##TITLE=31Pdec_SR153_oil
 , 24 sc
 16.11.2022
##JCAMPDX= 6.0         $$ Bruker NMR JCAMP-DX V2.0
##DATA TYPE= NMR SPECTRUM
##DATA CLASS= NTUPLES
##ORIGIN= UXNMR, Bruker Analytische Messtechnik GmbH
##OWNER= root
$$ XWIN-NMR		Version 3.5
$$ Wed Nov 16 15:36:56 2022 Russian Standard Time (UT+4h)  she@DPX200
##.OBSERVE FREQUENCY= 81.013821
##.OBSERVE NUCLEUS= ^31P
##.ACQUISITION MODE= SIMULTANEOUS
##.ACQUISITION SCHEME= undefined
##.AVERAGES= 24
##.DIGITISER RES= 16
##SPECTROMETER/DATA SYSTEM= spect
##.PULSE SEQUENCE= zgpg30
##.SOLVENT NAME= CDCl3
##.SHIFT REFERENCE= (INTERNAL, CDCl3, 0, 248.564)
##AUDIT TRAIL= $$ (NUMBER, WHEN, WHO, WHERE, WHAT)
$$ ##TITLE= Audit trail, XWIN-NMR		Version 3.5
$$ ##JCAMPDX= 5.01
$$ ##ORIGIN= Bruker BioSpin GmbH
$$ ##OWNER= she
$$ F:/spectra/data/she/nmr/P31/1/pdata/1/auditp.txt
$$ ##AUDIT TRAIL=  $$ (NUMBER, WHEN, WHO, WHERE, WHAT)
(   1,<2022-11-16 15:35:49.21 +0400>,<she>,<DPX200>,
      <created by zg, POWCHK disabled, PULCHK disabled
       configuration hash MD5:
       00 E9 B6 7A A2 85 ED C7 34 08 36 98 17 FE 4E 26
       data hash MD5: 32K
       E1 1E BF 5B 62 A4 7D 28 89 C3 5D A1 D9 62 62 43>)
(   2,<2022-11-16 15:35:52.01 +0400>,<she>,<DPX200>,
      <Start of raw data processing
       efp BC_mod = 2 LB = 1 FT_mod = 6 PKNL = 1 PHC0 = -10292.45 PHC1 = 176.856 SI = 64K 
       data hash MD5: 64K
       3B 6C 4D 42 B8 EF 47 96 49 64 D7 FB C9 12 6C 4E>)
(   3,<2022-11-16 15:36:11.51 +0400>,<she>,<DPX200>,
      <pk PHC0 = -18.58769 PHC1 = 48.00001 
       data hash MD5: 64K
       08 0F 03 7C 22 82 3F 27 2A D0 7C 4D EC 99 09 2F>)
$$ ##END=
$$ 
$$ hash MD5
$$ 83 67 4D E9 E3 34 99 35 1C 8C 58 9C 76 6E D9 10
##$RELAX= 
##$RELAX= 
##$RELAX= 
##$RELAX= 
##$RELAX= 
##$RELAX= 
##$RELAX= 
##$RELAX= 
##$RELAX= 
$$ Bruker specific parameters
$$ --------------------------
##$DU= <F:/spectra>
##$EXPNO= 1
##$NAME= <P31>
##$PROCNO= 1
##$TYPE= <nmr>
##$USER= <she>
##$AMP= (0..31)
100 100 100 100 100 100 100 100 100 100 100 100 100 100 100 100 100 100 
100 100 100 100 100 100 100 100 100 100 100 100 100 100 
##$AQSEQ= 0
##$AQ_mod= 1
##$AUNM= <au_zg>
##$AUTOPOS= <>
##$BF1= 81.014009
##$BF2= 200.13
##$BF3= 200.13
##$BF4= 200.13
##$BF5= 200.13
##$BF6= 200.13
##$BF7= 200.13
##$BF8= 200.13
##$BYTORDA= 1
##$CFDGTYP= 0
##$CFRGTYP= 5
##$CHEMSTR= <none>
##$CNST= (0..31)
1 1 145 1 1 1 1 1 1 1 1 1 1 1 1 1 1 1 1 1 1 1 1 1 1 1 1 1 1 1 1 1 
##$CPDPRG= <waltz16>
##$CPDPRG1= <>
##$CPDPRG2= <waltz16>
##$CPDPRG3= <>
##$CPDPRG4= <mlev>
##$CPDPRG5= <mlev>
##$CPDPRG6= <mlev>
##$CPDPRG7= <mlev>
##$CPDPRG8= <mlev>
##$CPDPRGB= <>
##$CPDPRGT= <>
##$D= (0..31)
0 1 0 0 0 0 0 0 0 0 0 0.03 2e-05 3e-06 0 0 0 0 0 0 0 0 0 0 0 0 0 0 0 0 
0 0 
##$DATE= 1668598548
##$DBL= (0..7)
120 120 120 11 120 120 24 19 
##$DBP= (0..7)
150 150 150 150 150 150 150 150 
##$DBP07= 0
##$DBPNAM0= <>
##$DBPNAM1= <>
##$DBPNAM2= <>
##$DBPNAM3= <>
##$DBPNAM4= <>
##$DBPNAM5= <>
##$DBPNAM6= <>
##$DBPNAM7= <>
##$DBPOAL= (0..7)
0.5 0.5 0.5 0.5 0.5 0.5 0.5 0.5 
##$DBPOFFS= (0..7)
$$ [...]
##$SUBNAM2= <"">
##$SUBNAM3= <"">
##$SUBNAM4= <"">
##$SUBNAM5= <"">
##$SUBNAM6= <"">
##$SUBNAM7= <"">
##$SUBNAM8= <"">
##$SUBNAM9= <"">
##$SW= 501.771253377433
##$SWIBOX= (0..15)
0 1 3 0 0 0 0 0 0 0 0 0 0 0 0 0 
##$SW_h= 40650.406504065
##$TD= 32768
##$TD0= 1
##$TE= 0
##$TE2= 300
##$TE3= 300
##$TEG= 300
##$TL= (0..7)
0 120 53 12 22 120 120 120 
##$TP= (0..7)
150 150 150 150 150 150 150 150 
##$TP07= 0
##$TPNAME0= <>
##$TPNAME1= <>
##$TPNAME2= <>
##$TPNAME3= <>
##$TPNAME4= <>
##$TPNAME5= <>
##$TPNAME6= <>
##$TPNAME7= <>
##$TPOAL= (0..7)
0.5 0.5 0.5 0.5 0.5 0.5 0.5 0.5 
##$TPOFFS= (0..7)
0 0 0 0 0 0 0 0 
##$TUNHIN= 0
##$TUNHOUT= 0
##$TUNXOUT= 0
##$USERA1= <user>
##$USERA2= <user>
##$USERA3= <user>
##$USERA4= <user>
##$USERA5= <user>
##$V9= 5
##$VALIST= <valist>
##$VCLIST= <CCCCCCCCCCCCCCC>
##$VD= 0
##$VDLIST= <DDDDDDDDDDDDDDD>
##$VPLIST= <PPPPPPPPPPPPPPP>
##$VTLIST= <TTTTTTTTTTTTTTT>
##$WBST= 1024
##$WBSW= 4
##$XGAIN= (0..3)
0 0 0 0 
##$XL= 0
##$YL= 0
##$YMAX_a= 10274
##$YMIN_a= -15036
##$ZGOPTNS= <>
##$ZL1= 120
##$ZL2= 120
##$ZL3= 120
##$ZL4= 120
##$ABSF1= 0
##$ABSF2= 0
##$ABSG= 0
##$ABSL= 0
##$ALPHA= 0
##$AQORDER= 0
##$ASSFAC= 0
##$ASSFACI= 0
##$ASSFACX= 0
##$ASSWID= 0
##$AUNMP= <proc_1d>
##$AZFE= 0.1
##$AZFW= 0.5
##$BCFW= 0
##$BC_mod= 2
##$BYTORDP= 0
##$COROFFS= 0
##$CY= -3
##$DATMOD= 1
##$DC= 0
##$DFILT= <>
##$DTYPP= 0
##$F1P= 0
##$F2P= 0
##$FCOR= 1
##$FTSIZE= 65536
##$FT_mod= 6
##$GAMMA= 0
##$GB= 0
##$INTBC= 1
##$INTSCL= 6.047779e-11
##$ISEN= 30
##$LB= 1
##$LEV0= 0
##$LPBIN= 0
##$MAXI= 10000
##$MC2= 0
##$MEAN= 0
##$ME_mod= 0
##$MI= 50
##$NCOEF= 0
##$NC_proc= -5
##$NLEV= 6
##$NOISF1= 182.463
##$NOISF2= 159.3651
##$NSP= 0
##$NTH_PI= 0
##$NZP= 0
##$OFFSET= 248.5645
##$PC= 4
##$PHC0= -10311.04
##$PHC1= 224.856
##$PH_mod= 1
##$PKNL= yes
##$PPARMOD= 0
##$PSCAL= 0
##$PSIGN= 0
##$REVERSE= no
##$SF= 81.0140089999694
##$SI= 65536
##$SIGF1= 159.3651
##$SIGF2= -187.1042
##$SINO= 113.3802
##$SIOLD= 16384
##$SREGLST= <1H.CDCl3>
##$SSB= 0
##$STSI= 65536
##$STSR= 0
##$SW_p= 40650.406504065
##$SYMM= 0
##$S_DEV= 0
##$TDeff= 32768
##$TDoff= 0
##$TI= <>
##$TILT= no
##$TM1= 0
##$TM2= 0
##$TOPLEV= 0
##$USERP1= <user>
##$USERP2= <user>
##$USERP3= <user>
##$USERP4= <user>
##$USERP5= <user>
##$WDW= 1
##$XDIM= 65536
##$YMAX_p= 332848728
##$YMIN_p= -35912231
$$ End of Bruker specific parameters
$$ ---------------------------------
##NTUPLES= NMR SPECTRUM
##VAR_NAME=  FREQUENCY,     SPECTRUM/REAL,   SPECTRUM/IMAG
##SYMBOL=    X,             R,               I
##VAR_TYPE=  INDEPENDENT,   DEPENDENT,       DEPENDENT
##VAR_FORM=  AFFN,          ASDF,            ASDF
##VAR_DIM=   65536,         65536,           65536
##UNITS=     HZ,            ARBITRARY UNITS, ARBITRARY UNITS
##FACTOR=    0.620285442955139, 1,           1
##FIRST=     20137.2065510682, 0,            0
##LAST=      -20513.1999529968, 0,           0
##MIN=       -20513.1999529968, -35912231,   0
##MAX=       20137.2065510682, 332848728,    0
$$ Real data points
##PAGE= N=1
##DATA TABLE= (X++(R..R)), XYDATA
$$ [...]
39707H765616m5003q1261j24105k71640q8509N38462R45872O63296K36723M62288
$$ 8765616 8720613 8639352 8515247 8243607 8155098 8693560 9639432 10302728 10539451 11001739
39697A1001739J261380J941136K222803K394861K673855L013146L503541M476169
$$ 11001739 12263119 14204255 16427058 18821919 21495774 24508920 28012461 32488630
39689C2488630N994764P299106O899225L680876j599371o219310p698403o164090
$$ 32488630 38483394 45782500 52681725 56362601 54763230 48543920 40845517 34681427
39681C4681427l879088k532496j925428j277968m94143L35978J478399K904703
$$ 34681427 30802339 28269843 26344415 25066447 24572304 24908282 26386681 29291384
39673B9291384M100659N081889O337029P003594M727578j100282p199755r481722
$$ 29291384 33392043 38473932 44810961 51814555 56542133 55441851 48242096 38760374
39665C8760374p677122n024935l819376l414666k639941j856417j764970j926009
$$ 38760374 31083252 26058317 22238941 18824275 16184334 14327917 12562947 10636938
39657A0636938j609646j001742o25329m46797l20192m76641q62342q19369j42997
$$ 10636938 9027292 8025550 7400221 6953424 6633232 6156591 5294249 4474880 4331883
39648D331883L55579R1537l03667q3865L02834K7175o22050o93221j47314J66223
$$ 4331883 4687462 4778999 4475332 4391467 4694301 4721476 4099426 3406205 3258891 3425114
39638C425114m1923j54177J95483N54199M57663Q4972j46999j25190K1139J44545
$$ 3425114 3383191 3229014 3424497 3978696 4436359 4521331 4374332 4249142 4270281 4414826
39628D414826J38541N1656R6097K77221K30638j95945n07728k49437J81052J06373
$$ 4414826 4553367 4605023 4701120 4978341 5208979 5013034 4505306 4255869 4436921 4543294
39618D543294k83675k06589M01474Q07116P81539R45735J489203J554018N29997
$$ 4543294 4259619 4053030 4454504 5261620 6043159 6988894 8478097 10032115 10562112
39609A0562112q14005j273681p87974l13988m26854p65083p66748l62023J08273
$$ 10562112 9748107 8474426 7686452 7372464 6945610 6180527 5413779 5051756 5160029
39600E160029K83083N3707l44733n60581n33456m85983m60896k37813J46060K59539
$$ 5160029 5443112 5496819 5152086 4591505 4058049 3572066 3111170 2873357 3019417 3278956
39590C278956n9828l67216k89069q3531j05035j77166j4336J72104Q9567j2344
$$ 3278956 3219128 2851912 2562843 2479312 2374277 2197111 2182775 2354879 2444446 2432102
39580B432102J93879L90269J30859k09562R2644Q16556R40757J71711n82966n33592
$$ 2432102 2625981 3016250 3147109 2937547 3030191 3846747 4787504 4959215 4376249 3842657
39570C842657k829K76779J85590O0379R143j05420k63592k82941j18170N5520
$$ 3842657 3839828 4116607 4302197 4362576 4371719 4266299 4002707 3719766 3601596 3657116
39560C657116J5567k77251n42991m24098l7913J2739m60089p06060l8543R55195
$$ 3657116 3672683 3395432 2852441 2428343 2390430 2403169 1943080 1237020 1198477 2153672
39550B153672J057724J60519n85657m48333J7644O5965j76385k18710o5158k1091
$$ 2153672 3211396 3371915 2786258 2337925 2355569 2421534 2245149 2026439 1961281 1940190
39540A940190j32014k39168k07376J22622P24651J021799M27871n56137o32046
$$ 1940190 1808176 1569008 1361632 1484254 2208905 3230704 3658575 3102438 2470392
39531B470392N18789J582366J288982J0027r49874j015969o13864k89513k48033
$$ 2470392 2989181 4571547 5860529 5870556 4920682 3904713 3290849 3001336 2753303
39522B753303m38653n74810l52311N4755J46498p3232q0645J51336R449n37280
$$ 2753303 2314650 1739840 1387529 1442284 1588782 1515550 1434905 1586241 1595690 1058410
39512A058410o20475N2010N09085R1432l90148o4034M95830L68554p9639l7335
$$ 1058410 437935 489945 999030 1090462 700314 636280 1132110 1500664 1421025 1383690
39502A383690J30294l41855r09691n07155M16569M66540k98622m14028M59480
$$ 1383690 1513984 1172129 262438 -244717 171852 638392 339770 -74258 385222
39493C85222R17197J54183p68270p01666m6979K10220k0231k50922l42162l40445
$$ 385222 1302419 1456602 688332 -13334 -60313 149907 129676 -121246 -463408 -803853
39483h03853o6916M73979Q01044N82443J20240j21556m1308K23053M51635L09857
$$ -803853 -870769 -396790 404254 986697 1106937 985381 944073 1167126 1618761 1928618
39473A928618k77784p37357m86622J17883K57476n5544j25169Q7163o2852n29959
$$ 1928618 1650834 913477 426855 544738 802214 746670 621501 708664 645812 115853
39463A15853m73468K08047N41149J17310k17136R4038L43614p3701m73626m1997
$$ 115853 -357615 -149568 391581 508891 291755 385793 729407 655706 182080 140083
39453A40083P32467Q16145J55574m80078o40274l82135J57612O53935N74705o3038
$$ 140083 872550 1688695 1844269 1364191 723917 341782 499394 1153329 1728034 1664996
39443A664996m57708j56660K12741J4673l06706n3604M46466L70881k23962n33087
$$ 1664996 1207288 1050628 1263369 1278042 971336 917732 1364198 1735079 1511117 978030
39433I78030k48663J91549M24431M65774L27437m350l10625l81436l43853l22616
$$ 978030 729367 920916 1345347 1811121 2138558 2134208 1823583 1442147 1098294 775678
39423G75678r8437M07027O88818K91087m31917p58868n15201l1395M39759O97020
$$ 775678 677241 1084268 1773086 2064173 1632256 873388 358187 326792 766551 1463571
39413A463571L93039m49611j045762o87608K43820P66746N81656K04264J8478
$$ 1463571 1856610 1406999 361237 -326371 -82551 684195 1265851 1470115 1488593
39404A488593q8044k23459k87642k80809k95085k19466R1353M23660M29224J73476
$$ 1488593 1400549 1177090 889448 608639 313554 94088 185441 609101 1038325 1211801
39394A211801L9650J60383L35993M36652N12563N66078N29621M12314K52027M6438
$$ 1211801 1251451 1411834 1747827 2184479 2697042 3263120 3792741 4205055 4457082 4503520
39384D503520j20832j19456p2725k79549o70695p63205l80458M2003J29018M5002
$$ 4503520 4382688 4263232 4190507 3910958 3240263 2477058 2096600 2138603 2267621 2312623
39374B312623J2944q6558k81486k59971L2425J50166m8874j8160N16467R01316
$$ 2312623 2325567 2239009 1957523 1697552 1729977 1880143 1831269 1813109 2329576 3230892
39364C230892N40558r7138k21764R4266K83539L11940M67486N61478K38629k57759
$$ 3230892 3771450 3674312 3452548 3546814 3830353 4142293 4609779 5171257 5409886 5152127
39354E152127m69934n25412p32557p92417l26450K25033K50622J20791N34031
$$ 5152127 4682193 4156781 3424224 2631807 2305357 2530390 2781012 2901803 3435834
39345C435834J049531O77409j50434K04571J994007L171597J945625p86893k573693
$$ 3435834 4485365 5162774 5012340 5216911 7210918 10382515 12328140 11541247 8967554
39336H967554k347997j219842o26653p21366p87478n00415k16361k38975l43676
$$ 8967554 6619557 5399715 4773062 4051696 3264218 2763803 2547442 2308467 1964791
39327A964791j79194K07169N12307N89117M09003q3622o42144o10931J92231Q55484
$$ 1964791 1785597 1992766 2505073 3094190 3503193 3419571 2777427 2166496 2358727 3214211
39317C214211N36492j09590J13636Q53808P70104J96241J047091L355188M286299
$$ 3214211 3750703 3641113 3754749 4608557 5378661 5574902 6621993 9977181 14263480
39308A4263480K198975m35349m82231J078627P11393k100228l951441k476095
$$ 14263480 16462455 16027106 15544875 16623502 17334895 15234667 11283226 8807131
39300H807131M95624J725770N22046j313871k128000j752842r10529k61427P6833
$$ 8807131 9302755 11028525 11550571 10236700 8108700 6355858 5445329 5183902 5260735
39291E260735L61684N56273K64945k15881L91565K468059M022983K709583q92328
$$ 5260735 5622419 6178692 6443637 6227756 6619321 9087380 13110363 15819946 14927618
39282A4927618l620864l449655j416215K89223P15640L72221L68115J595810L627935
$$ 14927618 11306754 7857099 6440884 6730107 7445747 7817968 8186083 9781893 13409828
39273A3409828M415010K406700j062565l018600k465643j068595k36550L43699
$$ 13409828 17824838 20231538 19168973 16150373 13684730 12616135 12379585 12723284
39265A2723284Q42905K87889j454410k596924j730736J72366J274423J220824
$$ 12723284 13566189 13854078 12399668 9802744 8072008 8244374 9518797 10739621
39257A0739621R40816J177329K031111K877581K267367n77292l733478m080260
$$ 10739621 11680437 12857766 14888877 17766458 20033825 19456533 15723055 11642795
39249A1642795j556961N13848M73126P15705K999751M577725K498299o98185j79268
$$ 11642795 10085834 10599682 11072808 11788513 14788264 19365989 21864288 21166103 20986835
39240B0986835L368225M087920m59970n678829o525327l833583j630232j212962
$$ 20986835 24355060 28442980 27983010 22304181 15778854 11945271 10315039 9102077
39232I102077j004702l60566k02303n54541k70634P68113J371772J192298J304003
$$ 9102077 8097375 7736809 7534506 6979965 6709331 7477444 8849216 10041514 11345517
39223A1345517K213645K917173K614788J987279J811749J362989n41872l371164
$$ 11345517 13559162 16476335 19091123 21078402 22890151 24253140 23711268 20340104
39215B0340104n014339m220513k013133l39903L3184k06752k92062k96677o53342
$$ 20340104 15325765 11105252 9092119 8752216 8785400 8578648 8286586 7989909 7336567
39206G336567j286559j575909j098041k05688K62398p7004o20602m91365K36522
$$ 7336567 6050008 4474099 3376058 3170370 3432768 3355764 2735162 2243797 2480319
39197B480319N71621J31070n3669R88374K362499K124837n3755k187014k408016
$$ 2480319 3051940 3183010 3129341 4117715 6480214 8605051 8551296 6364282 3956266
39188C956266j160946k26239k87646m95297j62862K13327o6400o74654o55748
$$ 3956266 2795320 2569081 2281435 1786138 1623276 1836603 1770203 1095549 439801
39179D39801J74167Q68945O04376j75778l84470J65055O05132M89688M77192J004769
$$ 439801 613968 1482913 2087289 1911511 1527041 1692096 2297228 2786916 3264108 4268877
39169D268877J211380J93493j309316j751790r93841l26676l59814l27150K47809
$$ 4268877 5480257 5673750 4364434 2612644 1618803 1292127 932313 605163 852972
39160H52972O28361K16985l60328k89161K43739O31922P99968Q47970N07861k76558
$$ 852972 1481333 1698318 1337990 1048829 1292568 1924490 2724458 3572428 4080289 3803731
39150C803731q67784p66696l64784k17988j79624N9610J94079j36565n22495l53568
$$ 3803731 2935947 2169251 1804467 1586479 1406855 1466465 1660544 1523979 1001484 647916
39140F47916J48612K53476j62650n06947l33128K01211O10173M91249j05032n32439
$$ 647916 796528 1050004 887354 380407 47279 248490 858663 1349912 1244880 712441
39130G12441j86363N72243P34006Q2535m47049j91225L06470K99214l9953j44469
$$ 712441 526078 1098321 1832327 1914862 1467813 1276588 1583058 1882272 1842319 1697850
39120A697850J3872K02094M96656Q95051R26925L07732n02386r11026q58768n12040
$$ 1697850 1711722 1913816 2410472 3305523 4232448 4540180 4037794 3126768 2268000 1755960
39110A755960L2852M04208J43067m06569l50564K62884L71756k48852m83047J23318
$$ 1755960 1788812 2193020 2336087 1929518 1578954 1841838 2213594 1964742 1481695 1605013
39100A605013M46699j70293o14165m560O52738L96019K71495J387688K409858
$$ 1605013 2051712 1881419 1267254 1262694 1915432 2311451 2582946 3970634 6380492
39091F380492J350412j080762k333977j668277o33047k73177j42420J7673k03101
$$ 6380492 7730904 6650142 4316165 2647888 2014841 1741664 1599244 1616917 1413816
39082A413816n74743l23170L79254O70899O00352Q13301J014421N70650J38603
$$ 1413816 839073 515903 895157 1566056 2166408 2979709 3994130 4564780 4703383
39073D703383O23040J157857N97621L18118K355266N042504M277372k85497m087758
$$ 4703383 5326423 6484280 7081901 7400019 9755285 14797789 19075161 18789664 14701906
39064A4701906l893536j463006N77479K532287M682224M339685j99940n317644
$$ 14701906 10808370 9345364 9922843 12455130 17137354 21477039 21277099 15959455
39056A5959455n990199k654664q5215k72600o46036O08048J656686O33814j203297
$$ 15959455 9969256 7314592 7229377 6956777 6310741 6918789 8575475 9209289 8005992
39047H005992j690026q01364J67162O83706P38639J814j295252j811319q49150
$$ 8005992 6315966 5514602 5681764 6365470 7104109 7105923 5810671 3999352 3150202
39038C150202K84921L7078j065684j260644j78547Q38986Q48842L34972m385k55225
$$ 3150202 3435123 3472201 2406517 1145873 967326 1806312 2655154 2990126 2985741 2730516
39028B730516o21828p23667k28228L98256M55250K8880j52679K22936O52623N21825
$$ 2730516 2108688 1385021 1156793 1555049 2010299 2039179 1886500 2109436 2762059 3283884
39018C283884j57638q13526r03761m02026J72491K81830M2064J18795P07720J035163
$$ 3283884 3126246 2312720 1408959 1006933 1179424 1461254 1503318 1622113 2329833 3364996
39008C364996M37005m26123k93179Q72967J745307J412275L55439n16055q23836
$$ 3364996 3802001 3375878 3082699 3955666 5700973 7113248 7468687 6952632 6128796
38999F128796n18890K02242O09556L50418P23441L144330N914248N089858j903
$$ 6128796 5609906 5812148 6421704 6772122 7495563 10639893 16554141 21643999 21642096
38990B1642096m705911m774591j801732P3593O47338K570880N053562L909857
$$ 21642096 16936185 12161594 10359862 10433455 11080793 13651673 18705235 22615092
38982B2615092j446178n920255n607216k773989j504426j815252j268458J72571
$$ 22615092 21168914 15248659 9641443 6867454 5363028 3547776 2279318 2451889
38974B451889N22530m21515r69416n75743k51005l27578j60601J99904P4358l32859
$$ 2451889 2974419 2552904 1583488 1007745 756740 429162 268561 468465 542823 209964
38964B09964k57812R8549J8038k02490J60278O37326L14895k77124P0446R68160
$$ 209964 -47848 50701 68739 -133751 26527 663853 978748 701624 772070 1740230
38954A740230R39146P476l33883K25433L39479m84013r65615k91007N54008N01964
$$ 1740230 2679376 2686852 2352969 2578402 2917881 2433868 1468253 1177246 1731254 2233218
38944B233218p8658m21084n69613p10035m89542J34398L97950q8083n62486k90758
$$ 2233218 2154560 1733476 1163863 453828 -35714 98684 496634 408551 -153935 -444693
38934d44693L14705N09748L82544M03642M56096J42446l71308n52214k87101O5712
$$ -444693 -129988 379760 762304 1165946 1622042 1764488 1393180 840966 553865 619577
38924F19577K09026J15183r6081k34115j81449n4360J5286J68930M92645N89399
$$ 619577 828603 943786 847705 613590 432141 377781 393067 561997 1054642 1644041
38914A644041J17316l90954r9874P15162Q00364k60607j311760j193969k35803
$$ 1644041 1761357 1370403 1270529 1985691 2786055 2525448 1213688 19719 -216084
38905b16084M44936M71064L03796K34499M4372m17263q60382q48920k58896N51422
$$ -216084 228852 699916 1003712 1238211 1282583 865320 4938 -843982 -1102878 -551456
38895e51456R81541P26811Q7275m02747n43233m39073j31501L10262N11955J67161
$$ -551456 430085 1156896 1244171 841424 298191 -140882 -272383 37879 549834 716995
38885G16995l88474n41644k85196j32805j97822o4497L60908O09698M46466K19364
$$ 716995 328521 -213123 -498319 -631124 -828946 -893443 -532535 77163 523629 742993
38875G42993J73745O2460k68644n06864m13925k10618j04220N8687L39478M01950
$$ 742993 916738 979198 710554 203690 -210235 -420853 -525073 -466386 -126908 275042
38865B75042L9807l94640m56731j89233N5444Q5922n2858j89421p5290L47237
$$ 275042 314849 -79791 -536522 -725755 -670311 -584389 -637247 -826668 -901958 -554721
38855e54721O67069M30320j04529k01564K39023M67869N6169m14682k85075J71104
$$ -554721 112348 542668 438139 236575 475598 943467 999636 584954 299879 470983
38845D70983K58347o5441k65103j04551J48035K39741J50450j06526m52760n84978
$$ 470983 729330 663889 398786 294235 442270 682011 832461 725935 273175 -311803
38835c11803k63396K59401M58655J96673j50215k43983j55458r5685n7312P7278
$$ -311803 -575199 -315798 142857 339530 189315 -54668 -210126 -305811 -363123 -285845
38825b85845K35526K32220J37153K72986O74856Q12264K29231o55754r11144l35392
$$ -285845 -50319 181901 319054 592040 1266896 2079160 2308391 1652637 741493 406101
38815D06101K33959J25033k42279j28914L27013L81582j30092o06488n82888j88934
$$ 406101 640060 765093 522814 393900 720913 1102495 972403 365915 -216973 -405907
38805d05907K56378N37660M65307M1827l28476k87458p7397j34919l20518j89317
$$ -405907 -149529 388131 853438 895265 566789 279331 201934 67015 -253503 -442820
38795d42820J55716K41699J30243K84491N73953L66826k87897n67731k04797R3043
$$ -442820 -287104 -45405 84838 369329 943282 1310108 1022211 454480 249683 342726
38785C42726q7562j91461J66835L74469j07356o69155m65068K13709M44308J27414
$$ 342726 255164 63703 230538 605007 497651 -171504 -636572 -422863 21445 148859
38775A48859n5864Q8891M6545l49841n44271j74557L42204M74726L04492K12336
$$ 148859 92995 181886 228431 -121410 -665681 -840238 -498034 -23308 281184 493520
38765D93520K20956Q3456j75140k48251o3412P8843j711p0019Q7556K33001P7540
$$ 493520 714476 797932 622792 374541 311129 389972 388261 318242 405798 638799 716339
38754G16339j17235R1381M54544K67313m10277o22396N167N30333J10502o36504
$$ 716339 599104 690485 1145029 1412342 1002065 379669 384836 915169 1025671 389167
38744C89167o05148R4297M90740L54453K36894J89221k37373p55499m71034N25957
$$ 389167 -215981 -121684 369056 723509 960403 1149624 912251 156752 -314282 211675
38734B11675R82046L15771n17743n38077p3319P7477q2199p6117J07369J52078
$$ 211675 1193721 1509492 991749 453672 380353 457830 375631 299514 406883 558961
38724E58961M1724m2641j06422j94533j94137p6995J2816O4700J65141J31348
$$ 558961 600685 558044 451622 257089 62952 -14043 -1227 63473 228614 359962
38714C59962k31270n26363j82871N11969O88276K59986o935R8747l9193m75435
$$ 359962 128692 -397671 -580542 -68573 619703 879689 872754 971501 932308 456873
38704D56873l96696L00100N25628j62673o07433R8891J095654J237950R14925
$$ 456873 60177 360277 885905 723232 115799 214690 1310344 2548294 3463219
38695C463219J031529J194126M70275p50165j240514q69324n89641p66183q67100
$$ 3463219 4494748 5688874 6159149 5408984 4168470 3299146 2709505 1943322 1076222
38686A076222o62473m82218l67803q1006J54016l3766k72876N7044O21421N42417
$$ 1076222 413749 -68469 -436272 -517278 -363262 -397028 -669904 -612860 8561 550978
38676E50978j16200m36261j65486K7990j30256j26585K36514M35208K12118J4874
$$ 550978 434778 -1483 -166969 -138979 -269235 -395820 -159306 275902 488020 502894
38666E02894J36625K53104J11251n3573k9082J03718L55948Q23308J203114J006769
$$ 502894 639519 892623 1003874 950301 921219 1024937 1380885 2204193 3407307 4414076
38656D414076L35659k20104m65350o70638q11923n77689j50401r3785l69959l54576
$$ 4414076 4749735 4529631 4064281 3393643 2581720 2004031 1853630 1759845 1389886 1035310
38646A035310M2063J77642k07352n68006m86752j80688J37926N25577P04921J67536
$$ 1035310 1077373 1255015 1047663 479657 -7095 -187783 -49857 475720 1180641 1348177
38636A348177p72808j005113j80862O55524N49138j00467l83394k00500j0225
$$ 1348177 575369 -429744 -610606 44918 594056 493589 110195 -90305 -100530
38627a00530R2127K54251K93068j5115l78468l45229J1377K42868J40036j58586
$$ -100530 -8403 245848 538916 523801 145333 -199896 -188519 54349 194385 35799
38617C5799m13120l80614k169L31005J59764k53448j62613M24571N81811n0019
$$ 35799 -377321 -757935 -760104 -429099 -269335 -522783 -685396 -260825 320986 270967
38607B70967n42739j39566M58304K39795m08893l59601L37149N28711j25115o17784
$$ 270967 -271772 -411338 46966 286761 -122132 -481733 -144584 384127 259012 -358772
38597c58772k22835M69549O00976K27026j04092k36261k62733o9546L27719M22454
$$ -358772 -581607 -112058 488918 715944 611852 375591 112858 43312 371031 793485
38587G93485j20312p38716o34975P593K54195j31069l27645J60213O11997K31792
$$ 793485 673173 -65543 -700518 -692925 -438730 -569799 -897444 -737231 -125234 106558
38577A06558m58856l18575N94363R74520J86495p76988p47224K3514M45771K04022
$$ 106558 -352298 -670873 -76510 898010 1084505 307517 -439707 -416193 29578 233600
38567B33600q7398n1913K4252p6306j40009n9311q7164l09491l84201q8194K88703
$$ 233600 146202 94289 118541 42235 -97774 -157085 -244249 -553740 -937941 -1026135 -737432
38556g37432L76842K13719K8456j50602l56930l89617l1389N06392O92883L22784
$$ -737432 -360590 -146871 -118415 -269017 -625947 -1015564 -1046953 -540561 152322 475106
38546D75106j60423j71370K64726N24264K40724j52178n0144L95631N23942K38032
$$ 475106 314683 143313 408039 932303 1173027 1020849 970705 1366336 1890278 2128310
38536B128310J17355L29977K50584m28357r86545p23484o4103J65020K4311J26029
$$ 2128310 2245665 2575642 2826226 2397869 1411324 687840 623737 788757 813068 939097
38526I39097M22576L37905j01922k67600M94K28348K00436J47311O0695k84295
$$ 939097 1361673 1699578 1597656 1330056 1330550 1558898 1759334 1906645 1967340 1683045
38516A683045o14471m03841J05082J04882m21727n82927n8823L56923R8352l01136
$$ 1683045 1068574 664733 769815 874697 452970 -129957 -188780 168143 266495 -34641
38506c4641k21835O3924O6356l9793J06789L09183K02732q4122k02372r8914J33370
$$ -34641 -256476 -192552 -126196 -165989 -59200 249983 452715 368593 166221 67307 200677
38495B00677M45047N74242K18122k43704K4095R46326J282305L63037p83820q77404
$$ 200677 645724 1219966 1438088 1194384 1218479 2164805 3447110 3810147 3026327 2148923
38485B148923j97274M8148l89769o50250k44700L39306N10654K70184k2814l7509
$$ 2148923 1951649 1999797 1610028 959778 715078 1054384 1565038 1835222 1812408 1774899
38475A774899L40810P98239P35048L426p64402r41321o48949l21990l6895K05927
$$ 1774899 2115709 2913948 3648996 3652422 2888020 1946699 1297750 975760 938865 1144792
38465A144792J03954l63932n31749k0694M27114L3532o13809m09815L81377M59428
$$ 1144792 1248746 884814 353065 332371 759485 793017 179208 -230607 150770 610198
38455F10198l61947p96075j66821N38836L38290k12531o9830N74373O91958P6914
$$ 610198 248251 -547824 -714645 -175809 162481 -50050 -119880 454493 1146451 1223365
38445A223365m44242l44125l3782k4647j52310J5661M19410N74916K61078k16866
$$ 1223365 779123 434998 401216 376569 224259 239920 659330 1234246 1495324 1278458
38435A278458m76371m75619l38788m0614M09652O49500L19430k58528l22438K20641
$$ 1278458 802087 326468 -12320 -52934 356718 1006218 1325648 1067120 744682 965323
38425I65323N13402l7210q06903q06841j01370L42723N6602l92240k99983L13702
$$ 965323 1478725 1441515 634612 -172229 -273599 69124 125726 -266514 -566497 -252795
38415b52795Q79508R07797L46321l94280p44533n21186q3020K10570L83020M25506
$$ -252795 626713 1534510 1880831 1486551 742018 220832 137812 348382 731402 1156908
38405A156908K3599p51175j014337j65108J000208J268299P75671N98139Q26446
$$ 1156908 1180507 429332 -585005 -750113 250095 1518394 2294065 2892204 3718650
38396C718650O29807L23375J409977L732656M503095J805639k269850l984128
$$ 3718650 4348457 4671832 6081809 9814465 14317560 16123199 13853349 9869221
38388I869221k665904r73182p94869j218584r25230l56958m10907o77874l77728
$$ 9869221 7203317 6230135 5435266 4216682 3291452 2934494 2523587 1845713 1467985
38379A467985J09604K2464l30142k13736J30199M0165k11094J2042L12740n7649
$$ 1467985 1577589 1600053 1269911 1056175 1186374 1226539 1015445 1027487 1340227 1282578
38369A282578n39808K3950J249166J658427J281094J662451K817279K500819k89478
$$ 1282578 742770 766720 2015886 3674313 4955407 6617858 9435137 11935956 11646478
38360A1646478l149346l354059j553569m00802o46190q23347k05024K36665j34133
$$ 11646478 8497132 5143073 3589504 3188702 2542512 1719165 1514141 1750806 1616673
38351A616673n88434m57938r7102L1943O7631J68736J81604J29346K11589K59946
$$ 1616673 1028239 570301 473199 505142 572773 741509 923113 1052459 1264048 1523994
38341A523994k134k77156j44725O9027j33620l65666m8167L28676O9732j42336
$$ 1523994 1521860 1244704 1099979 1169006 1035386 669720 621553 950229 1019961 877625
38331H77625O77748J649954J195774J51522R64535L388757L977527J092921k339900
$$ 877625 1555373 3205327 4401101 4552623 5517158 8905915 12883442 13976363 11636463
38322A1636463k918530j274911k91679p03694j041768p27438o02404q92890q83923
$$ 11636463 8717933 7443022 7151343 6447649 5405881 4678443 4076039 3183149 2299226
38313B299226m66800k55376l02732j50814Q0542n4250l14923j90746J15557K13368
$$ 2299226 1832426 1577050 1274318 1123504 1204046 1149796 834873 644127 759684 973052
38303I73052M16422J002300J382111J215647J350050K185252K235033K11839k410057
$$ 973052 1389474 2391774 3773885 4989532 6339582 8524834 10759867 10971706 8561649
38294H561649l099421j855231p88269o39838k78545M91532L66540p97587j308249
$$ 8561649 5462228 3606997 2818728 2178890 1900345 2391877 2758417 1960830 652581
38285F52581m28538L72678n3662p33877m39642L25226M58597O3312p4705J74580
$$ 652581 224043 596721 543059 -190818 -630460 -305234 153363 216675 141970 316550
38275C16550M32578M99862K51004l30656o37082l881R12390O49687p50141j460250
$$ 316550 749128 1248990 1499994 1169338 532256 528375 1440765 2090452 1340311 -119939
38265a19939n59986N59551M33868l14453k95124M03059P01867L98856J56829J83505
$$ -119939 -679925 -120374 313494 -959 -296083 106976 808843 1207699 1364528 1548033
38255A548033J24993q9912k55589l99086n39507l81134R2127K80622q5615l13222
$$ 1548033 1673026 1583114 1327525 928439 388932 7798 99925 380547 294932 -18290
38245a8290J53250O64512L60760l28411k98380M34152P28696J17002n00844k94024
$$ -18290 134960 799472 1160232 831821 533441 967593 1696289 1813291 1312447 1018423
38235A018423K47103J38215n22962o38367K32114J100613R21003J07785j67273
$$ 1018423 1265526 1403741 880779 242412 474526 1575139 2496142 2603927 2436654
38226B436654K25265N12875P93849J946676L376758K883055n8045k776748k863580
$$ 2436654 2661919 3174794 3968643 5915319 9292077 12175132 12117087 9340339 6476759
38217F476759j413541p83371q56736j93039O48723K13284n24600M12236K045189
$$ 6476759 5063218 4279847 3423111 3230072 3878795 4092079 3567479 3979715 6024904
38208F024904K037131J692999M274686P955130O426742j298073p499668n937231
$$ 6024904 8062035 9755034 14029720 21984850 28411592 27113519 19613851 13676620
38200A3676620m86384J208251j374459k917291j614514o59175j408405j437332
$$ 13676620 13190236 14398487 13024028 10106737 8492223 7833048 6424643 4987311
38192D987311J05902P88844j54369k7251K275504L609932J405084k170025l444040
$$ 4987311 5093213 5882057 5727688 5700437 7975941 11585873 12990957 10820932 7376892
38183G376892k116141m35017M31178P46998M60121n35354j307398r84294k60872
$$ 7376892 5260751 4825734 5256912 6003910 6464031 5928677 4621279 3636985 3376113
38174C376113k66515o51143k91484O93223J129861P21755M84030J185437K227388
$$ 3376113 3109598 2458455 2166971 2860194 3990055 4711810 5195840 6381277 8608665
38165H608665K270172O51159j780452l229493k721527j229599m42720o03278n51856
$$ 8608665 10878837 11529996 9749544 6520051 3798524 2568925 2126205 1522927 971071
38156I71071J55296N41832r497o42364m44313J48014K63910R816k691J70586R9517
$$ 971071 1126367 1668199 1658702 1016338 572025 720039 983949 993765 991074 1161660 1261177
38145A261177n9725J39287M87059L60252k12250m97495j27090L72386L10451k57266
$$ 1261177 1201452 1340739 1827798 2188050 1975800 1478305 1351215 1723601 2034052 1776786
38135A776786o20399l44578J58687K27091o3246n5664K85181J47431p07562j192344
$$ 1776786 1156387 811809 970496 1197587 1134341 1078677 1363858 1511289 803727 -388617
38125c88617m22073P62595R43918K25104j54719Q4656P6238l88203m56376J42823
$$ -388617 -810690 -48095 895823 1120927 966208 1050864 1127102 738899 282523 425346
38115D25346N18623J27765l89337l75597n9615J71031L71814M86485J77168l84337
$$ 425346 943969 1071734 682397 306800 247185 418216 790030 1276515 1453683 1069346
38105A069346m94826l0640L41668K95914K02679K30320K07461M19359J208520
$$ 1069346 574520 543880 885548 1181462 1384141 1614461 1821922 2241281 3449801
38096C449801J815828J339125Q92457K501242N230396N088842M03366n023128
$$ 3449801 5265629 6604754 7497211 9998453 15228849 20317691 20721057 15697929
38088A5697929o377837l762306j144463o61183q91625l69634J91461j78389q50505
$$ 15697929 9320092 5557786 4413323 3752140 2860515 2490881 2682342 2503953 1653448
38079A653448p94503k17449K1907k35975m89726m22201j40962J02026J22228n2964
$$ 1653448 858945 641496 663403 427428 -62298 -484499 -625461 -523435 -401207 -454171
38069d54171j82569j28945k1974Q8297L71485P06034N61121j33105n90786k81636
$$ -454171 -636740 -765685 -787659 -699362 -327877 378157 939278 806173 215387 -66249
38059f6249J73917O646m15483k81209K06946K25617j57666j19201L87432M97555
$$ -66249 107668 114314 -301169 -582378 -375432 -149815 -307481 -426682 -39250 458305
38049D58305m0258l86142R689N48101M67310p8931m08038k31340J95181M55234
$$ 458305 418047 31905 41594 589695 1057005 978074 570036 338696 533877 989111
38039I89111K77324k13497m82767j96399K17555J17189l29261l31150K71752O71525
$$ 989111 1266435 1052938 570171 373772 591327 708516 379255 48105 319857 991382
38029I91382K52415n29652p99427l74411J45648J79309k08022m11565J1870P02095
$$ 991382 1243797 714145 -85282 -459693 -314045 -134736 -342758 -754323 -742453 -40358
38019d0358P78536n132p31568m34120N31573R17023L04604l59236j32533O81124
$$ -40358 738178 733046 1478 -432642 98931 1015954 1320558 961322 828789 1509913
38009A509913J034099M61623m82852r39374o26179n1537Q9169k68747m95749j38843
$$ 1509913 2544012 3005635 2522783 1583409 957230 905693 994862 726115 230366 91523
37999I1523M29245N46028J82500j20290o1687J85527M56875P48540Q66965M82137
$$ 91523 520768 1066796 1249296 1129006 1067319 1252846 1709721 2458261 3325226 3807363
37989C807363l11123r22424r39269n38604j05887J97909L24508J48097l21335
$$ 3807363 3496240 2573816 1634547 1095943 990056 1187965 1512473 1660570 1339235
37980A339235p16402n93450N3103O96844P72175K52464l37523n40488m55480m16357
$$ 1339235 622833 29383 82486 779330 1551505 1803969 1466446 925958 470478 54121
37970E4121l74775m5397M00486M05967n0102k59549J35229N04331K07820l47415
$$ 54121 -320654 -366051 34435 440402 390300 130751 265980 770311 978131 630716
37960F30716l29166K29237N29484K06156k98199m93569l59550j15333J8785j25896
$$ 630716 301550 530787 1060271 1266427 968228 474659 115109 -224 18561 -107335
37950a07335m15804l58060K39493P68027N55818r7496l21729N869J40646k71245
$$ -107335 -523139 -881199 -641706 126321 682139 584643 262914 268783 409429 138184
37940A38184o23929l33624K62687M21454L669m34037l69299J35799N41705L92431
$$ 138184 -485745 -819369 -556682 -135228 -131559 -565596 -934895 -799096 -257391 135040
37930A35040j74183n34526l07753J82709L71911J69227q0938j58116j22181m2534
$$ 135040 -39143 -573669 -881422 -698713 -326802 -157575 -238513 -396629 -518810 -561344
37920e61344O7979J24877O8004m245l820K7143J37501M78817Q56861P09586q8569
$$ -561344 -493365 -368488 -300484 -304729 -308549 -281406 -143905 334912 1191773 1901359 1812790
37909A812790q34929q65391l97102l8368O7234O9219q4877l18777j44289N29293
$$ 1812790 977861 112470 -284632 -323000 -255766 -186547 -271424 -590201 -734490 -205197
37899b05197Q56527K22223o00993n27210J06147J47236l78415l60265L83452P36119
$$ -205197 651330 873553 272560 -254650 -148503 -1267 -379682 -739947 -356495 379624
37889C79624J94294l06880j5047M52811K54989l45466n56576k30772K01311M13497
$$ 379624 573918 267038 251991 704802 959791 614325 57749 -173023 28288 441785
37879D41785K99550r9595m35727l13778R1915K48963J52757K48426M30556R4103
$$ 441785 741335 641740 206013 -107765 -15850 233113 385870 634296 1064852 1158955
37869A158955o42598q56610l12936P1608k45181n47886j67852L75011L50006L3280
$$ 1158955 516357 -340253 -653189 -581581 -826762 -1374648 -1542500 -1167489 -817483 -784203
37859g84203O0521L05199K83884P5623L4262J18030J86634L86962O32001L98972
$$ -784203 -723682 -418483 -134599 -58976 -24714 93316 279950 666912 1298913 1697885
37849A697885k93121n06845K19965R17248N51381m06529q12142n56800l24955
$$ 1697885 1404764 897919 1117884 2035132 2586513 2179984 1367842 811042 486087
37840D86087k48788q665J96411n259k16698J31915N97242L59783k79734l60101
$$ 486087 237299 228634 425045 419786 203088 335003 932245 1292028 1012294 652193
37830F52193L8119j2988n01824m32806L00241N69067m5267m47863J44928Q64811
$$ 652193 690312 677324 175500 -257306 42935 612002 566735 118872 263800 1128611
37820A128611N76187l83796q24920m05759J75152K80980q3253n19709n70818p0402
$$ 1128611 1704798 1321002 496082 90323 265475 546455 463202 -56507 -627325 -697727
37810f97727N22159N07310r6705m78137j72210L23214M20438K79192K91287L54724
$$ -697727 -175568 331742 235037 -243100 -415310 -92096 328342 607534 898821 1253545
37800A253545K65694K88313O35814Q23354L08301n21588p89548l94848n2334j16112
$$ 1253545 1519239 1807552 2443366 3266720 3575021 3053433 2263885 1869037 1816703 1700591
37790A700591j71464O4463K20560L0154k4417N71086J349499J267532J28295j019383
$$ 1700591 1529127 1593590 1814150 1844304 1819887 2390973 3740472 5008004 5136299 4116916
37780D116916j178093o31488l91855p01346p88096j75695N18152N21259M7589
$$ 4116916 2938823 2307335 1915480 1214134 426038 250343 768495 1289754 1337343
37771A337343j60291k4775o1969l12511k47361K00266L93406M2807l03018k01588
$$ 1337343 1177052 1152277 1090308 777797 530436 730702 1124108 1166915 863897 662309
37761F62309L17p6390j21740J70989L29269j51300p62040o40945J1508K24562
$$ 662309 662626 586236 464496 635485 964754 813454 51414 -589531 -578023 -353461
37751c53461j17341q8486O11718R71559K91235m68574K4197J382197J865448P61775
$$ -353461 -470802 -559288 52430 1023989 1315224 846650 870847 2253044 4118492 4880267
37741D880267p00080j112078o12988k42008k94134k35143P2352Q8530l46126n83934
$$ 4880267 4180187 3068109 2455121 2213113 1918979 1683836 1756188 1844718 1498592 914658
37731I14658k11665K11169N1249l35683k08949K70593K68900l25344o81499l37297
$$ 914658 702993 914162 965411 629728 420779 691372 960272 634928 -46571 -383868
37721c83868J66723K79389K32753L72757M62817K75499J98385N04029O30658R8102
$$ -383868 -217145 62244 294997 667754 1130571 1406070 1604455 2108484 2739142 2837244
37711B837244l83074J54978J201508J254379M7263j030250j020324n88167n54936
$$ 2837244 2454170 2609148 3810656 5065035 5112298 4082048 3061724 2473557 1918621
37702A918621n22023Q3902O39792K52932o00625o85615P2573N48841J98545l30910
$$ 1918621 1396598 1480500 2120292 2373224 1772599 1086984 1159557 1708398 1906943 1576033
37692A576033m49373l51492k63365n144L45051K87258j98307m44064j86217J8944
$$ 1576033 1126660 775168 511803 506659 851710 1138968 940661 496597 310380 329324
37682C29324r8556K1118O22935J005507Q62500J169871K516539L457094K154944
$$ 329324 230768 251886 874821 1880328 2742828 3912699 6429238 9886332 12041276
37673A2041276p50474k629442k237298r76671m54527l98710J49873Q82528P27608
$$ 12041276 11290802 8661360 6424062 5447391 4992864 4594154 4744027 5626555 6354163
37664F354163l52272j266172j304750q25556m38741k49274q0501P2111J25602
$$ 6354163 6001891 4735719 3430969 2605413 2166672 1917398 1836897 1909008 2034610
37655B034610K22882O21487J185674J278517O12319J37340J232291L510107M381073
$$ 2034610 2257492 2878979 4064653 5343170 5955489 6092829 7325120 10835227 15216300
37646A5216300K049021j583674k709150m45903J897711J136867j833896l688957
$$ 15216300 17265321 15681647 12972497 12526594 14424305 15561172 13727276 10038319
37638A0038319l027016j371207m63431l88891m55564m39886m54581m82526m86600
$$ 10038319 7011303 5640096 5176665 4787774 4332210 3892324 3437743 2955217 2468617
37629B468617m78994l39535l169K46202J68833O7489L16546O61430O63659N21024
$$ 2468617 1989623 1650088 1646919 1893121 2061954 2129443 2445989 3107419 3771078 4292102
37619D292102O58784R03326J024944J595721K935331L577063J650657k011462
$$ 4292102 4950886 5854212 6879156 8474877 11410208 14987271 16637928 14626466
37611A4626466m117154l028794q59962l43812j253866j534478p01016r4234l51485
$$ 14626466 10509312 7480518 6620556 6276744 5022878 3488400 2787384 2693150 2341665
37602B341665o28114l39989j3158r8301k47165j46179l7056p4168l6808P4289
$$ 2341665 1713551 1373562 1360404 1262103 1014938 868759 831703 757535 720727 795016
37592G95016j9137j66428R0593N21264L27027m38980o34640K42629J071246O39538
$$ 795016 775879 609451 700044 1221308 1548335 1109355 474715 717344 1788590 2428128
37582B428128n79400j099139m24469M94517O41631M1833n34849m99819J8288L88421
$$ 2428128 1848728 749589 325120 819637 1461268 1503101 968252 468433 486721 875142
37572H75142K42813l9955R5423M65024L93678j41419m17766j80892k9309k38047
$$ 875142 1117955 1078000 1173423 1638447 2032125 1890706 1472940 1292048 1262739 1024692
37562A024692k00300M01967Q99997Q33847P75251J099075J205112J154319K519613
$$ 1024692 824392 1226359 2126356 2960203 3735454 4834529 6039641 7193960 9713573
37553I713573N576381P021992L574372k495612m906304j357045L167229K882197
$$ 9713573 15289954 22311946 25886318 23390706 18484402 17127357 20294586 23176783
37545B3176783j627604n196797n058887k986788j447227q23143o10192p10320
$$ 23176783 21549179 16352382 11293495 8306707 6859480 6036337 5426145 4715825
37537D715825p65172j14030Q33087P38474n03660j262247n70479M18086L22593
$$ 4715825 3950653 3836623 4669710 5408184 4904524 3642277 3071798 3489884 3812477
37528C812477m11561n16829N0004L40073K7421m06932o79122q31883o75887o2976
$$ 3812477 3400916 2884087 2934091 3274164 3301585 2894653 2215531 1383648 707761 644785
37518F44785N18633M83529O4971r3398K2037k88n8625K20437N13415J59884n56405
$$ 644785 1163418 1646947 1711918 1618520 1640557 1640269 1581644 1802081 2315496 2475380 1918975
37507A918975o25863N2999M11289q8474o19719m09348N7395J1228l03159k21207
$$ 1918975 1293112 1346111 1757400 1668926 1049207 639859 697254 708482 405323 184116
37497A84116J21828J55759j7736J11461M15175L43997j0269n5917K10895K45467
$$ 184116 305944 461703 443967 555428 970603 1314600 1304331 1248414 1459309 1704776
37487A704776K0899L8733K98247L49044L65186Q92946J490705J251860R55224
$$ 1704776 1725675 1764408 2062655 2411699 2776885 3669831 5160536 6412396 7367620
37478G367620K544793N469264N955779K073635k464378k662903O82470J949913
$$ 7367620 9912413 15381677 21337456 23411091 20946713 18283810 18966280 20916193
37470B0916193j253052m904424m754391k106970q81442j614271j756791m78129
$$ 20916193 19663141 14758717 10004326 7897356 7015914 5401643 3644852 3166723
37462C166723L84262j11782o53847l47093j38398p07995j072082l91940N05759
$$ 3166723 3550985 3439203 2785356 2438263 2299865 1591870 519788 127848 633607
37453F33607N88233K51814L21639N24074J83979l90915m43086j10707j06373m24673
$$ 633607 1221840 1473654 1795293 2319367 2503346 2112431 1669345 1558638 1452265 1027592
37443A027592m17071K5749K88762K7528l62316l60538N1747M39759L49498k22595
$$ 1027592 610521 636270 925032 952560 590244 229706 281453 721212 1070710 848115
37433H48115o81414m29216K93217O20042K81789r316K62716N56696J89849m91199
$$ 848115 166701 -262515 30702 650744 932533 923217 1185933 1742629 1932478 1441279
37423A441279o42273k22636P2781m1634j93969j82092k51291m45682l82490P8509
$$ 1441279 799006 576370 649151 607517 413548 231456 -19835 -465517 -848007 -769498
37413g69498M65721L08973k02751m58784j61431L69580N76316K63273k00483l23112
$$ -769498 -303777 5196 -197555 -656339 -817770 -448190 128126 391399 190916 -132196
37403a32196q2851J15580O7603J8866J66610K85633J17938j74346k67419j43323
$$ -132196 -215047 -99467 -31864 -12998 153612 439245 557183 382837 115418 -27905
37393b7905J6923J72748L18066K62688r0622m24125l72985r8143o3149k90897
$$ -27905 -10982 161766 479832 742520 651898 227773 -145212 -243355 -306504 -597401
37383e97401k97231J54980O38523O11815J31187k52657k12954Q109L8440p7301
$$ -597401 -894632 -739652 -101129 510686 641873 389216 176262 184371 222811 145510
37373A45510k9483J65252J36573j72674k78221Q7626M30278K14410k31902k03390
$$ 145510 116027 281279 417852 245178 -33043 54583 484861 699271 467369 263979
37363B63979K31775L48375n3070l99461l33556j41112m6759J23805L65621L48604
$$ 263979 495754 844129 791059 391598 58042 -83070 -129829 -6024 359597 708201
37353G08201R7005N4424K22584N4735m92003o83916j99326K96761K52061Q737
$$ 708201 805206 859630 1082214 1136949 644946 -38970 -238296 58465 310526 319263
37343C19263n9865k46342o58090o22781J89382R03246O70711J8968o3717K83823
$$ 319263 259398 13056 -645034 -1267815 -1078433 -175187 495524 514492 450775 734598
37333G34598K45351j79564l11816n6468Q8848K4309K1128l2696l62012n50087
$$ 734598 979949 800385 488569 432101 520949 545258 566386 533690 171678 -378409
37323c78409p2637O53749P76539L36464O5888R4490m6626l17429k31886N7999
$$ -378409 -451046 202703 979242 1315706 1381594 1476084 1429458 1112029 880143 938142
37313I38142q9435n77673o39545j70845J45524J07615J97976M04866J12807n56766
$$ 938142 848707 271034 -368511 -539356 -393832 -286217 -88241 316625 429432 -127334
37303a27334n81460L14429J030064P04821q7333m25502l63370l92750l97790j9031
$$ -127334 -708794 -394365 635699 1340520 1253187 827685 464315 71565 -326225 -345256
37293c45256M76774N04556M5790l74954l89228o2397K98724L53942J2327l51604
$$ -345256 131518 636074 681864 306910 -82318 -144715 154009 507951 520278 168674
37283A68674k99538K7255J41645N8371K29064N71793M01656l97598r57010o27632
$$ 168674 -130864 -103609 38036 96407 325471 897264 1298920 901322 -55688 -683320
37273f83320R8479L86019J78140k7227l1404r6j5477m3496j01384j21822P5509
$$ -683320 -584841 -198822 -20682 -47909 -79313 -79409 -94886 -138382 -239766 -361588 -286079
37262b86079M17567N13035K02516j71393k76730k10202j72025j06363O4479J80647
$$ -286079 131488 644523 847039 675646 398916 188714 16689 -89674 -25195 155452
37252A55452Q3452j39472l15133l50787j86646J10443K24350l9691l07997o6150
$$ 155452 238904 99432 -215701 -566488 -753134 -642691 -418341 -458032 -766029 -832179
37242h32179M91899O37038J63113l68449n30338m91453m17930j33173L37025N39234
$$ -832179 -340280 296758 459871 91422 -438916 -930369 -1348299 -1481472 -1144447 -605213
37232f05213K76388k9474M41J71257J63787M9417M1505J28252K06742K30710Q2385
$$ -605213 -328825 -358299 -357858 -186601 -22814 26603 68108 196360 403102 633812 716197
37221G16197l08555o46756n35458j01042J61897J67651K51551M15905K95855n7797
$$ 716197 407642 -239114 -774572 -875614 -713717 -546066 -294515 121390 417245 359448
37211C59448j51006O2757P5708k11427k73886M1114J85310q1027k17434J27725
$$ 359448 208442 271199 346907 135480 -138406 -97292 88018 6991 -210443 -82718
37201h2718M78575L34405j02164m27682n80651n21339j10060L53783K81396j77380
$$ -82718 395857 730262 628098 200416 -380235 -901574 -1011634 -657851 -376455 -553835
37191e53835j71575M02155N53188j46858p02144k83759M02290L44252j37983j58781
$$ -553835 -725410 -323255 229933 83075 -619069 -902828 -500538 -156286 -294269 -453050
37181d53050J19310m6360m41691k09801N42014P64432J21924n09143m00060R5927
$$ -453050 -333740 -380100 -821791 -1031592 -489578 274854 396778 -112365 -512425 -416498
37171d16498K76291O0418j34937o2483J35908K11731J39979J27794K35764J44612
$$ -416498 -140207 -79789 -214726 -277209 -141301 70430 210409 338203 573967 718579
37161G18579l59057q02967n37143J91046M46240L0612k07414J78994M74988Q2308
$$ 718579 359522 -443445 -980588 -789542 -343302 -312690 -520104 -341110 133878 216186
37151B16186m01096k11555K68916K01400l08426m96796k04888R8744K43976M09465
$$ 216186 -184910 -396465 -127549 73851 -234575 -731371 -936259 -837515 -593539 -184074
37141a84074M87557K38587j02902j33725m561j16526l09782j10623L72074N52290
$$ -184074 303483 542070 439168 305443 300882 184356 -125426 -236049 136025 688315
37131F88315K85371j2548j08692j65157k28331j19878J20385J96258K4278j47242
$$ 688315 973686 961138 852446 687289 458958 339080 459465 655723 680001 532759
37121E32759j16831N2079J51699q615l95049n82535j39378O45300Q96603L13618
$$ 532759 415928 468007 619706 611091 216042 -366493 -505871 139429 1036032 1349650
37111A349650l39767l27597K4562k3430m10150m42697M4427M22232J89858l45544
$$ 1349650 1009883 682286 706848 683418 273268 -169429 -125002 297230 487088 141544
37101A41544m74757L2657N86684M21057l66956p66553k02667N33448M30759j27919
$$ 141544 -333213 -300556 286128 707185 340229 -426324 -628991 -95543 335216 207297
37091B07297l0365N78510M74505m16745o74565K29754R05784K86353o80812p42161
$$ 207297 176932 755442 1229947 813202 138637 368391 1274175 1560528 879716 137555
37081A37555l18166l88865o27811k27849L70173K34188k71673r4998O11979P98973
$$ 137555 -180611 -569476 -1197287 -1425136 -1054963 -820775 -1092448 -1187446 -575467 223506
37071B23506L65394J57958L35834K26877k54384m35300j74217p2127l07252l81511
$$ 223506 588900 746858 1082692 1309569 1055185 619885 445668 373541 66289 -315222
37061c15222j27823N0628L3379J38783L64677L38868O5987o7087j4669o1318j75746
$$ -315222 -443045 -392417 -359038 -220255 144422 483290 549277 482190 467521 406203 230457
37050B30457r7133P8308R6290R7233K59456K37623k27432n42132p8036N95564
$$ 230457 133324 211632 307922 405155 664611 902234 674802 132670 54634 650198
37040F50198M05569n05535r10673l18284M40907N60724K06798r7259k06151k05654
$$ 650198 1055767 550232 -360441 -678725 -237818 322906 529704 432445 226294 20640
37030B0640j26625j5360Q2907K14886L16929J50065k55091m70493l29620j90241
$$ 20640 -105985 -121345 -38438 176448 493377 643442 388351 -82142 -411762 -602003
37020f02003j65159J81251Q41633R47967J17185o60854m43543J81655J48123l22634
$$ -602003 -767162 -585911 255722 1203689 1320874 660020 216477 398132 546255 223621
37010B23621k97376J31280R6690m05021n06564K6342M82573L79896k5449l59390
$$ 223621 -73755 57525 154215 -250806 -757370 -731028 -248455 131441 105992 -253398
37000b53398m64796k56714R9065J45969j70747k62118J20649L81876J73925P9332
$$ -253398 -718194 -974908 -875843 -729874 -900621 -1162739 -1042090 -660214 -486289 -406957
36990d06957M42923N71991L8618l41729N7370M18006p1706o71649m21942J16301
$$ -406957 35966 607957 646575 304846 362216 780222 708516 36867 -385075 -268774
36980b68774J2173k59142J13355N10113K0329o57221l87481K68308J15154l84712
$$ -268774 -256601 -515743 -402388 107725 128054 -529167 -916648 -648340 -533186 -917898
36970i17898l4831P03600N21287k23946j49101N50636N21442j63602k31394L16032
$$ -917898 -952729 -249129 272158 48212 -100889 449747 971189 807587 576193 892225
36960H92225L38482j03130O0948N94236K56705p09971q28999n8758K05468k22495
$$ 892225 1230707 1127577 1188525 1782761 2039466 1329495 500496 441738 647206 424711
36950D24711j31982N65460O12826j13900l41178J31486R1882o30600p30549J21501
$$ 424711 292729 858189 1471015 1357115 1015937 1147423 1239305 608705 -121844 -343
36940c43O25011J29293m76726n53751m73765l32605K36738Q36684O94144J98231
$$ -343 624668 753961 277235 -276516 -750281 -1082886 -846148 -9464 684680 882911
36930H82911K46404M23130j82777r15039n58223K46965Q7206m50773J41027J188652
$$ 882911 1129315 1552445 1369668 454629 -103594 143371 230577 -220196 -79169 1109483
36920A109483R07219q4919K76399J507997J189652o43185j463284o26646l4599
$$ 1109483 2016702 1931783 2208182 3716179 4905831 4262646 2799362 2172716 2138117
36911B138117k94259k1807P71714M45095p61105p88078L24018M36879n14960m11884
$$ 2138117 1843858 1822051 2593765 3038860 2277755 1489677 1813695 2250574 1735614 1323730
36901A323730P31047O31003p13247q32805L81562L50552j104516j239230L05521
$$ 1323730 2054777 2685780 1972533 1139728 1521290 1871842 767326 -471904 -166383
36892a66383P49586l92986m13566J022827R49538r77017j355250O08723J481303
$$ -166383 583203 190217 -223349 799478 1749016 771999 -583251 25472 1506775
36883A506775Q6541m14134J090906J397884o15308j584611j14074O64950n33931
$$ 1506775 1593316 1179182 2270088 3667972 3052664 1468053 1353979 2018929 1484998
36874A484998p38214Q42363Q53639j170676j181213J321936J586649j165297j589559
$$ 1484998 746784 1589147 2442786 1272110 90897 1412833 2999482 1834185 244626
36865B44626J449382K077291j183036j823575K104768L415358m85696j802561
$$ 244626 1694008 3771299 2588263 764688 2869456 6284814 5799118 3996557
36857C996557K763379M908251Q85330j15456O048453Q663014L117186L015113
$$ 3996557 6759936 11668187 12553517 12438061 18486514 27149528 30266714 33281827
36849C3281827J4620678K0548631J2888632J9726537O1947481R9668795P0166147
$$ 33281827 47902505 68451136 81339768 101066305 163013786 262682581 332848728
36842C32848728k0261163r0685644q5791710l8882357j2723152j7197371j9815146
$$ 332848728 312587565 221901921 136110211 97227854 84504702 67307331 47492185
36835D7492185q604634j726384o667968r204547k842386J241642k580743n178794
$$ 47492185 38887551 37161167 30493199 21288652 18446266 19687908 17107165 11928371
36827A1928371j438619J356012j054036k598215P9578J510291r58834j965883
$$ 11928371 10489752 11845764 10791728 8193513 8273091 9783382 8824548 6858665
36819F858665R61333K601207L92842q01207J494964K470936o34154l137311j498126
$$ 6858665 7819998 10421205 10814047 10012840 11507804 13978740 13344586 10207275 8709149
36810H709149O05206m79883k068498q76010R73971M72945o62747O04677L369431
$$ 8709149 9314355 8834472 6765974 5889964 6863935 7336880 6674133 7278810 10648241
36801A0648241M589915L230233J21209l432375n280502l800432q25377L6508j362898
$$ 10648241 15238156 18468389 18589598 15157223 9876721 6076289 5250912 5287420 3924522
36792C924522j821453m25958K94141n50289o92667O23589J097378j09055p23193
$$ 3924522 2103069 1677111 1971252 1420963 728296 1351885 2449263 2340208 1617015
36783A617015K44524P22178k36602o59141K96575N87176o44587j206031M4185
$$ 1617015 1861539 2583717 2347115 1687974 1984549 2571725 1927138 721107 765292
36774G65292J016104K65726n56611j04715K95153l30967n74151L22397O28105
$$ 765292 1781396 2047122 1490511 1385796 1680949 1349982 775831 1098228 1726333
36765A726333n84630j390677l83906P91575M18542m71106l39639K70992L56938
$$ 1726333 1141703 -248974 -632880 158695 577237 106131 -233508 37484 394422
36756C94422L32270N36853J58828p89398q04107L48065P54452k90661q04702L52306
$$ 394422 726692 1263545 1422373 632975 -171132 176933 931385 640724 -163978 188328
36746A88328J300096M55026o96896l67421M58272Q1392r02190r95304l84113J9995
$$ 188328 1488424 1943450 1246554 879133 1337405 1418797 516607 -478697 -862810 -842815
36736h42815M42296J178354J314034L72164l78147J3250M83458o032n43140j38522
$$ -842815 -400519 777835 2091869 2464033 2085886 2099136 2582594 2576562 2033422 1894900
36726A894900L02300k26333q09172l54701K85578l0049m98879J13507J082374
$$ 1894900 2197200 1970867 1161695 806994 1092572 1062523 563644 677151 1759525
36717A759525R35726q5275p21777p95571q07114n07754L52387Q74366L18721m29474
$$ 1759525 2695251 2609976 1888199 1092628 285514 -222240 130147 1004513 1323234 893760
36707H93760l07741R8287j85126n80976p7386P42596O49224r6074l49203r4631
$$ 893760 586019 684306 499180 -81796 -159182 583414 1232638 1136564 787361 692730
36697F92730j20765l52451j83403J17383p1148l51216K97N12021K35682m83026
$$ 692730 571965 219514 36111 153494 82346 -268870 -268573 243448 479130 -3896
36687c896m83388K86267P54240M30465j27039l88076l33564n6246K46420J79032
$$ -3896 -487284 -201017 553223 983688 856649 468573 135009 78763 325183 504215
36677E04215k19859k39846L93165Q31546L46283m51178n30050P9795O23218P75951
$$ 504215 284356 44510 437675 1269221 1615504 1164326 634276 714071 1337289 2113240
36667B113240N99551M1009o45201o96523N9064O61893M49105J54800N86755J113129
$$ 2113240 2712791 2753800 2108599 1412076 1471140 2133033 2582138 2736938 3323693 4436822
36657D436822O84913l73447q93602o56372m16902n07316n40265k63901K08845
$$ 4436822 5121735 4748288 3854686 3198314 2781412 2274096 1733831 1469930 1678775
36648A678775P68357J162230Q74275j26573r67664r17064l72813j35024k36451
$$ 1678775 2447132 3609362 4483637 4357064 3389400 2472336 2099523 1964499 1728048
36639A728048k20516n6355k8256j35556k27352l28138l74767j43510K12645K15504
$$ 1728048 1507532 1451177 1422921 1287365 1060013 731875 357108 213598 426243 641747
36629F41747o3628k1575L07120J58911m98660o52892L3605M96975L7117m94271
$$ 641747 578119 556544 863664 1022575 523915 -128977 -95372 401603 438720 -55551
36619e5551k14855L19535K51405r8883m9426J43209l5751k68078j06328O6978
$$ -55551 -270406 49129 300534 201651 152225 295434 259683 -8395 -114723 -47745
36609d7745j66129l42131q09L69790K46238K9438J44886J62473k13701l32691
$$ -47745 -213874 -556005 -556814 -187024 59214 88652 233538 396011 182310 -150381
36599a50381J89268N40289R4520m12166k32933O8598j18288j55571M73432Q10751
$$ -150381 38887 579176 673696 261530 28597 97195 -21093 -176664 296768 1107519
36589A107519M7062p52631l29457N12896K77856n97078n71045L05948O47657J55697
$$ 1107519 1154581 401950 72493 585389 863245 266167 -304878 1070 648727 804424
36579H04424k31096k16618k76706k73139K33841O62163J93462n37178l65658K64502
$$ 804424 573328 356710 80004 -193135 40706 702869 896331 359153 -6505 257997
36569B57997N9819o79337n34361L95468O15304n7675k20445M94948P93202J20794
$$ 257997 317816 -361521 -895882 -500414 114890 57215 -163230 331718 1124920 1245714
36559A245714m43073k66579j29786m42017l92531L31098P17146J79905m22038
$$ 1245714 802641 536062 406276 -35741 -428272 -97174 619972 799877 377839
36550C77839l45836p9457r3700P6038O24417P21238p0717q29764o94857j68706
$$ 377839 32003 -47454 -141154 -65116 559301 1280539 1209822 380058 -314799 -483505
36540d83505n8462j29353J88198O12727N41852J11897j62861k69763m48363n42747
$$ -483505 -541967 -671320 -483122 129605 671457 783354 620493 350730 -97633 -640380
36530f40380k90790J26747L69709M10555L27654M7873l50202n00121k34001J66222
$$ -640380 -931170 -804423 -434714 -24159 303495 351368 1166 -498955 -732956 -566734
36520e66734M03090M52178L13159n6342m54850n37253k66161J09982M21344N21319
$$ -566734 -163644 288534 601693 545351 90501 -446752 -712913 -602931 -181587 339732
36510C39732J80021m17378n06420J86431P25636K62199n12881m15182K56219K82642
$$ 339732 519753 102375 -404045 -217614 508022 770221 257340 -157842 98377 381019
36500C81019k99616l34948K43618K50703m81353o24604K79916Q56222J70777p15160
$$ 381019 81403 -253545 -9927 240776 -240577 -865181 -585265 270957 441734 -273426
36490b73426n57945J71849M07784K39294K70168K87030j22545m74693j82162K57499
$$ -273426 -831371 -659522 -251738 -12444 257724 544754 422209 -52484 -234646 22853
36480B2853P4367l85391k78963K32486L05867j02336k25904J97681N99937N25686
$$ 22853 97220 -288171 -567134 -334648 -28781 -131117 -357021 -159340 440597 966283
36470I66283J22661k61225l63283l6519M78570N58002k3640o37451o36835k44627
$$ 966283 1088944 827719 464436 427917 906487 1464489 1440849 803398 166563 -78064
36460g8064l4120J0243K10341L94311J92023j65627j72195L2723r8207m82942
$$ -78064 -112184 -101941 108400 502711 694734 529107 356912 389635 291428 -191514
36450a91514m75802J1939L01244L5667k69736r0799L01419L22471m9935l30146
$$ -191514 -667316 -655377 -354133 -318466 -588202 -679001 -377582 -55111 -105046 -435192
36440d35192k42432J1099J41973J21771P8328N5434J6345l450Q4014K34337K62886
$$ -435192 -677624 -666525 -524552 -402781 -324453 -269019 -252674 -256124 -172110 62227 325113
36429C25113R6865j00117j50227p2105K2634O7382k2739l00603n33923l45476
$$ 325113 421978 321861 171634 99529 122163 189545 166806 -133797 -667720 -1013196
36419a013196J58241L17526j37673n23178j52111N42198N96899m761l32492L1893
$$ -1013196 -854955 -537429 -675102 -1198280 -1350391 -808193 -211294 -216055 -548547 -516654
36409e16654M32661K60333j50075j45693K74210N56796L56819j20209l82896j48014
$$ -516654 -83993 176340 26265 -119428 154782 711578 1068397 948188 565292 417278
36399D17278K99325L29530k21635o92378m32489K51926N27332J95675k05981l23699
$$ 417278 716603 1046133 824498 132120 -300369 -48443 478889 674564 468583 144884
36389A44884l03859k44119l4139K21509K58591J55714J92052K56252L1392l20542
$$ 144884 -158975 -403094 -437233 -215724 42867 198581 390633 646885 678277 357735
36379C57735l52976j08554L8512J50891M82001O49081J04059o58482n72436K40442
$$ 357735 4759 -103795 -65283 85608 567609 1216690 1320749 662267 89831 330273
36369C30273M83188k61083q23970l27638N04480O51895K88295Q1079n1762m77764
$$ 330273 813461 552378 -271592 -599230 -94750 557145 845440 926519 874757 396993
36359C96993q38031n18199K69952P17522M84439n8120l94338k49078K73914O40550
$$ 396993 -441038 -959237 -689285 28237 512676 454556 60218 -188860 85054 725604
36349G25604L76476k14660l83258r0749m0425l82288m02122J31161M33568J10059
$$ 725604 1102080 887420 504162 413413 372988 -9300 -411422 -280261 153307 263366
36339B63366o2305M32083P56823J28342o80821n06283L17440N90333J95183q526
$$ 263366 201061 633144 1389967 1518309 837488 331205 648645 1238978 1434161 1425635
36329A425635J32190m7434n68541o48281j35525J58295j40237l48706N9510N60406
$$ 1425635 1557825 1510391 941850 293569 158044 316339 176102 -172604 -113094 447312
36319D47312M30937j93534o29809n29153l9642N09912P43020M09613k43778n60198
$$ 447312 878249 684715 54906 -474247 -513889 -3977 739043 1148656 904878 344680
36309C44680k20833L21602M18767L0168l37038l54467k01844j51321j39289L6821
$$ 344680 123847 445449 864216 894384 557346 202879 1035 -150286 -289575 -252754
36299b52754K79494K83585N6582k8532J65627K76978M1076k45095k37918j27128
$$ -252754 26740 310325 366907 338375 504002 780980 822056 576961 339043 211915
36289B11915j95380j97412J61580M90600K75770j06775Q5458N92978M35285m11958
$$ 211915 16535 -180877 -19297 471303 747073 640298 725756 1318734 1754019 1342061
36279A342061q29586l14000K55255P9533m05644m59072j83413n7409q1315m7057
$$ 1342061 512475 198475 453730 533263 127619 -331453 -514866 -572275 -653590 -700647
36269g00647l0518p7795j452J26511j8092k25781J15485P81693P31169j49030
$$ -700647 -731165 -808960 -810412 -683901 -701993 -927774 -812289 -30596 700573 551543
36259E51543n88440M2398N90877L2835p69000n51755K14411K52756k97903k90019
$$ 551543 -36897 5501 596378 629213 -139787 -691542 -477131 -224375 -522278 -812297
36249h12297L27572N25194R3254q1312L42309O62077M24735p865l39958o86261
$$ -812297 -484725 40469 133723 52411 394720 1056797 1481532 1473667 1133709 447448
36239D47448q86765n25912J69671M11024L7449k41469N28L30306K75671m800j45725
$$ 447448 -439317 -965229 -795558 -384534 -347085 -588554 -588026 -257720 17951 13151 -132574
36228a32574r4931J2819P0070j0897j66710j11947K35399M58342K06317k07043
$$ -132574 -227505 -214686 -144616 -155513 -322223 -434170 -198771 259571 465888 258845
36218B58845k62877M029K24547L20800L48032J15858l97916o76766l88831k8861
$$ 258845 -4032 -3 224544 545344 893376 1009234 611318 -65448 -454279 -483140
36208d83140j12530k49073J33223O60177O00005J38282J0783K18213J78296j39591
$$ -483140 -595670 -844743 -711520 -51343 548662 686944 697727 915940 1094236 954645
36198I54645k99649l34418n21812n31638P1139P53573O34034p0058m17106k91329
$$ 954645 654996 320578 -201234 -732872 -661733 91840 725874 655816 238710 -52619
36188e2619k85948l22710J42369P00585L71442n76034p90182P560O25675M28932
$$ -52619 -338567 -661277 -518908 181677 553119 -22915 -813097 -805537 -179862 249070
36178B49070J48274K58394J64748l91423o43397k44279L071l48710m96250J20047
$$ 249070 397344 655738 820486 429063 -214334 -458613 -455542 -804252 -1300502 -1180455
36168a180455O88059M06852j04257J12363P41410P81314J14821m97816n51966
$$ -1180455 -492396 -85544 -189801 -77438 663972 1445286 1560107 1062291 510325
36159E10325j49158L83694O30846K68789m31348p45691m51384o8566M2321O8555
$$ 510325 361167 744861 1375707 1644496 1213148 467457 16073 -52493 -10172 58383
36149E8383N3453k39183n15273q8962P90747R22976p281p74247m63312K21199
$$ 58383 111836 -127347 -642620 -731582 59165 982141 974860 200613 -262699 -41500
36139d1500L09498N3113Q7091J79641q6131k95162J2421L19919J086m89111l69580
$$ -41500 267998 321111 408202 587843 501712 206550 218971 538890 539976 50865 -318715
36128c18715J45393L18691J13072l4791r5488j79713k514M72025N29813j87546
$$ -318715 -173322 145369 258441 223650 128162 -51551 -54065 417960 947773 760227
36118G60227q08398n16855N2753q8725n33478k24630O11198Q04076J99467k19257
$$ 760227 -48171 -565026 -512273 -600998 -1134476 -1359106 -747908 56168 255635 36378
36108C6378n2518P9977j36051k38405o970J53202M7187j5461R1461J25622L9983
$$ 36378 -16140 63837 -72214 -310619 -317589 -164387 -117200 -132661 -41200 84422 124405
36097A24405J9504J935j67331k75395j19809m3619l33082m82278M3316P26907
$$ 124405 143909 145844 -21487 -296882 -416691 -460310 -793392 -1275670 -1232354 -505447
36087e05447P04028J57111r2380n71r7621k24222J67759O91868M54168l02019
$$ -505447 198581 355692 263312 262741 165120 -59102 108657 800525 1254693 952674
36077I52674m61627N9198K06897l06079n69401j98880Q9717J0637K18014P57906
$$ 952674 491047 550245 757142 451063 -118338 -317218 -227501 -216864 1150 759056
36067G59056O13477m60044j152617n60979M20757O46525L78891L31059K52965
$$ 759056 1372533 912489 -240128 -801107 -380350 266175 645066 976125 1229090
36058A229090k80829o78768k60472L91376K97492l18514n31404k74471j59546
$$ 1229090 948261 269493 9021 400397 697889 379375 -152029 -426500 -586046
36049e86046j75259J73800O99271P06032K05891j30566j39881k50958m72400l39991
$$ -586046 -761305 -587505 111766 817798 1023689 893123 753242 502284 29884 -310107
36039c10107Q2928J60550k04333l42118N8387M40590L24082J6084l2036K8536
$$ -310107 -227179 -66629 -270962 -613080 -554693 -114103 209979 226063 194027 222563
36029B22563j74966n18263n22697l6892N58915P71407M64106l2926k43578n0194
$$ 222563 47597 -470666 -993363 -1030255 -471340 300067 764173 731247 487669 437475
36019D37475J75194N6361l00172m96832l82009j35389P1014J99877J95254l098
$$ 437475 612669 669030 368858 -127974 -509983 -645372 -574358 -374481 -179227 -182325
36009a82325k85368m32972l60470j49405J00705L09881L91994L34427K18326P6430
$$ -182325 -467693 -900665 -1261135 -1410540 -1309835 -999954 -607960 -273533 -55207 21223
35999B1223j10566k10878k127M27651O42755M28252R7784J717M6111j3391j12314
$$ 21223 -89343 -300221 -302348 125303 768058 1196310 1294094 1295811 1341922 1328531 1216217
35988A216217n2388J26014K74588L97676N00416M73641M06735O24726J065095
$$ 1216217 1163829 1289843 1564431 1962107 2462523 2936164 3342899 3967625 5032720
35979E032720J077569L26398n56579q08139o06919o25973q87444q73022n20516
$$ 5032720 6110289 6436687 5880108 5071969 4465050 3839077 2951633 2078611 1558095
35970A558095k42261r3723J87944L89634K2779o29944o68744m22L78159q4998
$$ 1558095 1315834 1222111 1410055 1799689 1822468 1192524 523780 523358 901517 816519
35960H16519o17042l72022K39485K59254l17955o06241j71592M32346N04961O1861
$$ 816519 199477 -172545 66940 326194 8239 -598002 -769594 -337248 167713 229574
35950B29574k99795j64049K22784K73380j33818m09855q9976L77259K36896l63552
$$ 229574 -70221 -234270 -11486 261894 128076 -281779 -371755 5504 242400 -121152
35940a21152n50497j07748K29139Q3884O3048N70166R25260M33559l99816o18343
$$ -121152 -671649 -779397 -550258 -466374 -403326 166840 1092100 1525659 1125843 507500
35930E07500k45060l1120j48486j01802K37859M33715L00252J33501R3983L9898
$$ 507500 262440 231320 82834 -18968 218891 652606 952858 1086359 1180342 1220240
35920A220240q857J16095K45605L3150l79769m83676k20057n6334j86446k81639
$$ 1220240 1211383 1327478 1573083 1606233 1226464 742788 522731 466397 279951 -1688
35910a688j37193L0535N9201O8146J08958R9868J43801L70651M94897J69698k72592
$$ -1688 -138881 -108346 -49145 19001 127959 227827 371628 742279 1237176 1406874 1134282
35899A134282k07594J78118J05041m00688m33712J71335L65231l61402r37330
$$ 1134282 926688 1104806 1209847 809159 375447 546782 912013 550611 -386719
35890c86719l61715O12960O33930j57766n11147r3269K41858O2834r0350J06593
$$ -386719 -748434 -135474 498456 340690 -170457 -263726 -21868 40966 -49384 57209
35880E7209K14649q527j12449J46903K58569j72024o71181n79183j5071L62754
$$ 57209 271858 263331 150882 297785 556354 384330 -286851 -866034 -881105 -518351
35870e18351K49542q4950k58341j26482J82331L72126K50778j7331j22083o6868
$$ -518351 -268809 -353759 -612100 -738582 -556251 -184125 66653 49322 -72761 -139629
35860a39629j00951j97882n2280K94764L23781k11899q21252q85546m13826J20419
$$ -139629 -240580 -438462 -490742 -195978 127803 -84096 -905348 -1790894 -2204720 -2084301
35850b084301M09564M53606L22422J36473J23892L59865N41628L20062j79695
$$ -2084301 -1674737 -1221131 -898709 -762236 -638344 -278479 263149 583211 403516
35841D03516m15886n0497O06571Q29278K09715p74471j093832l32225O42303O37591
$$ 403516 -12370 -62867 543704 1372982 1582697 808226 -285606 -617831 24472 662063
35831F62063k89372q66572l66317M24852M55724p7535k46738O5003J29764k59051
$$ 662063 372691 -493881 -860198 -435346 20378 -57157 -303895 -238892 -109128 -368179
35821c68179m25255j3250L73901J90566j49450q541L94664L78145p2209l45053
$$ -368179 -793434 -806684 -432783 -242217 -391667 -400208 -5544 372601 300392 -44661
35811d4661k30900j22465j71836m3832K87664K81632k20106m97048j5534O01564
$$ -44661 -275561 -398026 -569862 -613694 -326030 -44398 -264504 -761552 -777086 -175522
35801a75522M57769k00510l94275J686J61694j84932l07839J33770L78950j15249
$$ -175522 282247 81737 -312538 -310852 -149158 -334090 -641929 -508159 -129209 -244458
35791b44458o20067k84951M26884M95289o863j63410J89902L11968l9062j90874
$$ -244458 -864525 -1149476 -722592 -227303 -234166 -397576 -207674 104294 65232 -125642
35781a25642K40670P07507O29444J62724k63381n06945n07058j48051L56140N01523
$$ -125642 115028 822535 1451979 1614703 1351322 844377 337319 189268 545408 1046931
35771A046931J93384j10164j39638j20882j78790j02641P8673n512l34628l95127
$$ 1046931 1240315 1130151 990513 869631 690841 588200 666873 661361 326733 -68394
35761f8394r3060L0624j77954j55114K41763K63852m02866q34697k72828N61881
$$ -68394 -161454 -130830 -308784 -463898 -222135 41717 -361149 -1195846 -1468674 -906793
35751i06793N93620O5931o1606K50364L49412K58952M60923O34177L8459r40397
$$ -906793 -313173 -247242 -308848 -58484 290928 549880 1010803 1644980 1683439 743042
35741G43042j046764p1121Q00959P70666L09972j4847l37269o65077m75675K38988
$$ 743042 -303722 -374843 426116 1196782 1506754 1491907 1154638 489561 13886 252874
35731B52874N76925O4674n35609m56154p5174o7967k36036o9463K17067J57197
$$ 252874 829799 894473 358864 -97290 -172464 -240431 -476467 -545930 -328863 -171666
35721a71666j1931J69796L89506L6909o23463p41379j87599L55820N35775O39235
$$ -171666 -183597 -13801 375705 412614 -210849 -952228 -1139827 -784007 -248232 391003
35711C91003P31478M10785l34427q14492n62640R563K47031P8942j39536k21361
$$ 391003 1122481 1533266 1198839 384347 -178293 -168730 78301 157243 17707 -203654
35701b03654k00383o5984J72048K98367J04407k51647l50656k0048M19126M97275
$$ -203654 -404037 -470021 -297973 394 104801 -146846 -497502 -517550 -98424 398851
35691C98851J32529k77571l32757q7987J02046R7611O6501P9742j6966k08026
$$ 398851 531380 253809 -78948 -166935 -64889 32722 99223 178965 161999 -46027
35681d6027j80846J51191L71001J67640j05313M8439M40806M60039L0911k98520
$$ -46027 -226873 -75682 295319 462959 357646 406085 846891 1306930 1337841 1039321
35671A039321k48560j79831m00378o27431m40378R1035N31859O01204L42464k0626
$$ 1039321 790761 610930 210552 -416879 -857257 -766222 -234363 366841 709305 688679
35661F88679k11734p6108K05962K43714r8965n21393o46481l78885J25938N86248
$$ 688679 476945 400837 606799 850513 751548 230155 -416326 -795211 -669273 -83025
35651h3025O51048J86645l79527l87043J97057O39817M12589j19367l20803j72241
$$ -83025 568023 754668 375141 -11902 185155 824972 1237561 1118194 797391 625150
35641F25150n1753n471J44392K09317j39749o35061o14400k2916M60179M34262
$$ 625150 573397 567926 712318 921635 781886 146825 -467575 -490491 -30312 403950
35631D03950K42539K00856P0090l05753m93648j64821K38194J73790r3454J0561
$$ 403950 646489 847345 917435 611682 118034 -46787 191407 365197 271743 282304
35621B82304L13757K00333k09464j50546M40718O45908k1522p84473p44396j61340
$$ 282304 596061 796394 586930 436384 877102 1523010 1501488 717015 -27381 -188721
35611a88721J12190l7878n1248J89967J96343j64020l43212p403L81253K66260
$$ -188721 -76531 -114409 -165657 24310 220653 56633 -286579 -293982 87271 353531
35601C53531j65000l04470l2761J68213l6196l71834l64998K2892L57184K72196
$$ 353531 188531 -115939 -148700 19513 -16683 -388517 -753515 -730623 -373439 -101243
35591a01243q3382k08293J55874O61565O81560K3083p73082r53906l68644L53483
$$ -101243 -184625 -392918 -237044 424521 1106081 1129164 356082 -597824 -966468 -612985
35581f12985N13994J33668j49779M5121L57327K52623j74233l47074p1382K12244
$$ -612985 -98991 34677 -115102 -69981 287346 539969 365736 18662 -52720 159524
35571A59524J39864n6984m687K08334K43537O3063j25942k69103l79863k46580
$$ 159524 299388 242404 237717 446051 689588 752651 626709 357606 -22257 -268837
35561b68837K50153O44403L52342l28977m11267L39010Q73190L07125p19925r17811
$$ -268837 -18684 625719 978061 649084 237817 576827 1450017 1757142 1037217 119406
35551A19406k00389K91703l2414m43906k28794J50854n9944n34125l38526M92184
$$ 119406 -80983 210720 178306 -265600 -494394 -343540 -403484 -937609 -1276135 -783951
35541g83951Q85409L35518l49524k89172K41787M06687P6022j94375j34802l657
$$ -783951 101458 436976 87452 -201720 40067 446754 522776 328401 193599 189942
35531A89942K0113N3571J30395J38813J38708K55706K98256L964l83377l87619
$$ 189942 210055 263626 394021 532834 671542 927248 1225504 1229468 846091 458472
35521D58472j25634j49728m22846k96838K78949M67072r0045n39614j54353M28448
$$ 458472 332838 183110 -239736 -536574 -257625 209447 119402 -420212 -574565 -146117
35511a46117K27089m65514n69351N8019N16759L52593O4237N4737O0371j49549
$$ -146117 80972 -384542 -953893 -895874 -379115 -26522 37715 92452 152823 3274
35501C274l28562k87691k02523j52251M0303L21331L53862J14203m4785l3007
$$ 3274 -325288 -612979 -815502 -967753 -927450 -606119 -252257 -138054 -182839 -215846
35491b15846q8477j36509J55546N67781M47835j38584l40534M6367J44001m50660
$$ -215846 -304323 -440832 -285286 282495 730330 591746 251212 297579 441580 -9080
35481i080p87198j13446P06047M81918l66690n09830J62127N37132K04093p1112
$$ -9080 -796278 -909724 -203677 278241 -88449 -598279 -436152 100980 305073 233961
35471B33961J15519J64469k62010n33105j64952L35716L65971J49467J16216P8564
$$ 233961 349480 513949 251939 -281166 -446118 -110402 255569 405036 521252 599816
35461E99816k48816m89975j58955M27548N54261J68020j72193k23392k42734l30282
$$ 599816 351000 -138975 -297930 129618 683879 851899 679706 456314 213580 -116702
35451a16702k60883m976J69744J96305K81638L92942K05568k73420n44863l29933
$$ -116702 -377585 -382561 -212817 -16512 265126 658068 863636 590216 45353 -284580
35441b84580J5164R9329Q0271K51393M15833J90714k81615m82375l06151j57270
$$ -284580 -269416 -170087 -89816 161577 577410 768124 486509 4134 -302017 -459287
35431d59287k09813j17560L23412O94497N08595m9029l44832j35274J87222J70549
$$ -459287 -669100 -786660 -463248 231249 739844 690815 345983 210709 397931 568480
35421E68480j74481m85642m78936j88310J18557K23471J85568K28432L75950L73595
$$ 568480 393999 -91643 -570579 -758889 -640332 -416861 -231293 -2861 373089 746684
35411G46684R0294k13770k48726j34428j61551k57208j01625K54845L49099l136
$$ 746684 836978 623208 374482 240054 78503 -178705 -280330 -25485 323614 320478
35401C20478l76977l15636P2419L41140K91135O1129j86000l79894m22555k10353
$$ 320478 -56499 -372135 -299716 41424 332559 393688 207688 -172206 -594761 -805114
35391h05114J90692N23445N33825J78826l05378n48057l67681K7985K65252K13461
$$ -805114 -614422 -90977 442848 621674 316296 -231761 -599442 -571457 -306205 -92744
35381i2744M9098k8378M5033K58635M92711M73453P1698l78653m15212q9448J37430
$$ -92744 -43646 -72024 -26991 231644 724355 1197808 1269506 890853 475641 386193 523623
35370E23623J31774J82305K85483J2091o34070r16476m11360K52189L10950m729
$$ 523623 655397 837702 1123185 1135276 501206 -415270 -826630 -574441 -263491 -268220
35360b68220l737K48669J52809k34748k28879K60199M87283O7355m35369m51612
$$ -268220 -271957 -23288 129521 -105227 -334106 -73907 413376 480731 45362 -406250
35350d06250k09761j70327k69797k05596P472K24294M92617P48473O05241n5236
$$ -406250 -616011 -786338 -1056135 -1261731 -1254259 -1029965 -537348 211125 816366 761130
35340G61130o46356n81051j19723O4105p9801l8131K96178M41712J91002k6991
$$ 761130 114774 -466277 -586000 -521895 -601696 -639827 -343649 98063 289065 262074
35330B62074J02010K30832o5135n60930o76635k78393K12871M13099L39880K07576
$$ 262074 364084 594916 529781 -31149 -707784 -986177 -773306 -360207 -20327 187249
35320A87249J28426O8519m4151j94868k25699p248K70336J99799k55398n27305
$$ 187249 315675 384194 340043 145175 -80524 -87772 182564 382363 126965 -400340
35310d00340j61218M19545L89570k73040o91927l82153M8814o1931l31110j7452
$$ -400340 -561558 -142013 247557 -25483 -717410 -1099563 -1050749 -1112680 -1443790 -1461242
35300a461242O21811O52477L2285k24169L15273P54502L27835l33469k61977K35565
$$ -1461242 -839431 -186954 -154669 -378838 -63565 690937 1018772 685303 423326 658891
35290F58891J40781n05447o42012L5566N72292L25346q6490L2933K99178O9814
$$ 658891 799672 294225 -347787 -312221 260071 585417 498927 531860 831038 900852
35280I00852l41075k47540J14613m0573o09690o48220O9016N94114K61894l14651
$$ 900852 559777 312237 426850 386277 -223413 -871633 -802617 -208503 53391 -261260
35270b61260k68682K22056L81110R0103r8352L4341J37643L3162j8691Q3146M0486
$$ -261260 -529942 -307886 73224 163327 64975 99316 236959 270121 251430 334576 375062
35259C75062k42945l56190k7715L43239K33079k09756l81185r9958J81962N7076
$$ 375062 132117 -224073 -251788 91451 324530 114774 -266411 -366369 -184407 -127331
35249a27331l15278m61068j32967M70104Q61165O48546m3821n67214m09511J45406
$$ -127331 -442609 -903677 -1036644 -566540 294625 943171 899350 332136 -77375 68031
35239F8031L38570l6323l36172k1459M99771M36167k05697n99064k97833J38715
$$ 68031 406601 370278 34106 12647 512418 948585 742888 143824 -154009 -15294
35229a5294M3453l14389j57737N37253R07127M48173k48923l96357j23720j00647
$$ -15294 28159 -286230 -443967 93286 1000413 1448586 1199663 803306 679586 578939
35219E78939l80468l85713J7564K47102J6266j31135K70446P77059O88763R1543
$$ 578939 198471 -187242 -169678 77424 93690 -37445 233001 1010060 1698823 1790366
35209A790366l80262n06398n51562n82896l94786m6284J39705J09903Q8608R9156
$$ 1790366 1410104 903706 352144 -230752 -625538 -671822 -532117 -422214 -333606 -234450
35199b34450K351p6759N8433J69775n4822k53507J57841Q13804O83354k93871
$$ -234450 -232099 -308858 -250425 -80650 -135472 -388979 -231138 582666 1266020 972149
35189I72149r23293n13752J35414J20570k02786q8983K37660J28647k31564k17638
$$ 972149 48856 -464896 -329482 -208912 -411698 -500681 -263021 -134374 -365938 -583576
35179e83576M9536K0588j24080J98917O96883M85320l41865o63359q7423M08719
$$ -583576 -534040 -513452 -637532 -438615 258268 743588 401723 -261636 -349059 59660
35169E9660M9609n61973m94976R0688L55427R8314j07996J19222M94722N37679
$$ 59660 109269 -452704 -947680 -856992 -501565 -403251 -511247 -392025 102697 640376
35159F40376J56906k72507l05971M3643K41609p9751n14317m10540R1918K02804
$$ 640376 797282 524775 218804 262447 504056 424305 -90012 -500552 -408634 -205830
35149b05830k59326m98218K6865O82973N48817k46894p18325l37052M10554P29661
$$ -205830 -465156 -963374 -936509 -253536 295281 48387 -669938 -1006990 -596436 133225
35139A33225L69797k45330m97965j90610K32907K08583j87172l05079J48548O55267
$$ 133225 503022 257692 -240273 -430883 -197976 10607 -176565 -481644 -333096 322171
35129C22171O09788J34675j82443r5997J30053J95726P0319r6779j52591j03762
$$ 322171 931959 1066634 884191 788194 918247 1113973 1184292 1087513 934922 831160
35119H31160j77674n20207q11590n59865J25828N42242L79966J45837K56513L30841
$$ 831160 653486 133279 -678311 -1238176 -1112348 -570106 -190140 -44303 212210 543051
35109E43051m8779m32809j51535M95733N82907m7328n93479n25186j83561L386
$$ 543051 494272 61463 -90072 405661 988568 941240 347761 -177425 -360986 -357600
35099c57600J32779L49642M12133J37662k00566l00985k54252j99458K1070M53233
$$ -357600 -224821 124821 536954 674616 474050 173065 -81187 -280645 -259575 193658
35089A93658O48616K03826n28710p79611l46897J95002K82478k1734k91236l08242
$$ 193658 842274 1046100 517390 -262221 -609118 -414116 -131638 -153372 -444608 -752850
35079g52850k00740j68340k33070k35528k1902L56918O46673O29666L47307M8331
$$ -752850 -953590 -1121930 -1355000 -1590528 -1612430 -1255512 -608839 20827 368134 416465
35069D16465o0580J3396R0106P644j90407k70560q9821J64592J66069r5796k43029
$$ 416465 355885 369281 459387 467031 276624 6064 -83757 80835 246904 151108 -91921
35058i1921q390L62116L97617O070m11945m41354q7216K80082K98308o8060m85142
$$ -91921 -100311 261805 659422 665492 253547 -187807 -275023 5059 303367 235307 -249835
35047b49835n48422k22975P6162j0069k81412k32737K03635N09404L12144o2911
$$ -249835 -798257 -1021232 -945070 -955139 -1236551 -1469288 -1265653 -756249 -444105 -507016
35037e07016o5713K85287M75716K65538m6845j73568k13797k92285k19932J35390
$$ -507016 -572729 -287442 188274 453812 406967 233399 19602 -272683 -492615 -357225
35027c57225M18121J91898l19676l98375J68633P13462N83051N3223q1028L40927
$$ -357225 60896 252794 -66882 -465257 -296624 416838 999889 1053112 972084 1313011
35017A313011O13070J63495o61764j084107q48002l25749J33853M93053O83117
$$ 1313011 1926081 2089576 1427812 343705 -504297 -830046 -696193 -203140 479977
35008D79977M83345m7390m04040k19855K21723L65593Q6473k92907n06862n25318
$$ 479977 963322 915932 511892 292037 513760 879353 965826 672919 166057 -359261
34998c59261l67427j04626N0270J0562M1199L24678M92889J36030l75018k85424
$$ -359261 -726688 -831314 -781044 -770482 -729283 -404605 88284 224314 -150704 -436128
34988d36128L38681O14472K08310j72571o522K09252n7947l61307n7367M97043
$$ -436128 -97447 517025 725335 552764 546242 755494 697547 336240 278873 775916
34978G75916M56762j73317o17656n27161k43223n492K70191M69801L19988k8024
$$ 775916 1232678 1059361 441705 -85456 -328679 -334171 -63980 405821 725809 697785
34968F97785j37699k225L0680k9958R7302K56342M2514l29016k31074K49294L32941
$$ 697785 560086 557861 588541 558583 655885 912227 954741 625725 394651 643945 976886
34957I76886j56461m95192l06029r7080j84491j02025L79809O30317K41462j62234
$$ 976886 820425 325233 19204 -77876 -262367 -364392 15417 645734 887196 724962
34947G24962M418K21809j98842q08794p08805m7628K70392P9634N4395M11158
$$ 724962 729380 951189 752347 -56447 -765252 -812880 -542488 -462854 -408459 2699
34937B699N52258J18111m73548p33273o40301l06863K38162P13830O40778L8424
$$ 2699 554957 673068 199520 -533753 -1174054 -1480917 -1242755 -528925 111853 150277
34927A50277l95390j29244N03131P47007L44985k67076n71160n17989m07477l61867
$$ 150277 -245113 -374357 128774 875781 1220766 953690 382530 -135459 -542936 -904803
34917i04803j48223L60433P87257O72159J72674j29002q8454q8900k27963j52487
$$ -904803 -1053026 -692593 94664 766823 939497 810495 722041 633141 405178 252691
34907B52691Q6930j26397q32616j066319k72074O54690O57249J52963K49603Q38433
$$ 252691 339621 213224 -619392 -1685711 -1957785 -1303095 -645846 -492883 -243280 595153
34897E95153Q06529k3089n40431j23898M49750K97967l36845o75756m96005j23439
$$ 595153 1401682 1378593 838162 714264 1164014 1461981 1125136 449380 -46625 -170064
34887a70064J43654J88148L8568o4323Q4604K59196R1266k61128l12053r2306
$$ -170064 -26410 161738 200306 135983 220587 479783 571049 309921 -2132 -94438
34877i4438q7113l00121k02157K53270M58258K38864J66340M12814L17089l30911
$$ -94438 -181551 -481672 -683829 -430559 27699 266563 432903 845717 1162806 831895
34867H31895o03770J13973Q87676N26911n42755r17865l31057J49437p2364l69704
$$ 831895 228125 342098 1229774 1756685 1213930 296065 -34992 114445 42081 -327623
34857c27623j52684K25099K52249Q3367N0990K9389j48860j77986J94413N09450
$$ -327623 -480307 -255208 -2959 80408 131398 160787 11927 -166059 28354 537804
34847E37804J49550o32975r23511m03035K33537L20231J09449J89775M37172K12835
$$ 537804 687354 54379 -869132 -1272167 -1038630 -718399 -608950 -419175 17997 230832
34837B30832m89358q20738k63959N46687O81061J87961j20466M3349J20301k43116
$$ 230832 -258526 -1079264 -1343223 -796536 -115475 72486 -47980 -4631 115670 -127446
34827a27446n45450k19032M37740O39370J85775l31937l49253L1543K88957J28651
$$ -127446 -672896 -891928 -454188 185182 370957 39020 -310233 -278690 10267 138918
34817A38918k33622l51609m2195M21868O27763M53029P2407l51446p29337q43329
$$ 138918 -94704 -446313 -488508 -66640 561123 1014152 1086559 735113 5776 -837553
34807h37553m57208K31601N82925K33321l70230m57625J15236O80262N65542j04409
$$ -837553 -1294761 -1063160 -480235 -246914 -617144 -1074769 -959533 -279271 286271 181862
34797A81862n59448k92503L46685O01134K51777j84440k55924j65505k61902l38605
$$ 181862 -377586 -670089 -323404 277730 529507 345067 89143 -76362 -338264 -676869
34787f76869L517N12011M97993q5972m75464j97537K93324M01998K26612J51614
$$ -676869 -673352 -161341 336652 250680 -224784 -422321 -128997 273001 499613 651227
34777F51227J07131j73631m79579l47599J53188M40732K41979q5017j42943r352
$$ 651227 758358 584727 105148 -242451 -89263 351469 593448 508431 365488 356136
34767C56136O777j60026k98529k25476J6847K20095K19888P4580K009Q3118J15825
$$ 356136 362913 202887 -95642 -321118 -304271 -84176 135712 210292 212301 295419 411244
34756D11244j01095l99288l61000J30764O25072N56860n5052n46163l61975K49403
$$ 411244 310149 -89139 -450139 -319375 305697 862557 807505 261342 -100633 148770
34746A48770N34104J95832k63681l01281p9252j18898m41107n15310m6786N84454
$$ 148770 682874 878706 615025 313744 234492 115594 -325513 -840823 -887609 -303155
34736c03155P75753L51004l00505n72554j75561N03272P03466J81078m15387l91239
$$ -303155 472598 823602 523097 -49457 -225018 278254 981720 1162798 747411 356172
34726C56172L5199J29353k14880m10352k11522n4194k03723k89400j0127L17759
$$ 356172 391371 520724 305844 -104508 -316030 -370224 -573947 -863347 -873474 -555715
34716e55715L29965K21381L25715M85239L21404j17594m03132k85404P9611L46712
$$ -555715 -225750 -4369 321346 806585 1127989 1010395 607263 321859 401470 748182
34706G48182K63466j05875l62435j96793J64715K41296k4565k88056m20275n34905
$$ 748182 1011648 905773 543338 346545 511260 752556 727991 439935 19660 -515245
34696e15245m53709J02736P23249N85640k29077o34050j49053L64203J75649j11651
$$ -515245 -968954 -866218 -142969 442671 213594 -420456 -569509 -205306 -29657 -141308
34686a41308K76981Q02269M47286n28177r07737l41833K93718L08476n0875l24322
$$ -141308 135673 937942 1385228 857051 -50686 -392519 -98801 209675 158800 -165522
34676a65522m17436l02537J05123N75298O56935L04333m5914p7682J23122L33809
$$ -165522 -582958 -885495 -780372 -205074 451861 756194 710280 632598 755720 1089529
34666A089529L48607J7845m57581n28113o2093K55829j02781n70902l24335L39816
$$ 1089529 1438136 1455981 998400 470287 408194 664023 561242 -9660 -333995 5821
34656E821M74259O4353l5224L11545K69699m08450q09611l36437L09174K72227
$$ 5821 480080 544433 509209 820754 1090453 682003 -127608 -464045 -154871 117356
34646A17356j90590l17058m2623J41082O4722m5954o0801J1007J93094L62484
$$ 117356 -73234 -390292 -432915 -291833 -227111 -273065 -333866 -322859 -129765 232719
34636B32719K17780k16688m18062p8753L60075L03086j63617m41339k14790K64416
$$ 232719 450499 233811 -184251 -263004 97071 400157 236540 -204799 -419589 -155173
34626a55173N39838L68867o2739k45603Q7348M89181K96757l83699p49911m67313
$$ -155173 384665 753532 690793 445190 532538 1021719 1318476 934777 184866 -282447
34616b82447q4378m5208m0227K22433L40072m6615m56593k78722J89846K48767
$$ -282447 -366825 -412033 -452260 -229827 110245 63630 -392963 -671685 -481839 -233072
34606b33072n551J01751N67547O25233J472o00782n52641j36420M5355m6167m7010
$$ -233072 -238623 -136872 430675 1055908 1057380 456598 -96043 -232463 -187108 -233275 -280285
34595b80285J32404K68735K84076L16832L79117K98730N9391q7570j257O1134
$$ -280285 -147881 120854 404930 721762 1100879 1399609 1459000 1371430 1370173 1431307
34585A431307k27871p30216r18789n52675j0181K22071J58496J45669K63345K62030
$$ 1431307 1203436 473220 -445569 -998244 -1008425 -786354 -627858 -482189 -218844 43186
34575D3186N3201j07693m031K50952L97926L14525P4283j16967p3093J14699Q2786
$$ 43186 96387 -11306 -15337 235615 633541 948066 1022349 905382 832289 946988 1029774
34564A029774l07384o39570m53245O3613L19749J56307m4196l0952M8772N6327
$$ 1029774 722390 82820 -370425 -306812 12937 169244 125048 94096 142868 199195
34554A99195K5350q6213k95883k96548J39056N17493J45447o91818r50617l62127
$$ 199195 224545 138332 -157551 -454099 -315043 202450 347897 -343921 -1294538 -1656665
34544a656665K29581L28784M77374R59418R80847M1894q52620n16941N60042R20668
$$ -1656665 -1427084 -1098300 -620926 338492 1319339 1361233 508613 -8328 551714 1472382
34534A472382K68221l67512l77542k17452k63644k12440R4641K30473l2643k77586
$$ 1472382 1740603 1373091 995549 778097 514453 302013 396654 627127 594484 316898
34524C16898j95483j27499m04442o75221m03246K80768O80712L88555k48280n18137
$$ 316898 121415 -6084 -410526 -1085747 -1488993 -1208225 -527513 -138958 -387238 -905375
34514i05375j22189M59987M97454n6495m48410j42337M36565N75298L04305J63322
$$ -905375 -1027564 -567577 -70123 -126618 -575028 -717365 -280800 294498 598803 762125
34504G62125K28131J10783j93707k56144n3689q6444m69598o31880k32122K47055
$$ 762125 990256 1101039 907332 651188 597499 511055 41457 -590423 -822545 -575490
34494e75490K24987j41366k79707k5249K77360K95120L3479k37783k32983N2347
$$ -575490 -350503 -491869 -771576 -796825 -519465 -224345 -190866 -428649 -661632 -609285
34484f09285K77199J86364J9929J47771L97539K63246k12814l82254J8730M27443
$$ -609285 -332086 -145722 -125793 21978 419517 682763 469949 87695 106425 533868
34474E33868L10434p0624j51396R0240K18019l377l95786o22158m22686J58773
$$ 533868 844302 773678 622282 712522 930541 927164 531378 -90780 -513466 -354693
34464c54693O15732L89238l69091q47140o14680j41845K6294N0432K64136M04398
$$ -354693 261039 650277 281186 -565954 -1180634 -1322479 -1296185 -1245753 -981617 -577219
34454e77219Q1549l53346k29209L14321M45895o9740m86929k06691L80724N50924
$$ -577219 -495670 -849016 -1078225 -763904 -318009 -387749 -874678 -1081369 -700645 -149721
34444a49721K43160m5926o5483n1066k37934m68193l71064J60596P40795Q29629
$$ -149721 93439 47513 -17970 -69036 -306970 -775163 -1146227 -985631 -244836 584793
34434E84793L65953j09080j53325k9730k38642o31399n79305k8339L12838P8178
$$ 584793 950746 841666 688341 658611 419969 -211430 -790735 -819074 -506236 -428058
34424d28058j63731J08382M39538J66867l68211k97689L12786N07579l425l79200
$$ -428058 -591789 -483407 -43869 122998 -245213 -542902 -230116 277463 274038 -105162
34414a05162p1435K81068L079m16164j42419N67768P41586J92962l31316l95656
$$ -105162 -176597 104471 107550 -308614 -451033 116735 858321 1051283 719967 324311
34404C24311l14635l10424j54679J53844J97336q5569j95611L4654J07423j83728
$$ 324311 9676 -300748 -455427 -301583 -104247 -189816 -385427 -350773 -243350 -427078
34394d27078k48918K83259P57553M18490l93003p35041l80248R8384K79554K30876
$$ -427078 -675996 -392737 364816 783306 390303 -344738 -724986 -626602 -347048 -116172
34384a16172Q1047j16605k20079j86528k15154k91551M086P00322R68359K20073
$$ -116172 -35125 -151730 -371809 -558337 -773491 -1065042 -1060956 -360634 607725 827798
34374H27798p87632q74767j16557M22028L64509K82454L88504K25323k12789k67273
$$ 827798 40166 -834601 -951158 -529130 -164621 117833 506337 731660 518871 251598
34364B51598J72611L64855p479l31005k52211k72314o25457o70970q6112L89693
$$ 251598 424209 789064 781585 450580 198369 -73945 -699402 -1370372 -1456484 -1066791
34354a066791K04700j7283L26240N89174j3100q53765p54527J23319N66403K04588
$$ -1066791 -862091 -879374 -553134 36040 22940 -830825 -1585352 -1462033 -895630 -691042
34344f91042j45919N4655M22682N23777L97805J23946k70601m28186k7467M64936
$$ -691042 -836961 -782306 -359624 164153 561958 685904 415303 -12883 -40350 424586
34334D24586K87871l52558m57310K27902Q19067O52771R7976k84166m71308m98597
$$ 424586 712457 359899 -97411 130491 949558 1602329 1700305 1416139 944831 446234
34324D46234j58366L35399K54460m75453q31941j46256P41769O63741j21947l86995
$$ 446234 287868 623267 877727 402274 -429667 -575923 165846 829587 707640 320645
34314C20645J71786N82989J64650n28840o17601n6400M99957N44910R5609m73528
$$ 320645 492431 1075420 1240070 711230 93629 37229 537186 1082096 1177705 704177
34304G04177o92818l26951L13906N82590K33301k37956k50362M6674J3099m63786
$$ 704177 11359 -315592 -1686 580904 814205 576249 325887 372561 385660 -78126
34294g8126o92963j66328O05607P35379K00307j97661r5568l9312m09623o35935
$$ -78126 -771089 -937417 -331810 403569 603876 406215 310647 271335 -138288 -774223
34284g74223j14865O44293O51360n4444m46212n2941M33949L14989j53435l42552
$$ -774223 -889088 -244795 406565 352121 -94091 -147032 286917 601906 448471 105919
34274A05919j70181L0339J02181Q1732l1852j51634o4796J64443J11628l50645
$$ 105919 -64262 -33923 68258 149990 118138 -33496 -98292 66151 177779 -172866
34264a72866o93996m38985J28408L97123K87020J76736K21857K67013K78153L48605
$$ -172866 -866862 -1305847 -1177439 -780316 -493296 -316560 -94703 172310 450463 799068
34254G99068L57396R4796l06222m82445l58514j74352l8811J54398L82161M42582
$$ 799068 1156464 1251260 945038 462593 104079 -70273 -109084 45314 427475 870057
34244H70057K73695J1800k49497m61043m53044j24325K56264L14154J03766L130
$$ 870057 1143752 1155552 906055 445012 -8032 -132357 123907 438061 541827 544957
34234E44957J15604J92406J28045P3383L6800j37234l30236k19941Q4640N1063
$$ 544957 660561 852967 981012 1054395 1091195 953961 623725 403784 488424 539487
34224E39487l93268n68622l2076O50078O56425P3375l05436j40561J29997J07967
$$ 539487 146219 -422403 -454479 195599 852024 925399 619963 479402 609399 717366
34214G17366l2522k172R5232J6118j66255k06048j38303k31537m78047m68084
$$ 717366 684844 682672 777904 794022 627767 421719 283416 51879 -426168 -894252
34204h94252L7603O41553P39316L34825K9244J25027K04461j12409m43396k18142
$$ -894252 -856649 -215096 524220 859045 888289 1013316 1217777 1105368 661972 443830
34194D43830L18967L84595j38369n23771l46279m3161m1034o8146J71965L10752
$$ 443830 762797 1147392 1009023 485252 138973 95812 54778 -13368 158597 469349
34184D69349k6171l92183j54309L89819M05242j23216l29518J75878P25598O12121
$$ 469349 443178 50995 -103314 286505 691747 568531 239013 414891 1140489 1752610
34174A752610j1873n58348p45548n86807j52334L03526M07859J82265P9133K31989
$$ 1752610 1740737 1182389 436841 -149966 -302300 1226 409085 591350 670483 902472
34164I02472J76028l19522p00805m52948J8865J8477l03325k39819K50179M83314
$$ 902472 1078500 758978 58173 -394775 -375910 -357433 -660758 -900577 -650398 -167084
34154a67084K11376k8336Q4000J16235k57332n68160k88647K54915L52627j1747
$$ -167084 44292 15956 99956 216191 -41141 -609301 -897948 -643033 -290406 -302153
34144c02153k11834J7779K61553J65316m2917J0030K57145L22892N6046l00946
$$ -302153 -513987 -496208 -234655 -69339 -112256 -102226 154919 477811 533857 232911
34134B32911m11281j75549J99661L83280K01396j98283m62090l35612J18418N60388
$$ 232911 -178370 -353919 -154258 229022 430418 232135 -229955 -565567 -447149 113239
34124A13239O27127K21545l98349q51847r53001p34802k48197M16444R03802P67362
$$ 113239 740366 961911 563562 -288285 -1241286 -1976088 -2224285 -1807841 -904039 -136677
34114a36677R2104l81457j13950M89114O22794J94539j50506n8461J08004O906
$$ -136677 -44573 -426030 -539980 -50866 571928 766467 615961 557500 665504 672410
34104F72410j45713r9163q8063l57329n72981k73582L24018N46050K03062k13781
$$ 672410 526697 427534 339471 -17858 -590839 -864421 -540403 5647 208709 -5072
34094e072k77570q7722Q2961J72782K24061K32850K47744L38938L57797J7074
$$ -5072 -282642 -370364 -287403 -114621 109440 342290 590034 928972 1286769 1303843
34084A303843o37714j086830q60699p9050O45786P69910K95053j98126q9932N26398
$$ 1303843 666129 -420701 -1281400 -1360450 -714664 55246 350299 152173 62241 588639
34074E88639Q19923K58762n68413o83345r2629K80168J8788k82482j56733k258
$$ 588639 1408562 1667324 1098911 415566 322937 603105 621893 339411 182678 180420
34064A80420j97269l15098N7016M03873O8921n43114n13047J50380N80233L90148
$$ 180420 -16849 -331947 -274931 128942 197863 -345251 -858298 -707918 -127685 262463
34054B62463n846l11837o02538o64622j29794N94881N91169r6398l31871L22324
$$ 262463 256617 -55220 -657758 -1322380 -1452174 -857293 -266124 -362522 -694393 -372069
34044c72069P98363K20157o15077m60568M35900P89388K45309l15954l16477j83150
$$ -372069 426294 646451 31374 -429194 6706 796094 1041403 725449 408972 225822
34034B25822l46412m93201k02188L39381O66044O52823M62944J77508k18048o21735
$$ 225822 -120590 -613791 -815979 -476598 189446 842269 1305213 1482721 1264673 642938
34024F42938p91536n29489R1154O39876O34484Q5694m47438n23081k92271r8938
$$ 642938 -148598 -678087 -586933 52943 687427 773121 325683 -197398 -489669 -588607
34014e88607M1683K15109K30357l6902k34333k4702K89042K43984L7425J32833
$$ -588607 -546924 -331815 -101458 -138360 -372693 -397395 -108353 135631 173056 305889
34004C05889L03116k6137o04150n66509J11237M71923J55784j9919M28766O91225
$$ 305889 609005 582868 -21282 -587791 -476554 -4631 151153 131234 560000 1251225
33994A251225L4161q20843p58874l3090K16177j99347l87507K4498L62796J73220
$$ 1251225 1285386 464543 -294331 -327421 -111244 -310591 -698098 -673600 -310804 -137584
33984a37584l3391K60814O74656N38465r9886o03671n74927j37537L76928O57123
$$ -137584 -170975 89839 764495 1302960 1203074 599403 24476 -113061 263867 920990
33974I20990M83548q2771o24562p16938l46380J40592M28217M22467J40863l41752
$$ 920990 1404538 1321767 697205 -19733 -366113 -225521 202696 625163 766026 424274
33964D24274p72994p65718j99621M64119N63302O2832k79955J26035Q23232Q68818
$$ 424274 -348720 -1114438 -1314059 -849940 -286638 -223806 -503761 -377726 445506 1314324
33954A314324J72022l80106k53415p901l08689q37698q41391l28994L7642K9822
$$ 1314324 1486346 1106240 852825 844924 536235 -301463 -1142854 -1471848 -1434206 -1404384
33944a404384N0434K85368L98517K04096J4213R5975K75779L00743J85356K2265
$$ -1404384 -1353950 -1068582 -670065 -465969 -451756 -355781 -80002 220741 406097 428362
33934D28362j68281k55866o2302K52529K78065k4645k22011r5880M6867k2170
$$ 428362 260081 4215 -58087 194442 472507 447862 225851 129971 176838 154668
33924A54668o0688R4427R8139k96047o14329k48001N68222R63536N59685j14622
$$ 154668 93980 188407 286546 -9501 -623830 -871831 -303609 659927 1219612 1104990
33914A104990l71711j20865K11131K24779q5387l60186k65042P4990J68458j92336
$$ 1104990 733279 612414 823545 1048324 962937 602751 337709 412699 581157 388821
33904C88821o03129n88057k24402O9894J38243J04741p33j90203k32593Q7706
$$ 388821 -214308 -802365 -1026767 -956873 -818630 -713889 -714622 -904825 -1137418 -1049712
33894a049712M96339N20867K35819J63848L80598L39730j89793o19068l85664
$$ -1049712 -553373 -32506 203313 367161 747759 1087489 897696 278628 -107036
33885a07036J65427K78339j27305m37000k92977j98R2333J23398L72193O94027
$$ -107036 58391 336730 209425 -227575 -520552 -520750 -428417 -305019 67174 761201
33875G61201O65049K09038k47736l34621j94505j69874k15807o414L82678L90027
$$ 761201 1426250 1635288 1387552 1052931 858426 688552 472745 466331 849009 1239036
$$ [...]
##END NTUPLES=NMR SPECTRUM
##END=
