##TITLE=31Pdec_SR152_oil
 DMSO, 64 sc
 21.2.2023
##JCAMPDX= 6.0         $$ Bruker NMR JCAMP-DX V2.0
##DATA TYPE= NMR SPECTRUM
##DATA CLASS= NTUPLES
##ORIGIN= UXNMR, Bruker Analytische Messtechnik GmbH
##OWNER= root
$$ XWIN-NMR		Version 3.5
$$ Tue Feb 21 17:46:22 2023 Russian Standard Time (UT+4h)  she@DPX200
##.OBSERVE FREQUENCY= 81.013821
##.OBSERVE NUCLEUS= ^31P
##.ACQUISITION MODE= SIMULTANEOUS
##.ACQUISITION SCHEME= undefined
##.AVERAGES= 80
##.DIGITISER RES= 16
##SPECTROMETER/DATA SYSTEM= spect
##.PULSE SEQUENCE= zgpg30
##.SOLVENT NAME= DMSO
##.SHIFT REFERENCE= (INTERNAL, DMSO, 0, 248.564)
##AUDIT TRAIL= $$ (NUMBER, WHEN, WHO, WHERE, WHAT)
$$ ##TITLE= Audit trail, XWIN-NMR		Version 3.5
$$ ##JCAMPDX= 5.01
$$ ##ORIGIN= Bruker BioSpin GmbH
$$ ##OWNER= she
$$ F:/spectra/data/she/nmr/P31/1/pdata/1/auditp.txt
$$ ##AUDIT TRAIL=  $$ (NUMBER, WHEN, WHO, WHERE, WHAT)
(   1,<2023-02-21 17:45:35.95 +0400>,<she>,<DPX200>,
      <continue with go, POWCHK disabled, PULCHK disabled
       configuration hash MD5:
       00 E9 B6 7A A2 85 ED C7 34 08 36 98 17 FE 4E 26
       data hash MD5: 32K
       BC 97 AA 05 18 ED DB 0E 6B 97 24 1D 72 F2 20 B9>)
(   2,<2023-02-21 17:45:37.93 +0400>,<she>,<DPX200>,
      <Start of raw data processing
       efp BC_mod = 2 LB = 1 FT_mod = 6 PKNL = 1 PHC0 = -11018.14 PHC1 = 177.0102 SI = 64K 
       data hash MD5: 64K
       99 F1 96 9B F8 FE 47 23 76 10 2B E8 64 C7 81 C4>)
(   3,<2023-02-21 17:45:49.64 +0400>,<she>,<DPX200>,
      <pk PHC0 = -3.743144 PHC1 = 0 
       data hash MD5: 64K
       DE 40 FF 93 FE 9A D4 25 66 BA AA 61 88 3A 95 73>)
(   4,<2023-02-21 17:45:55.17 +0400>,<she>,<DPX200>,
      <abs ABSG = 5 
       data hash MD5: 64K
       7C 1E AE D6 E9 24 7B C7 36 BA 18 D5 64 DD BF 52>)
$$ ##END=
$$ 
$$ hash MD5
$$ F1 93 6C 40 85 61 9F C7 BD CA 2B 0D B5 DA 6A 50
##$RELAX= 
##$RELAX= 
##$RELAX= 
##$RELAX= 
##$RELAX= 
##$RELAX= 
##$RELAX= 
##$RELAX= 
##$RELAX= 
$$ Bruker specific parameters
$$ --------------------------
##$DU= <F:/spectra>
##$EXPNO= 1
##$NAME= <P31>
##$PROCNO= 1
##$TYPE= <nmr>
##$USER= <she>
##$AMP= (0..31)
100 100 100 100 100 100 100 100 100 100 100 100 100 100 100 100 100 100 
100 100 100 100 100 100 100 100 100 100 100 100 100 100 
##$AQSEQ= 0
##$AQ_mod= 1
##$AUNM= <au_zg>
##$AUTOPOS= <>
##$BF1= 81.014009
##$BF2= 200.13
##$BF3= 200.13
##$BF4= 200.13
##$BF5= 200.13
##$BF6= 200.13
##$BF7= 200.13
##$BF8= 200.13
##$BYTORDA= 1
##$CFDGTYP= 0
##$CFRGTYP= 5
##$CHEMSTR= <none>
##$CNST= (0..31)
1 1 145 1 1 1 1 1 1 1 1 1 1 1 1 1 1 1 1 1 1 1 1 1 1 1 1 1 1 1 1 1 
##$CPDPRG= <waltz16>
##$CPDPRG1= <>
##$CPDPRG2= <waltz16>
##$CPDPRG3= <>
##$CPDPRG4= <mlev>
##$CPDPRG5= <mlev>
##$CPDPRG6= <mlev>
##$CPDPRG7= <mlev>
##$CPDPRG8= <mlev>
##$CPDPRGB= <>
##$CPDPRGT= <>
##$D= (0..31)
0 1 0 0 0 0 0 0 0 0 0 0.03 2e-05 3e-06 0 0 0 0 0 0 0 0 0 0 0 0 0 0 0 0 
0 0 
##$DATE= 1676987031
##$DBL= (0..7)
120 120 120 11 120 120 24 19 
##$DBP= (0..7)
150 150 150 150 150 150 150 150 
##$DBP07= 0
##$DBPNAM0= <>
##$DBPNAM1= <>
$$ [...]
##$SUBNAM3= <"">
##$SUBNAM4= <"">
##$SUBNAM5= <"">
##$SUBNAM6= <"">
##$SUBNAM7= <"">
##$SUBNAM8= <"">
##$SUBNAM9= <"">
##$SW= 501.771253377433
##$SWIBOX= (0..15)
0 1 3 0 0 0 0 0 0 0 0 0 0 0 0 0 
##$SW_h= 40650.406504065
##$TD= 32768
##$TD0= 1
##$TE= 0
##$TE2= 300
##$TE3= 300
##$TEG= 300
##$TL= (0..7)
0 120 53 12 22 120 120 120 
##$TP= (0..7)
150 150 150 150 150 150 150 150 
##$TP07= 0
##$TPNAME0= <>
##$TPNAME1= <>
##$TPNAME2= <>
##$TPNAME3= <>
##$TPNAME4= <>
##$TPNAME5= <>
##$TPNAME6= <>
##$TPNAME7= <>
##$TPOAL= (0..7)
0.5 0.5 0.5 0.5 0.5 0.5 0.5 0.5 
##$TPOFFS= (0..7)
0 0 0 0 0 0 0 0 
##$TUNHIN= 0
##$TUNHOUT= 0
##$TUNXOUT= 0
##$USERA1= <user>
##$USERA2= <user>
##$USERA3= <user>
##$USERA4= <user>
##$USERA5= <user>
##$V9= 5
##$VALIST= <valist>
##$VCLIST= <CCCCCCCCCCCCCCC>
##$VD= 0
##$VDLIST= <DDDDDDDDDDDDDDD>
##$VPLIST= <PPPPPPPPPPPPPPP>
##$VTLIST= <TTTTTTTTTTTTTTT>
##$WBST= 1024
##$WBSW= 4
##$XGAIN= (0..3)
0 0 0 0 
##$XL= 0
##$YL= 0
##$YMAX_a= 5153
##$YMIN_a= -5415
##$ZGOPTNS= <>
##$ZL1= 120
##$ZL2= 120
##$ZL3= 120
##$ZL4= 120
##$ABSF1= 248.5645
##$ABSF2= -253.2056
##$ABSG= 5
##$ABSL= 3
##$ALPHA= 0
##$AQORDER= 0
##$ASSFAC= 0
##$ASSFACI= 0
##$ASSFACX= 0
##$ASSWID= 0
##$AUNMP= <proc_1d>
##$AZFE= 0.1
##$AZFW= 0.5
##$BCFW= 0
##$BC_mod= 2
##$BYTORDP= 0
##$COROFFS= 0
##$CY= -3
##$DATMOD= 1
##$DC= 0
##$DFILT= <>
##$DTYPP= 0
##$F1P= 0
##$F2P= 0
##$FCOR= 1
##$FTSIZE= 65536
##$FT_mod= 6
##$GAMMA= 0
##$GB= 0
##$INTBC= 1
##$INTSCL= 6.047779e-11
##$ISEN= 30
##$LB= 1
##$LEV0= 0
##$LPBIN= 0
##$MAXI= 10000
##$MC2= 0
##$MEAN= 0
##$ME_mod= 0
##$MI= 50
##$NCOEF= 0
##$NC_proc= -9
##$NLEV= 6
##$NOISF1= 182.463
##$NOISF2= 159.3651
##$NSP= 0
##$NTH_PI= 0
##$NZP= 0
##$OFFSET= 248.5645
##$PC= 4
##$PHC0= -11021.88
##$PHC1= 177.0102
##$PH_mod= 1
##$PKNL= yes
##$PPARMOD= 0
##$PSCAL= 0
##$PSIGN= 0
##$REVERSE= no
##$SF= 81.0140089999694
##$SI= 65536
##$SIGF1= 159.3651
##$SIGF2= -187.1042
##$SINO= 113.3802
##$SIOLD= 16384
##$SREGLST= <1H.CDCl3>
##$SSB= 0
##$STSI= 65536
##$STSR= 0
##$SW_p= 40650.406504065
##$SYMM= 0
##$S_DEV= 0
##$TDeff= 32768
##$TDoff= 0
##$TI= <>
##$TILT= no
##$TM1= 0
##$TM2= 0
##$TOPLEV= 0
##$USERP1= <user>
##$USERP2= <user>
##$USERP3= <user>
##$USERP4= <user>
##$USERP5= <user>
##$WDW= 1
##$XDIM= 65536
##$YMAX_p= 435210560
##$YMIN_p= -338896067
$$ End of Bruker specific parameters
$$ ---------------------------------
##NTUPLES= NMR SPECTRUM
##VAR_NAME=  FREQUENCY,     SPECTRUM/REAL,   SPECTRUM/IMAG
##SYMBOL=    X,             R,               I
##VAR_TYPE=  INDEPENDENT,   DEPENDENT,       DEPENDENT
##VAR_FORM=  AFFN,          ASDF,            ASDF
##VAR_DIM=   65536,         65536,           65536
##UNITS=     HZ,            ARBITRARY UNITS, ARBITRARY UNITS
##FACTOR=    0.620285442955139, 1,           1
##FIRST=     20137.2065510682, 0,            0
##LAST=      -20513.1999529968, 0,           0
##MIN=       -20513.1999529968, -338896067,  0
##MAX=       20137.2065510682, 435210560,    0
$$ Real data points
##PAGE= N=1
##DATA TABLE= (X++(R..R)), XYDATA
$$ [...]
41192b7609329J0751502O634952j573523j675667L137546J960845l756741k162557
41184a4292972P526443J0991900J065925r562595o400620O298725J3088649Q468602
41176A7184057K20546m241280n225092n840188o984128p173580l774576L502319
41168a2331922Q542892M069266n883814p050874N413565J7441345J5217897M764406
41160C0182761J14177K07037o042109j6577897j7292458o426816R35419l252084
41152a8151970q882686o493247p07545L113635R389627J8389432J6978276j578162
41144A2057360j9952458j6115332O205093K2780084K0837545J0075111K968104
41137C8855507o81726o666587j5216097k1138988j8855427o464186R763059J6936820
$$ y = [-27609329, -16857827, -10222875, -11796398, -13472065, -10334519, -8373674, -12130415, -14292972, -6766529, 4225371, 5291296, -4271299, -10671919, -4373194, 8715455, 17184057, 17404603, 13163323, 7938231, 2098043, -4886085, -12059665, -15834241, -12331922, -3789030, 280236, -5603578, -12654452, -7240887, 10200458, 25418355, 30182761, 30296938, 30503975, 24461866, 7883969, -9408489, -15835305, -14899886, -18151970, -27034656, -33527903, -34235448, -31121813, -21732186, -3342754, 13635522, 12057360, -7895098, -24010430, -17805337, 4974747, 25812292, 35887403, 38855507, 38173781, 31507194, 16291097, -4847891, -23703318, -30167504, -20404445, -3467625]
41129c467625Q647836n830430j2889939j1423111q875768n029138O318472K0257299
41121a2292404K1117758M826951j1865344j2039561N06309Q554913L239235q458045
41113f410188j3816704o585454P955106J6641924J0266056n755627j5777513j0491273
41105b3973673M495534J6863687J8902112R842389n989612j9605544k1302442
41098b0767549r512996N610684J0436136O08247j3325134j3772774N209168K5855678
41090i658540K2609494m303691k3272907j1336168J2567981J4284487m801036
41083c910380j1579247N198243J7518299M621111j3867235j1596556K739599M316888
41075f559278m798753k822113J0505482J2348121l273306j3911652m844570Q232962
$$ y = [-3467625, 5180211, -650219, -13540158, -24963269, -33839037, -38868175, -32549703, -12292404, 8825354, 13652305, 1786961, -10252600, -9746291, -1191378, 2047857, -6410188, -20226892, -26812346, -18857240, -2215316, 8050740, 2295113, -13482400, -23973673, -19478139, -2614452, 16287660, 26130049, 20140437, 534893, -20767549, -30280545, -24669861, -14233725, -13625478, -26950612, -40723386, -35514218, -9658540, 12950954, 8647263, -14625644, -25961812, -13393831, 890656, -3910380, -15489627, -10291384, 7226915, 11848026, -2019209, -13615765, -10876166, -6559278, -11358031, -14180144, -3674662, 8673459, 5400153, -8511499, -13356069, -5123107]
41067e123107N559291o780246r438474k29O480000K030414m157934j190230Q232469
41058d388046J2206333M786428p323327j2798497p916125R68168N890504M768882
41050c805680K65215m117281m796949J80787O988413Q072817J933906l657296
41042A063932j830803M876052R748083R855650M944171m662497j4122927j5420656
41034e548995q134825j199768P97964K672103M574681k296141j5819787j5820437
41026d0775205O245635K5774418J5832713j1601760k1049405l479203J6543791
41019a2509016K0712871J5262362Q204484k494486j2208540q791181L219837L823478
41011A5219809q003474r046091P106825J4255478k601981j7426460l502835K1107009
$$ y = [-5123107, 436184, -6344062, -15782536, -15782765, -9302765, -7272351, -11430285, -12620515, -4388046, 7818287, 12604715, 5281388, -7517109, -15433234, -14465066, -8574562, -3805680, -3540465, -7657746, -12454695, -12273908, -5285495, 2787322, 4721228, 1063932, -766871, 4109181, 13857264, 23712914, 28657085, 23994588, 9871661, -5548995, -13683820, -14883588, -14085624, -11413521, -6838840, -9134981, -24954768, -40775205, -34529570, -8755152, 7077561, -4524199, -25573604, -29052807, -12509016, 8203855, 23466217, 31670701, 29176215, 16967675, 8176494, 11396331, 15219809, 7216335, -1829756, 5277069, 19532547, 16930566, -495894, -3998729, 17108280]
41003A7108280K0507535l875371j9115445j1825833N0174K502545Q16011j355778
40995D812118r207569j7927979j2221080P274472J8736003R734768n140831p231969
40987a1172067J075814N107332J8072o498293o097946L252054J6252872K1578965
40979B3516803J0881472r511729k2269242j7784261l592828O752684P854364L530109
40971f22628l44094j478934k593324o820473j0287789m973066P056421J1579059
40963h484828K744726n148759N24202Q197096J96828j5329023j4510696L634739
40955b8175715J4806364P679632j430579J342931P581564P074421N230563P108017
40947B1217198M645102n810691j1983404o658804k168959q030404j2357759l832540
$$ y = [17108280, 37615815, 33740444, 14624999, 2799166, 2849340, 5351885, 6167896, 4812118, -4395451, -22323430, -34544510, -27270038, -8534035, 1200733, -3940098, -11172067, -10096253, -4988921, -4970849, -11469142, -17567088, -14315034, 1937838, 23516803, 34398275, 24886546, 2617304, -15166957, -18759785, -12007101, -4152737, -622628, -966722, -2445656, -5038980, -11859453, -22147242, -27120308, -20063887, -8484828, -5740102, -10888861, -10364659, -2167563, -1970735, -17299758, -31810454, -28175715, -13369351, -5689719, -7120298, -5777367, 1804197, 8878618, 14109181, 21217198, 25862300, 20051609, 8068205, 1409401, -759558, -8789962, -21147721, -24980261]
40939b4980261N649119J723047n327712J190797J2687368R392925l642020m232282
40931g539019Q377739J2710003K310536n508625j679628J755661k251723k722246
40923E452698O281930J2616716P722403J032501R55151N73973n441680q411963
40915B0781729l541185j842511r329957j2700389k911495N439264j022457q104259
40907a3231260J689907J3847529K570298k2187688k4331773J730595K0354307
40900a9558085R568865p064694j083923J6545863J6380765k984637j6081383r095689
40892a3372918O338812J4472797J1523227J535482q613677j0774331l981708J362821
40884a509495j514996l015078O636688J6185517P890199j1316505j6388590k100253
$$ y = [-24980261, -19331142, -17608095, -22935807, -21745010, -9057642, 335283, -3306737, -7539019, 838720, 13548723, 15859259, 10350634, 8671006, 10426667, 8174944, 5452698, 11734628, 24351344, 32073747, 33106248, 34061399, 34635372, 29193692, 20781729, 17240544, 15398033, 6068076, -6632313, -9543808, -4104544, -5127001, -13231260, -11541353, 2306176, 4876474, -17311214, -41642987, -39912392, -19558085, -9989220, -17053914, -18137837, -1591974, 14788791, 11804154, -4277229, -13372918, -7034106, 7438691, 18961918, 20497400, 11883723, 1109392, -2872316, -1509495, -3024491, -6039569, 597119, 16782636, 24672835, 13356330, -3032260, -5132513]
40876e132513J0181582Q136654M715026Q621565N641183j2335320k3694838q183538
40868a2050199J6003858J6270442l853868j0955958M542747J5049394K419242
40861B7425658j4003349j1082156K147337L132643p527900j1416165m203927O01280
40853a4926579l457444p152432l280187L175009O480255Q688372J1265064Q966404
40845I758462l16612p370126k927452O485994M741880j0184987j9115370o440991
40837b5369202J4855230J6852171m656538k1696537j2262812R095729J4638352
40830h543607M500099J246633R858975J1493521k49009o250272L502371R310671
40822B4869382n476502k3661564j9974543n76330R643273O678596N565382P085695
$$ y = [-5132513, 5049069, 13185723, 17900749, 26522314, 32163497, 19828177, -3866661, -12050199, 3953659, 20224101, 16370233, 5414275, 9957022, 25006416, 27425658, 13422309, 2340153, 4487490, 7620133, 92233, -11323932, -15527859, -14926579, -18384023, -25536455, -28816642, -25641633, -19161378, -10473006, 792058, 9758462, 9441850, 2071724, -855728, 5630266, 10372146, 187159, -18928211, -25369202, -10513972, 6338199, 1681661, -20014876, -32277688, -23181959, -8543607, -4043508, -2796875, 7062100, 18555621, 18306612, 12056340, 15558711, 24869382, 19392880, -4268684, -24243227, -24819557, -15176284, -8497688, -2932306, 4153389]
40814D153389k047717j7014218j4901418O823320K0618217R122844r298920r836897
40806a2381400M112194J2121880O908773l586037j2470781j6038942q754997Q225575
40798b1863735J9905792J3217593m155730j3027094p473528Q16696Q92124m656644
40790a6344526n403468M171153J7327980J9399857M198180j4281130j6144602
40783g076556k199899P516574M430612K086148Q556102J0080142k504315j2199448
40775H689360k951548R782427L387548j1142230o145049J3115207J3841253q503491
40767B0073477j9320486p29852J8603549R494072j2789644j6066046j046180N993684
40759D212574l511322j3245721j1619005l570050M608194J1160904J0891573l0479
$$ y = [4153389, 2105672, -14908546, -29809964, -22986644, -2368427, 6754417, -2544503, -12381400, -8269206, 3852674, 10761447, 7175410, -5295371, -21334313, -30089310, -21863735, -1957943, 11259650, 7103920, -5923174, -13396702, -12580006, -11687882, -16344526, -21747994, -17576841, -248861, 19150996, 23349176, 9068046, -7076556, -9276455, -1759881, 2670731, 4756879, 13312981, 23393123, 20888808, 8689360, 5737812, 15520239, 18907787, 7765557, 1620508, 14735715, 28576968, 20073477, 752991, 23139, 18626688, 28120760, 15331116, -734930, -1781110, 4212574, 701252, -12544469, -24163474, -27733524, -23125330, -11964426, -1072853, -1103332]
40751a103332j1773390j0098876K551475J0794919R719774P857705P696659K197543
40743A7842477o912359o911320L427399P318392l881923j3768395m163894J5784623
40735H735000K0112371J200996k0370041k2093760m854135J1643497J2038952
40728F412880q08006j2423540j2717126m025601M719700Q108766P015703M394608
40720F77384J974439K50471q24328o22842L118833J0816412J5932488R668192
40712D0991049n846859j6260127j2677116l257668N02090P93704N467072J0153209
40704A9865354L710984j1227967j8661713j0898742L274623J2747799J3883550
40697A2693888O333801p059284j5500823r650881L257359Q216261N749554Q480427
$$ y = [-1103332, -12876722, -22975598, -20424123, -9629204, 90570, 7948275, 15644934, 17842477, 10930118, 4018798, 7446197, 14764589, 10882666, -2885729, -7049623, 8735000, 28847371, 30048367, 9678326, -12415434, -17269569, -5626072, 6412880, 5604874, -6818666, -19535792, -23561393, -18841693, -10732927, -3717224, 677384, 2651823, 2902294, 2077966, 1455124, 4573957, 15390369, 31322857, 40991049, 35144190, 18884063, 6206947, 2949279, 3451369, 4245073, 9712145, 19865354, 23576338, 12348371, -6313342, -17212084, -13937461, -1189662, 12693888, 19027689, 11968405, -3532418, -13183299, -9925940, -1709679, 4039875, 12520302]
40689A2520302J4672773Q455815r081387j5053026j563567Q741744q4432r836608
40681H771614k26397J3985208O603679j5011553k0397861l553642J0886291P359157
40673H416496k782515n691561l164895j448625j235076l036481o919362o248677
40665b2110696K804913Q559101m76328j1527478l270727J6607509J8477446j699291
40657G364449j3687681j740596J0035693r48138j7904946j3667823M365791Q348693
40649a7834558l798890o990249R661100K6981284K4939184P844589o176809q113110
40641B6512541m180412n278857j3429784j7661883p289755R810635J2909285k145743
40633g53973j3402992m472132Q858210K721594j4914087j3746509J1894490L2029414
$$ y = [12520302, 27193075, 35648890, 26567503, 11514477, 9950910, 18692654, 18608222, 8771614, 8545217, 22530425, 29134104, 14122551, -6275310, -9828952, 1057339, 8416496, 5633981, -57580, -3222475, -4671100, -5906176, -8942657, -15862019, -22110696, -19305783, -10746682, -11223010, -22750488, -26021215, -9413706, 9063740, 7364449, -6323232, -8063828, 1971865, 1023727, -16881219, -30549042, -26183251, -17834558, -21633448, -28623697, -18962597, 8018687, 32957871, 40802460, 34625651, 26512541, 22332129, 17053272, 3623488, -14038395, -21328150, -11517515, 1391770, -753973, -14156965, -18629097, -9770887, -7049293, -21963380, -35709889, -23815399, 8214015]
40625H214015K3161603j600721j6306677j6961649j5889330j4983829n724967
40618d0091555Q688993J1851866j268082j3745305q795676P880931J7385180J2537270
40610e556378K986977j163260J20807K371218K540762j811710r456011j0513669
40602b0481264L332462K0869384J8899255n003755k3895113j7804012j719904
40595b5802947N53355n925622j005595J1335352R377052n236733p313034P679822
40587a6338350J3842789n61296j2289215l738269O537798k690758j7165302j0709465
40579d3112068J1479304K2383270J4328037L359430j6218L07346J687644N288144
40571A5704889O149953p31992q223912p100375k184823k616522m469635n10867
$$ y = [8214015, 31375618, 29774897, 13468220, -3493429, -19382759, -34366588, -40091555, -31402562, -19550696, -20818778, -34564083, -43359759, -35478828, -18093648, -5556378, -2569401, -3732661, -3611854, -1240636, 1300126, -511584, -9967595, -20481264, -17148802, 3720582, 22619837, 17616082, -6279031, -24083043, -25802947, -25249592, -31175214, -32180809, -20845457, -11468405, -16705138, -24018172, -16338350, -2495561, -3056857, -15346072, -19084341, -12546543, -15237301, -32402603, -43112068, -31632764, -9249494, 5078543, 8437973, 8421755, 8729101, 10416745, 15704889, 21854842, 21122850, 12898938, 5798563, 3613740, 997218, -3472417, -3983284]
40563c983284K502819l796242r574462j813060R873920P182994m723930n847699
40555a0178944L648794N947747k26786J380339J1165270J0609644l523791j2356915
40547F465358q295219n231215p734291j390305J4603700J6848989l335623j9434613
40539g503219r341208R684434R783872m569402r071008j81308M109987l388542
40531a0476394j0042097n035080P299342J5678221J2986496J803195n509475N32585
40523G236793J0344772N064971j2633896j6597728L585563K2575476J5467899
40516C5043850n456912j2408471m685383l156083j1992425j4086733k567855Q263664
40508a1046348O911601L14036L36235P857908J4123163R826397o392819k2085947
$$ y = [-3983284, -1480465, -5276707, -14851169, -16664229, -6790309, 392685, -4331245, -10178944, -6530150, -582403, -809189, 571150, 11736420, 22346064, 18822273, 6465358, -1829861, -7061076, -14795367, -16185672, -1581972, 15267017, 11931394, -7503219, -16844427, -7159993, 2623879, -1945523, -11016531, -11197839, -7087852, -10476394, -20518491, -25553571, -18254229, -2576008, 10410488, 12213683, 6704208, 7236793, 17581565, 22646536, 10012640, -6585088, -2999525, 19575951, 35043850, 29586938, 17178467, 12493084, 9337001, -2655424, -16742157, -19310012, -11046348, -4134747, -3820711, -3484476, 4373432, 18496595, 28322992, 21930173, -155774]
40500a55774j9591362J123315J7152507J1210649n364133j2305164j0305832j1248529
40492b9484323j0264907N397322K4686677K0203372q698323k7877911j3898239
40485c9936332J4775537K5502347J2989618k280423n407787j065580o60542p112878
40477c196040j2705762q102646N438526J4066517P116088p174889j0924320q39820
40469a6322346Q216610N588093j406576j003549O093426J0373376P191947L04649
40461A9035630m174299l043531J873824M992901L132938j7118N20733K987876
40453B5308954K219382j091301j543067J838050M554098L531039j087223q437502
40445B5292430j4861236j3655932m481195K663630J853731J974764J0914356J7843035
$$ y = [-155774, -19747136, -18623821, -1471314, 9739335, 4375202, -7929962, -18235794, -29484323, -39749230, -34351908, -9665231, 10538141, 1839818, -26038093, -39936332, -25160795, 341552, 13331170, 11050747, 5642960, 4577380, 3916838, -3196040, -15901802, -24004448, -18565922, -4499405, 2616683, -4558206, -15482526, -16322346, -8105736, -2517643, -3924219, -4927768, 1165658, 11539034, 18730981, 19035630, 14861331, 11817800, 13691624, 18684525, 21817463, 21800345, 22321078, 25308954, 27528336, 26437035, 24893968, 26732018, 31286116, 34817155, 33729932, 25292430, 10431194, -3224738, -7705933, -5042303, -3188572, -1213808, 9700548, 27543583]
40437B7543583Q465955q827432j2951984k809308K860141k206850m426193J444343
40429I092255K809813m210292m568781O994294J1561848k717434j6707004q475854
40421f221155J1585919J6491088J671905j3638872j6179708r951237k984538L94305
40413a8832293j356198k578429P235219K4217971K5456218L94394k6033468k3470938
40405a4967524J330024J6897596J3307087P273291N858018j927794j4674103j3212924
40397a16329L926839J0167583p934534k5466591j5477608J0883475K3670912J7053874
40389A6707621P819781K630234n903826j4999284j0565075O493019J5548747N904680
40381B3635897o619271l712410Q150560Q432297o502714j8121166j1902592L456935
$$ y = [27543583, 36009538, 27182106, 14230122, 11420814, 14280955, 12074105, 7647912, 9092255, 11902068, 7691776, 3122995, 10117289, 21679137, 18961703, 2254699, -6221155, 5364764, 21855852, 23527757, 9888885, -6290823, -16242060, -19226598, -18832293, -20188491, -22766920, -15531701, 8686270, 34142488, 34536882, 8503414, -14967524, -13637500, 3260096, 16567183, 23840474, 29698492, 27770698, 13096595, -116329, 3810510, 13978093, 6043559, -19423032, -34900640, -24017165, -346253, 16707621, 24527402, 27157636, 21253810, 6254526, -4310549, 2182470, 17731217, 23635897, 17016626, 13304216, 21454776, 29887073, 23384359, 5263193, -6639399, -3182464]
40373c182464R308078K095213m594177j226363N388023M896776j308121n796453
40365E580512q293177j1811434j1302862n64578J2143213J1716673L4335n079842
40357g577160K377289Q799239O664908O393349J1524889N420203j8097487l1927629
40349a6422399j0931345K4132472K9676268K00657k6394311k4668148r716011
40342c4122817k029695L311160J5912035K4971113J7122404J803345l128204P11169
40334B4550510j180321j0485132j5972791j3069816o268746L030400J4519768
40327d876128J9241811R222233n505934o998106L700656P363679l257218j1872229
40319G018764m355952R217289R682346l694390j3621859r327532O91453K671324
$$ y = [-3182464, 6125614, 8220827, 3626650, 2400287, 7788310, 12685086, 11376965, 5580512, -2712665, -14524099, -25826961, -26391539, -14248326, -2531653, -2497318, -7577160, -5199871, 3599368, 10264276, 16657625, 28182514, 33602717, 15505230, -16422399, -27353744, -3221272, 26454996, 26655653, 261342, -24406806, -34122817, -36152512, -32841352, -16929317, 8041796, 25164200, 26967545, 23839341, 24550510, 23370189, 12885057, -3087734, -16157550, -22426296, -19395896, -4876128, 14365683, 23587916, 18081982, 11083876, 14784532, 22148211, 18890993, 7018764, 2662812, 11880101, 21562447, 17868057, 4246198, -5081334, -4389881, -1718557]
40311a718557l307843m784570M041131J2782579R774192L07512j217272M769698
40303B0646870K410586j2306330k0770452q915321J0160882J5987585R981178
40296A7194998N912585K381327j0852057k5046153j8919955N064887J7381473
40289f882895K538300j9012788k0969883m133843J2858371J9325240J5986820
40282b90678O055866m432231p866293n971057q041434j1765004k677461J7740765
40274a7247527K4200213M278037j6734098j0062208J3498263K1226856P486650
40267B6646186m643145m545182m949788j0651970p596318Q364248J8435197R084563
40259C0143791p619778j4256990j0574934m006957M624888J2730488R945181m547104
$$ y = [-1718557, -5026400, -9810970, -5769839, 7012740, 16786932, 17094444, 15877172, 20646870, 23057456, 10751126, -10019326, -18934647, -8773765, 7213820, 17194998, 23107583, 25488910, 14636853, -10409300, -29329255, -24264368, -6882895, -4344595, -23357383, -44327266, -48461109, -35602738, -16277498, -290678, 5765188, 1332957, -6533336, -12504393, -20545827, -32310831, -34988292, -17247527, 6952686, 11230723, -5503375, -15565583, -2067320, 19159536, 26646186, 22003041, 17457859, 12508071, 1856101, -5740217, 2624031, 21059228, 30143791, 22524013, 8267023, -2307911, -6314868, -1689980, 11040508, 20985689, 16438585]
40251A6438585j3472421n672362N620647N430634K435845J0407181J8596990Q252907
40243D8038006j0367119r510947R190092J3279441q480917k6080854j5426852
40236F40850M742167N874624n450445m614141O890613P600716l129511m906519
40228G648354M856907N586616p957261j3900668j220099R758810J559878j1064270
40220d731733p107534N838116O922372k929724o874677k761316j935928l291105
40212a6871529N324606K0193674K0694296L94667k0009374j8612685J359147J7229675
40204I702477J1533723j0793937k5492491j3613834J2645014K0598938J859658
40197F439548j2355032J982353K1497205J1591379j5428875j8784883L642067
$$ y = [16438585, 2966164, -2706198, 2914449, 8345083, 10780928, 21188109, 39785099, 48038006, 37670887, 28159940, 37350032, 50629473, 42148556, 16067702, 640850, 5383017, 11257641, 5807196, 1193055, 8083668, 15684384, 12554873, 7648354, 12505261, 18091877, 10134616, -3766052, -4986151, 4772659, 6332537, -4731733, -11839267, -6001151, 921221, -2008503, -8883180, -11644496, -13580424, -16871529, -11546923, 8646751, 29341047, 29735714, 9726340, -8886345, -7527198, 9702477, 21236200, 10442263, -15050228, -28664062, -16019048, 4579890, 6439548, -5915484, -3933131, 17564074, 29155453, 13726578, -5058305, -1416238]
40190a416238J3402139k102598j0629342N134519J6883815K458777j4763782q198528
40182G68762O907301M935396m503063M82169J0733976M437440j0601689j1314738
40174A845554o59392K182905r59858L520659P870037k372282j2551750P52989
40166c71138K2985629K0036958k328681o068164J2318540J5078915p894996j7456825
40158C6300238O675349K5921163L040889l7124419m4902491j6223145J1638755
40151a4673661J6299617P391981j128389m936019j495482P326403R738277J94303
40143A8717030o838389K100822J4680781J0393841n731256j1063475k122628J821810
40135B1958536p682671j5278187q563149K381652K731284m287559m827855L619637
$$ y = [-1416238, 11985901, 9883303, -746039, 4388480, 21272295, 23731072, 8967290, 768762, 7676063, 12611459, 8108396, 8590565, 19324541, 23761981, 13160292, 1845554, 1186162, 3369067, 2409209, 5929868, 13799905, 11427623, -1124127, -371138, 22614491, 42651449, 40322768, 34254604, 46573144, 61652059, 53757063, 36300238, 42975587, 68896750, 71937639, 34813220, -10089271, -26312416, -14673661, 1625956, 9017937, 7889548, 2953529, 1458047, 8784450, 18522727, 18717030, 11878641, 13979463, 28660244, 39054085, 33322829, 22259354, 20136726, 21958536, 14275865, -1002322, -9565471, -7183819, -4452535, -8740094, -13567949, -9948312]
40127i948312J0193261Q401039N133088Q320682J2662576O380269q606474j4578771
40119A7957358l113403P897058l071465k6447862k9113685p0237L0584644K9124849
40111B3747257K09828k2833231k0300147k775469J0462193J3469652J0870342
40104A2850425N249895l583467j0681589p331941N270544J0769847l104678k2204413
40096a2765377j8863869Q059503K5216249J0595077j1741492o318404J9059607
40089A3241294K5523330M115498j2316561l093833J0702392N196032r397255j2125392
40081B1845505o371990o867370j0104809l371296Q640260J0057834m33701r877883
40073C516550j1350831p203972J630855J3147548J6777035M885658j1576694j3508614
$$ y = [-9948312, 244949, 8645988, 13779076, 22099758, 34762334, 41142603, 32536129, 17957358, 14843955, 22741013, 19669548, -6778314, -35891999, -35962236, -5377592, 23747257, 23957085, 1123854, -19176293, -21951762, -11489569, 1980083, 12850425, 18100320, 14516853, 3835264, -3496677, 1773867, 12543714, 9439036, -12765377, -31629246, -23569743, 1646506, 12241583, 500091, -5818313, 13241294, 38764624, 42880122, 30563561, 27469728, 38172120, 43368152, 33970897, 21845505, 15473515, 8606145, -1498664, -4869960, 3770300, 13828134, 13394433, 3516550, -7834281, -15038253, -13407398, -259850, 16517185, 21402843, 9826149, -3682465]
40065c682465J894470J8396818K0501046P474652r245406j6210752r710555p90580
40057H627228j639030o943971k143428R516573Q807140n665331j0672637L130230
40049C016774J2845370J691211j0843590k167076J3864249J1048441m699504q722664
40041A6033211p33191J044043k383944L322286R728652l886869k5913224k0874383
40033b3663419J2122038L1184870J4207652r434933q082312O841027R084613J403939
40025C3663475J584484O036562j258933j5703841j7335438m122117N136197Q89113
40017H889502n105953j230039O612717N515487n894920j5566504j1504056N179520
40009a3104246K0003715J9131181M413313q255318o515150N630964J3153312N256938
$$ y = [-3682465, -1787995, 16608823, 37109869, 44584521, 35339115, 19128363, 9417808, 8627228, 6988198, 44227, -2099201, 7417372, 16224512, 10559181, -113456, 3016774, 15862144, 17553355, 6709765, 4542689, 18406938, 29455379, 24755875, 16033211, 15300020, 16344063, 13960119, 17282405, 27011057, 23124188, -2789036, -23663419, -11541381, 19643489, 33851141, 24416208, 16333896, 23174923, 32259536, 33663475, 35247959, 41284521, 40025588, 24321747, 6986309, 2864192, 8000389, 8889502, 3783549, 2553510, 9166227, 14681714, 8786794, -6779710, -18283766, -13104246, 6899469, 26030650, 30443963, 22188645, 15673495, 21304459, 34457771, 39714709]
40001C9714709j4044456k7780155k1402371l48622J3161009P427489k370524L336003
39993b306918J7340924J5192065o315906k1382512j1513103Q910196J3989756
39986A3914502j5756j4361454j2995838K432651J8010576K0273304O741895j1173696
39978B2826184j8469198j1762238m32614O909700R878527R890632N616266j801443
39970B2655816o710439o231145l942129l525146l958675l057969r76155J215288
39962d530554K587236K277107J800916M821908J0340626J0681962K135737p883831
39954B2231107j1052222q625506m208818M193960J4280041J3370823k247511j3168576
39946A4773298k042484J6328182J3792984q286955k1347013j2735690R83591N728481
$$ y = [39714709, 25670253, -2109902, -23512273, -23860895, -10699886, -3272397, -5642921, -2306918, 15034006, 30226071, 23910165, 2527653, -8985450, -75254, 13914502, 13898746, -462708, -13458546, -11025895, 6984681, 27257985, 33999880, 22826184, 4356986, -7405252, -7837866, -928166, 8950361, 18840993, 24457259, 22655816, 15945377, 9714232, 5772103, 2246957, -1711718, -4769687, -5745842, -4530554, -1943318, 333789, 2134705, 6956613, 17297239, 27979201, 30114938, 22231107, 11178885, 2553379, -1655439, 2538521, 16818562, 30189385, 27941874, 14773298, 12730814, 29058996, 42851980, 34565025, 13218012, 482322, 1465913, 7194394]
39938G194394P185979J0245369P188070l763436r999876m606798L417809O102098
39930B2963609N796291L489046k394753l629576Q041891J8012197M562653k0242838
39922C6598520k0643013M639321J4729178p642915k5603503q724823J6848527
39915A0201292J3842098n748265p613995M838477L321762j0991399j2324562J082410
39907c392182O870766J191372M99157M212051m354688k0177886j8744013J078104
39899c2817319J3429002R276204P574339J6081580J7470878N019577k736132L083760
39891C6381889M737492p587638j4952454l578443Q056914J3722j3967918q910032
39883A93532R977510J5787739J120447j4259067j4473374n512811k6150N66868
$$ y = [7194394, 14380373, 24625742, 31813812, 28050376, 18050500, 13443702, 16861511, 22963609, 28759900, 32248946, 29854193, 26224617, 34266508, 52278705, 56841358, 36598520, 15955507, 20594828, 35324006, 27681091, 2077588, -6647235, 10201292, 24043390, 18295125, 10681130, 15519607, 18841369, 7849970, -4474592, -3392182, 3478584, 4669956, 5169113, 9381164, 5026476, -15151410, -33895423, -32817319, -19388317, -10112113, -2537774, 13543806, 31014684, 36034261, 33298129, 36381889, 41119381, 33531743, 18579289, 15000846, 23057760, 23071482, 9103564, 193532, 10171042, 25958781, 27079228, 12820161, -1653213, -7166024, -7192174, -6625306]
39875f625306L123551R697274J3173068N991356q393508j6926914j2624419k959490
39867a5544388K968818P007358J1936575R869332l132939j1014813J604323J9990017
39859B3684283J7043095l381713j1563139r27402K823260j0547926j5514531M558976
39851F174903K5741019K0803611J015625o668549k067671k080197n912695q85710
39843C6120336Q400003O306625n191777j0383990o823061l946570k56171J2670712
39835C6896107K6546636K2323793M19791j7403716j7871193q212140J731609R415702
39827E3846589J1046687L069068o090655m119673M696428N496653j636268l296558
39819F3012271O14084l504427j4002140j1482674P078204J8267259Q474457m645970
$$ y = [-6625306, -3501755, 6195519, 19368587, 25359943, 16966435, 39521, -12584898, -15544388, -12575570, -5568212, 6368363, 16237695, 13104756, 2089943, 3694266, 23684283, 40727378, 37345665, 25782526, 24855124, 27678384, 17130458, 1615927, 6174903, 31915922, 52719533, 53735158, 47066609, 44998938, 42918741, 37006046, 36120336, 44520339, 50826964, 45635187, 35251197, 28428136, 24481566, 24225395, 36896107, 63442743, 85766536, 86186327, 68782611, 50911418, 42699278, 44430887, 53846589, 64893276, 67962344, 61871689, 57752016, 62448444, 67945097, 66308829, 63012271, 63626355, 60121928, 46119788, 34637114, 41715318, 59982577, 68457034, 63811064]
39811F3811064k652088M945907K115915m097298M58229P222502j399458j7377047
39803E3027726j4386812J1118842L1234763K3816417j054790j8500243j7738734
39796F7517169o376662K802281K336254n002203p510056K480631J5377403J3254613
39788H4879430n498239k1138921j7375443r31622J1282374J4849397J6255617
39781H2322593J5427195N213128j1606675j9394961r729343O173451J3043351
39774H1448739J1041564R487298Q211601j79839j1479030j0331030N563494J6908538
39766A10671335Q314860r592685j6010200q536891j174857l81825j04604K008100
39758H5193233J069736j456810K342542R939258Q015519n192410j3606401q007270
$$ y = [63811064, 61158976, 66104883, 68220798, 64123500, 64581729, 71804231, 70404773, 53027726, 38640914, 49759756, 80994519, 104810936, 103756146, 85255903, 67517169, 61140507, 63942788, 66279042, 61276839, 53766783, 56247414, 71624817, 84879430, 79381191, 58242270, 40866827, 39935205, 51217579, 66066976, 82322593, 97749788, 102962916, 91356241, 71961280, 62231937, 68405388, 81448739, 92490303, 101977601, 110189202, 110009363, 98530333, 88199303, 93762797, 110671335, 118986195, 109393510, 93383310, 84846419, 83671562, 83289737, 83185133, 85193233, 86262969, 84806159, 87148701, 97087959, 105103478, 99911068, 86304667, 78297397]
39750G8297397j281484o825593j5523809j0198596O358961J5195327Q582013k701238
39742G1902978q424546j0184566j1130209p171272N029143J8151538J9257601
39735G7430667M608455j3108982j5657689n96261J1884419K473962j8531295k0717150
39727B7786126M269381K7648600K1992144j784233j3679284p577062j791068m408006
39719E2456598m898588l08270l031857j4952459j7332088K69495J9154068J6028931
39711D7385830l510777j3145164j589046J5324896J7497314L399786j2471920
39704E2890919j7175096j0082373Q66066R180460J3656183J3717575P106656m057791
39696F6102599j0752729p693172k332235m862797j2639360j4124108n735021N590216
$$ y = [78297397, 77015913, 70190320, 54666511, 44467915, 50826876, 66022203, 74604216, 71902978, 63478432, 53293866, 42163657, 34992385, 40021528, 58173066, 77430667, 82039122, 68930140, 53272451, 52676190, 64560609, 67034571, 48503276, 27786126, 32055507, 59704107, 81696251, 79912018, 66232734, 58655672, 56864604, 52456598, 47558010, 47249740, 44217883, 29265424, 11933336, 12202831, 31356899, 47385830, 43875053, 30729889, 29140843, 44465739, 61963053, 65362839, 52890919, 35715823, 25633450, 26499516, 35679976, 49336159, 63053734, 70160390, 66102599, 55349870, 47656698, 45324463, 40461666, 27822306, 13698198, 7963177, 13553393]
39688A3553393J4259353J8827198J4999807k19885j6864073j8607645l964252
39681B1983896J1215008J4539512Q355037n30938q078872q301427K716617J4664159
39673E6562992J1276765n019300j4266355r674471o718728j3321949j3753264
39666E085690K812197J8327103J1147413r271273j5113747O83698J8023893J7960966
39658D9655940J330160j7618963k3733789j1405296P538549J2810039Q27119r257380
39650A0146379l681088O094275M820391j081175J999944Q827987O095595j184452
39642C2037856J742649J1241620J0600014J25821k728932O442023J1916161M397335
39634G5774547n704759p066977l017187k299792o290530r647584n998778O225840
$$ y = [13553393, 27812746, 46639944, 61639751, 61419866, 44555793, 25948148, 21983896, 33198904, 47738416, 56093453, 55562515, 47483643, 39182216, 41898833, 56562992, 67839757, 62820457, 48554102, 38879631, 32160903, 18838954, 5085690, 7897887, 26224990, 37372403, 28101130, 12987383, 13671081, 31694974, 49655940, 50986100, 33367137, 9633348, -1771948, 5766601, 18576640, 19403759, 10146379, 6465291, 12559566, 17379957, 16298782, 18298726, 27126713, 33222308, 32037856, 33780505, 45022125, 55622139, 55747960, 53019028, 59461051, 71377212, 75774547, 70069788, 63002811, 59985624, 57685832, 51395302, 41747718, 35748940, 41974780]
39626D1974780J7195571J1870284q160824k0277970j1405521J226557j603874
39619C0819003q114943K686404J9772672J4537900r892701k0295874n261646R873964
39611C4124779N982295n086827p960580n490271k144298O053399J3772729O044775
39603D5296001j2848783j7821767k438149Q889138J973602m635107L574079Q803053
39595C0792067n958224k2464656j4765930Q756231J9441638R815911m534425j2158362
39587H924250j1962286l858689O456120N694577n880461p115476J1034320K4075020
39579B7367375R470059j5062342j7502237l09340Q532280J934572k116195L748758
39571A6062930Q977835J0479515J4389398J3901055l715396k6854096k7421107
$$ y = [41974780, 59170351, 71040635, 62879811, 42601841, 31196320, 32422877, 30819003, 22704060, 25390464, 45163136, 59701036, 49808335, 29512461, 24250815, 34124779, 40107074, 35020247, 27059667, 21569396, 19425098, 25478497, 39251226, 45296001, 32447218, 14625451, 12187302, 21076440, 23050042, 18414935, 21989014, 30792067, 24833843, 2369187, -12396743, -3640512, 15801126, 25617037, 21082612, 8924250, -3038036, -6896725, -440605, 5253972, -626489, -7741965, 3292355, 27367375, 36837434, 21775092, 4272855, 3963515, 12495795, 14430367, 12314172, 16062930, 25040765, 35520280, 49909678, 63810733, 60095337, 33241241, 5820134]
39564E820134l877086J3069718N895116o447694k506897R487721J0087328Q58773
39556C2387113m86228J1943804K3718707J7309867q097722l2193705l0618692
39549A3963144k471153K4297568K5153462R525591L562358R615490O111851j3049178
39541G6709133k5604772j5854368N72842J277093j0430921j4330317m094476P301190
39533A5545404Q700674L351367k24455k84641r35746l251837k232316N378853
39525B6047303J3100140J0775142p69407r038831o877269j064656R01945J657376
39517C4731743L781199O15065j1169600k0285715j5619757l459241L628316N809373
39509a968617R165217J0079306L846081o77523N437693J1741447L882041r468694
$$ y = [5820134, 1943048, 15012766, 20907882, 14460188, 11953291, 21441012, 31528340, 32387113, 31900885, 43844689, 67563396, 84873263, 76775541, 44581836, 13963144, 11491991, 35789559, 60943021, 70468612, 74030970, 83646460, 89758311, 76709133, 51104361, 35249993, 35822835, 37099928, 26669007, 12338690, 8244214, 15545404, 24246078, 27597445, 27372990, 27088349, 26152603, 22900766, 20668450, 26047303, 39147443, 49922585, 49153178, 40114347, 33237078, 32172422, 33074367, 34731743, 38512942, 39128007, 27958407, 7672692, -7947065, -11406306, -7777990, -1968617, 7196600, 17275906, 21121987, 20444464, 25882157, 37623604, 41505645, 32036951]
39501C2036951r219770J134537K104463n986719l562173J0935347J4992517k44987
39493D2190166j4568410j1115227Q95165P098106Q562974R062746L197115q970655
39485C6351980j4315198p574675k632206r005507j3635676j918595J6614783K0188142
39477B4073048L870502j6348034k2550661r660438J1695810K1749923R920892
39470B2751042j0094962j4725782j655207Q535319M255540k420881R22897Q369523
39462A5937489R516849M578234l617610j5583372k4197415j6134815N625848J9363253
39454d511539J5137402P780587Q176421M800432j0134283j9783940r660328M745116
39446c450132K253902q475068m684571J1210187J6124727L838060p932981o288376
$$ y = [32036951, 22817181, 23951718, 26056181, 20069462, 16507289, 27442636, 42435153, 42190166, 27621756, 16506529, 17401694, 24499800, 33062774, 42125520, 45322635, 36351980, 22036782, 14462107, 11829901, 2824394, -10811282, -12729877, 3884906, 24073048, 27943550, 11595516, -10955145, -20615583, -8919773, 12830150, 22751042, 12656080, -2069702, -3724909, 4810410, 9065950, 6645069, 7567966, 15937489, 25454338, 30032572, 26414962, 10831590, -13365825, -29500640, -23874792, -4511539, 10625863, 18406450, 26582871, 31383303, 21249020, 1465080, -8195248, -3450132, -1196230, -9671298, -14355869, -3145682, 12979045, 16817105, 8884124, 2595748]
39438B595748K530641P474979M451454n163783j4217420j1591485L567305J5746312
39430E393751J3049650M000566J293163J018045n092579r582544k557835N646061
39422A3168278j337673j6757591j9886023q555213J682761N982794J1963939J6106786
39414B368058O358648j0388502j1117884P334646K0215720J1014634o495090j2093286
39406G196944n744526K17551K39m195309p615725l992669P229439J3027548J378532
39397G502024j5556785j2674600J0023351K3146500J0029229r403584j0061775
39390C004360L273953R533357M018882j719258j999179o24508J135955M492429
39382B1115991N547168O48942n042986n362715l955608o145672o344536L167891
$$ y = [2595748, 5126389, 12601368, 17052822, 11889039, -2328381, -13919866, -10352561, 5393751, 18443401, 22443967, 23737130, 24755175, 19662596, 10080052, 7522217, 13168278, 11830605, -4926986, -24813009, -33368222, -31685461, -25702667, -13738728, 2368058, 8726706, -1661796, -12779680, -5445034, 14770686, 25785320, 19290230, 7196944, 1452418, 1669969, 1670208, -2525101, -10140826, -14133495, -6904056, 6123492, 7502024, -8054761, -20729361, -10706010, 12440490, 22469719, 13066135, 3004360, 6278313, 15811670, 19830552, 18111294, 16112115, 15487607, 16623562, 21115991, 26663159, 27312101, 22269115, 16906400, 12950792, 6805120, 460584, 3628475]
39374C628475J5392701J4895988j53730j4903929j7263182r496740M49884Q539937
39366A089404J2857792J1239891M913304j109355l829616l944750j513606L413469
39358B3116533N081576m035502j9348089k3293492p055195J3305843J4681821
39351B453495j252811q852145M863968J9926507J1931453j0991855j8876376l480385
39343d278149J0917980N029856p954988n166475J1119294J8841489Q301668p944738
39335B8865937j4692844r867563j045762L648125J462375j785105J958429Q550912
39327A7094504L036566j5706778k4520923o013506K2006914K8019708J0195876
39320C4112361n525775o362032m425185o981851m468039M399921L884935r548571
$$ y = [3628475, 19021176, 33917164, 33763434, 18859505, 1596323, -7900417, -7450533, 1089404, 13947196, 25187087, 30100391, 28991036, 25161420, 21216670, 19703064, 23116533, 28198109, 24162607, 4814518, -18478974, -25534169, -12228326, 2453495, 1200684, -7651461, -2787493, 17139014, 29070467, 18078612, -797764, -4278149, 6639831, 11669687, 3714699, -1451776, 9667518, 28509007, 36810675, 28865937, 14173093, 4305530, 3259768, 6907893, 8370268, 6585163, 8543592, 17094504, 20131070, 4424292, -20096631, -26110137, -4103223, 23916485, 34112361, 28586586, 22224554, 17799369, 10817518, 6349479, 10749400, 14634335, 5085764]
39312E085764j4952989m71278J3943808P494001p873554q021769N546322J3715972
39304A4466277J3108933J4273865J4663210J949104j7852724k2729449p877108
39297A0002108O958851P507101M68378o041057j4868224k3575188j7312070P828268
39289b9031833L0693600L0020373J1816941k766946o595904p668350q970259n343148
39281A2154474J635861K233070n355954j0051549l518755P957501J1809985L782304
39273B0646937r217630j6941400j4326657n101134K262199M185904N803732J1588908
39265a099141J5728005R364498m021497j0182489l249441N963212N812411q5252
39257A8230306l65629N959739Q532914J529004q252712j1172345o404459m32544
$$ y = [5085764, -9867225, -10338503, 3605305, 11099306, 3225752, -4796017, 750305, 14466277, 27575210, 41849075, 56512285, 58461389, 40608665, 17879216, 10002108, 16960959, 24468060, 24936438, 18895381, 4027157, -19548031, -36860101, -29031833, 1661767, 31682140, 43499081, 40732135, 34136231, 26467881, 17497622, 12154474, 13790335, 16023405, 10667451, 615902, -2902853, 5054648, 16864633, 20646937, 11429307, -5512093, -19838750, -24939884, -22677685, -18491781, -12688049, -1099141, 14628864, 23993362, 19971865, 9789376, 6539935, 12503147, 18315558, 18230306, 17864677, 23824416, 32357330, 33886334, 25633622, 14461277, 8056818, 7624274]
39249G624274K354440L548606N978711Q232135O099760n15138m996980j730464
39241B6595344M925120M800788m141378j2321599j1759765o015424k104807M83365
39233D61644N124549Q416513N163293q00175j539409J636366J318883j129054
39225A8652610K564488J0200615Q869551l576972j2016488o720412J708929O26622
39217B0308943m589820k666997K386487m11829o635440k132594J0633458J2112221
39209B9004429l998987j7514409q386223J5655260K9219620J9820794j819729
39202F1980755j7612005j8664515p881921M995890R541355K243975r174060j2682717
39194A2746757n386929L079541L106518k284923k091301P076729J6359680J6551167
$$ y = [7624274, 9978714, 13527320, 19506031, 27738166, 33837926, 33322788, 28325808, 26595344, 31520464, 36321252, 32179874, 19858275, 8098510, 2083086, -21721, 461644, 5586193, 14002706, 19165999, 18365824, 16826415, 18462781, 19781664, 18652610, 21217098, 31417713, 40287264, 36710292, 24693804, 17973392, 19682321, 20308943, 15719123, 13052126, 15438613, 15026784, 8391344, 6258750, 16892208, 29004429, 25005442, 7491033, -895190, 14760070, 43979690, 63800484, 61980755, 44368750, 25704235, 17822314, 22818204, 32359559, 34603534, 25429474, 12746757, 7359828, 10439369, 13545887, 11260964, 9169663, 16246392, 32606072, 49157239]
39186D9157239Q068258l556385j4386342j9012002r933346R544861J9402559N056569
39178D4341411j8400433k2051070l126532J1470311O208676j798428N016754J3846466
39170C5507155M389031j3956762j5096499J410498R707021l93872q377638J927831
39162A5116765J5848588J1410589o308187j2243997L411087K2142271K0320419
39155F9697535k964289k4721328k3230697k653487J1153382J977431j5741358
39148A3517189j5967962L090534J6100950N705221j3585028j5562447K630477
39141d071066J7799983J1270952q535987j8451587r397429N237901J0072306O845367
39133A0770440N624152N141618k953678j2798355p312094J2375676K1678140Q719023
$$ y = [49157239, 57225497, 53669112, 39282770, 20270768, 10337422, 19882283, 39284842, 44341411, 25940978, 3889908, 763376, 12233687, 18442363, 16643935, 21660689, 35507155, 39896186, 25939424, 10842925, 12253423, 21960444, 21566572, 13188934, 15116765, 30965353, 42375942, 36067755, 23823758, 27234845, 49377116, 69697535, 66733246, 42011918, 18781221, 16127734, 27281116, 29258547, 13517189, -2450773, 639761, 16740711, 22445932, 8860904, -6701543, -4071066, 13728917, 24999869, 16463882, -1987705, -11385134, -6147233, 3925073, 10770440, 16394592, 21536210, 18582532, 5784177, -1527917, 10847759, 32525899, 41244922]
39125D1244922n080740R34457J1804675K563028j6782896j5529352N898033J5654524
39117D0706651L314828n091539N091592J0992953o906833k8912228k6718004o500723
39109a4023303O208431P496760J2193055K1174815K0142080O701047n906886j0708794
39101D3277205j1810946q890576K535962J5012223J3324012j892435j2178457
39094C9376988p414660J710526L033646J95769K263860P185008N668567l985102
39086D8034602j3029222j2662371l321527N711507N425703k827074q005033k702634
39078A6623951P203127J0338426M122454l706098n109657J322100J0190778J1933025
39070E2918106O99359j5663400k0490491r574161J261098q84495n944102J644808
$$ y = [41244922, 36164182, 37098639, 48903314, 51466342, 34683446, 19154094, 25052127, 40706651, 44021479, 38929940, 44021532, 55014485, 48107652, 19195424, -7522580, -14023303, -7814872, -318112, 11874943, 33049758, 53191838, 59892885, 53985999, 43277205, 31466259, 22575683, 25111645, 40123868, 53447880, 51555445, 39376988, 31962328, 33672854, 36706500, 36902269, 39166129, 46351137, 52019704, 48034602, 35005380, 22343009, 19021482, 24732989, 30158692, 27331618, 19326585, 16623951, 23827078, 34165504, 38287958, 34581860, 29472203, 30794303, 40985081, 52918106, 53617465, 37954065, 17463574, 7889413, 9150511, 8266016, 2321914, 3966722]
39062C966722J4851500J4108317J085485k091758R848031J4276208k213829j8695694
39054C5134982j0537314J1663518J7189601K70754j5069078j3779920p967416
39047A6905127r342554p030732J0315790K6644819J6736124j2792343k5911881
39040A5524350o273568J8327365J4749682r457104k0213345p394829N192653O31527
39032A1086731p270692j507379R405787P869209l517777r325277p315329n948565
39024f523292l167600R054738K1776350J5698723n970439j5531418o18396J5924082
39016C0642748R653103j0679388j9664431j2200779l202541N01562N567629J2466533
39008A3084436J2032519M037820N87709N903462R010436L095875l337877l275511
$$ y = [3966722, 18818222, 32926539, 34012024, 31920266, 41768297, 56044505, 53830676, 35134982, 24597668, 36261186, 53450787, 53721541, 38652463, 24872543, 16905127, 7562573, 531841, 10847631, 37492450, 54228574, 41436231, 15524350, 9250782, 27578147, 42327829, 32870725, 12657380, 5262551, 10455204, 11086731, 3816039, 2308660, 11714447, 19583656, 16065879, 6740602, -574727, -6523292, -9690892, -636154, 21140196, 36838919, 30868480, 15337062, 14718666, 30642748, 40295851, 29616463, 9952032, -2248747, -5451288, -4949726, 617903, 13084436, 25116955, 29154775, 29742484, 35645946, 44656382, 47752257, 44414380, 41138869]
39000D1138869l977507j0892089j2708983R07951J7052863J5233616j24465m910697
38992D1719558P304092J6419145R634376O01169K768072N261636n865240j9493123
38984E8349685j6407147l160357k019935j2101875r606057J0740120K3343025
38977D9137459J1013748q682581j1876901k392498J803862k48306K949237J0292108
38969E1996128J0439377M113079K716474O474072M028007n232275p645373J757842
38961F8647331R905038O116665k234645k673181M647995J0261617Q393950J45162
38953A03209932r464588j2842977n502814N528432P032174k751672j1052015r456263
38945F4700209m479893k499531K812225J6191304K5298247J5990594l488207j1426836
$$ y = [41138869, 37161362, 26269273, 13560290, 14468241, 31521104, 46754720, 46630255, 41719558, 49023650, 65442795, 75077171, 75678340, 78446412, 83708048, 77842808, 58349685, 41942538, 38782181, 36762246, 24660371, 15054314, 25794434, 49137459, 60151207, 51468626, 39591725, 37199227, 39003089, 38754783, 41704020, 51996128, 62435505, 66548584, 69265058, 75739130, 79767137, 74534862, 66889489, 68647331, 78552369, 84669034, 82434389, 79761208, 84409203, 94670820, 103064770, 103209932, 93745344, 80902367, 75399553, 80927985, 87960159, 85208487, 74156472, 64700209, 60220316, 57720785, 60533010, 76724314, 102022561, 118013155, 114524948, 103098112]
38937A03098112l283881M704917L240549J973005Q047626J1379241K953228p333752
38929A24779045o420670m41835l462945j1196720o593382J0039510J8124993Q566316
38921A33394312j875150K052215J0173938N590551o159242o045402P129268J4563729
38913A58824219O354032n324138n951331K816608J0417678J2044926R417752N196218
38905A93795964K537405L813766N579006J299251p650538j1284531n062585L440323
38897A86468061O696270P918269J3329237K0680919K2527814J6224033N317225
38890B79161828m368868o406880J828623J2268306J1608226r10708r706852l599302
38882B79874373Q636474J2205822P170262M219458O133826O050996J124985l292014
$$ y = [103098112, 99814231, 104519148, 107759697, 109732702, 117780328, 129159569, 132112797, 124779045, 118358375, 117916540, 114453595, 103256875, 96663493, 106703003, 124827996, 133394312, 131519162, 133571377, 143745315, 149335866, 143176624, 137131222, 144260490, 158824219, 165178251, 159854113, 153902782, 156719390, 167137068, 179181994, 188599746, 193795964, 196333369, 200147135, 205726141, 207025392, 199374854, 188090323, 183027738, 186468061, 193164331, 201082600, 214411837, 235092756, 257620570, 273844603, 279161828, 274792960, 268386080, 270214703, 282483009, 294091235, 293180527, 283473675, 279874373, 288510847, 300716669, 307886931, 312106389, 318240215, 324291211, 325416196, 322124182]
38874C22124182k157064M587602J3908464K0025150J6826447N902906l338626
38867C77879061o651175q818795q598349N030181K8754752L4325480M577268l2399942
38859C94098481l3598584Q6423K6230797K1756456P476611M334331R23399j5766294
38851D05541620k7328167j0664838K0686677L1982613J4992655o451622j4081231
38844D14677707j3200925j2893577j1125027n252610n43898j353711m918201q160660
38836C57229098j1495553j3735308j2133045q644637p547291p091054l038947
38829B93543263O32468l748828j2533777j3582253n861802j987563p040835r567812
38821B39852861j202423Q409268O987823j174417m052118j830664m135085j1746295
$$ y = [322124182, 319967118, 324554720, 338463184, 358488334, 375314781, 381217687, 377879061, 371227886, 362409091, 353810742, 358840923, 387595675, 421921155, 426498423, 394098481, 360499897, 360586320, 386817117, 408573573, 416050184, 420384515, 421307914, 405541620, 378213453, 367548615, 388235292, 420217905, 435210560, 428758938, 414677707, 401476782, 388583205, 377458178, 372205568, 371661670, 370307959, 365389758, 357229098, 345733545, 331998237, 319865192, 311220555, 303673264, 296582210, 293543263, 294175731, 290426903, 277893126, 264310873, 258449071, 256461508, 249420673, 239852861, 238650438, 247059706, 254047529, 252873112, 248820994, 246990330, 242855245, 231108950]
38813B31108950j4663160p754362K485771P276817L435952p259987j8434266k0178257
38805A76017458q896059M419441N100699n948379j3645768r734256j159615M594947
38797A50748468R798302J6326240J7127242P149144n801105j1062017r518305
38790A74767969q323258p467299l137369L633o537636j8635113k0757879o866515
38782A03046533J0153756J4598287N777445n041061r368401p681274m339351j311800
38774A05834134K784439Q081554Q523104l687130k4393665l4147061j8594272
38767D4401103J0177183K4890553J6680023M270552N229995J2300456Q837096
38760A26786961l344458p138873K723534J1266873M925785r836839j6096759q343082
$$ y = [231108950, 216445790, 208691428, 211177199, 218454016, 221889968, 214629981, 196195715, 176017458, 167121399, 171540840, 176641539, 170693160, 157047392, 147313136, 146153521, 150748468, 160546770, 176873010, 194000252, 201149396, 195348291, 184286274, 174767969, 166444711, 158977412, 155840043, 155843676, 149306040, 130670927, 109913048, 103046533, 113200289, 127798576, 133576021, 128534960, 119166559, 111485285, 107145934, 105834134, 108618573, 116700127, 125223231, 121536101, 97142436, 62995375, 44401103, 54578286, 79468839, 96148862, 100419414, 105649409, 117949865, 126786961, 123442503, 116303630, 119027164, 130294037, 135219822, 125382983, 109286224, 100943142]
38752A00943142K457161L937261l656727j0407371r906673n264067k531548k901258
38744G2669920l684989l225259j297899K370325O095527N645727j84162o446386
38736G1942804q353435o223583k64255J1314135K1652190J4094469j3739967l4678797
38728E5743561k2313234Q201455J5657777r029168k8611677j3660744J6478656
38721B2466626K5385278J0043907m137721l770636K281075M975109M297740J22310
38713F1663688p097986r834429m047154o12328q877450j6199847n329661J3630333
38705B3295166J4401855l416003j1614606J794791J3019617R65814j8704312j7718217
38697B024105K852869J6969923J2056068K016238K403375R820527J1336615L539610
$$ y = [100943142, 103400303, 107337564, 103680837, 93273466, 83366793, 78102726, 75571178, 72669920, 68984931, 65759672, 64461773, 66832098, 72927625, 78573352, 78389190, 71942804, 63589369, 57365786, 57101531, 68415666, 90067856, 104162325, 90422358, 55743561, 33430327, 41631782, 57289559, 48260391, 19648714, 5987970, 22466626, 47851904, 57895811, 53758090, 49987454, 52268529, 57243638, 61541378, 61663688, 54565702, 44731273, 40684119, 40071791, 31194341, 14994494, 9664833, 23295166, 37697021, 34281018, 22666412, 24461203, 37480820, 38446634, 19742322, 2024105, 4876974, 21846897, 33902965, 35919203, 38322578, 48143105, 59479720, 63019330]
38689F3019330n399862q279101o493294m535397k194958K803209O634895K003412
38681D7558234q923362j3218529n005074L850782K60609r901726j0341687J372142
38673E651389J1637695J1325023M996144p85767n331548p698328m486052K591171
38665A7899727O440356M684230J468657j859613p820653j3214530r960466J108172
38657a254120Q245512N243165q7529Q29119M948692M982472J319882q76676j154841
38648B2195676l080599o688359p576926l551907J110219j64459p294357j0767935
38640a5818647k345308J2007967J7541848J0594293K814355J718016J83445o839971
38632A9855998r920585k167370N449093K188145k252969M570721J2038761K180041
$$ y = [63019330, 57619468, 49340367, 42847073, 38311676, 36116718, 38919927, 45554822, 47558234, 38634872, 25416343, 20411269, 24262051, 24522660, 14620934, 4279247, 5651389, 17289084, 28614107, 33610251, 32824484, 27492936, 19794608, 15308556, 17899727, 24340083, 29024313, 30492970, 28633357, 20812704, 7598174, -2362292, -1254120, 6991392, 12234557, 12147028, 12976147, 17924839, 22907311, 24227193, 23350517, 22195676, 19115077, 12426718, 4849792, 1297885, 2408104, 2243645, -5050712, -15818647, -18163955, -6155988, 11385860, 21980153, 24794508, 26512524, 26695969, 19855998, 9935413, 7768043, 13217136, 15405281, 13152312, 17723033, 29761794, 31941835]
38624C1941835j7746418k4334157j3760747k016335N388260J4966256J9911669
38617A4350363N629117j8131671k3422914o945337N486829K928829L241582J4125235
38609b737967J6743959K934901o404722J229912P253994k232467j0158755j973116
38601D655739N413744m598288j5908380q425174O480966R164600N879724R135265
38593A1798196Q589611n376514j3481874P99551J5043477L173473j5730875q760335
38585c945290J0954875O617290j4866112j3849023J0689282J9070256J698300
38578A6369578o478438Q052099J3862733m950822j7814327k441386J5927649R365103
38570C1892189q428926j2889594q373270o621561J628409K0959373K7249597M427125
$$ y = [31941835, 14195417, -10138740, -23899487, -25915822, -20527562, -5561306, 14350363, 19979480, 1847809, -21575105, -28520442, -23033613, -20104784, -16863202, -2737967, 14005992, 16940893, 10536171, 11766083, 19020077, 16787610, 6628855, 4655739, 10069483, 5471195, -10437185, -18862359, -12381393, -3216793, 2662931, 11798196, 20387807, 15011293, 1529419, 2328970, 17372447, 20545920, 4815045, -3945290, 7009585, 13626875, -1239237, -15088260, -4398978, 14671278, 16369578, 9891140, 17943239, 31805972, 26855150, 9040823, 6599437, 22527086, 31892189, 23463263, 10573669, 2200399, -4421162, -2792753, 18166620, 45416217, 49843342]
38562D9843342k0551005j5743393N048009P314997p350084j0128741K171609N108840
38554A5713574p188353j3072002k853845O486889K158402o222470o204178J150778
38546a0031205R452840J3958173R063657m592255j2809735n500978L555746l676884
38538e80641j6427317r387827J3010347J9418536K353123q555453M378165J8242850
38530B2451783R410369p555460p263322L156567o91679j6064497j6952435K062557
38522a1446117J6307249R026032n899931p520971M250897J4157468J2591311K044823
38514C3510761r426512j4452047j1216508n356226k338718J474526J2207972K3810367
38506B8213615K1629824L364823j4910289j8737582j1417226m569282k277259
$$ y = [49843342, 29292337, 13548944, 18596953, 25911950, 18561866, 8433125, 10604734, 15713574, 8525221, -4546781, -7400626, -913737, 1244665, -4977805, -11181983, -10031205, -578365, 13379808, 22443465, 17851210, 5041475, -459503, 3096243, -580641, -17007958, -26395785, -13385438, 6033098, 8386221, -169232, 4208933, 22451783, 31862152, 24306692, 17043370, 20199937, 19508258, 3443761, -13508674, -11446117, 4861132, 13887164, 7987233, 466262, 4717159, 18874627, 31465938, 33510761, 24084249, 9632202, -1584306, -6940532, -9279250, -7804724, 4403248, 28213615, 49843439, 53208262, 38297973, 19560391, 8143165, 3573883, 1296624]
38499A296624j764010j375609M4750M872679J0720894R789933R03200o041052
38491A8447409n103488m049956r428780j2557381l652795R381563J2092188N997812
38483A1126572K852527K821605k354404r288587p554906j647855n053647j3154240
38475b2252935p845862Q661521J3130961P46474n184888N392293J0052491n260082
38467b560027j7050228k491872J9503843J7691301j220407p159725K556618M644964
38459A3914467n473384q372079O25701L211783o459070j0134079K168557J5501279
38451D983175J5242960N757021m259415j3161520j6273958o770951O401756M305288
38443c775644j0864107j4344479K557766J7553499J3170268K517301L528282J0336792
$$ y = [1296624, -467386, -1842995, -1798245, 3074434, 13795328, 23585261, 24488461, 18447409, 13343921, 9293965, -134815, -12692196, -16344991, -6963428, 5128760, 11126572, 13979099, 16800704, 14446300, 5157713, -2397193, -4045048, -9098695, -22252935, -30098797, -21437276, -8306315, -7559841, -12744729, -7352436, 2700055, -2560027, -19610255, -22102127, -2598284, 15093017, 13872610, 6712885, 9269503, 13914467, 8441083, 69004, 694705, 3906488, -2552582, -12686661, -10518104, 4983175, 20226135, 25983156, 21723741, 8562221, -7711737, -14482688, -8080932, -3775644, -14639751, -28984230, -26426464, -8872965, 4297303, 6814604, 10342886, 20679678]
38435B0679678Q932864J959149j385490l637156q762742r069348o51451L405935
38427A1471439n689359j3197962m043697Q884586L783533j3349664j7020199j816858
38419c0978181J1344571P939542l040682p315164l312875K128048M161250L160314
38411a5913177L975271R951995J3976824M625526j2890140j6550175P48225J6285457
38403D209806J0562203k738268k025438M513325l766281j8190104j2394141R700735
38395a0128163J6225787L77592p694062P313524J9300996N384479j4752387j0792667
38387E235099R740670J4797462l020503j8972539j4233144J569519Q049063j061721
38379B103906j4415724j6605692m055001J0102336J0954779K135198J175150J2089717
$$ y = [20679678, 29612542, 31571691, 30186201, 26549045, 17786303, 8716955, 8065504, 11471439, 5782080, -7415882, -11459579, -2574993, 1208540, -12141124, -29161323, -30978181, -19633610, -11694068, -14734750, -22049914, -25362789, -23234741, -19073491, -15913177, -11937906, -1985911, 11990913, 16616439, 3726299, -12823876, -12075651, 4209806, 14772009, 12033741, 10008303, 14521628, 10755347, -7434757, -19828898, -10128163, 6097624, 6475216, -1218846, 6094678, 25395674, 30780153, 16027766, 5235099, 14975769, 29773231, 26752728, 7780189, -6452955, -4883436, 3165627, 2103906, -12311818, -28917510, -32972511, -22870175, -11915396, -9780198, -8605048, 3484669]
38371C484669J7486769N934210q535522p640004L680670P613701J378173l464706
38363A9937960l086899l986708o577912m130506K388398M703263K855844M817475
38355A6920915R405558N644116p677232j7237759j4891990p960502m246465r63841
38347b1007200M099042M398986k343786n180355L982056J5079239J3646190K409657
38339A5083829m225627j715752K228090K966562K704155P62934o040986j3103545
38331a340340j1243588j737687M148395K596088J620792N231618O752820L037002
38323I065100J794538P031808R547036J694065q871024j0766304n217837l58853
38315C918529J871778K041668l945783j4986524j7133234k194474J3745639R552643
$$ y = [3484669, 20971438, 26905648, 18370126, 10730122, 14410792, 22024493, 23402666, 19937960, 16851061, 12864353, 6286441, 2155935, 4544333, 9247596, 12103440, 16920915, 26326473, 31970589, 24293357, 7055598, -7836392, -15796894, -20043359, -21007200, -16908158, -12509172, -14852958, -20033313, -16051257, -972018, 12674172, 15083829, 10858202, 9142450, 11370540, 14337102, 17041257, 17804191, 11763205, -1340340, -12583928, -14321615, -10173220, -7577132, -5956340, -724722, 6028098, 9065100, 10859638, 17891446, 27438482, 29132547, 20261523, 9495219, 4277382, 3918529, 5790307, 7831975, 3886192, -11100332, -28233566, -30428040, -16682401, -7129758]
38307g129758q145609j2574135M048269K1006625K1154600J0664321R26761q184368
38299B1766706j7570638k0091162j3714248p660430n154074L442004J9111630
38292a9870212K4103163Q683201q970359q200919L411614N496715j739037l346420
38284d32254O80838k111086r166856n057876Q527721J1113745l282374j4964254
38276a4692396q915492M412430Q918767N483327L043719K024585p84899k315264
38268b825223K65852K233296j04917k315734j087486m15495q80773N062368J7189892
38259A7121780K0068942N287249j0542496p240020P948797J0375150n372370j9515945
38251A8131087j7893075q104593k83176Q217988J8750924J9327387K393913j6661165
$$ y = [-7129758, -15275367, -27849502, -23801233, -2794608, 18359992, 29024313, 29951074, 21766706, 4196068, -15895094, -29609342, -37269772, -42423846, -38981842, -19870212, 4232951, 12916152, 3945793, -4255126, -843512, 4653203, 2914166, -432254, 248584, -1862502, -11029358, -16087234, -7559513, 3554232, 271858, -14692396, -23607888, -19195458, -10276691, -4793364, -1749645, 274940, -509959, -2825223, -2559371, -326075, -430992, -2746726, -3834212, -4249707, -5130480, -68112, 17121780, 37190722, 42477971, 31935475, 24695455, 32644252, 43019402, 37647032, 18131087, 238012, -7866581, -8149757, 68231, 18819155, 38146542, 40540455, 23879290]
38243B3879290j6789129j615117N837563k192274q320398k75317Q071183j27844
38235H467957j4536212j1242250Q784984J7722870J459217j8682309j6444270
38228b4470013L208271J5052900J0370276L182118L560598M802987L66428l486243
38220A2587322K74556O804924P337803J456799n923151j2523311j6274490j1631327
38212a7890875K878895J7444797J9671181Q874734m408576j1237827j0758148
38205D574181n766197J498681Q477725J1914847R959412L132581n974980j2610195
38197A5206055j2294952o511415l214221p262920j2542017r409188Q62162O373277
38189b8793219J470037m163486N09592J0396916J1211316K756014J656099J4550037
$$ y = [23879290, 7090161, 5475044, 11312607, 9120333, 799935, 524618, 8595801, 8467957, -6068255, -17310505, -8525521, 9197349, 10656566, -8025743, -24470013, -21261742, -6208842, 4161434, 7343552, 10904150, 15707137, 16073565, 12587322, 12861878, 19666802, 27004605, 28461404, 22538253, 10014942, -6259548, -17890875, -15011980, 2432817, 22103998, 30978732, 26570156, 15332329, 4574181, -1192016, 306665, 8784390, 20699237, 30658649, 33791230, 27816250, 15206055, 2911103, -3600312, -6814533, -14077453, -26619470, -36028658, -35166496, -28793219, -27323182, -31486668, -30977076, -20580160, -9368844, -6612830, -4956731, 9593306]
38181I593306K2091551M943642k2502172k6379890k120264J5402065J253900k2706419
38173b0424281k0503495N521417K2096108J6028599P011515Q622510P419873p871740
38165A7900506k1774690j4849288N152933J3516185J124698j7930200k5245468
38158d2105324j3465045J1122681L1765791L2998376J6937208J233866m175545
38151C4312008p046167j3237340j3050882M1611J1851630O465807p913200j1147666
38143B75801j388667O103772M347828o55263n916488j2189651j2368589q0082
38135b1871339J2633007Q549571m890898l568824J3694820K0306516L572404j5551363
38127A2873894j6525693q298967p635481r842585j836081J1423246J5128760Q715335
$$ y = [9593306, 31684857, 36628499, 14126327, -12253563, -14373827, 1028238, 2282138, -20424281, -40927776, -35406359, -13310251, 2718348, 9729863, 18352373, 25772246, 17900506, -3874184, -18723472, -13570539, -54354, 1070344, -16859856, -42105324, -55570369, -44447688, -12681897, 20316479, 37253687, 38487553, 34312008, 27265841, 14028501, 977619, 1019230, 12870860, 19336667, 11423467, 275801, -1112866, 4990906, 9338734, 8683471, 2766983, -9422668, -21791257, -21871339, -9238332, -688761, -5579659, -9148483, 4546337, 24852853, 28425257, 12873894, -3651799, -11950766, -19586247, -29428832, -31264913, -19841667, -4712907, 4002428]
38119D002428K404191j799506p606221j0496338m192013M763902N800391K429181
38111d693985N030598J0601668P105075n300354j4283487j4329585j0008328l363573
38103b9241971N536869Q919434L81974r100200m184745P734414N266127j0449936
38095b5138034j3808843M648452K1917790J8342410N180768L25174j058732j0325237
38087H3748j7718840o446656J6079037K6238333J8756390J0318341R964546P619567
38079F4894466m708552j8718226k3175885j8437383j1725251p329222n807789
38072b5007842n730855l763681J440355N995771P116240Q839383J3108956J0791382
38064A2789709n493666k3491335k2516530k496314J4877098J6577087J2461118
$$ y = [4002428, 6406619, 4607113, -2999108, -13495446, -17687459, -12923557, -7123166, -4693985, 336613, 10938281, 18043356, 12743002, -1540485, -15870070, -25878398, -29241971, -23705102, -14785668, -14403694, -23503894, -27688639, -19954225, -14688098, -25138034, -38946877, -34298425, -12380635, 5961775, 11142543, 11467717, 10408985, 83748, -17635092, -24081748, -8002711, 18235622, 36992012, 47310353, 57274899, 64894466, 60185914, 41467688, 18291803, -145580, -11870831, -19200053, -25007842, -30738697, -34502378, -33062023, -27066252, -19950012, -11110629, 1998327, 12789709, 7296043, -16195292, -38711822, -41208136, -26331038, -9753951, 2707167]
38057B707167J3335663J2843246K706104q621460q062990Q8352K18831j0151368
38049E063545j6488450q716321M855207R184744J231463p930164p297250J808187
38041a8289039Q881245P581989J865114k116702m230705n776595l039154N834025
38033i289822J2271585P142496l183939l578955P306262J4902586J0499867Q51481
38025C6921561o734679j3434492j8053956j3221585m59046N668191j980364j1485952
38017b2780322r805744N20279J0814764J7652925J6320337R12604j7871612j5853349
38009b0090118Q209918K1899725N643274j4043489o396354J1713283M553268j8882757
38001g393250j7938185Q857501J8133487n834094k4138988q148665J4958510J0975481
$$ y = [2707167, 16042830, 28886076, 31592180, 22970720, 14907730, 14996082, 15214913, 5063545, -11424905, -20141226, -15286019, -6101275, -4869812, -12799976, -20097226, -18289039, -9407794, -1825805, 39309, -2077393, -6308098, -12084693, -15123847, -9289822, 2981763, 10124259, 6940320, 3361365, 10667627, 25570213, 36070080, 36921561, 30186882, 16752390, -1301566, -14523151, -14982197, -9314006, -11294370, -22780322, -32586066, -32065787, -21251023, -3598098, 12722239, 13634843, -4236769, -20090118, -11880200, 10019525, 15662799, 1619310, -4777044, 6936239, 11489507, -7393250, -25331435, -16473934, 1659553, -4174541, -28313529, -36462194, -21503684, -10528203]
37993a0528203n982152m054655R946333O825224j0622105j2544251N918381J7135841
37985c905587O677815p418934p384656J74817K120275j085834l040019l125119
37977a6987242k467448l71501N42056l024748n541669J333311J2181467J1878255
37969b457519j617400j3444450j3561368o929558Q99347J0818439J7506478Q988554
37961B02523j1181125j9205073k150738K1445049K7458467J8478854J1450515
37954D6498472N684713j1509525l2508858l1317969l642118J9739593J3270245
37947F214553p956343j1091095P536300J9424244N469314j9084132k7025689j2740643
37939c9253491N941361J1786347M584277l477104j454826J0711062K1538950J7991277
$$ y = [-10528203, -16510355, -20565010, -10618677, -3793453, -14415558, -26959809, -21041428, -3905587, 2772228, -4646706, -12031362, -11856545, -9736270, -10822104, -13862123, -16987242, -19454690, -19826191, -19284135, -22308883, -27850552, -26517241, -14335774, -2457519, -4074919, -17519369, -31080737, -38010295, -37110948, -26292509, -8786031, 202523, -10978602, -30183675, -32334413, -10889364, 16569103, 35047957, 46498472, 52183185, 40673660, 8164802, -23153167, -26795285, -7055692, 6214553, -1741790, -12832885, -5296585, 14127659, 19596973, 512841, -26512848, -39253491, -33312130, -21525783, -16941506, -20418610, -21873436, -11162374, 10376576, 28367853]
37931B8367853k41802j8232964k1198420r899209L220724R281295Q036405J557930
37923H91812p692866j3252252q798049K491104J0722290J2144417J0298429M495864
37915A1300749r774771k5493112k4353246j789363K0944228K2351615Q571270
37908A757370J438827O548170J0270842N023550o67159O07093L354501K24358
37900B8557552o253275q948005n799327j31469K938562j246611j1725670j8276788
37892b0885031j0762818O285412J6247401J0011537l754647j0116709l816224
37885a6791079P612604J1634533K204892j1528269j1718688N660216K1113940
37878H188149J6240033P55404k929989L725636m08570j5259552j4140586R997870
$$ y = [28367853, 28126051, 9893087, -11305333, -21204542, -17983818, -8702523, -666118, 891812, -6801054, -20053306, -28851355, -26360251, -15637961, -3493544, 6804885, 11300749, 1525978, -23967134, -48320380, -50109743, -29165515, -6813900, 1757370, 3196197, 9744367, 20015209, 25038759, 24371600, 24978693, 28333194, 28557552, 22304277, 13356272, 7556945, 7425476, 10364038, 9117427, -2608243, -20885031, -31647849, -25362437, -9115036, 896501, -2858146, -12974855, -16791079, -9178475, 2456058, 4660950, -6867319, -18586007, -12925791, 8188149, 24428182, 25183586, 22253597, 25979233, 25570663, 10311111, -3829475, 6168395]
37870F168395K4605030N781008k0412516j5624456J0917392J7047599o711072
37863B1771380k5237513j4810002N556906J0313292L908970L182893P075278N145731
37855A6906935n9176j83439N33342o257550j4108744j0599289J523K046159n203235
37846a6923474n498871P531923J8664713J3493324n41889n711087J220043O627257
37838A8861939K48531j1360424j4305078n500003L748172K763570m592025o236232
37830a6371550K7025L600384r89677l287133P234640K1593402K0316536M37908
37822C2561535j8965660k0383175o437816Q596865J5546615J2929597K398055
37815B6246016r614683j2365849l042591N247723j767185j8144517k2399133o039215
$$ y = [6168395, 30773425, 36554433, 16141917, 517461, 11434853, 28482452, 21771380, -3466133, -18276135, -12719229, -2405937, 1503033, 4685926, 11761204, 16906935, 16847759, 16664320, 17197662, 10940112, -3168632, -13767921, -13766398, -11720239, -16923474, -22422345, -14890422, 3774291, 17267615, 16725726, 11014639, 12234682, 18861939, 19110470, 7750046, -6555032, -12055035, -8306863, -5543293, -10135318, -16371550, -16344525, -12744141, -13733818, -17020951, -9786311, 11807091, 32123627, 32561535, 13595875, -6787300, -13225116, -4628251, 10918364, 23847961, 26246016, 16631333, 4265484, 1222893, 6470616, 4703431, -13441086, -35840219, -41879434]
37807d1879434J3122961J3248195k862636j1437304J064250K0150690K1446447
37800A2853169J151433j9088103j7782544K256239J9151921J7780793M664105
37793B0987013l020974J920948J0413136R425620k917649j5470034j6366408o019123
37785a047471L787243M360962N35089K577152R745034R694308k904874j4880166
37777A1867277r763419Q915747J9524643R213611r955295j7403902j0120826l280136
37769a002300o778871j1915365n874345Q670474J7189649J3102697M090981j730645
37761A5752275n661359j0117518j0112985j713630P440897O907914l75331k059689
37753F0574M281378P940091L045830k756151k503201p96876k517186j374948Q914010
$$ y = [-41879434, -28756473, -15508278, -18370914, -29808218, -28743968, -8593278, 12853169, 14004602, -5083501, -22866045, -20609806, -1457885, 16322908, 20987013, 17966039, 19886987, 30300123, 39725743, 36808094, 21338060, 4971652, -1047471, 2739772, 7100734, 7635823, 10212975, 19958009, 29652317, 26747443, 11867277, 2103858, 11019605, 30544248, 39757859, 29802564, 12398662, 2277836, -1002300, -7781171, -19696536, -25570881, -16900407, 289242, 13391939, 17482920, 15752275, 10090916, -26602, -10139587, -11853217, -4412320, 2495594, 2120263, 60574, 4341952, 12282043, 15327873, 12571722, 10068521, 9271645, 6754459, 5379511, 14293521]
37744A4293521J9420727J5109349l603092j9795812k0044441o614697R192866
37737G958421J7125437J2380472r93209j0815247q550657J60322M044339K620360
37729B3930238L859861P454454L929661p667412j4794855r468281K34700L367839
37721A0846205Q96447n0144J852284L539221L710653O48456q638742j9955436
37713g151056k0814170o685556R117621J1882799N073487K062262M439228K836527
37705G61142l499521l863020M865866J0365846K481744j1165037j4859303m195750
37697a9108033J1203905K0714623K1285878J3693625k269751k3398556l6571572
37690a4449881k6209565N283074L0953947K5533309k496477j9215291q856542
$$ y = [14293521, 33714248, 48823597, 45220505, 25424693, 5380252, -1234445, 7958421, 25083858, 37464330, 36471121, 25655874, 17105217, 17265539, 21309878, 23930238, 27790099, 35244553, 39174214, 31506802, 16711947, 7243666, 7478366, 10846205, 11742652, 11692508, 13544792, 17084013, 20794666, 21443122, 12804380, -7151056, -27965226, -34650782, -25533161, -13650362, -8576875, -6514613, -2075385, 761142, -2738379, -6601399, -1735533, 8630313, 11112057, -52980, -14912283, -19108033, -7904128, 12810495, 34096373, 47789998, 45520247, 22121691, -14449881, -40659446, -35376372, -4422425, 21110884, 18614407, -600884, -9457426]
37683i457426P539971O040352n584290m812516P969566J2802678M478686k441198
37675A6535823k328746n766623j3411029r174504R580497J9730067O580512j0994019
37667A0751978r874779J132777q87746j2970941j3233179p14009L185193n958274
37659b8568980n985482J2748748K6584287J3851939j0304795j5728618j40132
37652g543033J2245100P841714k710590p119568p403173q502402o830075J396065
37644a8625962J0456038J2109139O528132J65126k801102j993725J886787O193337
37636A3917770N918018q38164q753144j0655382n802051K62186K766952J742653
37628a441162p434l39752O31866J095625j6436j436711j815254k112325k580086
$$ y = [-9457426, -1917455, 4122897, -1461393, -6273909, 1695657, 14498335, 18977021, 16535823, 14207077, 8440454, -4970575, -14145079, -4564582, 15165485, 21745997, 10751978, 877199, 2009976, 1122230, -11848711, -25081890, -25795899, -22610706, -28568980, -34554462, -21805714, 4778573, 18630512, 8325717, -7402901, -7543033, 4702067, 12543781, 9833191, 2713623, -4689550, -13191952, -20022027, -18625962, -8169924, 3939215, 10467347, 10632473, 7831371, 5837646, 7724433, 13917770, 19835788, 18997624, 10244480, -410902, -6212953, -5950767, -3183815, -1441162, -1448596, -1788348, -1156482, -60857, -77293, -1514004, -3329258, -5441583, -8021669]
37619h021669K38016P267728R770200j076892j6267686j4210995R054993K8112085
37611A4865780J9173884p429125k1795866j4415097k603021J12231k19796L887331
37603h423679P389964N109931J872637Q23925l956902j2787502j2271498N047359
37595a7195765K4277383K5785906J0850199l849782r829125j0952796j0361579
37588H724441p603389m660939k641923K434946R444033O525948r721055j9551204
37580a7049142m830880J9095533K0796213j321847j7620626j3057873m777771
37573a8766393n968882k737693J5502785K8531746J3287099j7107943k8447503
37566a5706784j1270366J1610700J9024522J1655691m54767j0850526j4018353
$$ y = [-8021669, -7783653, -515925, 9254275, 8177383, -8090303, -22301298, -13246305, 14865780, 34039664, 26610539, 4814673, -9600424, -12203445, -12091214, -12311010, -8423679, -1033715, 4076216, 5948853, 6772778, 2815876, -9971626, -22243124, -17195765, 7081618, 32867524, 43717723, 39867941, 30038816, 19086020, 8724441, 1121052, -3539887, -6181810, -3746864, 5697169, 12223117, 2502062, -17049142, -21880022, -2784489, 18011724, 16689877, -930749, -13988622, -18766393, -24735275, -27472968, -11970183, 16561563, 29848662, 12740719, -15706784, -26977150, -15366450, 3658072, 15313763, 14858996, 4008470, -10009883]
37559a0009883n528060R643035J8748458J4788984J992843j1580244j9270893
37552a215760j5663705j069967J3801374J6465971O657688m908804j0166795q791654
37544d891652k765338M564137O223691j025584q483780n714370K429369J870015
37536g793512p728416j1183182k142313O674827M870347J100433O910955J5800018
37528F509157J3373804J416036m175769K198465Q087800K199014j0208237j6171785
37520C228485j1273374j477090N946363P835338M514261j375588o205436p963930
37512f770971o631479j772956O267985J1389186M620618j2216602k1789386j0371753
37504c7275358J1138049J8199758N557710n926911j128914P675954M249022k484417
$$ y = [-10009883, -15537943, -5894908, 12853550, 27642534, 29635377, 18055133, -1215760, -16879465, -17949432, -4148058, 12317913, 18975601, 14066797, 3900002, -4891652, -7656990, -3092853, 3130838, 2105254, -6378526, -12092896, -9663527, -7793512, -15521928, -26705110, -28847423, -22172596, -17302249, -16201816, -9290861, 6509157, 19882961, 21298997, 17123228, 19321693, 27409493, 29608507, 19400270, 3228485, -8044889, -9521979, -3575616, 4259722, 8773983, 7398395, 1192959, -6770971, -13402450, -15175406, -8907421, 2481765, 7102383, -5114219, -26903605, -37275358, -26137309, -7937551, -2379841, -8306752, -9435666, -1759712, 2489310, 4893]
37496D893N117942J7903491R915703j6345445k6098371m269300J7921069Q350129
37488A2500111j7681692k1658463J069823J9083619J3379793j999357q740016
37481d046182o625794j575360N097421P435146l980244k1726406k2226801O64595
37473d6983625K0686860J3597347q122488j3561085L741863K1271120K1340762
37466A1970754R871257K34958m787627q616457r929356n056716L161262O335442
37458C183517J069823n247671k557813Q155202J4109817P353989l111075l818892
37450A9136897K487003Q55060j1443786j8977299j1356835J391573N121884J622588
37442a1162915J702402P233516J1653915J1983543R424448L134973o334565j2073478
$$ y = [4893, 5122835, 23026326, 32942029, 16596584, -9501787, -13771087, 4149982, 12500111, -5181581, -26840044, -25770221, -6686602, 6693191, 4693834, -4046182, -10671976, -12247336, -7149915, 285231, -3695013, -25421419, -47648220, -46983625, -26296765, -12699418, -20821906, -34382991, -30641128, -9370008, 11970754, 21842011, 22076969, 17289342, 8672885, -1256471, -6313187, -3151925, 3183517, 4253340, -994331, -3552144, 4603058, 18712875, 26066864, 22955789, 19136897, 21623900, 22478960, 11035174, -7942125, -19298960, -17907387, -12785503, -11162915, -9460513, -2226997, 9426918, 21410461, 30834909, 33969882, 27635317, 15561839]
37434A5561839r273161m308768n571625r713126p486216O33143N738646M632232
37426i787036J827280n01808l805705n571890r23968P915303J2395704Q365059
37418I912939n9789n784838l058107Q652302J9258060J4162796n877903k0173197
37410A7032263j4516878j915895k112809j0921848r692735K760944J1005614J1080643
37402B719299J2434982J3511851L052836j1995994r464937R633563J5440719m884059
37394C0448260k3904362j5132049P201356J2515629j253844j1618750o633037
37387h376797O827720J9129724K1732167N786383k2595708l6266659j7902202
37380c1665372J2184564K0899547O362230o004433l552258K882925L958459K011433
$$ y = [15561839, 6288678, 1979910, -3591715, -13304841, -20791057, -20157914, -14419268, -9787036, -7959756, -8461564, -12267269, -17839159, -18763127, -10847824, 1547880, 9912939, 9853150, 4068312, 1010205, 9662507, 28920567, 43083363, 37205460, 17032263, 2515385, 599490, -1513319, -12435167, -22127902, -19366958, -8361344, 2719299, 15154281, 28666132, 31718968, 19722974, 10258037, 19891600, 35332319, 30448260, 6543898, -8588151, -1386795, 11128834, 9874990, -1743760, -8376797, -1549077, 17580647, 39312814, 45099197, 22503489, -13763170, -31665372, -19480808, 1418739, 7780969, 1776536, -1775722, 1107203, 5065662, 7077095]
37372G077095k451945j0905678j4260826k976119J1567072R659144l775321m775036
37364a0841614J0244050J8442632P987287o389238j1829965j3542461j4022464
37357a9951773m474326J1730428J5289598M082794J164926J3890000J6332989
37350C8064636n886546k5038193j4779612M853436K401224r622828J495637K5672102
37342A7159856K1143436j4604704l5134118j5372219J3182862J5152476O35355
37335B162944k498606N027526M521868m071859n321984L256825J0395747J1401743
37327B4874204R220033K314137r454497j3673789k41162J7234644J5571331m291576
37319D1553325j8355877j4864016p190179p207748p470509J39635P040888L664833
$$ y = [7077095, 4625150, -6280528, -20541354, -23517473, -11950401, -2291257, -6066578, -10841614, -597564, 17845068, 25832355, 19443117, 7613152, -5929309, -19951773, -24426099, -12695671, 2593927, 6676721, 7841647, 21731647, 38064636, 32178090, 7139897, -7639715, -2786279, -385055, -10007883, -8512246, 17159856, 38303292, 23698588, -11435530, -26807749, -13624887, 1527589, 2162944, -335662, 4691864, 9213732, 5141873, -180111, 3076714, 13472461, 24874204, 34094237, 36408374, 26953877, 13280088, 13038926, 30273570, 45844901, 41553325, 23197448, 8333432, 1143253, -6064495, -13535004, -13395369, -6354481, -2689648]
37311b689648j962889K268872J1176116J1737019N914202N294318Q254518L095711
37303D3088219p844571r329437o21670J338820p641088r688937K641809R478244
37295B1421389k800294j4895659o523734N935376l794883k3015231j7334464J0114962
37287c0892538K0177507J492439j1343601L589387K0816682J3287167m537072
37280A2589971p907726m033404r721755j3447925K524209K1950484J6217729o992206
37272A1179377j5716706n437995J70621n429669n563461J655669n41058j0120360
37264b9803582m466946J6592103K4601879J0273450m83440O856349J0357580o512244
37256B7415149k2894082j6069519Q45787M756034O08270M180380R003176J704738
$$ y = [-2689648, -4652537, -2383665, 8792451, 20529470, 26443672, 31737990, 39992508, 43088219, 35243648, 25914211, 25292541, 26631361, 18990273, 9301336, 11943145, 21421389, 18621095, 3725436, -2798298, 3137078, -657805, -23673036, -41007500, -30892538, -10715031, -9222592, -20566193, -16976806, 3839876, 17127043, 12589971, 4682245, 648841, -9072914, -22520839, -19996630, 1953854, 18171583, 11179377, -4537329, -9975324, -9804703, -15234372, -20797833, -19142164, -19683222, -29803582, -34270528, -17678425, 6923454, 17196904, 16713464, 23569813, 33927393, 27415149, 4521067, -11548452, -10702665, -5946631, -5338361, -1157981, 7845195, 9549933]
37248I549933p489870j476801J0487992P956812l393908j875490J0308690R944663
37240C4012021p036776j9116520j4228335l797438J223126L493171M607065R0927
37232g52759o452718m845162K351371K086193m831284l175134Q835997J3791529
37224G008033M123997n210108k515006L019440R79623k342859Q93682M434170
37216A0390972K070619J374423P267381P189154q235745k2849742j5989171K974407
37208a5807702O618424p042358j0551426Q251733K4062011J1866125j3334339
37201D062468j7098820M455930K0599252J2006475l819910l461547O331051K826501
37193B5901400j3888457k0311594o683757Q460103P996021N79572K351402R609893
$$ y = [9549933, 2060063, 583262, 11071254, 19028066, 15634158, 13758668, 24067358, 34012021, 26975245, 7858725, -6369610, -10167048, -8943922, -5450751, -843686, -752759, -7205477, -12050639, -9699268, -7613075, -12444359, -15619493, -6783496, 7008033, 11132030, 5921922, 3406916, 6426356, 7405979, 5063120, 5956802, 10390972, 12461591, 13836014, 21103395, 28292549, 20056804, -2792938, -18782109, -15807702, -9189278, -16231636, -26783062, -18531329, 5530682, 17396807, 4062468, -13036352, -8580422, 12018830, 24025305, 20205395, 16743848, 23074899, 25901400, 12012943, -8298651, -14982408, -6522305, 1473716, 2053288, 4404690, 14014583]
37185A4014583O929895o320695j5068095j0522152J635364J2764007J7605532
37178B1038439J1395419n172701j8700032j5011973N63114Q342765J365817o775400
37170b954552m323826L314545O765531O927535O716821J090350j2170237k0799564
37162a5433397j1936720O589619J3759776M390229l469163M827898J8665288J7444811
37154C4838341O94375j1038951n303628O346949P716554Q16211k270661j120557
37146C0678633m521274j0928899r731596j972357q74556q422230j0637743j827443
37138a8237465O483489Q109884J1172890J4485917J783259k3651156k7829766
37131b7682948L836377L2378366J7117331k0035199k5753814L317354K0269118
$$ y = [14014583, 20944478, 14623783, -444312, -10966464, -9331100, 3432907, 21038439, 32433858, 27261157, 8561125, -6450848, -5887734, 2455031, 3820848, -2954552, -7278378, -3963833, 2801698, 9729233, 16446054, 17536404, 5366167, -15433397, -27370117, -20780498, -7020722, -2630493, -6099656, -1271758, 17393530, 34838341, 35532716, 24493765, 19190137, 25537086, 33253640, 34069851, 31799190, 30678633, 26157359, 15228460, 5496864, 3524507, 2649951, -5772279, -16410022, -18237465, -11753976, -3644092, 7528798, 22014715, 23797974, 146818, -27682948, -23846571, 8531795, 25649126, 5613927, -20139887, -16822533, 3446585]
37124C446585N372230r118500k21162J0615605L013807o690688j832844R92479
37116E577512j3945260k5526958q613150K1169573L0337614J7347219O040150
37109C2386700L574330j535592q819649n946358M473574O513569k122671q569176
37101A9954727p942175o181245k997181O259898J4481220R937799k440237p140691
37093B3932115l018146j943777n257640l221638L058782J308831q709026j2320519
37085f171018l678840N756880O167575J132669k308699j738819L149687Q741488
37077A1050923N905136o560776j3101827k308400J1877374J0581028J959167N673406
37069B5076031J3493657R7922k8040926l3577067o359916J7337544R611755r492661
$$ y = [3446585, 8818815, -299685, -520847, 10094758, 13108565, 6417877, 4585033, 5577512, -8367748, -33894706, -42507856, -21338283, 8999331, 26346550, 32386700, 35961030, 34425438, 25605789, 19659431, 24133005, 30646574, 28523903, 19954727, 12012552, 5831307, 2834126, 9094024, 23575244, 33513043, 31072806, 23932115, 20913969, 18970192, 13712552, 10490914, 13549696, 14858527, 6149501, -6171018, -9849858, -4092978, 2074597, 3207266, 898567, -840252, 2309435, 11050923, 16956059, 10395283, -2706544, -5014944, 6862430, 17443458, 19402625, 25076031, 38569688, 38667610, 10626684, -22950383, -29310299, -11972755, -2361000, -11853661]
37061a1853661q927627O683924J3640609R021792N905057N433712J96550o212604
37053A3887752n694222j509526R45718O428125J4890502J0819794j0559066k4049626
37045E159451q835552J3689865R246069j3769325j6109099Q873025K4368225R033100
37037C1655759j1532939p637829J1839466K0206534J2258507N43688r858264k0037469
37029B7437453k2474362r429091R490664J5976144O589734n730704j0627368q631021
37021B601449l311618K929268N914968K514528l130902l619482J377156M708627
37013I983994J483561n372163q853558m470525M990481R850835K985247r501051
37005A096821j3598758o140220N23868k109445m749935M609341J9892223K3927097
$$ y = [-11853661, -20781288, -14097364, -456755, 8565037, 14470094, 19903806, 20100356, 13887752, 8193530, 6684004, 7629722, 14057847, 28948349, 39768143, 29209077, 5159451, -3676101, 10013764, 19259833, 5490508, -10618591, -1745566, 22622659, 31655759, 20122820, 12484991, 24324457, 44530991, 56789498, 57333186, 47474922, 27437453, 4963091, -4466000, 5024664, 21000808, 27590542, 21859838, 11232470, 2601449, -710169, 2219099, 8134067, 10648595, 7517693, 3898211, 5275367, 9983994, 11467555, 6095392, -2758166, -7228691, -2238210, 7612625, 10597872, 1096821, -12501937, -18642157, -18118289, -20227734, -24977669, -20368328, -476105, 23450992]
36997B3450992J1973526m088961j2943914j3523173q598069n53771N339778L782321
36989D838729k398949n172729l072180j715903k623699j010090M279826P742710
36981H67715N475632j215126r577077j4349988o835476J2299771K3610114J0274479
36973B0550044j2894905j4438940P308425J9411788M998103j0446401j847177
36966A2640937J3893639P217751j3886660j7324585Q32857J3151593O614781k692762
36958B0447551l512358n787973j4648731j6405216l096158J1704349J4348319
36951C049783R524162O197090L072684j398514j835492J289009r76956o999275
36943A1922491k634589J1401979J2851004o670916k2280651j1655217R789873
$$ y = [23450992, 35424518, 31335557, 18391643, 4868470, -3729599, -4283370, 1056408, 4838729, 2439780, -2732949, -5805129, -7521032, -10144731, -11154821, -6874995, 867715, 6343347, 5128221, -4448856, -18798844, -25634320, -13334549, 10275565, 20550044, 7655139, -6783801, 524624, 19936412, 24934515, 14488114, 12640937, 26534576, 33752327, 19865667, 2541082, 3373939, 16525532, 23140313, 20447551, 16935193, 11147220, -3501511, -19906727, -23002885, -11298536, 3049783, 12573945, 18771035, 21843719, 20445205, 18609713, 19898722, 18921766, 11922491, 9287902, 20689881, 33540885, 26869969, 4589318, -7065899, 2723974]
36936B723974J2833274k730994j4349733j3327337r236421o162672J96295O605325
36928b3448289O191941M316040R737009J4803522N974513j0397514j5495735q218122
36920a6536635m663727q964125q770940r43200K430126k211535k889944M813494
36912c7736486Q690617K256326k753486L428729J1431078P277728o419866j3869843
36904b7695203n262535J2600832K1747680J0439553j0570777j6372224o27446
36897a5740120J1905331M96581j7425376j0840910J5782484K7380131R666855
36890B1224976j4231021k0864571j2027187J124736J2289138J2902085k501500
36883b083344j8231402j1807330Q991104J3541414k212299r186784L183199R189938
$$ y = [2723974, 15557248, 12826254, -1523479, -14850816, -24087237, -30249909, -30053614, -23448289, -17256348, -12940308, -3203299, 11600223, 17574736, 7177222, -8318513, -16536635, -21200362, -30164487, -38935427, -39878627, -37448501, -39660036, -42549980, -37736486, -29045869, -26789543, -29543029, -26114300, -14683222, -7405494, -13825360, -27695203, -32957738, -20356906, 1390774, 11830327, 1259550, -15112674, -15740120, -3834789, -3338208, -20763584, -31604494, -15822010, 11558121, 21224976, 6993955, -13870616, -25897803, -24773067, -12483929, 418156, -2083344, -20314746, -32122076, -23130972, -9589558, -11801857, -20988641, -17805442, -8615504]
36875h615504k853383n407272J6883808L1316379Q471224k4894306k6014639k117134
36867a3230827Q694319J918527L845113J6681593J5756834j238020q106145K653789
36859B6975183P346326o022108j8506905j4996079o856674p019896q903345l331089
36851c1314587N144302J0106376J2940210J2386226K684249j0940232j3343526
36844a2336982k578051O132642N184795M216664Q702331R140732L96770p008993
36836A1849908n133723j407001l098477m590745n06489K735812j043667o622151
36828g816533p524241n695494l207690L294862J1959855J2453212K332747n414286
36820C82432q51468P754945P055505k528846j0489842j0925841n354847K389847
$$ y = [-8615504, -11468887, -16876159, 7649, 31324028, 39795252, 14900946, -11113693, -13230827, -4536508, -2617981, 1227132, 17908725, 33665559, 32427539, 24321394, 26975183, 34321509, 28299401, 9792496, -5203583, -12060257, -19080153, -27983498, -31314587, -26170285, -16063909, -3123699, 9262527, 11946776, 1006544, -12336982, -14915033, -8782391, -3597596, 619068, 9321399, 18462131, 18858901, 11849908, 6716185, 5309184, 2210707, -2380038, -2886527, -150715, -1194382, -7816533, -15340774, -21036268, -24243958, -20949096, -8989241, 3463971, 5796718, 382432, -469036, 7285909, 14341414, 11812568, 1322726, -9603115, -14957962, -12568115]
36812a2568115P505901O517333K360550P46296L48160m118492r202386o062708
36804a4473461K741857N559664K952330P889102J9402534J7701946l209173j9142678
36796A9422121r204756J1454865J3409539m376177j6362891q942052M976678R485994
36788A9863321M612620j873633o500320q046594l956060M659792J0108706N148080
36780B4015912q952490k2470314k3927691q856617J4143944K7590003K0587012
36773B2129759J170636j0452661l077934J3103930J8215369O303588p774753q524075
36765C1093859p69766o46659r175161j0612258K38712P629273J123652o256563
36757A2625089j246390N674094j29887r068501l736997Q008704N277445p934453
$$ y = [-12568115, -5062214, 1455119, 3815669, 4561965, 4910125, 791633, -8410753, -14473461, -11731604, -6171940, -3219610, 4669492, 24072026, 41773972, 38564799, 19422121, 10217365, 21672230, 35081769, 30705592, 14342701, 5400649, 10377327, 19863321, 24475941, 22602308, 16101988, 8055394, 4099334, 8759126, 18867832, 24015912, 15063422, -7406892, -31334583, -40191200, -26047256, 1542747, 22129759, 23300395, 12847734, 9769800, 22873730, 41089099, 47392687, 39617934, 31093859, 30324093, 29677434, 20502273, 9890015, 10128727, 17758000, 18881652, 12625089, 11378699, 17052793, 16922906, 7854405, 4117408, 12126112, 17403557, 9469104]
36749I469104q085954P478620J6676248R646588q89833p366797j4035414j4601462
36741a708900J916300J9536995Q358066k3188776l1191040m238123J6271777L607620
36733a0636081j2970244l176909J2981869P011044m816541M497383J8001267M436816
36725A5328604k1806625k2354408L84878J1431936M552838M294535J3579570J0245776
36717A5657104n350344q372277K194221N72822j4797912j4102404R683396K4336071
36709I820677J1283909n839851l659968O478705O338361P76818n24321l278827
36701B1395503j1134697j2807294l920446J587283l189448n037958L354132R084172
36693f68753M685274K465279Q445271Q243795m708813j2952833m664318N718728
$$ y = [9469104, 1383150, 8861770, 25538018, 35184606, 34294773, 26927976, 12892562, -1708900, 207400, 19744395, 28102461, 4913685, -26277355, -30515478, -14243701, -10636081, -23606325, -26783234, -13801365, -6790321, -11606862, -7109479, 10891788, 15328604, -6478021, -28832429, -28447551, -17015615, -12462777, -8168242, 5411328, 15657104, 10306760, 1934483, 4128704, 4701526, -10096386, -24198790, -14515394, 9820677, 21104586, 15264735, 11604767, 18083472, 24421833, 25198651, 24674330, 21395503, 10260806, -2546488, -6466934, -4879651, -8069099, -13107057, -9752925, -668753, 4016521, 6481800, 14927071, 23170866, 18462053, 5509220, 844902, 6563630]
36685F563630M479320Q19179L680129K895756o423034q151879L685000O398884
36677A3946985j2482877k6314763j0765325J2164116Q323775j1943457j2133710
36670c9205256R936059K1764693R604562o380562q979260k481276N737797J2960797
36662B957554J1043575m763767j9099489j4059363J227265N081616Q227M094986
36654a3509396J2745636N513808j1510751j0270679Q862695J2808135p822462
36647c183014j9307274k1087K2762170J6804045n446550j1217199J364076P787391
36639I542558j392860j2641276j5136910j0164686N6452J2693727J7873747R579769
36631A0410521j573251k567886Q43253n266417j6562624j5261844l76080Q485407
$$ y = [6563630, 11042950, 11862129, 15542258, 18438014, 12014980, 3863101, 7548101, 13946985, 1464108, -24850655, -35615980, -23451864, -15128089, -27071546, -39205256, -29269197, -7504504, 2100058, -4280504, -13259764, -15741040, -10003243, 2957554, 14001129, 9237362, -9862127, -23921490, -22694225, -17612609, -17604382, -13509396, -763760, 4750048, -6760703, -17031382, -8168687, 4639448, -3183014, -22490288, -22511375, 250795, 17054840, 11608290, 391091, 1755167, 9542558, 8149698, -4491578, -19628488, -29793174, -29736722, -17042995, 830752, 10410521, 8837270, 6269384, 7112637, 1846220, -14716404, -29978248, -30354328, -21868921]
36623b1868921K365530k256179Q862535K1528826J2423393j3039314k2877475
36616a4861605j895228K4868414K4189030j256091j8661963j1166660K917689
36609D133586K284379o502815m863096O039773R101182m52592r870508r599339
36601i729430k724418N113495J0459626Q337518j652710p980148j354336P263153
36593G732750J017457j3570557j3645939L528989J4956642O875810p956625j4447872
36585a5509345j3660309q878091L464367J8053759J8630265M456812l211814N127002
36577H472646J0389718j464435j3411867o979589M799684R34354j0009703o489939
36569a3759131O076925M908216q850185j1608099K136145J1736057N241435m838381
$$ y = [-21868921, -19503391, -21759570, -12897035, 8631791, 21055184, 8015870, -14861605, -16756833, 8111581, 32300611, 31044520, 12382557, 1215897, 4133586, 6417965, -84850, -4947946, 1091827, 10193009, 9740417, -130091, -9729430, -12453848, -7340353, 3119273, 11456791, 9804081, 1823933, 469597, 7732750, 8750207, -4820350, -18466289, -14937300, 19342, 6895152, -1061473, -15509345, -29169654, -38047745, -34583378, -16529619, 2100646, 6557458, 3345644, 8472646, 18862364, 17397929, 3986062, -2993527, 1806157, 2740511, -7269192, -13759131, -7682206, -2773990, -11624175, -23232274, -21096129, -9360072, -4118637, -8957018]
36561h957018n376480N84633N519188O491924K61376j2110061j6144830r4184
36553b9825452K0829195J9812181j698055j5147518q061936J935200J602259L84953
36545a0169173L885414l30226j4026459j4115626J0709749L3495986K5099991
36538C4549656k324420j5555784r238934m718070r034181o644992Q080453J7968713
36530A3082441R470633p857798j6112668r896994L028326J1544237Q166613n071927
36522F352863j5826432j3583206k042789P371870J0897765J2358474J1955798
36515A7484343O797020K14145j430211M0264j804989m784093j354222N497327
36507B0659584L957185o826713j2617362m642731P676594J0793146M108259l524466
$$ y = [-8957018, -14333498, -13748865, -8229677, -1737753, -1476377, -13586438, -29731268, -29825452, -8996257, 10815924, 9117869, -6029649, -14091585, -12156385, -10554126, -10169173, -6283759, -6613985, -20640444, -34756070, -24046321, 9449665, 34549656, 32225236, 16669452, 7430518, 2712448, -6321733, -12966725, -4886272, 13082441, 22553074, 14695276, -1417392, -11314386, -8286060, 3258177, 11424790, 6352863, -9473569, -23056775, -25099564, -17727694, -6829929, 5528545, 17484343, 24281363, 24495508, 23065297, 23105561, 21300572, 16516479, 15162257, 20659584, 24616769, 17790056, 5172694, 529963, 8206557, 18999703, 23107962, 19583496]
36499A9583496o383712m341633J064240O554168P092207J094599o685611j0304463
36491G673291q328196l239284J762994M483518M820577M019456J291056n699755
$$ y = [19583496, 13199784, 8858151, 9922391, 16476559, 23568766, 24663365, 17977754, 7673291, -654905, -3894189, -2131195, 2352323, 7172900, 11192356, 12483412, 6783657]
$$ [...]
##END NTUPLES=NMR SPECTRUM
##END=
