##TITLE=31Pdec_SR152_TFA3
 DMSO-d6, 64 sc
 23.3.2023
##JCAMPDX= 6.0         $$ Bruker NMR JCAMP-DX V2.0
##DATA TYPE= NMR SPECTRUM
##DATA CLASS= NTUPLES
##ORIGIN= UXNMR, Bruker Analytische Messtechnik GmbH
##OWNER= root
$$ XWIN-NMR		Version 3.5
$$ Thu Mar 23 14:09:26 2023 Russian Standard Time (UT+4h)  she@DPX200
##.OBSERVE FREQUENCY= 81.013821
##.OBSERVE NUCLEUS= ^31P
##.ACQUISITION MODE= SIMULTANEOUS
##.ACQUISITION SCHEME= undefined
##.AVERAGES= 64
##.DIGITISER RES= 16
##SPECTROMETER/DATA SYSTEM= spect
##.PULSE SEQUENCE= zgpg30
##.SOLVENT NAME= CDCl3
##.SHIFT REFERENCE= (INTERNAL, CDCl3, 0, 248.564)
##AUDIT TRAIL= $$ (NUMBER, WHEN, WHO, WHERE, WHAT)
$$ ##TITLE= Audit trail, XWIN-NMR		Version 3.5
$$ ##JCAMPDX= 5.01
$$ ##ORIGIN= Bruker BioSpin GmbH
$$ ##OWNER= she
$$ F:/spectra/data/she/nmr/P31/1/pdata/1/auditp.txt
$$ ##AUDIT TRAIL=  $$ (NUMBER, WHEN, WHO, WHERE, WHAT)
(   1,<2023-03-23 14:08:27.18 +0400>,<she>,<DPX200>,
      <continue with go, POWCHK disabled, PULCHK disabled
       configuration hash MD5:
       00 E9 B6 7A A2 85 ED C7 34 08 36 98 17 FE 4E 26
       data hash MD5: 32K
       A0 00 3F C0 46 DC C9 AA D7 C2 C1 02 98 53 CB BD>)
(   2,<2023-03-23 14:08:28.75 +0400>,<she>,<DPX200>,
      <Start of raw data processing
       efp BC_mod = 2 LB = 1 FT_mod = 6 PKNL = 1 PHC0 = -10637.71 PHC1 = 103.6848 SI = 64K 
       data hash MD5: 64K
       F9 71 C7 D4 C3 EF 3F A2 01 7F D4 D6 FF 66 7B 4A>)
(   3,<2023-03-23 14:08:59.76 +0400>,<she>,<DPX200>,
      <pk PHC0 = 173.7808 PHC1 = -447.2001 
       data hash MD5: 64K
       81 91 FE 48 58 B7 17 AF 01 70 A7 80 C8 AD 08 A9>)
(   4,<2023-03-23 14:09:02.93 +0400>,<she>,<DPX200>,
      <abs ABSG = 5 
       data hash MD5: 64K
       F9 C8 2B C9 7F 43 F9 40 F4 BE AC 37 04 59 00 16>)
$$ ##END=
$$ 
$$ hash MD5
$$ 30 B9 96 F1 3E 5A 54 1A F7 E0 FF BD 85 5E 6F C6
##$RELAX= 
##$RELAX= 
##$RELAX= 
##$RELAX= 
##$RELAX= 
##$RELAX= 
##$RELAX= 
##$RELAX= 
##$RELAX= 
$$ Bruker specific parameters
$$ --------------------------
##$DU= <F:/spectra>
##$EXPNO= 1
##$NAME= <P31>
##$PROCNO= 1
##$TYPE= <nmr>
##$USER= <she>
##$AMP= (0..31)
100 100 100 100 100 100 100 100 100 100 100 100 100 100 100 100 100 100 
100 100 100 100 100 100 100 100 100 100 100 100 100 100 
##$AQSEQ= 0
##$AQ_mod= 1
##$AUNM= <au_zg>
##$AUTOPOS= <>
##$BF1= 81.014009
##$BF2= 200.13
##$BF3= 200.13
##$BF4= 200.13
##$BF5= 200.13
##$BF6= 200.13
##$BF7= 200.13
##$BF8= 200.13
##$BYTORDA= 1
##$CFDGTYP= 0
##$CFRGTYP= 5
##$CHEMSTR= <none>
##$CNST= (0..31)
1 1 145 1 1 1 1 1 1 1 1 1 1 1 1 1 1 1 1 1 1 1 1 1 1 1 1 1 1 1 1 1 
##$CPDPRG= <waltz16>
##$CPDPRG1= <>
##$CPDPRG2= <waltz16>
##$CPDPRG3= <>
##$CPDPRG4= <mlev>
##$CPDPRG5= <mlev>
##$CPDPRG6= <mlev>
##$CPDPRG7= <mlev>
##$CPDPRG8= <mlev>
##$CPDPRGB= <>
##$CPDPRGT= <>
##$D= (0..31)
0 1 0 0 0 0 0 0 0 0 0 0.03 2e-05 3e-06 0 0 0 0 0 0 0 0 0 0 0 0 0 0 0 0 
0 0 
##$DATE= 1679566029
##$DBL= (0..7)
120 120 120 11 120 120 24 19 
##$DBP= (0..7)
150 150 150 150 150 150 150 150 
##$DBP07= 0
##$DBPNAM0= <>
$$ [...]
##$SUBNAM3= <"">
##$SUBNAM4= <"">
##$SUBNAM5= <"">
##$SUBNAM6= <"">
##$SUBNAM7= <"">
##$SUBNAM8= <"">
##$SUBNAM9= <"">
##$SW= 501.771253377433
##$SWIBOX= (0..15)
0 1 3 0 0 0 0 0 0 0 0 0 0 0 0 0 
##$SW_h= 40650.406504065
##$TD= 32768
##$TD0= 1
##$TE= 0
##$TE2= 300
##$TE3= 300
##$TEG= 300
##$TL= (0..7)
0 120 53 12 22 120 120 120 
##$TP= (0..7)
150 150 150 150 150 150 150 150 
##$TP07= 0
##$TPNAME0= <>
##$TPNAME1= <>
##$TPNAME2= <>
##$TPNAME3= <>
##$TPNAME4= <>
##$TPNAME5= <>
##$TPNAME6= <>
##$TPNAME7= <>
##$TPOAL= (0..7)
0.5 0.5 0.5 0.5 0.5 0.5 0.5 0.5 
##$TPOFFS= (0..7)
0 0 0 0 0 0 0 0 
##$TUNHIN= 0
##$TUNHOUT= 0
##$TUNXOUT= 0
##$USERA1= <user>
##$USERA2= <user>
##$USERA3= <user>
##$USERA4= <user>
##$USERA5= <user>
##$V9= 5
##$VALIST= <valist>
##$VCLIST= <CCCCCCCCCCCCCCC>
##$VD= 0
##$VDLIST= <DDDDDDDDDDDDDDD>
##$VPLIST= <PPPPPPPPPPPPPPP>
##$VTLIST= <TTTTTTTTTTTTTTT>
##$WBST= 1024
##$WBSW= 4
##$XGAIN= (0..3)
0 0 0 0 
##$XL= 0
##$YL= 0
##$YMAX_a= 3621
##$YMIN_a= -2146
##$ZGOPTNS= <>
##$ZL1= 120
##$ZL2= 120
##$ZL3= 120
##$ZL4= 120
##$ABSF1= 248.5645
##$ABSF2= -253.2056
##$ABSG= 5
##$ABSL= 3
##$ALPHA= 0
##$AQORDER= 0
##$ASSFAC= 0
##$ASSFACI= 0
##$ASSFACX= 0
##$ASSWID= 0
##$AUNMP= <proc_1d>
##$AZFE= 0.1
##$AZFW= 0.5
##$BCFW= 0
##$BC_mod= 2
##$BYTORDP= 0
##$COROFFS= 0
##$CY= -3
##$DATMOD= 1
##$DC= 0
##$DFILT= <>
##$DTYPP= 0
##$F1P= 0
##$F2P= 0
##$FCOR= 1
##$FTSIZE= 65536
##$FT_mod= 6
##$GAMMA= 0
##$GB= 0
##$INTBC= 1
##$INTSCL= 6.047779e-11
##$ISEN= 30
##$LB= 1
##$LEV0= 0
##$LPBIN= 0
##$MAXI= 10000
##$MC2= 0
##$MEAN= 0
##$ME_mod= 0
##$MI= 50
##$NCOEF= 0
##$NC_proc= -8
##$NLEV= 6
##$NOISF1= 182.463
##$NOISF2= 159.3651
##$NSP= 0
##$NTH_PI= 0
##$NZP= 0
##$OFFSET= 248.5645
##$PC= 4
##$PHC0= -10463.93
##$PHC1= -343.5153
##$PH_mod= 1
##$PKNL= yes
##$PPARMOD= 0
##$PSCAL= 0
##$PSIGN= 0
##$REVERSE= no
##$SF= 81.0140089999694
##$SI= 65536
##$SIGF1= 159.3651
##$SIGF2= -187.1042
##$SINO= 113.3802
##$SIOLD= 16384
##$SREGLST= <1H.CDCl3>
##$SSB= 0
##$STSI= 65536
##$STSR= 0
##$SW_p= 40650.406504065
##$SYMM= 0
##$S_DEV= 0
##$TDeff= 32768
##$TDoff= 0
##$TI= <>
##$TILT= no
##$TM1= 0
##$TM2= 0
##$TOPLEV= 0
##$USERP1= <user>
##$USERP2= <user>
##$USERP3= <user>
##$USERP4= <user>
##$USERP5= <user>
##$WDW= 1
##$XDIM= 65536
##$YMAX_p= 322241170
##$YMIN_p= -48850922
$$ End of Bruker specific parameters
$$ ---------------------------------
##NTUPLES= NMR SPECTRUM
##VAR_NAME=  FREQUENCY,     SPECTRUM/REAL,   SPECTRUM/IMAG
##SYMBOL=    X,             R,               I
##VAR_TYPE=  INDEPENDENT,   DEPENDENT,       DEPENDENT
##VAR_FORM=  AFFN,          ASDF,            ASDF
##VAR_DIM=   65536,         65536,           65536
##UNITS=     HZ,            ARBITRARY UNITS, ARBITRARY UNITS
##FACTOR=    0.620285442955139, 1,           1
##FIRST=     20137.2065510682, 0,            0
##LAST=      -20513.1999529968, 0,           0
##MIN=       -20513.1999529968, -48850922,   0
##MAX=       20137.2065510682, 322241170,    0
$$ Real data points
##PAGE= N=1
##DATA TABLE= (X++(R..R)), XYDATA
$$ [...]
##PAGE= N=2
##DATA TABLE= (X++(I..I)), XYDATA
14982 7982367 7748830 2992309 -2905920 -5491996 -4621546 -3854783 -5109642 -6005239 -3406038
14973 -3406038 1706790 4892575 3968046 2096666 3694589 8413511 11288007 8853525
14965 8853525 3316892 -71769 1256459 4765887 5473352 675477 -7194078 -12015198
14957 -12015198 -9274357 -859907 5988776 5516827 -1048671 -7572073 -9736090 -8085286
14949 -8085286 -5037094 -1814167 646368 664831 -1670766 -2726253 878403 7590256
14941 7590256 13106389 16453345 19970800 23096887 20889867 11015460 -1412039 -9217799
14933 -9217799 -11180864 -11423019 -12226445 -11100197 -5335737 3148404 9108048 9670969 7632930
14924 7632930 7996747 11317924 12740762 9136041 4317584 3578701 5482642 4472284
14916 4472284 296970 -1806064 -228841 1302778 2291213 7024892 14399707 15392117
14908 15392117 6344271 -3779818 -6695780 -7141719 -12603422 -18280753 -14582490 -4763479
14900 -4763479 -1321161 -6415529 -9572237 -5826785 -2811965 -6117982 -9566517 -6046662
14892 -6046662 1325426 5467360 5630020 5179869 4699671 3152488 1771438 1969716 2612020
14883 2612020 2593686 2568615 1894758 -1636655 -6858226 -9031485 -6825962 -4188052 -3242038
14874 -3242038 -1543753 1159763 557900 -4184490 -7076324 -4482701 -887376 -525258
14866 -525258 -74521 4441438 9713943 10393566 6713718 1104858 -6580304 -14268722 -15215050
14857 -15215050 -8087725 -2517578 -5585615 -9791577 -5367430 2083634 68101 -8895584
14849 -8895584 -9588186 2155785 13559681 15319688 13150686 13706009 12582908 4736565
14841 4736565 -3711122 -3891429 2510731 7229165 7480359 6040642 3780408 301057
14833 301057 -1200369 2239054 6583955 5518162 991148 1476802 9128784 15755984
14825 15755984 13970558 6674815 1888979 2147364 3426702 2601407 1247260 1647412
14817 1647412 2934433 3443574 4232500 6596566 7268525 1129552 -9993415 -16356651
14809 -16356651 -11807400 -2231622 2381743 792027 -1044847 -1562497 -4729721 -9804291
14801 -9804291 -9945597 -4191437 -1455464 -6923357 -12721020 -10010561 -3667651 -4826573
14793 -4826573 -12816379 -15743626 -8253749 2140500 7961790 10649368 12813969 11232949
14785 11232949 4003371 -2743985 -3110637 -1068606 -3247779 -5989532 -30622 12522618
14777 12522618 17026869 6044056 -8542761 -10012010 1827586 11346341 7072714 -6144224
14769 -6144224 -15307142 -13754606 -5418436 1352056 1447565 -3489436 -7099581 -4713596
14761 -4713596 1655472 6101125 6445780 6062725 7072770 5608769 -2479960 -13368403
14753 -13368403 -17649921 -11685728 -2677714 -115389 -4493858 -7589031 -3279534 5139209
14745 5139209 9641144 7035363 1194705 -3260178 -5860179 -7749958 -7773488 -4600217
14737 -4600217 -1158664 -2583342 -9067131 -14285266 -12663129 -5652782 1212667 5315030
14729 5315030 8290741 11598857 13870956 13192142 10046762 6875505 5390336 5172714
14721 5172714 4954440 4613748 4963204 5602787 4772091 2551034 2157151 5315222 7926151
14712 7926151 4577578 -2927442 -6620707 -3232400 1323647 1231330 -807063 465076
14704 465076 2683742 -1166132 -11074444 -18689962 -18662436 -14838327 -12605832 -10622114 -4448030
14695 -4448030 5044359 11711137 11528612 6459094 1342504 -394636 1791558 5813359
14687 5813359 8215334 6962243 3615755 1864314 3864211 8796287 14363894 18085675
14679 18085675 17489147 11469213 2382877 -5123566 -8787294 -10776538 -13655697 -16161153
14671 -16161153 -15486105 -12248773 -9514448 -7413817 -3339143 1633375 1882465 -4054522
14663 -4054522 -8809878 -5471305 1921288 3727257 -1402920 -5713875 -5444200 -6068832
14655 -6068832 -11340635 -15152337 -10616145 -1835002 1080334 -3705829 -8001922 -6006017
14647 -6006017 -1588708 -973566 -3332985 -2625127 3470067 10287331 12159180 9331263
14639 9331263 7091489 8395903 9838667 6881122 1176993 -1221537 1264414 3397444
14631 3397444 1201629 -2389486 -3162122 -2677339 -4970538 -8972539 -9578827 -5251555 160881
14622 160881 2962791 3014045 1671666 -142333 -1702426 -3089628 -5566857 -8768779 -8992498
14613 -8992498 -3851565 2883748 5575215 4747195 5620267 9084751 10176599 6524679
14605 6524679 2317090 1491568 2151741 821755 -2014453 -3799643 -3626330 -1092651 4690986
14596 4690986 11428273 12796715 5885376 -3254717 -6234321 -2484511 1874126 3342882
14588 3342882 3564042 3385471 738509 -4417358 -8555884 -10084422 -11524208 -13608763
14580 -13608763 -12238396 -5533758 434966 -936611 -6084089 -5072073 4052472 11959286
14572 11959286 11263977 6396089 5957297 10563108 14079976 13228956 9345696 3035580
14564 3035580 -5336320 -10573753 -6372608 4275200 10178884 6643038 1779389 3532480
14556 3532480 7553265 5207924 -1596931 -2660089 5479506 15361222 19450860 17416270
14548 17416270 11538173 2707446 -5753957 -7020919 1055623 10619283 12116721 5877810
14540 5877810 231208 -1028557 -3371564 -11680170 -20546281 -19687121 -7899640 4068959
14532 4068959 6574341 2172017 -438535 654913 722453 -479151 3035779 12072112
14524 12072112 17865968 14044266 5915245 1784187 1312606 -93337 -897405 3250528
14516 3250528 9347556 10209960 6389988 5265460 8526248 10129650 7338076 4002280
14508 4002280 1150719 -5358923 -14068396 -14883277 -3144629 11171817 15657202 11120710
14500 11120710 7825227 10549042 14849361 15534684 11963645 6074861 787124 -189559
14492 -189559 4437771 10716552 13342679 12034909 11159510 13445044 16503063 15540316 8406214
14483 8406214 -1501334 -7475951 -6512719 -3386051 -4321206 -7547859 -5939852 525068
14475 525068 2578703 -4825294 -14248563 -16519558 -13366337 -12148332 -12893454 -9216481
14467 -9216481 75278 8562119 11306588 9864122 7983459 7745490 9941796 13129008
14459 13129008 12519188 5229484 -3295841 -3976636 3605767 9180338 4501235 -6301960
14451 -6301960 -12122763 -7647954 2215274 8827559 7970091 2085839 -3421156 -5150492
14443 -5150492 -3445208 -732348 203852 -2878855 -9344255 -13717440 -9856165 972230
14435 972230 9742209 10017998 5154144 2112338 2202014 2645111 3716361 7890275 13423368
14426 13423368 15213218 12321155 9472671 10239931 12732974 12866255 9014058 3312210
14418 3312210 397857 3435733 8987598 8605671 -760678 -11158649 -13318131 -8458013
14410 -8458013 -4046832 -1436897 3233688 7731464 4565034 -5054559 -8880561 -311379
14402 -311379 11063125 12030428 2719443 -5758064 -6407601 -2378154 -11491 -1624653
14394 -1624653 -4966877 -6354934 -4304474 -1320234 -972171 -3131649 -4888244 -6077631
14386 -6077631 -9393936 -14144763 -15300551 -11107295 -6605698 -6504452 -8939727 -9251376
14378 -9251376 -5639630 1508280 10819338 17579350 16244793 9306461 7063383 13075414
14370 13075414 16636713 7429689 -8079770 -14470901 -7999889 829238 3795885 3578773
14362 3578773 4854197 6340531 5107643 2016131 -608944 -2123959 -2350189 -1307396
14354 -1307396 -954194 -2663385 -2975885 2294050 9364039 9004876 -188742 -8027404 -5820213
14345 -5820213 2591227 6991182 3110325 -5419142 -13221375 -16861298 -15484284 -11605151
14337 -11605151 -8874197 -6792910 -1343358 6863936 10351728 4845190 -3303315 -5189485
14329 -5189485 -970080 2560727 2881919 3596107 7070008 11546105 14845278 15456899 11003526
14320 11003526 1582418 -6038466 -4194209 5054090 11292673 9145358 4413294 4816131
14312 4816131 10299829 15629821 17696014 16347147 11681348 4694702 -1575746 -4872237
14304 -4872237 -6035756 -6344794 -5024855 -1888409 348235 -372843 -1966982 -1846837 -1807871
14295 -1807871 -4916371 -9033088 -8607322 -2987140 1978609 1799745 -1685319 -5076133
14287 -5076133 -8451881 -11931554 -11119696 -1998540 10749093 16662658 12247508 5409325
14279 5409325 4367779 7323069 7874831 6084070 6670033 8455262 4741984 -4828951
14271 -4828951 -11881785 -12104092 -11548955 -14507276 -13938685 -3220149 9353112 9872018
14263 9872018 -522072 -6943026 -2525138 3768337 3437901 30074 -935900 -2411602
14255 -2411602 -8092448 -12760531 -9655304 -1963898 1771293 -90006 -2386963 -2314026
14247 -2314026 -1075528 1061188 4416273 6679713 6246296 6311456 9526728 11700088 7908250
14238 7908250 1911078 1336855 5636836 7598546 5623975 5187017 7985840 9019714
14230 9019714 5983621 2910108 2192515 973839 -1926988 -3187178 -2137816 -3420623
14222 -3420623 -8929180 -13797560 -14025535 -11625628 -8563800 -2423264 7273446 14685850
14214 14685850 14881799 10399191 6001055 2074935 -2146184 -4343931 -3436777 -2978146
14206 -2978146 -4718790 -4046899 1925389 6941774 3773914 -4210133 -7536774 -3736743
14198 -3736743 1813735 5607656 8177516 8091055 2789839 -4014430 -3904953 5184855 15606693
14189 15606693 19417651 15840703 8170516 -939539 -8838554 -12411463 -11127531 -7625450
14181 -7625450 -3877157 345621 4748092 7817473 9291677 9671469 7294544 489412
14173 489412 -6971126 -8080481 -2130967 3056991 1313514 -3710878 -3984786 2484364
14165 2484364 10247420 13489673 11569906 8603701 9296336 14065959 17645445 14535664
14157 14535664 6160289 -482289 -1950968 -2131724 -5209658 -9277908 -10122902 -7729152
14149 -7729152 -5077515 -3133614 -1052288 655192 1054610 1183029 1879247 1297224 -1287737
14140 -1287737 -1635957 3893324 10661127 10628671 4800147 2973979 9095044 14814964 12040415
14131 12040415 4792171 2089489 4539365 5892879 4230865 2796640 1549054 -2712297
14123 -2712297 -7588294 -5880514 2593112 8724272 7286820 4204369 5873441 9223117
14115 9223117 9015553 7919738 10871429 14794886 13486240 9332600 10275724 16660803
14107 16660803 20778523 19345346 17080823 16791867 14921083 9449652 4164232 1610406
14099 1610406 -1356323 -7083577 -11713142 -10165479 -2684226 6088054 11143880 9394079
14091 9394079 2370632 -2968579 -1260064 3604432 3969908 765665 1948983 8286698
14083 8286698 10774755 4872961 -2664066 -5220757 -5040233 -5769518 -5840837 -4930528 -7529766
14074 -7529766 -13493359 -14309079 -6190363 2155659 2840329 696445 2906802 6064237
14066 6064237 4200583 1152751 3077055 6178121 4370682 2084724 5816956 9263343
14058 9263343 2079937 -10915351 -14997169 -7641077 -423160 -379519 -4101203 -9236521
14050 -9236521 -16800870 -22124465 -18461515 -10423993 -9479393 -15428779 -17011185 -11410950
14042 -11410950 -7308473 -7418233 -5162326 -1044966 -3854652 -11342313 -9225081 3728091
14034 3728091 9411992 -1234350 -12930374 -11417680 -5377486 -7411107 -10243479 -1334768
14026 -1334768 11835498 12437562 2107501 -2493860 3605547 9389116 8173627 5076223
14018 5076223 4407606 4352628 4496512 6028667 5034029 -2397311 -9669716 -6661713 3998988
14009 3998988 10216078 8776120 7013233 6808666 1890076 -7044715 -9336198 -1060409
14001 -1060409 7981283 9261452 6383301 5672701 6500638 6879505 8933867 12276633 10639002
13992 10639002 1868248 -6455607 -7986434 -6688342 -8018245 -8644478 -3563671 2770620
13984 2770620 2300732 -3593543 -6755776 -5751898 -6731110 -10855566 -10724191 -2390326 6927631
13975 6927631 8379113 3839736 2843896 9284035 16982420 19093272 16975333 16565826
13967 16565826 18734275 17871259 10176996 -754195 -8458105 -10591308 -8848919 -4581260
13959 -4581260 1710204 7599991 9311655 5677677 -560700 -5524900 -6900932 -4795124
13951 -4795124 -1794868 -1142182 -2683792 -1812337 4897775 13913784 17679028 13240426
13943 13240426 5352452 811650 1861337 5517743 7695258 7293109 6500012 6926350
13935 6926350 6431746 2246987 -3135243 -3427871 2675416 8618510 8444723 3839421 -391750
13926 -391750 -3040030 -4231687 -1255328 7144673 15596142 17522001 13227359 6859620
13918 6859620 -1087780 -10832825 -16314079 -11023608 -26904 3973640 -2112305 -8090863
13910 -8090863 -6714529 -3832302 -7082866 -12827806 -12190511 -5253781 -1055851 -4628319
13902 -4628319 -10358033 -9376009 -169074 9737100 12004003 6700522 2005341 3772663
13894 3772663 8004047 7170310 1711148 -556382 3861478 9426842 10069777 6553849
13886 6553849 2815859 202511 -1270187 -342369 2773353 4188266 629156 -6083066
13878 -6083066 -11610817 -14022300 -13717695 -10977563 -6722037 -3997956 -5498579 -10090162
13870 -10090162 -13921716 -14672281 -13326750 -12076121 -11445615 -9719764 -5496059 -695034
13862 -695034 862214 -1001190 -1481305 2234424 5617530 3009749 -3016637 -4557231
13854 -4557231 13953 3898717 2331295 -1123830 -1227404 1132367 1091645 -3529548 -10194732
13845 -10194732 -14011108 -11340034 -3882277 1058059 -1626047 -7210877 -6430051 1784273
13837 1784273 9028927 9329277 5171602 244618 -5772603 -11926097 -13376986 -8988235
13829 -8988235 -4893780 -5320888 -6036432 -2358339 2613547 4095642 3860577 5033892 4356223
13820 4356223 -1562380 -6841061 -3371968 5210618 7175723 -19845 -6336269 -4650990
13812 -4650990 -158661 -717786 -5701434 -9337386 -9374395 -7359183 -4369234 -1229496 -162322
13803 -162322 -2041688 -4036746 -3503982 -2259621 -3419643 -5834067 -5946190 -4245102 -4921945
13794 -4921945 -8410266 -9339002 -4780365 -370982 -3255040 -11046445 -13941399 -8178229
13786 -8178229 -1152785 -533173 -4080960 -5067796 -3204298 -3605983 -7370030 -10152243 -9396138
13777 -9396138 -6576674 -2515271 3023209 6963241 5318431 988660 1515452 6773310
13769 6773310 6831395 -3828798 -17158859 -21953272 -17442019 -10727119 -5996794 -2944377
13761 -2944377 -1902001 -3436337 -4847252 -2944456 931297 2891124 1490412 -2817487
13753 -2817487 -9859151 -16993339 -17996783 -10381767 -918328 1989766 -937306 -2449575
13745 -2449575 236455 3256935 3301768 879545 -2688260 -6130162 -7071363 -4867052 -3014267
13736 -3014267 -4009058 -4356757 -259605 4868900 5575111 4171090 6953209 12551440 13635241
13727 13635241 9852671 8859203 12935742 14632373 9090048 1581653 -1760417 -2641571
13719 -2641571 -4698544 -6047987 -3939408 -1160298 -1447288 -3018974 -2795029 -2977597 -6728174
13710 -6728174 -10291001 -6792971 2852442 9332797 6301341 -2075062 -6289413 -1480870
13702 -1480870 8478141 14839662 11624255 1162186 -7628410 -7503398 530105 9217783
13694 9217783 12742211 11682274 11167182 14918473 20814305 22485454 16128252 5252419
13686 5252419 -2623562 -3411989 755478 4881780 5133664 1106736 -2979212 -1025360
13678 -1025360 7192151 12837379 7832715 -3341250 -8244437 -2941309 3590545 3162064
13670 3162064 -1490161 -3957815 -3881630 -3680599 -2060607 1923366 3178714 -2733078 -10081580
13661 -10081580 -8841875 594004 6771569 2354655 -7239959 -12728059 -12158277 -9484794
13653 -9484794 -6958961 -4333551 -3403687 -7606683 -15904059 -20892256 -16375222 -5959681
13645 -5959681 -373773 -4508853 -10485439 -7875124 1249486 4248452 -4166744 -13603564
13637 -13603564 -12122583 -2186514 4778669 5336563 6339179 11634701 16239332 15878009
13629 15878009 13963347 14651979 15143414 10383876 1592237 -5207878 -7059564 -6112880
13621 -6112880 -5216280 -5185106 -5485856 -4642183 -1087926 3737523 4916284 9950 -6208548
13612 -6208548 -7085128 -2916615 369136 714546 2018459 5540132 5959320 119530 -5838667
13603 -5838667 -4533856 636430 -729425 -10446976 -17741438 -13757577 -3666822 1077988
13595 1077988 -1463849 -2571463 3274477 10208286 9349443 910496 -6282870 -5726200
13587 -5726200 229333 4858822 4634011 644045 -5009854 -10944548 -14972103 -14256085
13579 -14256085 -8721608 -2223615 1882482 4811866 9303473 13725257 13102495 6364313
13571 6364313 -1313141 -4947648 -5154531 -4966449 -4561677 -2558800 -325441 -972525 -4720916
13562 -4720916 -8595995 -10642273 -11719428 -12911246 -13251062 -10459420 -3222634 6388609
13554 6388609 12377630 9459322 21061 -6950198 -6965427 -6147446 -11373048 -18350099 -17419762
13545 -17419762 -9410076 -5946024 -12172966 -18412363 -13787307 -982485 8619504 9310984
13537 9310984 4256741 -1695290 -5521287 -4487028 2222200 10448066 14445007 13375306
13529 13375306 11068168 10359101 11220716 13049582 14746038 13862624 9890211 6795503
13521 6795503 7437450 7310583 315185 -10056237 -13145168 -6131332 1329888 1001662
13513 1001662 -2825123 -1882109 2491805 2408514 -2887236 -5087296 800517 9148932 11487130
13504 11487130 6986949 2021529 1852538 5545594 8127530 6124697 1216547 -1519923
13496 -1519923 264034 2873460 1516215 -2645470 -4245664 -2323300 -1932753 -5195516
13488 -5195516 -6239931 367692 10255692 14478940 11815409 8792706 7957369 4061625
13480 4061625 -5692840 -14856949 -16079679 -11266411 -7960541 -9156012 -12265267 -15153151
13472 -15153151 -16655727 -13114283 -2143081 9966093 12384821 3647159 -5330740 -5599278
13464 -5599278 -1347871 -1802079 -7258533 -9987107 -6117503 525349 5637433 8828146
13456 8828146 10139340 8304386 4679732 3932540 7627844 10746513 8119356 1820866
13448 1820866 -1566724 365901 3658603 4242522 2966580 3196737 5597381 7231849
13440 7231849 5548784 2059125 1162967 4955636 9937997 10480197 5743721 1036207
13432 1036207 951646 3279117 2363846 -2814997 -7562775 -8607754 -8535184 -11267221 -15978443
13423 -15978443 -18345303 -16418162 -12397696 -8892378 -5839231 -1711721 3646155 8130773
13415 8130773 9062856 6009714 2141344 1731573 5438251 9036615 7919644 2032191
13407 2032191 -4506963 -7472966 -5420491 -544549 1796963 -3130498 -13438195 -20378789
13399 -20378789 -17271910 -7070958 2071150 6462005 7780246 6826379 2888249 -1175637
13391 -1175637 -273568 4977123 7652977 3827646 -2953805 -8140626 -11051451 -11176045
13383 -11176045 -6433559 1375726 5850858 4822912 3607996 5269494 5043945 215242
13375 215242 -2371728 3167788 10568304 10437702 4896203 2475832 2967724 -477236 -6885160
13366 -6885160 -8166047 -3826341 -2215003 -5995965 -8732618 -8004935 -9426223 -14167282
13358 -14167282 -14891810 -8958627 -3645488 -2438480 1510062 10763728 15222983 8853838
13350 8853838 3101334 9969692 20857650 18351707 3628143 -5295429 -1446979 2318147
13342 2318147 -4020483 -11499142 -6645388 8449435 19830502 19504931 11322229 2227016
13334 2227016 -5084070 -11158062 -16449650 -20202019 -20871060 -17548016 -11702015 -6764676
13326 -6764676 -5217142 -6595575 -8528645 -9112605 -8484400 -8606682 -10678666 -12194785 -8402370
13317 -8402370 1785627 13171071 19545523 19778940 16584641 11791106 6256348 2307309
13309 2307309 1637592 1503091 -2433612 -9175066 -12385580 -8277175 -157826 5949896
13301 5949896 7237157 4534070 -80585 -3934654 -4070840 477582 7025649 11403420
13293 11403420 11902195 10194574 8267850 5691687 1296881 -3054758 -3280794 857514
13285 857514 3522986 183343 -4911813 -3616718 4600659 11792323 12533301 9588390
13277 9588390 7193409 5471047 4459170 6819922 11886697 13073787 6884181 -602057
13269 -602057 -2202147 201295 571200 -705492 1026875 5100427 6263341 3393642
13261 3393642 156492 -1583747 -1980456 1311975 9882336 17810631 16645002 7477254
13253 7477254 244255 294200 3220122 3885664 2594983 543643 -2966820 -6060361 -4379287
13244 -4379287 984437 2361154 -3753465 -10710674 -10732856 -4983941 -399763 -692418 -4737587
13235 -4737587 -10496480 -16283275 -20058169 -20527938 -17975861 -13235716 -7925131 -5331111
13227 -5331111 -7232225 -9811030 -7379161 -665161 3687558 2633996 33766 -882491
13219 -882491 -2087221 -5291008 -7904742 -7917496 -7670320 -9128718 -9915843 -7645274 -4143017
13210 -4143017 -2001078 -778283 273296 -387322 -3336282 -6064011 -6966411 -7606169 -8309300
13201 -8309300 -5912058 665129 6589265 6691648 1923853 -2785451 -4293755 -2469277
13193 -2469277 1351639 5021634 7202413 8892006 10240840 7406788 -1405045 -8524241
13185 -8524241 -4856907 4433221 3983204 -8815611 -17608412 -10429566 3035434 7241694
13177 7241694 2814482 255627 411514 -3741093 -10618884 -10605124 -2142235 5795345 7704909
13168 7704909 6688212 5062670 857832 -4834755 -7191008 -6361075 -7499985 -10076451
13160 -10076451 -6669601 4419746 14259138 15248351 10602024 7604680 7922653 9054470
13152 9054470 9766238 9457321 6501523 1375813 -1925946 -760131 2977536 6751522
13144 6751522 10791754 15077094 16505097 12403163 4962989 -300161 122844 4445608
13136 4445608 6793764 2686704 -5253438 -9240182 -6060351 -1219263 115893 1096151
13128 1096151 5785174 9127991 4042648 -4838827 -6239946 -105586 2291000 -2606923
13120 -2606923 -5095049 -17012 3454709 -2307258 -9506552 -7453973 -107884 690448
13112 690448 -6330304 -11967012 -11689310 -9374451 -7181197 -2289243 5204505 9804639
13104 9804639 8401975 4439185 2343046 2413163 2555717 1360525 -1283596 -3789006 -3609114
13095 -3609114 -1268137 -1922470 -8925687 -17674116 -20707526 -17328150 -12515079 -7624758
13087 -7624758 610372 11188870 16521028 12355604 4429816 1028271 2777972 4075549
13079 4075549 1975679 -745293 -370148 3388948 7631478 8635431 4476830 -2547844
13071 -2547844 -6465483 -2903354 5759407 12211607 11700349 6312161 1428875 -74173
13063 -74173 1261443 4326675 8242106 10887319 10021949 6716049 4751837 5398736 5872561
13054 5872561 4614743 4193936 5917160 5801624 982587 -3414011 -708650 6028831
13046 6028831 7155379 757633 -4743506 -3829246 -959165 -993204 -1130790 2041788 4914844
13037 4914844 3300310 589779 1801549 4276807 2554849 -1344156 -1626511 -189132
13029 -189132 -4404846 -13772682 -18644860 -14271629 -7508417 -6035406 -7927454 -6346454
13021 -6346454 538595 8658788 13452102 12604929 6412521 -1349860 -5193386 -3286164
13013 -3286164 462849 1234329 -1556048 -4783514 -4937248 -230589 7784167 13841172
13005 13841172 13208716 7405631 2825071 2806061 4204932 2657112 -2299933 -8380095
12997 -8380095 -13021361 -13479329 -8528158 -1665975 1407667 -68219 -1855811 -2916053
12989 -2916053 -7200183 -14450499 -16764928 -10067422 -2489931 -3739462 -11186965 -15258449
12981 -15258449 -14702727 -16103558 -20007937 -19118739 -11756575 -6180479 -7444917 -9439428
12973 -9439428 -5829557 -958214 -2425333 -8504773 -10958844 -6986771 -933398 3692490
12965 3692490 6705731 6907859 2416714 -4132458 -6651477 -3124494 2411504 5962066
12957 5962066 7066707 5745399 1238147 -4568021 -7225836 -5499484 -3080470 -2663964
12949 -2663964 -2786882 -2943650 -6491699 -13852032 -17239210 -8948683 6452170 14632618
12941 14632618 7327019 -8648624 -19447473 -17807847 -7410173 2858380 6483552
12934 6483552 3283065 -1236862 -592615 6830152 15993995 19653281 14817070 5031216
12926 5031216 -3163342 -5660150 -3170910 590334 2093987 -112698 -4738852 -8146583
12918 -8146583 -7285448 -3721620 -2592289 -5202810 -5527815 1355487 9592514 8263295
12910 8263295 -3097804 -12469604 -11278275 -4538688 -589593 1441349 6471157 11899559
12902 11899559 10892405 4379796 402952 2208253 5179050 5497145 4197836 2446155
12894 2446155 279097 387429 5471126 11211611 9948759 2460041 -2420248 -1479682
12886 -1479682 -977548 -4085487 -4920651 -360311 2160810 -3686555 -11807173 -12824369
12878 -12824369 -8266830 -6392682 -8505390 -8936341 -6002584 -4100327 -5658221 -7873458
12870 -7873458 -7043778 -1566554 7269676 13551732 10144830 -912272 -6758958 522719
12862 522719 11884513 13671734 6910947 3726463 8305511 13393942 13967921 12128610
12854 12128610 8601933 1672757 -4224505 -926885 10040078 17716948 17721523 16263152
12846 16263152 15602196 9101576 -4066489 -13010890 -11604956 -8225394 -10103608 -10721015
12838 -10721015 -4250218 -248216 -8679299 -19538974 -15118674 2324523 12963978 8020587
12830 8020587 -1044493 -3134114 -941220 274777 2344812 5764639 3951634 -5653008
12822 -5653008 -13987800 -12144381 -3559452 2965445 5687473 7600283 7784500 3950247
12814 3950247 -480432 -563056 1461975 -221352 -4527300 -4786497 220940 4795976 6477414
12805 6477414 9448053 15269247 17643885 11067289 -488153 -8698248 -11238795 -11828880
12797 -11828880 -12370084 -11055584 -7992892 -6703950 -7915759 -6674736 410525 8151943
12789 8151943 8330715 1585310 -1983730 3917875 12886651 14456673 8231934 3360295
12781 3360295 4809101 7010062 3598153 -2065315 -1015814 9121024 20744830 24642584
12773 24642584 18365754 6569037 -3533340 -6318621 -542569 9514486 16362393 14650916
12765 14650916 5406112 -4648123 -8555743 -5257208 -572465 -894743 -5907310 -9613038
12757 -9613038 -8760826 -6659805 -6689473 -6104458 -788579 6427790 8150989 2887650 -2477525
12748 -2477525 -1893670 3035808 7433588 9962711 12324881 15123263 17186996 17003209
12740 17003209 13131575 5881297 -143600 648800 6428764 7513852 -1384816 -12622323
12732 -12622323 -14930744 -8078768 -1566618 -687860 -1666393 -832541 -702378 -3990315 -7467873
12723 -7467873 -5740629 2114706 12091277 18534279 16884096 7449604 -1916578 -1792142
12715 -1792142 7407260 14508944 11278541 2455114 -1993166 -138795 2054163 990744
12707 990744 -1140409 -2391078 -4394527 -8594600 -13294067 -15797457 -14971649 -11223449
12699 -11223449 -6077691 -1824368 219925 810114 955138 429867 -435592 147968 2148916
12690 2148916 2144367 -1709350 -5617306 -5000283 -1236309 869372 461012 565622 2086538
12681 2086538 3048876 2839578 2039897 -785212 -6305878 -9559233 -4888569 4265771 8017594
12672 8017594 3588323 -1319826 -487686 3509198 6875235 10878413 15493524 14792808
12664 14792808 5950022 -3191570 -3604140 2078581 4242288 741970 -1765835 436254
12656 436254 3304863 2597503 -405137 -2165833 -1068399 2424899 5781723 4862169 -1253124
12647 -1253124 -6660115 -5045683 837398 2102419 -3659509 -9331190 -9328276 -6904595 -7142008
12638 -7142008 -8580984 -6627905 -1351813 2939258 3523976 750900 -4220503 -9427791
12630 -9427791 -11519435 -8882569 -4513554 -2749258 -3894476 -4774258 -3745827 -2227092
12622 -2227092 -1558880 -1109147 108178 1818789 2900483 2375960 254691 -1765264 -1366254
12613 -1366254 1366283 3071665 916114 -3530757 -5763001 -2972504 3783481 10425500
12605 10425500 11557404 4113666 -7704102 -13731085 -8556650 766677 3118653 -1683467
12597 -1683467 -3360340 2569506 7549863 3442652 -4483367 -5764351 -832168 742051
12589 742051 -3824759 -6624047 -2626180 2145372 315150 -6172582 -10665736 -11720413
12581 -11720413 -12120609 -11692121 -7829600 -1424826 3912437 7860251 12979932 18483976
12573 18483976 20070640 16788747 12698178 9981269 5459285 -3157849 -11781850 -14634483
12565 -14634483 -11767188 -7895574 -5275895 -1913404 3208190 6982458 6030642 1635254
12557 1635254 -1314765 161506 4268449 7177387 7071770 4588054 819377 -2919515
12549 -2919515 -4051022 -567823 5267772 7824914 4343474 -1798836 -5473694 -5192973
12541 -5192973 -2743677 -388571 -407507 -4068517 -8381656 -7611963 -1521611 2126407 -1870370
12532 -1870370 -7495034 -6048573 508337 3249440 829956 344499 4031359 5709075
12524 5709075 2358490 -846492 -309983 887653 1730564 6955550 16043193 18560309
12516 18560309 9062148 -1697617 -671827 8546223 11674909 4529848 -3518528 -5150113
12508 -5150113 -3206221 -2494062 -2701210 -1602845 1400181 6590748 13496097 18598759
12500 18598759 18459797 14967389 12624857 11695613 9561346 7305163 8125773 10166907
12492 10166907 8467257 3985601 2858289 5839969 6429243 1463217 -3917260 -4669212
12484 -4669212 -2525377 -1205214 -986166 -1163893 -2355068 -3380636 -1347118 2189853
12476 2189853 873701 -6977083 -13814039 -11986606 -3285214 4189567 4798007 -1775409
12468 -1775409 -11737402 -18098828 -15280121 -6459911 -1678661 -5199891 -10143926 -9618424
12460 -9618424 -6590167 -6415694 -5654144 2678367 15830136 22803211 19247147 13082433
12452 13082433 13543271 20433006 26512675 26418342 20873108 14424218 10647190 8789876
12444 8789876 5333421 -502920 -4690033 -3515617 1491328 6226643 9269130 11411700
12436 11411700 12155517 10321639 6594421 2161120 -3359986 -9305231 -11767933 -8343433
12428 -8343433 -2798183 -29104 1342547 5117146 8142438 3206652 -7849276 -12790771
12420 -12790771 -5004114 6169872 7305284 -1526513 -8100331 -4804041 3158671 6860199
12412 6860199 4682584 1393117 368237 856153 1442209 2431832 4304539 6186704 6883250
12403 6883250 6165701 4414694 2143294 356021 -29064 194601 -921597 -3351887 -4413791
12394 -4413791 -2625659 -141668 647132 728687 2179051 4716873 7773899 13119667 20713053
12385 20713053 24530702 18913368 7907829 1475289 2776746 6446406 9193786 12970910
12377 12970910 16114854 11894348 558242 -6895342 -3653504 2729597 2707195 -980534
12369 -980534 -914815 480580 -4125519 -12293818 -14730578 -10748283 -8653350 -11221917 -12564333
12360 -12564333 -10350804 -9788571 -12999376 -14725946 -11896623 -8413498 -7196703 -6007461
12352 -6007461 -4231147 -5137801 -8191309 -8142015 -5308081 -6905319 -13564425 -15318459 -7805699
12343 -7805699 -1695053 -6512116 -14577634 -12885846 -3748405 -97141 -4432192 -6589864
12335 -6589864 -1719812 2777178 452170 -5023438 -7421611 -6068614 -2921508 1171694
12327 1171694 4061798 2692408 -1097752 -1355198 2602392 4001231 -901047 -6643241
12319 -6643241 -7010775 -3424577 54630 3975567 9264184 10902825 3989922 -6629218
12311 -6629218 -10894385 -6628967 -487944 3706286 8851676 14881253 14220266 2777377
12303 2777377 -10673696 -13733496 -6273868 255123 -1250502 -5729905 -5923277 -3340953
12295 -3340953 -4328878 -9291011 -12166197 -9753691 -5716588 -3894112 -2348783 2771957
12287 2771957 10313422 14920833 13961724 10343132 7983689 6933826 4230039 -1634898
12279 -1634898 -8236517 -10941619 -6941016 1697481 8674149 8067863 -532346 -11169168
12271 -11169168 -16224636 -12696425 -4358396 2215522 3954167 3559089 5435461 10153182
12263 10153182 14038460 13897579 10515564 7102064 5843017 6781287 8610515 9356155
12255 9356155 7474027 3698145 973773 1331693 3637895 5356978 5102576 2227187
12247 2227187 -3802336 -10964426 -13791169 -9236545 -2663932 -2844317 -10011888 -14143070
12239 -14143070 -7979908 2811921 7030692 2325174 -3488337 -4222728 -2198480 -2242939
12231 -2242939 -4473402 -6314680 -7772321 -10331340 -12532819 -11150878 -6688166 -3887246
12223 -3887246 -5635690 -9136743 -9746217 -6522405 -1941926 2316687 6400868 9254536
12215 9254536 7679907 382435 -8504317 -12449029 -9322453 -3387375 194180 1124336
12207 1124336 2683510 6004425 8402155 7794360 6148858 6611049 8656683 8647943 5188104
12198 5188104 1634074 2057607 5877919 8137453 5284127 -367671 -2895655 591631
12190 591631 6699839 9965865 9205424 7534238 6466994 3577349 -2098846 -5807926
12182 -5807926 -2543156 4746541 7589050 3109364 -2360299 -2712130 -24896 778486
12174 778486 890724 5046741 11804665 13427288 6856843 -791479 -734952 7111165 15249487
12165 15249487 17250798 12347660 4056360 -2143376 -1685038 4420880 8758232 5258598
12157 5258598 -3003266 -8084811 -8443068 -9895169 -14433488 -15449803 -8466856 -336745
12149 -336745 -586620 -7320868 -10071491 -5412983 -866141 -1886684 -3567883 496072
12141 496072 7801615 11036428 8160186 2953990 -1220184 -3158480 -2277073 -445421
12133 -445421 -2545313 -9688416 -14548214 -9862780 337034 5063133 980772 -4729431
12125 -4729431 -6038951 -4625958 -3358926 -1154751 2570635 5103495 5669766 7409100
12117 7409100 10435081 9086700 852568 -7355171 -7354146 -208940 6251312 6873478 1876396
12108 1876396 -5839100 -11395548 -9885352 -2484070 3094331 2679951 1436909 4446072
12100 4446072 7396212 4130665 -1734662 -2062175 2447305 4103623 1262743 -865040
12092 -865040 -1419212 -4912386 -10401388 -10695919 -4803294 -695925 -2005220 -1939581 4545877
12083 4545877 11725234 12454645 8564679 5065678 1080676 -5631174 -10801328 -8872555
12075 -8872555 -2724355 -567967 -5171758 -12157969 -16578876 -15651661 -8078121 3010238
12067 3010238 9072962 4857459 -3762482 -6975915 -3969608 -1683113 -2592541 -2273837
12059 -2273837 886259 2349922 -138758 -2605981 -2539369 -3431015 -7195156 -8243377 -1231163
12050 -1231163 9186285 12727463 6010258 -4541184 -11442507 -12871540 -10593143 -5980803
12042 -5980803 -31633 5551410 9396572 11367460 11631395 10323841 8684661 8526364
12034 8526364 9591386 9627123 8550703 9898877 15350250 20156321 18291216 10906872
12026 10906872 4433508 441870 -5903030 -15049398 -18062671 -8364407 6603278 13106247
12018 13106247 8122794 1066704 -468708 1234172 1144994 -713564 -1377046 488288
12010 488288 4658308 9783564 12308447 9439452 4063411 1626277 1875001 437954
12002 437954 -933531 4914452 16396270 20012386 8116605 -8631218 -15006194 -10428555
11994 -10428555 -4974855 -2219408 2485054 9854359 14600065 15033525 14378882 12170947
11986 12170947 4372651 -6524289 -11343869 -7231595 -2290665 -3458972 -7319129 -7439108
11978 -7439108 -4325628 -2845739 -4471645 -6958537 -8501309 -8607443 -7639941 -7758165 -10878787
11969 -10878787 -14148644 -12213739 -6090151 -4019940 -9923942 -16682645 -15922075 -9645295
11961 -9645295 -6094810 -7676638 -9646097 -8667840 -6047016 -3200830 -83460 1567432
11953 1567432 -1061690 -6685578 -9929486 -7977554 -3548216 -51025 2366373 4178203
11945 4178203 3798949 612136 -2160355 -1409545 573092 -1184423 -6582754 -9595980
11937 -9595980 -6514583 -1419671 -693694 -4666738 -8338687 -8749197 -7083329 -3873123
11929 -3873123 2343350 9712307 11671367 4982950 -4265554 -7362597 -3553916 710090
11921 710090 1458458 736821 726924 -130861 -3455671 -7318527 -8392175 -5331124 1080421
11912 1080421 8840416 14947565 16846883 14420722 9250607 2650167 -3528872 -5880711
11904 -5880711 -3065586 572427 -495367 -5287889 -7970225 -6997019 -6777820 -9324113
11896 -9324113 -10536399 -7259974 -2314533 782331 2989889 5927773 7644446 6533120
11888 6533120 5347243 6585499 7384011 4071114 -971795 -2264527 809480 3929720
11880 3929720 4427191 3326855 1692420 -689867 -3245141 -4802370 -5580672 -6181369 -5563756
11871 -5563756 -2891490 -46232 834818 817815 1785645 2352153 186799 -3173357 -4526956
11862 -4526956 -4941892 -8233446 -13700722 -15859187 -12390544 -7343666 -4764943 -3757801
11854 -3757801 -2181720 -1047621 -1953754 -3190309 -2008028 1002825 3096562 3893303
11846 3893303 5468979 7961993 8145972 3876845 -1801877 -3337691 551127 4971674
11838 4971674 5051725 2092419 702190 945147 -2107959 -9884204 -16085899 -14430994 -7476357
11829 -7476357 -3562948 -6719479 -13430179 -18028580 -17407676 -11537667 -3560656 1105158
11821 1105158 -174300 -3247320 -2010560 3233607 6579661 5363461 3027950 2453085
11813 2453085 1863870 -647014 -3428689 -4745649 -5610161 -6324813 -4583164 -521882 789164
11804 789164 -3250606 -6694091 -2655533 5412591 7573389 2328393 -550031 4930369
11796 4930369 10668065 5753095 -6604513 -12230828 -5666938 2051663 -1133924 -11933006
11788 -11933006 -17109067 -11064684 -418073 7197532 10370856 9086604 1613694 -9466767
11780 -9466767 -15400822 -11739121 -5620835 -6130197 -11835151 -15241974 -15498451 -17258350
11772 -17258350 -19212524 -14721353 -4554148 1853435 899996 311369 5159121 8223635
11764 8223635 2052534 -7322112 -8586814 -2045553 2203777 664309 318498 5308608
11756 5308608 9313261 5056876 -5010576 -12076895 -11407962 -5740646 -342397 2309026
11748 2309026 3518020 5738727 9372853 12618460 14481841 15801840 15963357 11650705
11740 11650705 2160445 -6610097 -8154049 -4054470 -1882196 -5102382 -10157482 -13371152
11732 -13371152 -15051967 -15825177 -14545968 -11801685 -10428286 -10329834 -7713703 -1926010
11724 -1926010 2270547 2573222 3786744 9778772 15609985 13860369 5514991 -1897926
11716 -1897926 -4751189 -5294366 -4819250 -2209215 804435 376441 -2093015 -405923 6078764
11707 6078764 9419464 4633607 -1816748 -1087134 4837195 6278772 449389 -4532639
11699 -4532639 -1264389 7269499 12496490 10895939 6441128 4235296 4847146 5010081
11691 5010081 2135346 -2765031 -6532677 -7726399 -8000723 -9073594 -9709336 -7608961
11683 -7608961 -3633198 -1487591 -2497007 -3014153 1123325 8638430 13308796 10624774
11675 10624774 2830078 -3252081 -2972915 2201944 7452657 10188761 11646759 13534437
11667 13534437 15464063 16562640 17229256 17344802 14901468 9432110 5231882 7129666
11659 7129666 13355996 16754061 13524744 6479219 -1230287 -10128044 -19285635 -22656939
11651 -22656939 -16133208 -5106543 1125667 1022293 839591 3722270 5681096 3908589
11643 3908589 2396510 5337482 9652002 8928546 2214178 -5371998 -9013791 -7372896
11635 -7372896 -1163322 6918203 11552741 8847210 1707324 -2848366 -2784279 -3384038 -8618776
11626 -8618776 -14466341 -14627165 -9776409 -5888944 -4639084 -1650789 4455428 7523075
11618 7523075 2732392 -4423074 -4545008 2023622 5370454 826833 -4056471 -1538014
11610 -1538014 3935078 2663641 -4891490 -8549287 -3599955 3363220 5668863 5138199
11602 5138199 5330144 4037636 -838846 -3918884 772344 9076525 11671560 8018077
11594 8018077 6213368 9225235 11267900 9903027 11227425 17646461 19982348 10463004
11586 10463004 -3077973 -6453765 817663 5602110 847788 -5495038 -3814321 4249970
11578 4249970 11107243 14106958 14876402 12968701 7204055 593741 -2660830 -3949252
11570 -3949252 -8207123 -15349725 -19247554 -16196402 -9782329 -5603475 -4750010 -4494207
11562 -4494207 -2662979 803914 4769785 7495176 7365385 4074349 -1640898 -9059163
11554 -9059163 -16178727 -17892058 -9518276 6063230 18231449 18599834 9273114 -1140849
11546 -1140849 -7193646 -8980507 -7491798 -3116224 1133459 226300 -6545149 -13048817
11538 -13048817 -12940759 -7063517 -1963571 -2364730 -7293941 -12600089 -14673133 -11777262
11530 -11777262 -4458502 3800037 7671110 4028466 -4221681 -9428898 -6162765 2524746
11522 2524746 7339423 2805529 -6030712 -9380466 -4682307 718882 -86909 -4493684
11514 -4493684 -5066610 -696685 2010649 -1501340 -7383991 -8900582 -5026125 -614870
11506 -614870 283639 -1580806 -2759336 -898258 3650623 8495816 11212709 11298303 9890424
11497 9890424 7612997 4378242 1936553 3803872 10115492 14865855 12215692 4526279
11489 4526279 -196565 1406553 5221394 7695379 10564272 14466218 13816033 4339309
11481 4339309 -7487750 -9897495 -719795 9361670 9894563 1972176 -5674281 -7538503
11473 -7538503 -5176354 -3132093 -4204732 -7163162 -7176031 -563677 9082989 12552029
11465 12552029 5911769 -3001349 -3495029 4201490 9462557 5559421 -2354767 -5661836
11457 -5661836 -3527804 -1616355 -2976413 -5445501 -6951208 -8237162 -9564271 -8827318
11449 -8827318 -4634113 1693823 8604882 15719974 21056208 20595482 14025297 7979966
11441 7979966 9101071 15535745 19806270 18682536 15047354 11233060 7314363 6161899
11433 6161899 11988536 21137560 22458361 11833267 -958696 -6047702 -6704627 -10346046
11425 -10346046 -13508100 -7952426 2495001 5568023 608424 277225 9343616 16326580
11417 16326580 12595143 6257002 7438779 11268682 7892454 918854 1719364 10041430
11409 10041430 14380330 10146786 4661081 3775113 5198911 6635342 9815199 13941068
11401 13941068 14692702 12382951 11996660 12742339 7651341 -2847937 -7777858 -1902291
11393 -1902291 5036934 3230435 -2250164 -1305599 3930730 3623398 -2524301 -5166552
11385 -5166552 -1072238 2907790 2585183 2327652 5428276 8112640 7373819 6716873 8949937
11376 8949937 10077392 6416150 2292186 3717551 8193342 8225068 3082218 -346710
11368 -346710 1660967 4965358 5189615 3897959 4175854 5020009 4103875 2383380 1438306
11359 1438306 -837883 -6483380 -11172433 -8055995 1847415 9405864 9387721 6740110
11351 6740110 7688851 10605240 11161215 11559949 16815226 24066563 24051191 13970979 1771038
11342 1771038 -4334253 -4477461 -2927406 -1281182 473476 1090863 717107 2804352 9075993
11333 9075993 15389771 16655585 13472627 10011932 7580355 4456706 501373 -2190246
11325 -2190246 -2543287 -1425516 -269716 -946159 -4962153 -10274580 -11557446 -6750796
11317 -6750796 -404980 3030417 5549010 10266932 13500030 9150200 -959901 -8526052
11309 -8526052 -9954462 -9068876 -8854978 -8095113 -7094041 -8970573 -13009810 -13844943 -9969806
11300 -9969806 -6178403 -4537621 -401801 8190021 14466861 12300022 5531629 1370448
11292 1370448 -32491 -2096175 -3054567 370955 4120655 1530714 -4756598 -5931588
11284 -5931588 -2183774 -3874115 -14687478 -23901945 -21306423 -11687583 -6773814 -8329318
11276 -8329318 -8068185 -1974530 3952330 3135958 -2872031 -7479702 -6686726 -1288309 5628195
11267 5628195 10919178 12677456 11278360 8595717 5471612 1183696 -3741274 -5959983
11259 -5959983 -2728866 3705328 7465521 5266845 -570366 -5967176 -9546448 -11322148
11251 -11322148 -9323578 -1623749 8554419 14237603 12788832 8792133 6654870 4546959
11243 4546959 -355015 -4602453 -2935967 1802172 934799 -6803977 -11701197 -6377807
11235 -6377807 3219770 5394931 -2423652 -11781050 -14078361 -8439161 4306 5026911
11227 5026911 3033522 -4003317 -9368969 -8561755 -4673153 -3521927 -5069981 -4562162
11219 -4562162 -1118252 1199676 1583670 4848176 12638508 18308170 15335657 6739903
11211 6739903 1032500 1436475 3873192 3785822 400713 -4650351 -8840381 -9582628 -6913867
11202 -6913867 -4314831 -3878182 -2701470 2038563 6861444 6234979 1446240 -1009801
11194 -1009801 754979 2568486 2640564 3802684 5816514 3772267 -2230914 -3892697
11186 -3892697 3136630 10965991 10521717 5033536 3881342 7342453 7466495 2220249
11178 2220249 -1568109 4704 2535693 1788157 -707197 -3171988 -6792597 -10010430
11170 -10010430 -7536453 66917 3259987 -3535723 -12178484 -11812765 -4743980 -2133026
11162 -2133026 -6560584 -8977191 -3483618 4108103 5522001 641399 -5268454 -9540289
11154 -9540289 -12379190 -12588032 -8099134 313392 9322056 16352625 20105426 18986247
11146 18986247 12300081 3061198 -3259900 -3928539 -1275218 1020121 2313964 4095609
11138 4095609 5987960 5516752 2429439 450236 2520648 6150385 6498624 2932513
11130 2932513 -1040744 -3515509 -5061375 -3881415 3363630 13372755 15688529 5729352
11122 5729352 -7146943 -11468977 -8985282 -9521471 -13732383 -12170739 -2162771 5736256
11114 5736256 2799786 -5068636 -5851807 3173880 14463484 20139137 17488538 8318311
11106 8318311 -1999604 -7635224 -8331127 -9119323 -11410797 -10066574 -3381482 1334824
11098 1334824 -915083 -3007591 3102035 11183112 8952232 -1881871 -7678872 -4567512
11090 -4567512 -3312589 -9459357 -13358312 -7028405 1795984 2274677 -2869789 -4328429
11082 -4328429 -2027863 -1880431 -2448028 1929927 7720097 5576934 -2962478 -5394519
11074 -5394519 2560277 9844554 7019237 -319153 -1862484 2341493 5149049 4024552
11066 4024552 959171 -4218247 -11199928 -13271722 -4125315 10251235 16299645 10754401
11058 10754401 4606416 6324286 10183375 7064827 -620581 -3241051 1020572 4703106
11050 4703106 3737675 2704037 5366098 7477680 3591907 -3907665 -8032592 -6833675
11042 -6833675 -4421868 -3255249 -881229 4189656 7746395 4616762 -3467062 -8497550
11034 -8497550 -5566322 936273 2755728 -1827850 -6373693 -5594432 -2362218 -2431303 -5439626
11025 -5439626 -6355750 -4296216 -3245664 -3473447 119956 7732656 10308372 2110000
11017 2110000 -7929456 -6289952 6200211 14666180 9441498 -3420114 -12332010 -12793409
11009 -12793409 -6801822 2872148 12733400 18007262 17308170 14909543 14744246 15268990
11001 15268990 13354278 9528679 5792196 1850488 -2596016 -5155065 -4197196 -1763915
10993 -1763915 514902 4358542 9538758 10419643 3518211 -5710799 -10146194 -10994475
10985 -10994475 -13045521 -14131012 -9049445 -1315513 456397 -2494426 -71685 8688793
10977 8688793 11680609 3305709 -4401250 444569 10401415 9226981 -4315289 -15708888
10969 -15708888 -15326586 -7947403 -1584563 1936973 2585998 -1639835 -8719376 -10225684
10961 -10225684 -1711304 8788644 9342879 -473712 -8646219 -5554666 4827654 10595873
10953 10595873 6174501 -2003922 -4001166 1894314 8042085 7279535 710563 -5545807
10945 -5545807 -8109935 -7545866 -4094487 2792635 10548613 13862224 10863559 5761915
10937 5761915 3495097 4431401 6000490 6625730 5827033 3161144 -205014 -1101526 1664271
10928 1664271 5048357 6447281 8196260 13332941 18833727 18429147 11863871 5865464
10920 5865464 4704926 4916856 1943535 -2340218 -2672025 1478650 4826621 2809441
10912 2809441 -3340815 -8082906 -6991903 -1139126 3669059 3206699 44922 19576 3801171
10903 3801171 5963788 3207993 -1399386 -4533831 -7536619 -11374336 -12042510 -6898325
10895 -6898325 -1414653 -2433153 -7332139 -7678658 -2289902 1630245 455684 -1336729
10887 -1336729 -503425 -781320 -5563469 -11352213 -12910071 -10033316 -5356308 14805
10879 14805 4806954 5765436 1706398 -3847597 -7416537 -9538167 -10986703 -9142036 -2207354
10870 -2207354 6173957 10608456 10096706 7682323 6508921 8272457 12198920 13752701
10862 13752701 8742450 603534 -1977077 2812856 6922861 5222140 3325570 6669975
10854 6669975 9669266 4423330 -5691736 -10743131 -8500263 -4651189 -2053885 730285
10846 730285 2477359 182636 -4523821 -8034804 -11512996 -16447208 -16888301 -6936670
10838 -6936670 6323169 9600828 2569466 -2400735 -399561 -186015 -6986901 -12762417
10830 -12762417 -10183332 -4882616 -5427710 -9533781 -8700483 -801392 9013433 15510495
10822 15510495 16028005 10321040 2405741 -1495583 -394693 283027 -2800533 -6717893
10814 -6717893 -8701260 -10081161 -11024954 -8340615 -1794723 4273325 8521372 14061300
10806 14061300 19578468 18481952 11228335 8108972 13254285 15993228 6693717 -7746388
10798 -7746388 -14172190 -11641468 -9134875 -10503771 -12328735 -12820711 -12920027 -11213172 -6269100
10789 -6269100 -1535713 -732529 -1698202 -1416399 -2434415 -6921647 -9737730 -5950479 -23895
10780 -23895 1693439 2269683 7612874 13750575 12755467 7786209 9341827 18097655 23831853
10771 23831853 20983138 13683953 5702880 -2689501 -7528112 -3229309 6196394 9451692
10763 9451692 3968152 -1186573 -932940 -1349463 -7087189 -12253531 -9655077 -867127
10755 -867127 8182838 14565064 16824668 13041416 4981069 -1584961 -4137183 -5441734
10747 -5441734 -6488924 -4581429 -633923 -54673 -3022906 -2521728 3432871 6292103
10739 6292103 -114185 -8787375 -9118709 -1520913 5007130 5747411 3359304 738323
10731 738323 -2350746 -5968627 -8053738 -6351471 -778982 5254974 6146759 -97801
10723 -97801 -7551536 -8501558 -4066789 -2786265 -7592852 -11140773 -6940676 1326470 5686094
10714 5686094 4055091 676507 221120 4182451 9567195 10005304 2813896 -4782068
10706 -4782068 -2934059 6875522 13256393 11460660 8645114 9703904 9154601 3211714
10698 3211714 -814955 3957798 11603107 12296099 6910415 2743928 217445 -5489205
10690 -5489205 -12969545 -14971660 -8932883 676298 8847164 12448989 9362733 2152222
10682 2152222 -1047871 3307730 7351128 3457646 -2157601 1703464 12277331 15533269
10674 15533269 7358519 -652140 1140557 8290839 11796312 10173813 6935934 3426780
10666 3426780 -627949 -4507214 -8012618 -11256779 -11320212 -4740690 5189102 10189439
10658 10189439 8086108 5269220 5916799 6618213 4784545 3473641 2919403 -3169690
10650 -3169690 -14985470 -19053272 -4419803 19291477 32386926 30673754 27381976 29976625
10642 29976625 29666635 18642875 4682855 -475615 1771803 2068789 -467103 1326991
10634 1326991 8046934 11181801 6510403 95633 -2286202 -2968347 -4903141 -4198285
10626 -4198285 2863552 10960792 12096813 7764895 6499746 10471239 12878592 9667976
10618 9667976 5874421 6849654 9495719 7509114 1641240 -1082423 2502420 7202916
10610 7202916 6295680 -242398 -6530096 -8426910 -7557455 -7054034 -6109818 -1907977 4230551
10601 4230551 7101012 4957534 2256318 2807588 4298501 2958530 -148093 -1890000
10593 -1890000 -2875507 -5079015 -5854667 -503501 9447826 15970642 13619913 5402158
10585 5402158 -1024189 -623459 5166102 9917279 8687486 4096971 2961018 5888676
10577 5888676 6024014 996606 -1764629 2099813 3875171 -5339894 -17963196 -18564118
10569 -18564118 -5900523 6419371 9922645 9014846 8541905 6842620 3865516 4257892
10561 4257892 8227034 9249389 4840686 936698 2386098 7280211 12900144 18670137
10553 18670137 21535838 17746391 10898399 8483751 9152678 4204993 -6748125 -13551331
10545 -13551331 -11328808 -6320201 -3137608 943674 5604977 4946239 -249140 -1003766
10537 -1003766 4701499 8920181 9711347 14433139 22228866 20830067 8141489 -916272
10529 -916272 1808123 5241089 974619 -1371221 6003653 12490233 8557749 4922626
10521 4922626 13890455 25855088 23644824 9086952 -2608242 -5163196 -2068168 4721862
10513 4721862 12316123 13905796 11019701 15455317 27149834 27929832 11389409 -2132571
10505 -2132571 2207307 10066913 7443109 7788949 23211644 35581264 28495774 21392285
10497 21392285 34792135 48874426 39933809 29837890 47232575 68352745 61280465
10490 61280465 61634205 117556138 171187022 102035219 -88425040 -239433694 -230335835
10483 -230335835 -129365388 -75251314 -87589657 -85561715 -41853383 -11427239 -22587668
10476 -22587668 -36329835 -24798845 -13264531 -23114007 -33839993 -26665915 -18229899
10469 -18229899 -25397823 -34097725 -27217463 -13949844 -10123665 -13214892 -14726474 -16768609
10461 -16768609 -21047164 -19546464 -9217583 75944 2207839 3469350 6708812 3800230
10453 3800230 -7795879 -17377253 -18014942 -15805782 -15410816 -12618858 -8045212 -10940800
10445 -10940800 -21185441 -24536523 -15198775 -6683538 -9718483 -15232353 -11525236 -3949720
10437 -3949720 -3550001 -7783404 -7174218 -2792103 -3243425 -9571890 -14875765 -15565383 -14057540
10428 -14057540 -13179369 -14336243 -17787921 -20159255 -16332424 -7469615 -1332261 -1426431
10420 -1426431 -2866506 -2205291 -2861804 -6419750 -7536045 -3305345 667771 -130690 -1369943
10411 -1369943 1569518 4945339 4034481 2157248 4000965 5727378 786361 -8086471
10403 -8086471 -11341759 -5691708 1966592 3299019 -3191831 -11906510 -15263698 -10281111
10395 -10281111 -1657058 3454306 3619436 2510796 1000325 -3972826 -12096320 -18230608
10387 -18230608 -20067493 -20476703 -20271883 -16061793 -8136508 -2940387 -3880427 -6534593
10379 -6534593 -6690350 -6115791 -6501811 -5256050 -2062238 -1982575 -6244076 -7226251 403790
10370 403790 9749373 10521253 3188801 -3165915 -3785343 -2017385 -2140914 -4243302 -5496715
10361 -5496715 -3236848 1866452 4741178 1784126 -1944985 1881028 10843671 12150998
10353 12150998 982964 -11224644 -13320966 -9726530 -10213007 -13162166 -10955804 -5964634
10345 -5964634 -7486708 -15134812 -18533504 -14024501 -9648774 -11036218 -13056120 -9877375
10337 -9877375 -4610987 -3345325 -5910639 -8321014 -9908754 -12234946 -13619182 -10574872
10329 -10574872 -4383434 -1601518 -6447696 -15268142 -20634813 -19685080 -15840139 -12385394
10321 -12385394 -7987654 -961623 5291083 5925137 2317999 361376 919877 -1728867
10313 -1728867 -9988339 -17644209 -18225597 -13771753 -10828484 -11410623 -12366332 -10823577 -6214061
10304 -6214061 441814 5465337 3671895 -5077495 -12923831 -12046851 -3711982 4803154
10296 4803154 9938509 13386456 15501348 13378978 6592958 179021 -607048 3569825
10288 3569825 7029436 5344490 -400552 -5678645 -7968044 -8392850 -7548873 -3129197
10280 -3129197 4962482 10238913 6285235 -3404263 -8866158 -6889864 -3707694 -3990695
10272 -3990695 -5573575 -7163754 -11911216 -18878504 -19939070 -11511219 -1671893 1368478
10264 1368478 677760 2919159 6424082 6018021 3677916 4419828 6360041 4848330 2020127
10255 2020127 1797242 36310 -8189802 -15364067 -9858019 4032759 9647127 2588793
10247 2588793 -3800784 -1203134 1299055 -5113129 -13279260 -12639925 -6575848 -5213983
10239 -5213983 -8564454 -8730952 -3804059 1684908 6658241 13095344 17856355 15195908
10231 15195908 6912533 875787 -589362 -2369551 -6408724 -8648066 -7496642 -6860424
10223 -6860424 -8174959 -7456602 -3911096 -3732531 -9971672 -15175874 -11075680 -1260545
10215 -1260545 3178132 -1572090 -8519652 -10325146 -6906938 -2139425 1388334 2703741
10207 2703741 1869789 882002 1947684 3818559 3220782 689376 607509 3727739 4555042
10198 4555042 -373085 -5914927 -5023062 885418 4194534 2654635 2355002 7735755
10190 7735755 13823953 11809589 -138169 -14615713 -22624531 -21437440 -15178424 -9268971
10182 -9268971 -5303411 -1467986 3043990 6038617 5417033 2367218 -172384 -1019474
10174 -1019474 -1111988 -1326062 -1220751 1039517 8006391 19833725 30907789 33203524
10166 33203524 25471546 15558079 10415691 7731302 1899053 -5721919 -8852038 -6047914
10158 -6047914 -1684545 1318523 3144860 2732923 -1099681 -4798609 -3595783 329816
10150 329816 555156 -3093097 -5002658 -4620693 -7069504 -11615106 -10372664 -2230470 2467372
10141 2467372 -3075404 -11627805 -13215698 -8902206 -6007923 -6407420 -7071936 -6754591 -5559227
10132 -5559227 -3085225 -2151452 -7349491 -14460599 -10706809 6274682 19650930 14987224
10124 14987224 1793590 -672465 7815097 10864820 3302349 -2115523 2202499 6117171
10116 6117171 -1254414 -15081564 -23036959 -20635357 -11758462 -1657808 4576219 3325352
10108 3325352 -2143809 -3144755 3049834 8750434 6612157 -922013 -6728475 -7616779
10100 -7616779 -4043087 2388977 6716870 2449872 -9018670 -16921723 -14921938 -10359546
10092 -10359546 -12749610 -18873970 -18416088 -10639854 -5129273 -6689764 -9431309 -7823869
10084 -7823869 -5148045 -6768830 -11018006 -11941231 -7891051 -2771365 -181284 -99154 -1086456
10075 -1086456 -2730331 -5013669 -6910764 -6764168 -3791127 1053943 5427811 6767222
10067 6767222 3677796 -3192818 -11224844 -16467419 -14716062 -4123160 10968586 19966648
10059 19966648 14461885 -1049775 -10875498 -4893005 9095963 15150173 9160217 1722319
10051 1722319 1581945 5419317 6938426 6917121 8090926 7427074 1567865 -4913734 -4944424
10042 -4944424 571384 5332586 7731226 10321014 11747987 8304617 2592021 1527613
10034 1527613 5325350 7129451 4818323 4562307 10061094 15989626 15830847 10214830
10026 10214830 4071019 375759 -691583 -814943 -3329119 -9233049 -12887946 -7804675
10018 -7804675 2597841 7561750 4127913 1210669 4895438 8459658 3477165 -6165706
10010 -6165706 -9511619 -3781733 3302377 4635954 829851 -3261360 -4283803 -2341836
10002 -2341836 111171 1329599 2736683 6419398 10276339 9735902 5227432 2959779
9994 2959779 6162721 10545284 11195839 8995724 6886465 4716721 1746183 -159509
9986 -159509 138842 582988 311180 1863797 5263770 5406326 337466 -3318153 627466
9977 627466 8315017 12177540 12544726 14771412 17824238 14904628 4992926 -4398544 -7034703
9968 -7034703 -4036567 748941 5232276 7287229 4157388 -3278528 -9062719 -7763734
9960 -7763734 -232814 7212150 8522839 3304548 -2468758 -2278195 3583185 8826805
9952 8826805 10111237 10712022 12788124 11715194 3597296 -6225680 -9399491 -6306892
9944 -6306892 -3828821 -3311160 444882 8197009 13305363 12100880 9432604 10345323 12857523
9935 12857523 13307768 13084872 14628786 15071454 10097041 1948070 -2354777 -335481 3451089
9926 3451089 4751510 4719873 5709967 5822981 1431767 -6362210 -11688712 -10771854 -5948001
9917 -5948001 -1910483 -587470 -1067795 -1807323 -898737 2971025 7174123 5875618 -2290490
9908 -2290490 -10364160 -11147180 -5750067 945121 8652564 17802749 21884507 14675323
9900 14675323 2874297 -740274 4033041 6438872 4729683 7851500 14903435 12879573
9892 12879573 2287807 3860832 26590387 49392617 52895202 50458439 62984431 78083879
9884 78083879 65293854 25167772 -8671062 -16624510 -12169996 -9870897 -4714367 6424103
9876 6424103 10498512 1121916 -6588495 -699567 7053408 2750719 -5218667 -2526522
9868 -2526522 5001410 2833600 -5865545 -6924141 -423761 2043853 77689 3202878
9860 3202878 9550043 6872917 -4404817 -8837463 -329994 8314053 5610911 -3438171
9852 -3438171 -8517750 -7811715 -4073408 2413377 9771471 11650222 5269033 -3201930
9844 -3201930 -6158149 -2972968 1859085 4133499 1708849 -4052171 -7602286 -5100032
9836 -5100032 -689951 -881067 -4161471 -4314973 -2604447 -6166290 -14165952 -17450156 -14206455
9827 -14206455 -13579832 -19389168 -22656542 -16941869 -9469883 -8349198 -8966405 -3336153
9819 -3336153 5464620 9426802 9563946 12010460 15045703 12248159 5907934 5209916 11488388
9810 11488388 16246018 14736271 11547203 10768424 9788404 6051552 2216445 772844
9802 772844 -125866 -1637819 -659855 4457788 9196566 8468309 3686002 -97818 -1635884
9793 -1635884 -3552222 -6311519 -6848726 -3936051 -1360557 -3482374 -9029583 -11768704
9785 -11768704 -7917142 -1301640 492759 -5432933 -14611509 -20942915 -22669632 -21780471
9777 -21780471 -20146340 -18449129 -17256729 -16700521 -15833095 -14158729 -13081423 -14169347
9769 -14169347 -16586412 -17668325 -15642296 -11036745 -6174047 -3526820 -3209643 -2219071
9761 -2219071 1586995 5085468 3126374 -3474042 -7997983 -7518105 -7091781 -11020499 -15198685
9752 -15198685 -12923350 -4045423 6743723 16622236 23861823 24425356 16629960 6729744
9744 6729744 2653637 3864012 4098265 1830706 186268 -1474014 -6597259 -12737996
9736 -12737996 -13525365 -9785160 -8718883 -10805456 -8584358 -1411055 510714 -7296796
9728 -7296796 -14083755 -9375740 1070275 4525044 -573752 -6063175 -8184028 -9313761
9720 -9313761 -8995738 -4168944 2926331 6737360 7679221 10592905 14683139 14328173 9886800
9711 9886800 7759484 8400564 4685243 -4473286 -9193359 -3318531 4611469 3199321
9703 3199321 -4994275 -7556418 -103357 8836244 10482938 5598701 -43537 -3683370
9695 -3683370 -5725024 -6077549 -4585907 -3423477 -5271176 -9023525 -10077739 -5885409
9687 -5885409 696779 5003655 5963558 5753073 5080266 2152448 -2936819 -6126001 -4160608
9678 -4160608 578947 2995355 2145262 2216468 6314941 11536305 11557504 3794795 -6557046
9669 -6557046 -10520913 -4602104 4677584 8003747 4524986 1644185 2910286 2409508
9661 2409508 -4708011 -12136321 -10401531 -1587482 2997579 -553996 -3802123 85326
9653 85326 6387870 8000002 7082523 9705903 13340345 9126715 -3539733 -13025516 -9219611
9644 -9219611 4103065 14627122 15687906 10649194 5188970 885960 -2449648 -2880828
9636 -2880828 1387028 7704213 10772418 8833990 5390692 4414609 6227607 8730780
9628 8730780 10499428 11642357 13045993 15181698 16400936 13280084 5358658 -1374471
9620 -1374471 -66935 7511780 11791913 7157376 -1744191 -7298342 -7485582 -4402298
9612 -4402298 567904 5983815 8721268 7029289 2105587 -5378868 -15161972 -21880712
9604 -21880712 -17840697 -5931709 -622846 -8468534 -16554977 -10596344 3718876 10353301
9596 10353301 6997902 4045489 4148010 622397 -4914297 -2196143 7721297 10303671
9588 10303671 752976 -7862442 -7040514 -6300359 -13887018 -20129565 -13892631 -2509205
9580 -2509205 453962 -2578895 393990 9481982 14492711 13528238 13774964 15934664 13425833
9571 13425833 6902978 4935486 8691228 9376475 3730782 -284745 2678036 6843052
9563 6843052 5710863 1568036 -1051515 -3402648 -7656361 -10150405 -6367558 801344
9555 801344 3652934 -705420 -7142972 -8665469 -4022788 921468 -201576 -5940695
9547 -5940695 -7814345 -1394388 7007014 8624392 3495439 -2035017 -5564254 -9252585
9539 -9252585 -12622247 -12841009 -11174824 -11082803 -10341376 -3509629 7474193 13832263 12105820
9530 12105820 7191595 2217603 -4779338 -11689169 -10662131 -781096 7160867 5185747
9522 5185747 -714263 -1144239 2561789 3427167 1917537 3935478 9170954 11248123 8490577
9513 8490577 6098482 7213930 8736206 7125637 3051801 -729033 -1985052 831567
9505 831567 7144522 12759830 13336954 9473008 5388673 3222420 1944843 962572 693521
9496 693521 -41009 -2901204 -6189889 -6446146 -4388934 -4588916 -7632773 -7290417 1148882
9487 1148882 12824757 17687277 11970123 2082424 -2952259 -607481 3994136 4311842
9479 4311842 -1080793 -7472876 -8965481 -4519161 1124972 2704851 -202854 -3829510
9471 -3829510 -5094657 -3998353 -1806700 250677 -59857 -4807678 -11384821 -12392952
9463 -12392952 -4210110 6121976 7632136 -1119559 -10315080 -11372081 -5970854 -732552
9455 -732552 1780361 3118131 4166235 4831240 6113299 8698972 11206546 12623095 14395342
9446 14395342 17697264 21142036 23205625 23553131 20295651 11123554 -184054 -5118613
9438 -5118613 -2810826 -3435524 -12543997 -20221820 -15862425 -6322027 -5908440 -13209343 -13897536
9429 -13897536 -5290119 -792749 -6854794 -12269609 -7491656 -80754 -1136315 -7913818
9421 -7913818 -10898157 -9293229 -8220331 -7216100 -2735946 2557472 3502065 2115898
9413 2115898 4015950 7910600 7871422 3949681 1450016 1015030 -1530277 -5823867 -6301272
9404 -6301272 -1876111 1641919 824687 -424486 2044238 5909961 5991724 1251856 -4476249
9395 -4476249 -7095028 -6203802 -5084214 -6447978 -8082866 -5312464 1108678 3835169
9387 3835169 -1141728 -7831266 -8482018 -4694600 -3952428 -7569471 -9146000 -4264931 4576890
9378 4576890 12454125 15752110 12016550 2266856 -6487196 -7213592 -1948172 856286
9370 856286 -1620842 -3757429 -1758915 652329 -237108 -1710639 -231178 1986015 1418983
9361 1418983 319036 3418441 9662454 12939922 10657844 6691774 4994682 4286734
9353 4286734 1115049 -4350400 -8170941 -7392022 -2647730 3939078 10963347 16601306
9345 16601306 17743695 13379428 7667857 5589713 5416254 242357 -11188145 -19999407
9337 -19999407 -17308521 -5471338 5037873 7591642 4064762 -225855 -1272007 2736408
9329 2736408 10192090 15716576 15164964 11025911 9107051 10218512 9596933 5040565 981137
9320 981137 2384876 7622070 9860148 4745809 -4208646 -8087303 -1795327 8692053
9312 8692053 11370687 2529322 -7799095 -8432929 -986065 4549947 4522931 3672629 3946330
9303 3946330 1012331 -6077732 -10659502 -8408605 -4586190 -5645724 -8703340 -5905942
9295 -5905942 3415213 11147399 10382948 2352286 -6811229 -12565973 -14250624 -13414537 -11736541
9286 -11736541 -10320670 -9854600 -10108480 -9045692 -4501764 1608054 3169698 -2631386
9278 -2631386 -9502930 -8657776 -917171 3288363 -2621745 -13023770 -17747563 -13779284
9270 -13779284 -6084013 -279841 1628539 442658 -1477303 -1464430 917579 3247684
9262 3247684 3511674 2389782 987134 -1176497 -3660113 -3261145 1726942 6977553 6026780
9253 6026780 -1217672 -7463850 -6662186 -927315 2853250 1317553 -2850878 -5732498
9245 -5732498 -6428752 -5615396 -2565436 3603401 10701655 14528491 13354402 8893469 3028514
9236 3028514 -3030448 -6284242 -3593766 2425589 4356308 -51068 -4152950 -2896509
9228 -2896509 -1057463 -4370497 -7978778 -3214068 7371622 12653937 9819575 7286953
9220 7286953 9499711 10603414 7198731 5839239 10816679 14252350 7647432 -3687606
9212 -3687606 -7753754 -2889638 2160620 2459170 1387178 1704545 1281280 -844345 -1443647
9203 -1443647 1608699 6236262 9948191 12279086 12516671 9637247 5714895 4947894 7821794
9194 7821794 10393970 10785883 11681289 13862371 12015446 1706149 -11944435 -17871640
9186 -17871640 -11690103 -893527 3996017 754806 -4333560 -5659900 -3772738 -1272931
9178 -1272931 2302783 7923267 12345790 11573653 8378264 9935792 16381265 18383958
9170 18383958 10103959 -1427704 -5835217 -3405643 -1805388 -2236828 1163394 8301538
9162 8301538 10112988 2343910 -6339381 -5998679 1172889 5899125 5590805 5439502 8396004
9153 8396004 11774610 13119990 12558999 9398850 3200297 -1302605 2215712 11364071
9145 11364071 15936900 12333696 9122669 12996288 17271040 12798710 3955830 2692894
9137 2692894 9891656 14643092 11716301 7608092 7092903 5810422 1000057 -1598827
9129 -1598827 1446994 3439058 -955794 -5148240 -1612776 4209199 2799169 -2699511
9121 -2699511 -2212639 2613323 688673 -8050397 -10070340 416911 11582234 11533706
9113 11533706 3857301 -1881445 -4850364 -8867217 -11360748 -6852561 2439408 8252950
9105 8252950 6622570 244827 -7173325 -13126617 -15020148 -12222890 -8138376 -6105471
9097 -6105471 -5059497 -2776082 -646442 -1077227 -2704149 -2574794 -1192675 -1604013 -5161485
9088 -5161485 -10941428 -16837057 -18893327 -13424084 -2924004 4405734 4714348 3510926
9080 3510926 6627397 11684133 13914237 14612155 16497017 15841445 8227935 -1381504 -4101111
9071 -4101111 -790209 -320677 -4580278 -5380214 1908148 10829425 13404345 9988026 5833501
9062 5833501 3484297 2138660 312500 -3478569 -9104155 -12638584 -9965609 -3355715
9054 -3355715 331070 -1266927 -4011659 -4932616 -5443741 -5470671 -1752396 4708392 6515608
9045 6515608 28876 -8153022 -10226464 -7688502 -6861470 -8262493 -7566148 -4678917 -4406148
9036 -4406148 -8199760 -11454750 -10280260 -6484593 -4319285 -5381756 -7962605 -9232446
9028 -9232446 -7376429 -3316088 -527102 -1662316 -5761056 -10327840 -14805125 -19179006
9020 -19179006 -20407552 -14819855 -4931235 616655 -3269833 -11596894 -15771036 -14154200
9012 -14154200 -11648779 -10195749 -5997699 2078731 7470374 4323784 -2829813 -4382342
9004 -4382342 581832 2861928 -3327610 -12179507 -15136017 -12276207 -9611497 -8877274
8996 -8877274 -6403610 -764660 4418860 5827226 4185201 1862708 202689 -94950
8988 -94950 1000527 1853022 1033940 560713 4016518 10503789 13863493 10157278 3683220
8979 3683220 2637614 9178338 16163650 14977619 5648507 -2914232 -3515832 1012199
8971 1012199 2964276 935907 182936 2048737 732982 -5937991 -9898601 -3706726
8963 -3706726 7233404 11476134 7261725 2590998 1453447 -34056 -3172036 -2617300
8955 -2617300 3644849 8900583 7488042 3108514 1435368 220719 -5846333 -13991995
8947 -13991995 -15220025 -7007910 2530217 4728308 -146251 -5665461 -7843288 -7676264
8939 -7676264 -6901091 -5225307 -2722190 -1980735 -5062733 -9614319 -11483205 -11140103 -13441151
8930 -13441151 -19684513 -24129233 -21176192 -12407813 -3276542 3601911 8083809 9387952
8922 9387952 8343018 9173755 13276058 14631841 8238480 -31421 -179395 7461290 13586694
8913 13586694 14482182 14992531 16655079 14052803 5917627 -471816 -464606 1380409 535170
8904 535170 -471862 484262 -524996 -5266154 -7851057 -4855311 -3005991 -8126823 -13533881
8895 -13533881 -9536723 933719 6905882 5809550 4526787 6380317 8068288 8932771
8887 8932771 12467733 17193877 15696711 5759995 -5132437 -9465364 -7619177 -3618281
8879 -3618281 830775 4743330 5596783 2709327 -523940 -1086794 -596426 -2533377 -7099299
8870 -7099299 -10905291 -10693948 -6365394 -1230835 652729 -1513976 -4454781 -5070101 -3962078
8861 -3962078 -3024853 -1883774 250642 1340313 -845690 -4137006 -4187491 -774657 1900907
8852 1900907 977820 -2208605 -4575052 -3829195 317844 4670747 4166302 -1653511 -6157139
8843 -6157139 -3800925 1828485 3408864 861750 414609 4154568 7694403 8080320 7077889
8834 7077889 6114033 4602612 3857851 5794422 7068368 2153612 -6356566 -8896306 -3067811
8825 -3067811 2037791 -47939 -3365237 -253719 5628396 5436235 -730230 -4703535
8817 -4703535 -2607508 1866263 5325388 8155766 9867674 7676209 1480138 -4360351
8809 -4360351 -5896148 -3280889 847194 3680467 2763330 -2662732 -10044462 -15237527
8801 -15237527 -16002286 -12524372 -5910638 1336254 4799029 1631762 -5652986 -11609741
8793 -11609741 -13611087 -12743222 -10334670 -7206360 -5429865 -6370819 -6907217 -2255033 6390648
8784 6390648 11641744 9427399 4495303 3271772 4720172 2570600 -5244824 -13800162
8776 -13800162 -17432953 -15091952 -9215570 -2738486 1683262 2341996 258718 -1353706
8768 -1353706 -830070 249103 322013 740639 3131852 5489201 4143776 -678827 -4460962
8759 -4460962 -4180416 -1737598 -552705 -1366386 -3085805 -5471135 -8505244 -10360231 -8488747
8750 -8488747 -2688422 4169697 8245241 7240279 2109434 -3069592 -4433472 -2179838
8742 -2179838 609881 2963671 6606181 10934021 11970806 8616582 5186475 4266042
8734 4266042 2145765 -3594034 -7227110 -3015699 3861016 3739509 -2312682 -4015061
8726 -4015061 1403550 4858755 319633 -6220384 -7295471 -4510745 -2759155 -1683856
8718 -1683856 537445 1523536 -276845 -618524 3448832 6809909 3999015 -1179575 -1689057
8709 -1689057 1383211 1994568 3186 -224791 815435 -564807 -2107179 1779945 8956494
8700 8956494 11235616 7477870 4928778 6275884 5579815 -480246 -7163755 -10606193
8692 -10606193 -12503392 -12266892 -4996161 7259312 12659353 5765701 -2478057 -98440
8684 -98440 8367996 10262893 4621056 1477552 4430502 6028151 779027 -7308649 -11923659
8675 -11923659 -11639366 -8599393 -6180167 -8175549 -14251642 -16873965 -9677792 1803098
8667 1803098 5693357 -58969 -5858011 -5548838 -3387636 -3188991 -917617 6110169 11317264
8658 11317264 7694567 -1488070 -7858485 -8796180 -6378086 -576264 8514063 15370541
8650 15370541 14480506 9146942 7018503 8197849 5799367 -2046492 -8937042 -10106965
8642 -10106965 -8180397 -6882942 -5679762 -3739813 -3521240 -6440026 -8960486 -6762261
8634 -6762261 -309253 6193039 8972818 6226138 -1363654 -9565468 -12842937 -9683620
8626 -9683620 -3609627 1747016 5339001 6232572 3499556 165528 1602867 7059274
8618 7059274 8552029 2213938 -5271856 -6921308 -5701525 -6808584 -5808196 4170533
8610 4170533 16588061 16663745 3970349 -3730657 4898710 18119142 18379807 7274969
8602 7274969 1221734 6973560 14351177 13266844 6608654 2908308 4539932 7626605
8594 7626605 8149588 4358912 -2770207 -8649287 -8430919 -3325955 572202 1325847 3449354
8585 3449354 8670579 11143078 6738953 894033 509248 3222689 2841154 1318313 5349171
8576 5349171 12773294 13222161 3699583 -6212097 -7786183 -3407246 258311 1426731
8568 1426731 900395 -2211217 -7015715 -9113903 -7509572 -7111490 -9108443 -6219977 5076801
8559 5076801 14793626 11820927 636599 -5708303 -5564036 -8713783 -17469000 -21569492
8551 -21569492 -14906043 -5211994 -1748971 -3042780 -2898872 -497560 1963483 4877441
8543 4877441 7808499 6214546 -1552980 -8725029 -8611929 -4865674 -6069363 -12690860
8535 -12690860 -16701876 -13153907 -5460242 1241199 6447017 12285804 18420727 20816387
8527 20816387 15310311 3131311 -7403055 -8033045 -696752 3509928 -2060891 -11387824
8519 -11387824 -14554219 -10010792 -3106452 3202273 9187918 12399615 8763947 6805
8511 6805 -6517609 -7107009 -5946241 -8074401 -11994065 -12010554 -5983851 1698665 4939529
8502 4939529 2688407 -445491 -1138317 -2641593 -9380214 -17644934 -18023423 -8485436 1484280
8493 1484280 2888256 -2795055 -9187757 -13549255 -14448080 -8180846 4741517 15143651
8485 15143651 15520386 10189448 7105767 5191730 -131645 -4235107 954132 11323169
8477 11323169 14514733 8960862 5183896 7231337 7354292 2299672 52873 4283369
8469 4283369 5863181 -1625657 -9888022 -9398411 -4737133 -5345202 -9287830 -8387925 -3472802
8460 -3472802 -1912913 -3728471 -2584852 1054867 -141011 -6752871 -9955928 -5044497
8452 -5044497 1686079 3329733 1900631 2631593 4803379 4381485 2404877 4161334 10030313
8443 10030313 12569896 5697423 -5881404 -10694606 -4236853 5479325 8517664 5294100
8435 5294100 3662454 6571460 9176223 7604681 3749797 415027 -1835395 -1522265
8427 -1522265 3346614 9459451 9547821 2681833 -3168978 -2241974 1802960 3365156 2581597
8418 2581597 1003164 -3262041 -10428539 -15523972 -15829802 -15536192 -17336176 -16679735 -11014307
8409 -11014307 -6613063 -7824129 -7877046 -870934 5197773 580821 -7627798 -4755552
8401 -4755552 7198008 11555225 3010755 -5336029 -4103306 -603130 -3340228 -7604002
8393 -7604002 -5475371 423919 2670698 820112 -1338653 -4292577 -10172219 -15840184
8385 -15840184 -16169244 -11702635 -7393535 -6048247 -7313799 -10167533 -12116510 -8791643
8377 -8791643 1289983 13375014 20891052 21256324 15595287 6193857 -3216601 -8064582
8369 -8064582 -6883927 -2474370 2328992 7025214 10756639 11629159 10372324 10271057 11630258
8360 11630258 10836286 6755333 3178010 2842284 4114392 5704647 8972692 12840491
8352 12840491 12411603 6214854 -700064 -4352720 -6624112 -8678893 -6252805 2955702
8344 2955702 12773755 15647072 12206767 8442318 7220998 7423300 7454680 5189563 -1083442
8335 -1083442 -7702101 -7478789 -1027805 1026401 -6650964 -14599397 -12864543 -7030804
8327 -7030804 -8730425 -16133846 -17166748 -9184705 -1938333 -1314643 -2767848 -2181653 -1544900
8318 -1544900 -1443215 1202510 4647894 1728017 -8123240 -15494643 -14481114 -11263157
8310 -11263157 -13657057 -19143804 -19533699 -12579089 -3343764 2704654 3953788 2576379
8302 2576379 2278443 3364425 402576 -9994707 -19991934 -17495159 -3545995 6668331
8294 6668331 3737546 -4213470 -4849719 1980502 7940924 8841864 5912710 407898 -5357972
8285 -5357972 -6429238 -1802375 1930450 11663 -2804228 -1061623 1139434 -2389121
8277 -2389121 -7947017 -8088722 -5366597 -8175062 -15577805 -18538854 -15053703 -11529143
8269 -11529143 -9255811 -3020964 5005384 4369527 -5673222 -10773245 -1961860 10090221
8261 10090221 11155123 4310592 3077180 10225091 16007647 14716648 11235143 10638999
8253 10638999 10602078 6480095 -1852974 -9750483 -10895762 -1752344 12994894 21674015
8245 21674015 17669064 8150011 4790153 8195358 9401981 5479711 3792572 8840278
8237 8840278 14292551 13085342 8447655 8608223 14699361 19886591 18632735 12239770
8229 12239770 5785953 2368704 274194 -4666939 -12737043 -17595158 -13677645 -5311070
8221 -5311070 -2341800 -6296058 -8610454 -4987027 -2451918 -6596510 -10708649 -6625712
8213 -6625712 542783 -4541 -6704543 -8099622 -2238384 32688 -6366323 -11967452
8205 -11967452 -8529306 -2566485 -4587337 -12983186 -18343776 -18314621 -17922063 -17983292 -13394943
8196 -13394943 -3092272 6684144 10618438 9471392 5783923 516086 -4182122 -4553139
8188 -4553139 -554693 2699967 1795702 -190635 1363528 6056879 10177077 12542866
8180 12542866 14823596 17131358 16938845 12831111 7047813 3420744 3673141 6048594
8172 6048594 7244406 5933444 4465969 6159909 10469447 12164875 6692646 -4124202
8164 -4124202 -13026143 -14167620 -8441384 -1853644 916187 763374 1717734 4949667 6887897
8155 6887897 4118170 -1464244 -4434541 -2172448 2619101 5454120 3957518 -1616839
8147 -1616839 -8912930 -13700139 -12411380 -6347854 -1398596 -1579673 -4447446 -5064646 -2969521
8138 -2969521 -2204544 -4913201 -8147017 -8013837 -4642658 -1294278 259437 1577966 4759322
8129 4759322 9127519 11601596 10259799 6856451 5169350 6875025 9718915 10156996
8121 10156996 7363033 4042547 3408727 5904133 9108604 10536900 9982508 8922781
8113 8922781 8288386 7809244 7304746 7024623 6265683 3595100 -218886 -1472593 1994826
8104 1994826 7149536 9438196 8747001 8102038 7733731 5663619 4182217 9126779 20120986
8095 20120986 27814811 25517229 18353370 14832173 13813206 7961408 -2260345 -7600003
8087 -7600003 -3919668 1644077 1539294 -2580491 -5480079 -7136021 -9891656 -11418289
8079 -11418289 -7551839 -237686 3686771 1594960 -1779934 -813674 4738959 10332977
8071 10332977 11267819 7039069 2526993 3235045 7900975 9221250 4682818 1881778
8063 1881778 7484956 15323188 13949554 3800023 -3135949 -820685 4369717 6835986
8055 6835986 9652465 13884224 11947948 1314104 -5119835 4390455 19905584 21083948
8047 21083948 6283131 -5971595 -5689465 -4195474 -11722189 -18567714 -11371897 3145132
8039 3145132 6757099 -3013088 -10075170 -4215251 5657778 6465930 -1881194 -10042260
8031 -10042260 -12012803 -8161383 -1204963 4707079 4752551 -1109774 -6020024 -4151759
8023 -4151759 1734860 5038793 4748535 4656643 5219705 2860357 -2477540 -5406938 -2803038
8014 -2803038 1436966 2106652 -620256 -3365788 -5323138 -7845679 -9929442 -8529918
8006 -8529918 -3721363 70137 -274588 -1910720 513269 7326563 12150932 8830138
7998 8830138 -1123902 -9623840 -10489897 -5373368 -687524 -168445 -2000901 -2476189 -400106
7989 -400106 2510801 4074649 3566941 1845157 102440 -1760887 -5313991 -11279776 -17191896
7980 -17191896 -18834101 -14763879 -8422641 -4713993 -4841822 -5419098 -2827236 2055773
7972 2055773 4130005 -378054 -8901138 -14368615 -12694348 -7073089 -3626250 -4412738
7964 -4412738 -7034516 -9751074 -13224466 -16940521 -17715897 -13559137 -6464660 210442
7956 210442 4743595 6069404 3072623 -2492063 -5229073 -1837757 4283198 7818635
7948 7818635 9172759 12771790 18465503 19808135 12211613 -1055446 -12612872 -17650129
7940 -17650129 -15637700 -8941364 -2133378 34522 -3068218 -6986057 -7560235 -5846230
7932 -5846230 -5642965 -7650315 -8735935 -6355448 -1200233 4519962 9205457 11698432
7924 11698432 10754399 6083294 -375966 -5155884 -5905708 -3552081 -1384310 -1434328 -2147104
7915 -2147104 -440294 4304079 9309158 11035984 7557657 -944163 -11934452 -20813708
7907 -20813708 -23735873 -20884629 -15493567 -9613273 -2958014 3883142 7863918 6470430
7899 6470430 672527 -5835519 -8949169 -6170024 908391 6222099 4832276 -797340
7891 -797340 -4121929 -4347078 -7148953 -13691169 -15907747 -7839357 3890899 7846706
7883 7846706 2675838 -2800516 -2385734 1659076 4752199 5141974 2648776 -1741207 -4433760
7874 -4433760 -2618198 875108 1507517 1047152 4570318 9576144 7108010 -3825197
7866 -3825197 -12225661 -10598952 -6178576 -9372836 -17612852 -19906315 -13612533 -6858730
7858 -6858730 -5223059 -5288172 -3016825 -716588 -2180400 -6421150 -10194986 -12960659 -15314449
7849 -15314449 -15059045 -9301527 72659 6928278 8075898 7229721 9434633 13127232
7841 13127232 11646801 3561918 -2782901 923668 11148768 16368040 12459534 7535167
7833 7535167 9032767 12516300 8695414 -2629451 -12167412 -13116449 -7711232 -1892449
7825 -1892449 1561993 3423291 4982567 6264638 6154471 4390615 3705867 7397154 13189579
7816 13189579 13499223 5618209 -2114295 152793 10827138 19790588 22058161 20970922
7808 20970922 19008435 14540140 8920848 7675196 11192649 12219841 6905720 930708
7800 930708 -417138 -970855 -6031034 -12541008 -14640743 -13627235 -13854370 -13308715 -8008016
7791 -8008016 -2395372 -4216472 -10375863 -9888303 -2071185 556016 -8230845 -17459108
7783 -17459108 -14783186 -3901719 2992829 3279018 3854962 7028520 7772647 4740280
7775 4740280 3735665 7447810 9608055 3809422 -6910516 -13882011 -13394309 -9459285
7767 -9459285 -7140577 -6479255 -3819397 2259426 7920238 8095704 3074158 -1270982 -659763
7758 -659763 2899351 5234731 5523972 4808620 2644052 -175811 1257407 9802685 19027781
7749 19027781 19399775 11563375 5923795 7718621 10147211 5394380 -4401311 -11485436
7741 -11485436 -12203573 -7871713 -834929 5486466 6648222 2111366 -2977597 -4645176
7733 -4645176 -4883816 -5937958 -4873358 765306 6300101 5311478 -1272567 -7158880 -8851812
7724 -8851812 -6605057 -962018 5689560 8061765 5138625 4241452 10387056 16199292
7716 16199292 11880894 1255836 -3453927 -423919 720964 -3938832 -7675434 -7074543
7708 -7074543 -8035114 -14132956 -20537572 -23486903 -24604850 -22040155 -10061586 6874010
7700 6874010 13033346 2818636 -8880744 -7645192 584592 2208015 -2018677 -1896175
7692 -1896175 3090558 4891192 2503946 1800984 2505659 -625072 -4967785 -1986616 7672936
7683 7672936 13397528 10051418 3161643 -2282019 -7303046 -11869410 -13097137 -12550894
7675 -12550894 -15242155 -19337172 -17113159 -8636641 -3904651 -7677419 -12381746 -10975039
7667 -10975039 -7509452 -8903866 -13888232 -16351085 -14004222 -8853063 -4025898 -3298568
7659 -3298568 -7982719 -11902707 -6655731 5374338 11546481 6250064 -1335930 -2012068
7651 -2012068 215545 -2765913 -8879977 -9978287 -4837231 981285 4470687 6117732
7643 6117732 4626804 -1031495 -6043129 -3785744 4940571 12522924 13999734 11352624
7635 11352624 9164478 9933602 12772640 13792868 9415600 1656753 -2528465 448294
7627 448294 6365295 9237711 7767247 3540174 -2109820 -6569968 -6885515 -5433525 -8371649
7618 -8371649 -14984781 -16361088 -9536724 -4092122 -7569972 -13280160 -12043290 -7843666
7610 -7843666 -10125194 -17026961 -19438833 -17365195 -18458176 -22447677 -20642928 -10690944
7602 -10690944 583813 9251166 17211655 22778928 20766508 13295417 8320471 5741518
7594 5741518 -2267324 -14692123 -19355271 -11932918 -3886708 -4667065 -8328163 -6100463
7586 -6100463 -1156598 -1064211 -4452045 -5220692 -3089071 -863998 2287982 6072221 4229040
7577 4229040 -5909369 -14831219 -12022457 -1197783 5676283 5539968 4843722 6121269
7569 6121269 5519450 3077221 4569137 11470635 17705127 18426785 15351272 12058237 9905394
7560 9905394 9250346 9157157 5923877 -2351174 -10287381 -10785013 -5697882 -3774541 -7664505
7551 -7664505 -10783303 -8778015 -6352922 -9164966 -15035234 -17350448 -13202536 -5224183
7543 -5224183 1311476 1645924 -4207811 -9184682 -5842170 3437274 8340235 4399408
7535 4399408 -1472176 -2260518 -860389 -3390790 -8048327 -8115032 -3628397 -2571436 -9689444
7526 -9689444 -19384074 -21969416 -14576719 -3974039 1083643 -590684 -2050408 1960996
7518 1960996 7335057 6827282 2042924 2034411 8724785 11850860 3326101 -9991437 -14893194
7509 -14893194 -8615769 702950 7048835 10932148 11886422 6612863 -2783413 -6965701
7501 -6965701 -538186 10410434 16484196 16320989 14974983 14550247 12317425 7053767
7493 7053767 2187607 1842146 6500237 12880941 16391485 14478231 9631687 8030347
7485 8030347 12622819 18486375 18207969 11435214 5391230 5341302 8343798 8343385 4376049
7476 4376049 835204 1277608 4825448 8190112 9138818 8037267 7158298 7982560 8598082
7467 8598082 5560411 -356288 -3089850 762092 5415781 2692963 -5444831 -7972192
7459 -7972192 -446999 7237255 3866924 -7380505 -13393446 -8763475 -911536 2580273
7451 2580273 3589256 7070871 11588696 11901644 7602681 3510963 2629880 3410882 3836411
7442 3836411 4110122 4548498 4153746 2768086 2353694 4398020 7306136 7948213 5388116
7433 5388116 1922516 250000 344494 -37816 -1724205 -2391714 105910 3765401 4548293
7424 4548293 2461671 2001438 5103511 7370281 4408609 -1098157 -2973401 -371255
7416 -371255 1880468 1084745 -372259 -366865 -34824 423161 3921767 11118970 16769815
7407 16769815 15778974 10492961 7436439 7997860 7062521 1272834 -5547617 -7173560 -2649152
7398 -2649152 3094483 5150609 3146774 95201 -1393715 -885083 677960 1791211
7390 1791211 554385 -3847505 -8875226 -9979127 -6145000 -2203631 -2901522 -6452532
7382 -6452532 -7715865 -6212148 -5622019 -5669291 -1373275 7348204 12001645 6117649 -5393477
7373 -5393477 -12785798 -13411747 -11290805 -8166983 -2124241 6290439 13385378 17638647
7365 17638647 19937553 19025393 13081544 5879610 4265142 7950363 8611457 1825219
7357 1825219 -6299182 -7984281 -3959019 -670799 -1598578 -5410702 -9282120 -10325254
7349 -10325254 -6838467 -1355935 787905 -1302272 -2417976 28742 812214 -4726587
7341 -4726587 -12052973 -13569248 -9502031 -5556605 -2810544 1863217 6990384 7105444
7333 7105444 2637951 696961 3947008 6403886 3567820 -78096 1820447 8036406
7325 8036406 12175447 11014807 6391790 1651534 -333328 1691784 5073796 4844504
7317 4844504 508462 -1977586 1487490 6186240 4637103 -2577613 -7133959 -3388230
7309 -3388230 5853838 13746736 15818009 12029331 5910685 2041134 1845818 1997990 -864196
7300 -864196 -4995388 -6092391 -3619194 -606815 1947677 5710927 10109885 11903207
7292 11903207 10359072 7667870 3340482 -5246230 -14332480 -13676930 -863874 11010180
7284 11010180 8741318 -2092894 -4151680 7112060 17619495 15820645 8168717 6841739
7276 6841739 11247524 11534511 5051627 -1494026 -4332986 -6663173 -9674990 -9076389 -3537739
7267 -3537739 1448929 2509049 4520277 12365133 21725115 24425235 19736676 14128951
7259 14128951 11555946 9927875 6784192 3248037 1717420 3328472 7847447 12789376
7251 12789376 13200452 6473630 -2499644 -5394524 -790379 3524614 403969 -7835462
7243 -7835462 -12809068 -9931403 -2482713 2779070 2027291 -2933103 -6902250 -6215873 -1753873
7234 -1753873 2952566 5576122 5942034 4676035 3120415 3334624 5319837 5301964 230530
7225 230530 -6891766 -10291853 -9308835 -7867373 -6481746 -1840435 3966931 1987442 -10701609
7216 -10701609 -23392627 -24292704 -15904718 -9657162 -8663049 -5891135 1223368 5515101
7208 5515101 2778384 -136437 3440641 7906608 3354134 -8180036 -14041414 -8385537
7200 -8385537 492436 2915036 466314 670179 4321523 5471394 2209588 -292432
7192 -292432 867143 505504 -6763797 -17042541 -21123255 -16208899 -8159799 -2301100
7184 -2301100 2259666 7401021 10339390 7189178 -772744 -8418931 -12710664 -13704946
7176 -13704946 -11062539 -4110147 4306491 8335107 5665701 1101314 1220013 6630208
7168 6630208 11604523 11113060 6424519 3013790 3925488 6754806 7625177 6557716 6848874
7159 6848874 9684240 12274755 12125982 10219055 8274517 5887201 3003827 2057936 3559700
7150 3559700 2422927 -5386162 -14026079 -13035626 -2290530 6053171 3719633 -3120583
7142 -3120583 -4831952 -2784744 -4404111 -8631849 -7236087 360565 4691552 1111889
7134 1111889 -3040657 -1077938 2204894 -164449 -4214387 -1155300 6955205 8426535
7126 8426535 -914542 -11274384 -12459108 -6405836 -1931332 -2566062 -4770029 -4981335
7118 -4981335 -3405744 -1721501 -393699 1474361 4424765 6139599 1791753 -9721304
7110 -9721304 -20618383 -21031238 -12267140 -6633646 -10560766 -14969906 -8800022 4055941
7102 4055941 10638693 8280608 7113522 13019050 18909426 16859858 10042841 6354124
7094 6354124 6345286 4835692 1208319 667367 5501017 10932750 11360317 7290099 4009411
7085 4009411 4837118 7412005 6820773 1654877 -4138160 -5797782 -2617778 2993599 9182493
7076 9182493 14434753 15557734 10682172 4144751 3152273 8220142 11856897 8956999
7068 8956999 3587686 2078533 3874981 3970990 1197997 -1321011 -2400432 -4223558 -7503042
7059 -7503042 -9266648 -6313901 1438118 11038471 17939942 18057785 11011160 1400237
7051 1400237 -5035530 -6682400 -6509749 -7925533 -11177852 -13119120 -10104520 -2555775
7043 -2555775 3387545 1572811 -6310380 -12272466 -12480829 -11363082 -12971053 -14014516
7035 -14014516 -10144087 -4105689 -1381756 -1494008 -532401 714917 -1041025 -3323401
7027 -3323401 -545039 5496274 6749806 1685935 -1885747 686884 4185511 3417140
7019 3417140 1756184 3764131 5758072 1209803 -8330483 -14897505 -14655706 -10523917
7011 -10523917 -5503693 550297 7253258 11856240 12637678 11108109 9483347 7605762
7003 7605762 3278192 -4676515 -13511697 -17297627 -12630130 -3570862 2134347 2193245 1154939
6994 1154939 1767921 681441 -3930558 -6375402 -1215155 6891665 8323633 1595932
6986 1595932 -5641267 -7750020 -6069939 -2790211 2199397 6315577 3866685 -4932246
6978 -4932246 -10508415 -5237255 5687567 10676784 6688681 1455176 1315073 3279832
6970 3279832 1502706 -3152853 -4415852 97742 5144307 4521575 -1208192 -6068156
6962 -6068156 -6571838 -5081811 -4767073 -4851106 -3689436 -3703254 -8209659 -13865555 -12135845
6953 -12135845 -746169 10997095 12601300 5247087 -789860 -270979 1423204 -1776411
6945 -1776411 -6705153 -5594801 1955763 7317614 4061368 -3604749 -6749985 -3482324
6937 -3482324 -305810 -1914570 -4516872 -2014433 4706551 9205040 8788928 7233634
6929 7233634 7619493 7617633 4568433 928396 281565 725499 -2287317 -7364614 -7318492
6920 -7318492 621718 9736569 12084482 8294670 5163267 5731195 6470247 4057854 480194
6911 480194 -198238 2854593 7164953 10080742 9834373 5318572 -2109794 -7248441 -5131372
6902 -5131372 2206781 5902112 -269573 -12201937 -20118737 -19944966 -16301646 -14046676
6894 -14046676 -11719095 -6226669 176112 2890037 2857263 5044667 8910454 7361835
6886 7361835 -1829798 -9793580 -7191620 3010551 9838039 8978929 5975552 5364177
6878 5364177 4659457 1585297 155571 4335595 10027191 9393822 1647267 -5512348 -5309702
6869 -5309702 776813 5611950 4007735 -2644467 -7861599 -6228444 1035780 7412196
6861 7412196 8565512 6546012 5254062 4599882 2236234 -1084598 -2003617 372212 3599481
6852 3599481 5572752 5366566 1139966 -7841667 -16427005 -16132240 -5210088 7561853
6844 7561853 12112600 7262704 -925835 -7662616 -12228193 -14437858 -13415441 -10282859
6836 -10282859 -8294944 -8870016 -9670438 -7859202 -3868570 -910461 -1493648 -4983972 -8093005
6827 -8093005 -7559678 -2833951 3717981 9313639 12919348 14614160 13953068 10505187 5837136
6818 5837136 3278221 4652851 7700494 7778490 2708317 -4368906 -7892967 -5972889 -2446726
6809 -2446726 -1814113 -3383462 -2719520 1571796 5531832 5273253 2137050 576493 2398370
6800 2398370 4795924 3370150 -3509533 -12072082 -14915655 -8149278 2711285 7841133
6792 7841133 5665535 5326358 12935034 20803482 17358112 4317309 -5049488 -4215031
6784 -4215031 -328848 -776221 -2501680 -92889 3664975 3188050 513595 1550467 5165052
6775 5165052 5003822 802895 -1148451 924768 1744059 -571744 -379912 5090996 9074302
6766 9074302 4930801 -3534028 -8091533 -7816828 -7574831 -8205491 -6236645 -1836085 861505
6757 861505 1191225 2128936 2475722 -2910822 -12656929 -16871295 -10531465 -2098388 -2100481
6748 -2100481 -8000229 -8384277 98078 8227661 7185420 -828665 -7247485 -7502803 -3959780
6739 -3959780 -1768980 -4337735 -10839975 -16399932 -16294807 -10895282 -4724039 -551803
6731 -551803 2618630 5267153 5215083 1934695 -701612 733584 4291461 5914113 5197372
6722 5197372 4061245 1867357 -3328600 -9712732 -12880125 -11924854 -9622219 -6489681
6714 -6489681 -53437 8943021 15260113 16296380 15174375 14046149 10294579 3623899
6706 3623899 706585 5926320 12061337 8547203 -3397852 -12575095 -13684244 -12052025
6698 -12052025 -11722943 -8960644 -1748019 2925055 -1965310 -12467699 -18018682 -13746100
6690 -13746100 -3648948 5459064 8848824 5757715 621218 -206678 3717802 5875058
6682 5875058 2634573 -977454 148074 2721256 1602836 -685175 811914 3361806
6674 3361806 1271846 -2625465 -955303 4566235 5008805 -421380 -2931765 327451
6666 327451 1669387 -2281835 -3248938 4521060 12876714 10795706 -646969 -12092026
6658 -12092026 -18374256 -19739446 -16319627 -9246174 -3166945 -988483 87916 2093209
6650 2093209 1386122 -3837928 -7689300 -5936806 -4832808 -11210426 -19332050 -18621492 -10580992
6641 -10580992 -6032186 -7588756 -7440992 -2722328 -549529 -5050406 -10454244 -11302553
6633 -11302553 -10074488 -9783392 -7420671 -707800 5366555 5214911 1179187 -471722
6625 -471722 1340268 2683264 1522713 -348334 -1158104 -1341944 -2279425 -4776680 -7919333
6616 -7919333 -8391691 -2835255 7470718 15854116 16175266 9254255 2443317 2534823 8838629
6607 8838629 13608336 10582144 2566391 -2248672 -1176350 597680 -517194 -1323677
6599 -1323677 458616 445237 -4528094 -9331533 -8881090 -7341749 -9830995 -10997050 -3653040
6590 -3653040 5844000 5051074 -3716002 -5470562 3555381 9963803 5091932 -2522151
6582 -2522151 -3390850 -1742735 -4683604 -8535928 -6733333 -2197140 -1220117 -2533636 -2586996
6573 -2586996 -4542482 -11172421 -15030081 -7591423 5841117 11808666 6738726 -1108838
6565 -1108838 -5466342 -7197273 -6945997 -3590058 -560089 -3646407 -10715724 -12506756
6557 -12506756 -6066160 810235 1776718 1003376 5195639 12182293 13510131 6223752
6549 6223752 -2781411 -4420809 2853761 11674564 13664937 8266828 2907447 4477868
6541 4477868 12273417 19698869 20807764 14544187 5016136 -1692459 -3532507 -5247002
6533 -5247002 -11440655 -17701062 -15023115 -3755640 5042990 5218123 3741835 7940409
6525 7940409 13261746 12025039 7100629 6525054 9369326 8228398 3361600 2981045 9250310
6516 9250310 14191474 11626763 4980493 526149 -505484 -224633 377101 1394285 2696131
6507 2696131 4117999 4961993 3882178 1488848 958053 3039031 3611244 220185 -2925906
6498 -2925906 -1831267 -165906 -2838541 -6430926 -4998681 -2083775 -6120253 -15057993
6490 -15057993 -17291700 -9497527 -2462574 -5308736 -13338459 -16615610 -13010875 -7217187
6482 -7217187 -2645033 380007 2491092 5502126 11282862 17501364 18314678 12022958
6474 12022958 4279455 1133068 2454780 4495998 5181990 4289100 1679564 -1856641
6466 -1856641 -4110693 -3676026 -1356328 810610 302274 -4741667 -12178851 -15550632 -11156402
6457 -11156402 -3414178 1617994 5263319 12027508 18875459 17850668 9280563 2722874
6449 2722874 2733590 2957992 -1835491 -6347380 -3110013 5882775 12016330 10904123 5572137
6440 5572137 1167577 -13280 445024 -424201 -2228537 -238461 7658573 15472197 16227579
6431 16227579 12455393 12132883 15486640 14827931 7709646 603802 -2170250 -3605057
6423 -3605057 -5641676 -5344290 -2793794 -3169335 -6799438 -6631407 -374458 4362478 2489576
6414 2489576 -573541 552770 2384275 1329865 1325121 4309221 3024418 -6339090 -13470343
6405 -13470343 -8176802 2284286 3866662 -1992425 -2102572 5244540 7075570 -2539708
6397 -2539708 -12205113 -9933112 933731 9110966 10652990 9736453 9203623 7502813
6389 7502813 3776227 826256 1744460 5544486 7759413 5721678 1984268 727112
6381 727112 1916917 2275115 1218588 1171647 2183446 2074367 2265803 6211915 10834442
6372 10834442 8459692 252453 -2521118 3775318 6677900 -4458686 -21171780 -27262227
6364 -27262227 -20505422 -11513459 -6228480 -1785219 3158414 5692977 5399151 4518952
6356 4518952 2733334 -351550 -654536 4010031 7380485 4334245 1876183 8535883
6348 8535883 17636290 15821611 5367921 1570711 8186394 12656347 8261996 3809106
6340 3809106 5801618 7138476 1615797 -4325306 -3695701 -983121 -2522120 -5189326
6332 -5189326 -4255700 -3062846 -5170269 -5663227 -294386 5018261 4308173 3168563 8732834
6323 8732834 15366098 13304806 5821060 3878624 7717748 8405315 5465706 7258750
6315 7258750 13244534 11951002 794136 -6914845 -1974672 6493707 6447296 2000845
6307 2000845 4947745 14128672 16938137 9141185 205618 -2527612 -3443857 -7940895
6299 -7940895 -11706290 -8250471 -1124425 292109 -4934635 -7617907 -1818327 7205466
6291 7205466 11171382 9329536 6695380 5598779 4110005 1269469 -986404 -1359918
6283 -1359918 -979736 -589267 1536738 7324684 15540098 21784272 22173772 17338492 12257772
6274 12257772 10724900 10485834 6592720 -457366 -4299116 -2162756 264446 -2415094
6266 -2415094 -6019395 -2587357 6655382 11311794 5465199 -4687756 -9087441 -5383660
6258 -5383660 539922 2895046 1715310 585251 678629 -822733 -5027262 -6420992 1054164
6249 1054164 12758201 15560013 5114919 -6415231 -6570489 304189 1669138 -3088533
6241 -3088533 -3911347 912676 1702582 -4528686 -7260488 118020 8261660 6042648 -2626066
6232 -2626066 -6228552 -3012818 -31106 776182 3974653 9096918 8451720 -968207 -10967644
6223 -10967644 -11382912 -1697343 9360739 13245083 8748303 1474439 -2419784 -2303408
6215 -2303408 -2634926 -6202279 -9768744 -8301664 -1932955 3778054 3834895 -1726607 -8375080
6206 -8375080 -10417450 -5192476 3821034 9065465 6414113 116189 -1865789 2886194
6198 2886194 8857292 9767201 6066385 3719324 6126879 9360003 7122928 -458827
6190 -458827 -6211944 -5216720 -1345916 -1553735 -6505571 -11248013 -13151454 -13589061 -12388925
6181 -12388925 -6964568 1660857 7515693 6779079 1972767 -2896103 -6961338 -9970459
6173 -9970459 -9698670 -5255427 445221 4649103 8229866 12406010 15096404 13760403
6165 13760403 9434039 5005483 1554431 -1151254 -2707079 -2897767 -2354760 -656607
6157 -656607 3503955 8468437 9330548 4197774 -2218218 -4142845 -1332813 2432655 4671893
6148 4671893 5167755 4263946 3282400 4474242 7761786 9584101 7451868 3422353 756204
6139 756204 -275374 -762554 -126137 2422469 5820721 9107214 12732255 15401536 12961355
6130 12961355 3966608 -6344613 -11329965 -10185930 -6950656 -4775649 -4374332 -5541322
6122 -5541322 -6579397 -4399779 1293303 5885477 5114472 405034 -3937239 -6340435
6114 -6340435 -7745206 -8645088 -9735166 -12552062 -15917741 -15122666 -8834777 -3257001 -4261466
6105 -4261466 -8560975 -8564150 -3330649 1921097 5301725 9733603 15153685 16668598 12264741
6096 12264741 6464776 3953974 4192671 4647264 5205156 6419298 6382020 2842129 -2474816
6087 -2474816 -4258640 909079 10054550 15740451 13470415 6636549 2235275 2150277 1968290
6078 1968290 -1179103 -4030658 -2566240 2089810 6134813 8067734 8217441 6720926
6070 6720926 5169973 6737984 11083724 12572618 7393198 -767930 -5631221 -5229690
6062 -5229690 -704576 6723980 13202542 12365571 3966650 -2897989 -1792808 1402590
6054 1402590 -1418699 -6918982 -6927329 -3648160 -5681379 -11418169 -10121021 -21338 7959220
6045 7959220 7268238 4153024 4781784 5543835 2315535 -741037 816227 3063762 1178084
6036 1178084 -892032 3168382 10325784 11541342 4995083 -1467710 -1190873 3526472
6028 3526472 5683055 2201214 -3226041 -4762859 -857124 4731414 8231451 9645390
6020 9645390 9669920 6660916 687267 -3127562 -1251899 1392072 -1595605 -7083432 -7119834
6011 -7119834 -2358377 -132998 -163309 5258769 15503557 19516170 13387481 6676359
6003 6676359 5518456 3182083 -4329601 -7108534 2360007 13505097 12654691 4717174
5995 4717174 4141508 10618829 10806585 1332819 -6889617 -7704465 -7456996 -10998733 -13886839
5986 -13886839 -12930593 -12385515 -14168514 -12306366 -3401589 5772214 7440595 3180888
5978 3180888 -62302 1323060 6834506 13655969 15620085 7369587 -5992434 -10721172
5970 -10721172 -1609880 9612135 9886418 2169139 -1471740 1375072 2494628 -1388718
5962 -1388718 -3515238 752713 6236171 6477658 2908787 374418 -1455544 -6024500
5954 -6024500 -11536861 -11014103 -1789046 9423695 13813374 10741557 7264770 7734952
5946 7734952 8147122 3319671 -3979358 -6425184 -3464446 -2714102 -8401673 -14678144 -14372491
5937 -14372491 -9087864 -4893707 -2010858 3837122 11579362 14386499 10139736 5329883
5929 5329883 5734481 8563300 7357244 945925 -5736899 -7183941 -1447429 8512960
5921 8512960 15820271 15209789 9478450 7033061 11240283 16377401 16281337 11732231 5870760
5912 5870760 -1587435 -9954952 -13131391 -7376001 448225 951967 -4319732 -6705756
5904 -6705756 -5372544 -7326202 -12686947 -12359543 -3603903 3711759 2098097 -2414252
5896 -2414252 -1173442 3859051 5910047 4878220 4018141 1486078 -5008423 -10026322
$$ [...]
##END NTUPLES=NMR SPECTRUM
##END=
