##TITLE=31Pdec_SR152_EtAc2
 , 124 sc
 15.11.2022
##JCAMPDX= 6.0         $$ Bruker NMR JCAMP-DX V2.0
##DATA TYPE= NMR SPECTRUM
##DATA CLASS= NTUPLES
##ORIGIN= UXNMR, Bruker Analytische Messtechnik GmbH
##OWNER= root
$$ XWIN-NMR		Version 3.5
$$ Tue Nov 15 16:12:27 2022 Russian Standard Time (UT+4h)  she@DPX200
##.OBSERVE FREQUENCY= 81.013821
##.OBSERVE NUCLEUS= ^31P
##.ACQUISITION MODE= SIMULTANEOUS
##.ACQUISITION SCHEME= undefined
##.AVERAGES= 124
##.DIGITISER RES= 16
##SPECTROMETER/DATA SYSTEM= spect
##.PULSE SEQUENCE= zgpg30
##.SOLVENT NAME= CDCl3
##.SHIFT REFERENCE= (INTERNAL, CDCl3, 0, 248.564)
##AUDIT TRAIL= $$ (NUMBER, WHEN, WHO, WHERE, WHAT)
$$ ##TITLE= Audit trail, XWIN-NMR		Version 3.5
$$ ##JCAMPDX= 5.01
$$ ##ORIGIN= Bruker BioSpin GmbH
$$ ##OWNER= she
$$ F:/spectra/data/she/nmr/P31/1/pdata/1/auditp.txt
$$ ##AUDIT TRAIL=  $$ (NUMBER, WHEN, WHO, WHERE, WHAT)
(   1,<2022-11-15 16:11:27.85 +0400>,<she>,<DPX200>,
      <continue with go, POWCHK disabled, PULCHK disabled
       configuration hash MD5:
       00 E9 B6 7A A2 85 ED C7 34 08 36 98 17 FE 4E 26
       data hash MD5: 32K
       B2 B0 CA 91 E5 C7 A5 A5 44 6C 6D 5C 75 63 CA 65>)
(   2,<2022-11-15 16:11:30.12 +0400>,<she>,<DPX200>,
      <Start of raw data processing
       efp BC_mod = 2 LB = 1 FT_mod = 6 PKNL = 1 PHC0 = -10347.53 PHC1 = 290.456 SI = 64K 
       data hash MD5: 64K
       57 35 E7 DE 26 4C 4C B7 14 7F 3A 14 5E 1B 1E 40>)
(   3,<2022-11-15 16:11:51.07 +0400>,<she>,<DPX200>,
      <pk PHC0 = 6.100601 PHC1 = 0 
       data hash MD5: 64K
       11 D0 4A B1 38 2E 6A 93 6F AE 5F F6 E7 B1 1A EB>)
(   4,<2022-11-15 16:11:57.51 +0400>,<she>,<DPX200>,
      <abs ABSG = 5 
       data hash MD5: 64K
       A5 CC 7F 3B 30 E1 BE EF AD 18 B6 D4 B2 E0 F8 B5>)
$$ ##END=
$$ 
$$ hash MD5
$$ 6F 2E 6A BB AF 74 E6 17 5E 77 73 0C E9 54 2B 7A
##$RELAX= 
##$RELAX= 
##$RELAX= 
##$RELAX= 
##$RELAX= 
##$RELAX= 
##$RELAX= 
##$RELAX= 
##$RELAX= 
$$ Bruker specific parameters
$$ --------------------------
##$DU= <F:/spectra>
##$EXPNO= 1
##$NAME= <P31>
##$PROCNO= 1
##$TYPE= <nmr>
##$USER= <she>
##$AMP= (0..31)
100 100 100 100 100 100 100 100 100 100 100 100 100 100 100 100 100 100 
100 100 100 100 100 100 100 100 100 100 100 100 100 100 
##$AQSEQ= 0
##$AQ_mod= 1
##$AUNM= <au_zg>
##$AUTOPOS= <>
##$BF1= 81.014009
##$BF2= 200.13
##$BF3= 200.13
##$BF4= 200.13
##$BF5= 200.13
##$BF6= 200.13
##$BF7= 200.13
##$BF8= 200.13
##$BYTORDA= 1
##$CFDGTYP= 0
##$CFRGTYP= 5
##$CHEMSTR= <none>
##$CNST= (0..31)
1 1 145 1 1 1 1 1 1 1 1 1 1 1 1 1 1 1 1 1 1 1 1 1 1 1 1 1 1 1 1 1 
##$CPDPRG= <waltz16>
##$CPDPRG1= <>
##$CPDPRG2= <waltz16>
##$CPDPRG3= <>
##$CPDPRG4= <mlev>
##$CPDPRG5= <mlev>
##$CPDPRG6= <mlev>
##$CPDPRG7= <mlev>
##$CPDPRG8= <mlev>
##$CPDPRGB= <>
##$CPDPRGT= <>
##$D= (0..31)
0 1 0 0 0 0 0 0 0 0 0 0.03 2e-05 3e-06 0 0 0 0 0 0 0 0 0 0 0 0 0 0 0 0 
0 0 
##$DATE= 1668514120
##$DBL= (0..7)
120 120 120 11 120 120 24 19 
##$DBP= (0..7)
150 150 150 150 150 150 150 150 
##$DBP07= 0
##$DBPNAM0= <>
##$DBPNAM1= <>
$$ [...]
##$SUBNAM3= <"">
##$SUBNAM4= <"">
##$SUBNAM5= <"">
##$SUBNAM6= <"">
##$SUBNAM7= <"">
##$SUBNAM8= <"">
##$SUBNAM9= <"">
##$SW= 501.771253377433
##$SWIBOX= (0..15)
0 1 3 0 0 0 0 0 0 0 0 0 0 0 0 0 
##$SW_h= 40650.406504065
##$TD= 32768
##$TD0= 1
##$TE= 0
##$TE2= 300
##$TE3= 300
##$TEG= 300
##$TL= (0..7)
0 120 53 12 22 120 120 120 
##$TP= (0..7)
150 150 150 150 150 150 150 150 
##$TP07= 0
##$TPNAME0= <>
##$TPNAME1= <>
##$TPNAME2= <>
##$TPNAME3= <>
##$TPNAME4= <>
##$TPNAME5= <>
##$TPNAME6= <>
##$TPNAME7= <>
##$TPOAL= (0..7)
0.5 0.5 0.5 0.5 0.5 0.5 0.5 0.5 
##$TPOFFS= (0..7)
0 0 0 0 0 0 0 0 
##$TUNHIN= 0
##$TUNHOUT= 0
##$TUNXOUT= 0
##$USERA1= <user>
##$USERA2= <user>
##$USERA3= <user>
##$USERA4= <user>
##$USERA5= <user>
##$V9= 5
##$VALIST= <valist>
##$VCLIST= <CCCCCCCCCCCCCCC>
##$VD= 0
##$VDLIST= <DDDDDDDDDDDDDDD>
##$VPLIST= <PPPPPPPPPPPPPPP>
##$VTLIST= <TTTTTTTTTTTTTTT>
##$WBST= 1024
##$WBSW= 4
##$XGAIN= (0..3)
0 0 0 0 
##$XL= 0
##$YL= 0
##$YMAX_a= 4070
##$YMIN_a= -6659
##$ZGOPTNS= <>
##$ZL1= 120
##$ZL2= 120
##$ZL3= 120
##$ZL4= 120
##$ABSF1= 248.5645
##$ABSF2= -253.2056
##$ABSG= 5
##$ABSL= 3
##$ALPHA= 0
##$AQORDER= 0
##$ASSFAC= 0
##$ASSFACI= 0
##$ASSFACX= 0
##$ASSWID= 0
##$AUNMP= <proc_1d>
##$AZFE= 0.1
##$AZFW= 0.5
##$BCFW= 0
##$BC_mod= 2
##$BYTORDP= 0
##$COROFFS= 0
##$CY= -3
##$DATMOD= 1
##$DC= 0
##$DFILT= <>
##$DTYPP= 0
##$F1P= 0
##$F2P= 0
##$FCOR= 1
##$FTSIZE= 65536
##$FT_mod= 6
##$GAMMA= 0
##$GB= 0
##$INTBC= 1
##$INTSCL= 6.047779e-11
##$ISEN= 30
##$LB= 1
##$LEV0= 0
##$LPBIN= 0
##$MAXI= 10000
##$MC2= 0
##$MEAN= 0
##$ME_mod= 0
##$MI= 50
##$NCOEF= 0
##$NC_proc= -7
##$NLEV= 6
##$NOISF1= 182.463
##$NOISF2= 159.3651
##$NSP= 0
##$NTH_PI= 0
##$NZP= 0
##$OFFSET= 248.5645
##$PC= 4
##$PHC0= -10341.43
##$PHC1= 290.456
##$PH_mod= 1
##$PKNL= yes
##$PPARMOD= 0
##$PSCAL= 0
##$PSIGN= 0
##$REVERSE= no
##$SF= 81.0140089999694
##$SI= 65536
##$SIGF1= 159.3651
##$SIGF2= -187.1042
##$SINO= 113.3802
##$SIOLD= 16384
##$SREGLST= <1H.CDCl3>
##$SSB= 0
##$STSI= 65536
##$STSR= 0
##$SW_p= 40650.406504065
##$SYMM= 0
##$S_DEV= 0
##$TDeff= 32768
##$TDoff= 0
##$TI= <>
##$TILT= no
##$TM1= 0
##$TM2= 0
##$TOPLEV= 0
##$USERP1= <user>
##$USERP2= <user>
##$USERP3= <user>
##$USERP4= <user>
##$USERP5= <user>
##$WDW= 1
##$XDIM= 65536
##$YMAX_p= 194739006
##$YMIN_p= -202985766
$$ End of Bruker specific parameters
$$ ---------------------------------
##NTUPLES= NMR SPECTRUM
##VAR_NAME=  FREQUENCY,     SPECTRUM/REAL,   SPECTRUM/IMAG
##SYMBOL=    X,             R,               I
##VAR_TYPE=  INDEPENDENT,   DEPENDENT,       DEPENDENT
##VAR_FORM=  AFFN,          ASDF,            ASDF
##VAR_DIM=   65536,         65536,           65536
##UNITS=     HZ,            ARBITRARY UNITS, ARBITRARY UNITS
##FACTOR=    0.620285442955139, 1,           1
##FIRST=     20137.2065510682, 0,            0
##LAST=      -20513.1999529968, 0,           0
##MIN=       -20513.1999529968, -202985766,  0
##MAX=       20137.2065510682, 194739006,    0
$$ Real data points
##PAGE= N=1
##DATA TABLE= (X++(R..R)), XYDATA
$$ [...]
42265b083701j726686K948943K935460J940371L647220L154702k981898p881849
$$ -2083701 -3810387 -861444 2074016 4014387 7661607 10816309 7834411 -47438
42257d7438m954832P59771J389660r47580M3690K819332K231626K28844J594351
$$ -47438 -5002270 -4242499 -2852839 -3800419 -3756729 -937397 1294229 1523073 3117424
42248C117424L587691P62485l662160k538422J940180J387358l985072n664343
$$ 3117424 6705115 7467600 3805440 1267018 3207198 4594556 609484 -5054859
42240e054859j729272N20653j723285k093570K564243N697039K042718l473475
$$ -5054859 -6784131 -6263478 -7986763 -10080333 -7516090 -1819051 223667 -3249808
42232c249808l686764M79645L303410K939870J604713O77189J2468l78067r84641
$$ -3249808 -6936572 -6456927 -3153517 -213647 1391066 2068255 2080723 1702656 718015
42223G18015k736535m398030l082599R18703L231838J261225k212255l118271
$$ 718015 -2018520 -6416550 -9499149 -8580446 -5348608 -4087383 -6299638 -9417909
42215i417909r00733K176444L739837K467225n70302j661151R49352L019428n9871
$$ -9417909 -10318642 -8142198 -4402361 -1935136 -2505438 -4166589 -3217237 -197809 -257680
42206b57680m538126k547294M489227N921987j453810o667257j127383P024377
$$ -257680 -4795806 -7343100 -2853873 3068114 1614304 -5052953 -6180336 844041
42198H44041N106779l882074n770124K322189P406924J039279p698692o403065
$$ 844041 5950820 2068746 -3701378 -1379189 6027735 7067014 -631678 -7034743
42190g034743K102314M906276j441311o680322k664074N251262O807336J064852
$$ -7034743 -4932429 -26153 -1467464 -8147786 -10811860 -5560598 1246738 2311590
42182B311590m037242l653560q91839L76808J077486K728332L155236P42079j204928
$$ 2311590 -1725652 -5379212 -6271051 -5894243 -4816757 -2088425 1066811 1808890 603962
42173F03962L49398J941541r66576m778389k051356N564001P847498J501860m123866
$$ 603962 953360 2894901 1928325 -2850064 -4901420 662581 8510079 10011939 5888073
42164E888073j461769L603801J707011n015708p034300k522688J418696J233060
$$ 5888073 4426304 8030105 9737116 4721408 -2312892 -4835580 -3416884 -2183824
42156b183824J058831L484947M728235J858629k025036l398377l613966m805570
$$ -2183824 -1124993 2359954 7088189 8946818 6921782 3523405 -90561 -4896131
42148d896131n063852j947772K523020M518878L669864K079571L22605j749016
$$ -4896131 -9959983 -11907755 -9384735 -4865857 -1195993 883578 1206183 -542833
42140e42833k076517J298183N633271N496985K0594n288076n258334j024132K283575
$$ -542833 -2619350 -1321167 4312104 9809089 9829683 4541607 -716727 -1740859 542716
42131E42716J977603O8342j79386J689019L037597J404192k397108m901770l904557
$$ 542716 2520319 2588661 2409275 4098294 7135891 8540083 6142975 1241205 -2663352
42122b663352r61202Q32548P57570O03802J214305J067785q97809k917008k426556
$$ -2663352 -3624554 -2792006 -2034436 -1430634 -216329 851456 -46353 -2963361 -5389917
42113e389917O14888L970634N801026N426525K391862k728336o818098o450496
$$ -5389917 -4775029 -804395 4996631 10423156 12815018 10086682 3268584 -3181912
42105c181912k461042L74717m43650j973808q76630J287988J173611k49125O42843
$$ -3181912 -5642954 -5268237 -5711887 -7685695 -8562325 -7274337 -6100726 -6349851 -5707008
42096e707008L286427L109954o54615k655556N64594M795805M236767l6212k335188
$$ -5707008 -2420581 689373 34758 -2620798 -2056204 2739601 6976368 6940156 4604968
42087D604968j028228K06963p27858j325244N10419K620848K020503o66906k606315
$$ 4604968 3576740 3783703 3055845 1730601 2241020 4861868 6882371 6215465 3609150
42078C609150k700547j866586p52642M40733O66912r45111k848333k283946N99965
$$ 3609150 908603 -957983 -1710625 -1269892 -602980 -1548091 -4396424 -6680370 -6080405
42069f080405K120154J08002k346201q86793L312821M341338j61221n164582n009206
$$ -6080405 -3960251 -3852249 -6198450 -7085243 -3772422 568916 407695 -4756887 -9766093
42060i766093r25018J742164J507579J296997K167767J939514N09171R73730L659213
$$ -9766093 -10691111 -8948947 -7441368 -6144371 -3976604 -2037090 -1527919 -554189 3105024
42051C105024M272471Q07880k598566k336002j142712k595950m096419j397496
$$ 3105024 7377495 8185375 5586809 3250807 2108095 -487855 -4584274 -5981770
42043e981770L047904L283683k54470j406939J269022K137922j774052n353980
$$ -5981770 -2933866 349817 95347 -1311592 -42570 2095352 321300 -5032680
42035e032680k996934L281537O993292N204028L35943l667266m453874k270077
$$ -5032680 -8029614 -4748077 2245215 7449243 7785186 4117920 -335954 -2606031
42027b606031L33651R56887K1953m67388j97968n4140N75461K371099L066041
$$ -2606031 -2272380 -1315493 -1293540 -1760928 -1958896 -2013036 -1437575 933524 3999565
42018C999565N35064k073079j99053L606370K316280l761478o297222k452651
$$ 3999565 4534629 2461550 2262497 5868867 8185147 4423669 -1873553 -4326204
42010d326204J83698l149945n518122q9481P204778O436822n78871l871261j187812
$$ -4326204 -4142506 -7292451 -12810573 -12900054 -5695276 741546 162675 -3708586 -4896398
42001d896398N63228j497219k117407J922504O423633O725378L239445j558663
$$ -4896398 -4333170 -5830389 -7947796 -6025292 398341 7123719 10363164 8804501
41993H804501n659045o205514j802212L234293L225980N1429O66087N270328O282662
$$ 8804501 3145456 -3060058 -4862270 -1627977 1598003 1649432 2315519 7585847 13868509
41984A3868509R49105l835199k857399l14896j235487k879649j044132J505369
$$ 13868509 14817614 10982415 8125016 7810120 6574633 3694984 2650852 4156221
41976D156221J33242l033529k975414o30883n02777k055857r51211K509909L342787
$$ 4156221 4289463 1255934 -1719480 -2350363 -2853140 -4908997 -5860208 -3350299 -7512
41967g512J64560k821314k767013j551292j071642j39949K027921L170735J251218
$$ -7512 157048 -2664266 -5431279 -6982571 -8054213 -8194162 -6166241 -2995506 -1744288
41958a744288k047096l138962o34407L480695N928363M970531J815471p42367
$$ -1744288 -3791384 -6930346 -7564753 -4084058 1844305 6814836 8630307 7887940
41950G887940j256901m82679N88313J598087J353523j620875n640669o142297
$$ 7887940 6631039 6148360 6736673 8334760 9688283 8067408 2426739 -3715558
41942c715558j814910K581057K636228N37942Q03018K419173P09507m109637o232888
$$ -3715558 -5530468 -2949411 -313183 224759 1027777 3446950 4156457 46820 -6186068
41933f186068k945394J251435J369297j174479j269065K690974P080166P491468
$$ -6186068 -9131462 -7880027 -6510730 -7685209 -8954274 -6263300 816866 8308334
41925H308334L066886l037214o332787m650433o4524K972865J929866j367142
$$ 8308334 11375220 8338006 2005219 -2645214 -2709738 263127 2192993 825851
41917H25851k752026k25732L708362M782076K104862r02579j645900j987809l945465
$$ 825851 -1926175 -2151907 1556455 6338531 8443393 7540814 5894914 3907105 -38360
41908c8360m419430L36070O177652M506596m288129q962854l189692M673254M334580
$$ -38360 -4457790 -4121720 2055932 6562528 2274399 -6688455 -9878147 -5204893 -870313
41899h70313r26336j037457L506877K952028m324150q104939k583410M612095
$$ -870313 -1796649 -2834106 672771 3624799 -699351 -8804290 -11387700 -6775605
41891f775605M790690O96154j54135K119674J914773j422411l224515j766025
$$ -6775605 -1984915 -1288761 -1442896 676778 2591551 1169140 -2055375 -3821400
41883c821400O5112Q81100K340010L982887K288363l007797o265581l005172L195276
$$ -3821400 -3756288 -2875188 -535178 3447709 5736072 2728275 -3537306 -6542478 -3347202
41874c347202M756516N2140m559934l410389J205201K992198O52875j158209L67064
$$ -3347202 1409314 1461454 -3098480 -6508869 -5303668 -2311470 -1658595 -2816804 -2449740
41865b449740K058787M89147k105113j417241J820534K824298L9458k865126k596007
$$ -2449740 -390953 98194 -2006919 -3424160 -1603626 1220672 1260130 -1604996 -4201003
41856d201003j64528J675843J956970J351736P20268O54351Q13124l54352l294916
$$ -4201003 -4365531 -2689688 -732718 619018 1339286 1993637 2806761 2452409 -842507
41847h42507n194978k904439K011250M300979J787139j874892k337006J78737
$$ -842507 -6037485 -8941924 -6930674 -2629695 -842556 -2717448 -5054454 -4875717
41839d875717K311474K226712J019912L96802L75288m45869k310499k673444P97416
$$ -4875717 -2564243 -337531 682381 1079183 1454471 1008602 -1301897 -3975341 -3177925
41830c177925N300863M604365k083677o947056l507764L766529N653674J387387
$$ -3177925 2122938 6727303 4643626 -2303430 -5811194 -2044665 3609009 4996396
41822D996396j596152j1412J463429k55738j539455M27355K155028K21219k576199
$$ 4996396 3400244 3388832 4852261 4596523 3057068 3484423 5639451 5860670 3284471
41813C284471k122903M59169J631083R98976l1743j507590k861455j360769L048885
$$ 3284471 1161568 1620737 3251820 4250796 4219053 2711463 -149992 -1510761 1538124
41804A538124N004718P69275n082830n388042n04095K851301J477480j103825
$$ 1538124 6542842 7312117 2229287 -3158755 -3662850 -811549 665931 -437894
41796d37894j038035J167608K955060K966776J195862j381497k810488j840483
$$ -437894 -1475929 -308321 2646739 5613515 6809377 5427880 2617392 776909
41788G76909K80696J237073M22854j081839k364778k988234k473503r40609O79139
$$ 776909 1057605 2294678 2717532 1635693 -729085 -3717319 -6190822 -7131431 -6452292
41779f452292J904495K697702J931066j336221m375971k584074L287959O026058
$$ -6452292 -4547797 -1850095 80971 -1255250 -5631221 -8215295 -4927336 1098722
41771A098722J424775n035742n368782J50098M452806L880477J486311P14146
$$ 1098722 2523497 -2512245 -7881027 -7730929 -3278123 602354 2088665 2802811
41763B802811Q08939m69289k907315m036350j996284K091509M443587K554328
$$ 2802811 3611750 3142461 235146 -3801204 -5797488 -3705979 737608 3291936
41755C291936j213056k497557j296515j311038k527477m85553M827319O344822
$$ 3291936 2078880 -418677 -1715192 -3026230 -5553707 -6039260 -1211941 5132881
41747E132881O94238n108910l929106P31826J838233Q30031K980357N446042J518908
$$ 5132881 5827119 718209 -3210897 -2479071 -640838 189193 3169550 8615592 10134500
41738A0134500n518889n315342K436813O232568P60359n222539l843942Q9594
$$ 10134500 4615611 -699731 1737082 7969650 8730009 3507470 -336472 -246878
41730b46878o30833k932397k68975M535250L532569k604583m938423Q2404N626486
$$ -246878 -877711 -3810108 -4079083 456167 3988736 1384153 -3554270 -3471866 2154620
41721B154620M626370j413517o231545o841097m623149j285404K532386N189624
$$ 2154620 6780990 5367473 -864072 -7705169 -12328318 -13613722 -11081336 -5891712
41713e891712M039758o50818l741404n95528N677051O671646K91048m874067j111269
$$ -5891712 -1851954 -2502772 -6244176 -6839704 -1162653 5508993 5800041 925974 -185295
41704a85295O723343P805319R85309m524941l623889j282883k046711k688780
$$ -185295 6538048 14343367 15328676 10803735 7179846 5896963 3850252 1161472
41696A161472J02312K539664N47093k226643k78874M063750M082782p65093m561618
$$ 1161472 1263784 3803448 4350541 2123898 1845024 5908774 9991556 9226463 4664845
41687D664845l931756j288509L78394P11652J09981j015119j293401k10053J04836
$$ 4664845 733089 -555420 -177026 534626 644607 -370512 -1663913 -1873966 -1769130
41678a769130j644446k493484M39021M248849M219375J699872J582045L036254
$$ -1769130 -3413576 -5907060 -5468039 -1219190 3000185 4700057 6282102 9318356
41670I318356N08629n573670p609250k972385R54741j452491m913441k485859
$$ 9318356 9826985 4253315 -3355935 -6328320 -5373579 -6826070 -11739511 -14225370
41662a4225370K534464K565153r22689r2053N166123O580697J821183j132636
$$ -14225370 -11690906 -9125753 -10048442 -10140495 -4974372 1606325 3427508 2294872
41654B294872K437653N775832K117526l856242m209656j118409k206443o389255
$$ 2294872 4732525 10508357 12625883 8769641 4559985 3441576 1235133 -5154122
41646e154122n364237J633969N550858J878113k733066k128692R2905j212730
$$ -5154122 -10518359 -8884390 -3333532 -1455419 -4188485 -6317177 -6224272 -7437002
41638g437002k849940P76445O917573P871450K673810j963728j693024N63900
$$ -7437002 -10286942 -9510497 -2592924 5278526 7952336 5988608 4295584 4859484
41630D859484R1205l620705o892333n469202J051856O919907N309397k117815
$$ 4859484 4950689 1329984 -5562349 -11031551 -9979695 -3059788 2249609 131794
41622A31794n360609L16676O453344L442846m595172n923501R59146N923838L171592
$$ 131794 -5228815 -4912139 1541205 4984051 388879 -5534622 -4575476 1348362 4519954
41613D519954j753963k664676r59070J85181J580171L604127K849945j983446
$$ 4519954 2765991 101315 -857755 -672574 907597 4511724 7361669 5378223
41605E378223o216820n640545k277620J45253J891314M281213N281670K617366
$$ 5378223 -838597 -6479142 -8756762 -8611509 -6720195 -2438982 2842688 5460054
41597E460054j584462l187105j155157K169607L739428J465277l725470o773978
$$ 5460054 3875592 688487 -466670 1702937 5442365 6907642 3182172 -3591806
41589c591806l569419K295341L214030j182631l315833n8254K320800m68212k889552
$$ -3591806 -7161225 -4865884 -1651854 -2834485 -6150318 -6208572 -3887772 -4355984 -7245536
41580g245536N47125N060071L442953j576729k009685K098738L437118l14573
$$ -7245536 -6698411 -1638340 1804613 227884 -1781801 316937 3754055 3439482
41572C439482l884610l816213k548106k267961j465809Q29581K725649K947143
$$ 3439482 -445128 -4261341 -6809447 -9077408 -10543217 -9713636 -6987987 -4040844
41564d040844K543663K120287Q88225q94420j619179q51202K83036J050496J481439
$$ -4040844 -1497181 623106 1511331 616911 -1002268 -1853470 -1570434 -519938 961501
41555I61501J664612K244381L742899M030119m3634o302627p333504q18758N291511
$$ 961501 2626113 4870494 8613393 12643512 12599878 6297251 -1036253 -1855011 3436500
41546C436500L454796k447466l789627o51591J27028k367848k257746J670681
$$ 3436500 6891296 4443830 654203 2612 129640 -2238208 -4495954 -2825273
41538b825273L351533O6632k787872o10565L610097M842296K902327N40064j048916
$$ -2825273 526260 592892 -2194980 -2805545 804552 5646848 8549175 9089239 8040323
41529H040323j983689k248304k299454k429982j234215K016448M179651J946952
$$ 8040323 6056634 3808330 1508876 -921106 -2155321 -138873 4040778 5987730
41521E987730j961482j783159K340893M414508J890606j333618k034687j451695
$$ 5987730 4026248 2243089 4583982 8998490 10889096 9555478 7520791 6069096
41513F069096p94939O76563J679978n58067m236842m095738k72926J112404j651713
$$ 6069096 5274157 5950720 7630698 7072631 2835789 -1259949 -1532875 -420471 -2072184
41504b072184k705793J034054M355019K860337j5367j92855O8329j830027k610675
$$ -2072184 -4777977 -3743923 611096 3471433 3456066 3263211 3331540 1501513 -1109162
41495a109162N69173L605280K098538q32581k97213J869486J435535l15275m08733
$$ -1109162 -539989 3065291 5163829 4331248 4034035 5903521 7339056 7023781 6615048
41486F615048j001894m295755n480632k3494O179588M341764k547285l871357
$$ 6615048 5613154 1317399 -4163233 -4186727 1992861 6334625 3787340 -84017
41478h4017J407798L734040n63584m074910k117997k426j946397l339041k11143
$$ -84017 1323781 5057821 4494237 419327 -1698670 -1701096 -3647493 -6986534 -7197677
41469g197677K718900P28670j827161P77482M935902L488614k062616m127193
$$ -7197677 -4478777 -3750107 -5577268 -4799786 136116 3624730 1562114 -2565079
41461b565079j353480M47121j107615j914485K58614K122474J854971K836753
$$ -2565079 -3918559 -3471438 -4579053 -6493538 -6234924 -4112450 -2257479 579274
41453E79274O652641Q091962K446710n903586q305486l807298k10833k456425
$$ 579274 7231915 15323877 17770587 11867001 3561515 -245783 -456616 -2913041
41445b913041n741875l369817K909427N503779J980736k277219k758421j521727
$$ -2913041 -8654916 -12024733 -9115306 -3611527 -1630791 -3908010 -6666431 -8188158
41437h188158j755706j589906K113421O881921P068440K260103j856369j469508
$$ -8188158 -9943864 -11533770 -9420349 -2538428 4530012 6790115 4933746 3464238
41429C464238R38332J349288l92279j740095j164545R87559L091151K519712k123547
$$ 3464238 4402570 5751858 5359579 3619484 2454939 3442498 6533649 9053361 6929814
41420F929814p719440q342246k190789N484472Q319572N544315Q83008k680512
$$ 6929814 -789626 -9131872 -11322661 -5838189 2481383 8025698 8908706 6228194
41412F228194m302230l573798q68838J540479J690344O91881P72833J380425J39988
$$ 6228194 1925964 -1647834 -2516672 -976193 714151 1406032 2178865 3559290 3699278
41403C699278k796705m521871l610202j641466j41240J033380J649577O54464
$$ 3699278 902573 -3619298 -7229500 -8870966 -9012206 -7978826 -6329249 -5674785
41395e674785r99104l61861K662540L685959J62882l346627o64809O464804R355197
$$ -5674785 -6673889 -7035750 -4373210 -687251 -524369 -3870996 -4535805 1928999 11284196
41386A1284196L604740n140117q619297n410146j75586L257077M096825K043420
$$ 11284196 14888936 9748819 1129522 -4280624 -4456210 -1199133 2897692 4941112
41378D941112k490941n883422l830496K307425N596774K048902m033362n657184
$$ 4941112 2450171 -3433251 -7263747 -4956322 640452 2689354 -1344008 -7001192
41370g001192j609862L324218M624725J730731k872691n328108k577934L934184
$$ -7001192 -8611054 -5286836 -662111 1068620 -1804071 -7132179 -9710113 -5775929
41362e775929P884040M934199r40988k221241J425362K423136l364432r973651
$$ -5775929 2108111 7042310 6101322 3880081 5305443 7728579 4364147 -5609504
41354e609504r496474k712070L227378N099216N887088P362695O418259R79887
$$ -5609504 -15105978 -17818048 -14590670 -9491454 -3604366 3758329 10176588 11156475
41346A1156475m887922n612209j670460J391882Q19502m39930M94984J618828
$$ 11156475 6268553 656344 -1014116 377766 1197268 757338 1252322 2871150
41338B871150j93302l251377l150993j3741J195810j350091k907600K92943M269261
$$ 2871150 2677848 -573529 -3724522 -3738263 -2542453 -3892544 -6800144 -6507201 -2237940
41329b237940K865700k554102m759531j079896L643990M825090L087508K85068
$$ -2237940 627760 -1926342 -6685873 -7765769 -4121779 703311 3790819 4075887
41321D075887l431246o090565l414428M031037Q303903L999052l288374m407980
$$ 4075887 644641 -5445924 -8860352 -4829315 3474588 7473640 4185266 -222714
41313b22714M54703L173412L55258k828970j904751Q23624J598426Q07702J96737
$$ -222714 231989 3405401 3760659 931689 -973062 -149438 1448988 2256690 2453427
41304B453427q96523k969391l544780p60912K551247K047353k097085n349900
$$ 2453427 1556904 -1412487 -4957267 -5718179 -3166932 -1119579 -3216664 -8566564
41296h566564m403083l19794L423592M266209K328988J37454J14202J648387J785451
$$ -8566564 -12969647 -13289441 -9865849 -5599640 -3270652 -3133198 -3018996 -1370609 414842
41287D14842m19990k085665o79848J732111J132263k219642l370680M59347N098793
$$ 414842 -5148 -2090813 -2770661 -1038550 93713 -2125929 -5496609 -5037262 61531
41278F1531M163804k090073n963077k065077M857685N762364j52760m329661j585614
$$ 61531 4225335 2135262 -3827815 -5892892 -1035207 4727157 4574397 244736 -1340878
41269a340878K414415Q23038l090037j816936K945857K419168m284716p548223
$$ -1340878 1073537 1896575 -1193462 -3010398 -64541 2354627 -1930089 -9478312
41261i478312k072820N154008O315828L724427K998774K657373j311046n822169
$$ -9478312 -11551132 -6397124 -81296 3643131 6641905 9299278 7988232 2166063
41253B166063m775230K03269J917939q85276k496038m35485J309114J71194j113351
$$ 2166063 -2609167 -2405898 -487959 -1373235 -3869273 -4304758 -2995644 -2824450 -3937801
41244c937801l74442M37358j77626m00219Q81260J657977N52101r11394j454102
$$ -3937801 -4312243 -3874885 -4052511 -4452730 -3571470 -1913493 -1361392 -2272786 -3726888
41235c726888j689732j356760R59201L920704L616727m21976l450781j974927
$$ -3726888 -5416620 -6773380 -5814179 -1893475 1723252 1301276 -2149505 -4124432
41227d124432J545550K552732j00783m040727n814739k767843L902933P836954
$$ -4124432 -2578882 -26150 -126933 -4167660 -9982399 -12750242 -8847309 -1010355
41219a010355M062651k993195m262764N64119K455383j868889l969819J709339
$$ -1010355 3052296 59101 -4203663 -3639544 -1184161 -3053050 -7022869 -5313530
41211e313530P059315L186633l983606k900669M121145M503239l289193o869799
$$ -5313530 1745785 4932418 948812 -1951857 2169288 6672527 3383334 -3486465
41203c486465o35424N025539J488756l809403p11084N770908L703748n150094
$$ -3486465 -4121889 903650 2392406 -1416997 -2128081 3642827 7346575 2196481
41195B196481p171901J379332Q173560L958083l899057l995787K063626M559162
$$ 2196481 -4975420 -3596088 4577472 8535555 4636498 640711 2704337 7263499
41187G263499J611603m96382k05716k538577p522280p767403j172391L793653
$$ 7263499 8875102 8378720 8173004 5634427 -1887853 -9655256 -10827647 -7033994
41179g033994J292233k025694J814492Q257502P433792L69975l195573r25250
$$ -7033994 -5741761 -7767455 -5952963 2304539 9738331 10108306 6912733 5987483
41171E987483j21103l570278m770010l08441L395571P86298l818103l733139K11088
$$ 5987483 5866380 2296102 -2473908 -2782349 613222 1399520 -2418583 -6151722 -5940634
41162e940634L005253L176475J899517o39478l173780k526625P95401J615366
$$ -5940634 -2935381 241094 2140611 1501133 -1672647 -4199272 -3403871 -1788505
41154a788505j036636p84763M866013P827328J862758n395162l151435N116679
$$ -1788505 -2825141 -3609904 1256109 9083437 10946195 5551033 2399598 7516277
41146G516277O745200m54999o015377m030990m95965j144237k712735o89500K641775
$$ 7516277 14261477 13806478 7791101 3760111 3264146 2119909 -592826 -1282326 1359449
41137A359449K980580Q29194r02827j587723j707939p84835R08095J843818J939887
$$ 1359449 4340029 5169223 4266396 2678673 970734 185899 1093994 2937812 4877699
41128D877699K275915J591769k378076p318242p298830j041471N423932O252179
$$ 4877699 7153614 8745383 6367307 -950935 -8249765 -9291236 -3867304 2384875
41120B384875K008391k859756m850887k865789J165738K729429j13286k636084
$$ 2384875 4393266 1533510 -3317377 -6183166 -5017428 -2287999 -2401285 -5037369
41112e037369K96224N083675L668311l339552o405427j418687M546386M800982
$$ -5037369 -4741145 342530 4010841 671289 -5734138 -7152825 -2606439 2194543
41104B194543J818875L01682n08383k502839l752050l032008k797559l012462
$$ 2194543 4013418 4315100 3806717 1303878 -2448172 -5480180 -8277739 -11290201
41096a1290201O89702P580592Q900046J191650n686319k516452M819587N021384
$$ -11290201 -10600499 -3019907 5880139 7071789 1385470 -1130982 3688605 8709989
41088H709989q66665l047339K09222J899488J29732O1009K279334J088414m321561
$$ 8709989 7843324 4795985 5005207 6904695 7034427 7095436 9374770 10463184 6141623
41079F141623p725529o646451n139604l939952J399728R327348J0310402J526555
$$ 6141623 -1583906 -8230357 -13369961 -17309913 -15910185 -6582837 3727565 5254120
41071E254120o304611l812800L542769M819821l87810m166102l626849k630821
$$ 5254120 -1050491 -4863291 -1320522 3499299 3111489 -1054613 -4681462 -7312283
41063g312283k685033j058796K347007L729858J811034k85190m95624l01517r36752
$$ -7312283 -9997316 -11056112 -8709105 -4979247 -3168213 -3453403 -3949027 -4250544 -5187296
41054e187296j540365j954181l133764l724849n88553N399426Q203324M310123
$$ -5187296 -6727661 -8681842 -11815606 -15540455 -16129008 -10729582 -2526258 1783865
41046A783865j564581k312829J806654L693435k51227m771748l208239K723456
$$ 1783865 219284 -2093545 -286891 3406544 3155317 -1616431 -4824670 -2101214
41038b101214M826794l29102o407535n524735J664312P356083O400566J108532
$$ -2101214 2725580 2396478 -4011057 -9535792 -7871480 -515397 5885169 6993701
41030F993701l169107l642918r46862K286113K927103L27158j731891N41307M207730
$$ 6993701 3824594 181676 -765186 1520927 4448030 4775188 3043297 3584604 7792334
41021G792334K205358n458853r019446k027993P917305Q393358q39582q068312
$$ 7792334 9997692 4538839 -4480607 -6508600 1408705 9802063 8962481 894169
41013H94169o181414m83089J865992J940864L888720O110928M179963j045345
$$ 894169 -5287245 -5770334 -3904342 -1963478 1925242 8036170 12216133 11170788
41005A1170788m664930n201205m904917l804035K39702N270322N373180o59283
$$ 11170788 6505858 1304653 -3600264 -7404299 -7164597 -1894275 3478905 2819622
40997B819622n888072l936742K328337M747561N81365m638859m703337k6800L698001
$$ 2819622 -3068450 -7005192 -4676855 70706 652071 -3986788 -8690125 -8716925 -5018924
40988e018924K533809j497853l307443q63569K876449M245497L104393J461781
$$ -5018924 -2485115 -3982968 -7290411 -8153980 -5277531 -1032034 2072359 3534140
40980C534140m5280j664473k153616m47225J234996L5129k214969j096702K679922
$$ 3534140 3488860 1824387 -329229 -776454 458542 493671 -1721298 -2818000 -138078
40971a38078L285086q60838l691982q35492L170962J937633k857251m579380j878026
$$ -138078 3147008 2286170 -1405812 -2241304 929658 2867291 10040 -4569340 -6447366
40962f447366M89209r0247r24606O01726L207922M207883K631338n67217l096829
$$ -6447366 -5958157 -6048404 -6973010 -6371284 -3163362 1044521 3675859 3108642 11813
40953A1813k637186K45981J814101K26443j218721P94078L650997K498645j843243
$$ 11813 -2625373 -2379392 -565291 -338848 -1557569 -763491 2887506 5386151 3542908
40944C542908l792598j195915K218146K570561j03973l460231m916805k650551
$$ 3542908 -249690 -1445605 772541 3343102 3239129 -221102 -5137907 -7788458
40936g788458K081340M720054K896869J55883L18415J178922q58002l226502j406180
$$ -7788458 -5707118 -987064 1909805 2065688 2384103 3563025 2705023 -521479 -1927659
40927a927659K056170J237375k159589j059289M177445N568483J238132j414437
$$ -1927659 128511 1365886 -793703 -1852992 2324453 7892936 9131068 7716631
40919G716631R78129K028920k284446n897114l146137J831439K913593J395008
$$ 7716631 8694760 10723680 8439234 2542120 -604017 1227422 4141015 5536023
40911E536023O45857j165821n378977o774168j665527L918083L064007l78883
$$ 5536023 6181880 5016059 -362918 -7137086 -8802613 -4884530 -1820523 -2199406
40903b199406J222369N169011K550673n756426r021823l311121K671060J559441
$$ -2199406 -977037 4191974 6742647 986221 -8035602 -11346723 -8675663 -7116222
40895g116222k099496n83186M476700N268329L23110l203299l84778L873083J864577
$$ -7116222 -9215718 -9798904 -5322204 -53875 269235 -2934064 -3318842 554241 2418818
40886B418818m993168p064093k57136P246527O373907L0881k420711K12369J013643
$$ 2418818 -2574350 -9638443 -9895579 -2649052 3724855 3755736 1335025 1547394 2561037
40877B561037j998949l207276l82989J943377J952662L087767M767435J683092
$$ 2561037 562088 -2645188 -3028177 -1084800 867862 3955629 8723064 10406156
40869A0406156m332848m022154K891435M362328l944480r396746k986408M840867
$$ 10406156 6073308 2051154 4942589 9304917 5360437 -4036309 -7022717 -2181850
40861b181850J909385m957196k780537M624606M532599j648460k233564K829058
$$ -2181850 -272465 -5229661 -8010198 -3385592 1147007 -501453 -2735017 94041
40853I4041L085579k041620k945403Q83574R26n576675m622196M592089R542046
$$ 94041 3179620 1138000 -1807403 -923829 -922903 -6499578 -11121774 -6529685 3012361
40844C012361M243301j651524n58975J624950r67161l384206r33500J235532j634110
$$ 3012361 7255662 5604138 5045163 6670113 5702952 2318746 1385246 2620778 986668
40835I86668m561184k157441J765981J706068n39208j308451j761425k868314
$$ 986668 -3574516 -5731957 -3965976 -2259908 -2799116 -4107567 -5868992 -8737306
40827h737306j374596L323615N679738K682706j263335k422593k588579k261927
$$ -8737306 -10111902 -6788287 -1108549 1574157 310822 -2111771 -4700350 -6962277
40819f962277J373341N720031L216411m419264m890001M777527J0331519J956074
$$ -6962277 -5588936 131095 3347506 -1071758 -5961759 -1184232 9147287 11103361
40811A1103361r120518q209718M5044J548297l274238k355254N775091R513699
$$ 11103361 1982843 -6226875 -6181831 -4633534 -7907772 -10263026 -4487935 5025764
40803E025764L582801l518038l603118Q48766L307415J821662j563722m141096
$$ 5025764 8608565 5090527 1487409 2336175 5643590 7465252 5901530 1760434
40795A760434l806400j038116P11499k23652r40266O56700J709955J8266j154715
$$ 1760434 -2045966 -3084082 -2372583 -2596235 -3536501 -2879801 -1169846 -1151580 -2306295
40786b306295N77142R55185l428515p015496k914632N342023Q323928M145355
$$ -2306295 -1729153 -773968 -4202483 -11217979 -14132611 -8790588 -466660 3678695
40778C678695q60909k519859j848508K33537L355297M355023P17660m025944m708703
$$ 3678695 2817786 297927 -1550581 -1317044 2038253 6393276 7110936 3084992 -1623711
40769a623711k252852q13533j89375K075068M173370L004509O19346K75024m05495
$$ -1623711 -3876563 -4690096 -4879471 -2804403 1368967 4373476 4992822 5267846 4862351
40760D862351m229546o423942j456030N582439N312644m76162j438281M059420
$$ 4862351 632805 -5791137 -7247167 -1664728 3647916 3171754 1733473 5792893
40752E792893O540985J514435l899587l575990j031745j034813j591960L40429
$$ 5792893 12333878 13848313 9948726 6372736 5340991 4306178 2714218 3054647
40744C054647K127584j1493m296029n656561k046166L893551P447489N725214
$$ 3054647 5182231 5170738 874709 -4781852 -6828018 -2934467 4513022 10238236
40736A0238236J002857j267311q9313p01038m830215n235192K687216R940257
$$ 10238236 11241093 9973782 9884469 9183431 4353216 -881976 1805240 11745497
40728A1745497N290427o586690j0819956m103277K594803K714690J355726K044147
$$ 11745497 17035924 10449234 -370722 -4473999 -1879196 835494 2191220 4235367
40720D235367N99742l539712l321545K684444N361046K39441m022223m62158L832888
$$ 4235367 4835109 1295397 -2026148 658296 6019342 6258783 2236560 1774402 5607290
40711E607290P5018o818975o483821r49L144784P96211m34721K337855M420348
$$ 5607290 5682308 -1136667 -7620488 -7621437 -4476653 -3680442 -4115163 -1777308 2643040
40702B643040K557738j93716l06029R65758J87185l248909o092445m786056m21718
$$ 2643040 5200778 5007062 4701033 5666791 5853976 2605067 -3487378 -8273434 -8695152
40693h695152J073020l359122p605245l440277O618900J1070194N399039k004913
$$ -8695152 -7622132 -10981254 -18586499 -22026776 -15407876 -4337682 1061357 -943556
40685i43556k996545k37493J98657j309261j755737k150934l362094j549725M811165
$$ -943556 -3940101 -4177594 -3978937 -5288198 -7043935 -9194869 -12556963 -14106688 -9295523
40676i295523Q993667N113696j708659k707505J169531K249823o64617j647856
$$ -9295523 -301856 4811840 3103181 395676 1565207 3815030 3150413 1502557
40668A502557J199797L110519J342735j308396k398511k600715k076885j38079
$$ 1502557 2702354 5812873 7155608 5847212 3448701 847986 -1228899 -1366978
40660a366978J250581m38431k698330p98962L550676L323055k607519o392121
$$ -1366978 -116397 -554828 -3253158 -4052120 -501444 2821611 214092 -6178029
40652f178029k449450M267677N635164J517214j602034o37835Q33969p50498l462201
$$ -6178029 -8627479 -4359802 1275362 2792576 1190542 552707 1386676 636178 -2826023
40643b826023l116265L77141K823565J670030p12644j014091K81298Q61719J218332
$$ -2826023 -5942288 -5565147 -2741582 -1071552 -1784196 -2798287 -2516989 -1655270 -436938
40634d36938L177190M909970K662517k214256l642949J14184L404701J856968
$$ -436938 2740252 7650222 10312739 8098483 4455534 4569718 7974419 9831387
40626I831387j503239k466069k377174l586864l167792K108037P720289N710957
$$ 9831387 8328148 5862079 3484905 -101959 -3269751 -1161714 6558575 12269532
40618A2269532l744619j1381304j0014325j984218N178617O707472L419983n20759
$$ 12269532 8524913 -2856391 -12870716 -14854934 -9676317 -2968845 451138 -69621
40610f9621j641749j58967J089233P98246L56364M64767r3543j012199K54044
$$ -69621 -1711370 -1870337 -781104 17142 373506 838273 744730 -267469 -13425
40601a3425L566339M621361J310880k526971k972355j436219o73677N4692J714724
$$ -13425 3552914 8174275 9485155 6958184 3985829 2549610 1875933 1930625 3645349
40592C645349K080274J73949p29595N83806l91343n297692p081633p14355O344387
$$ 3645349 5725623 5899572 5169977 5753783 5362440 64748 -7016885 -7731240 -1386853
40583a386853M418950k601955l466870J835756K968320k196279m069389J353245
$$ -1386853 3032097 430142 -3036728 -1200972 1767348 -428931 -4498320 -3145075
40575c145075N262009J243335m061920k582150K362699K836613j191802l943648
$$ -3145075 2116934 3360269 -701651 -3283801 -921102 1915511 723709 -3219939
40567c219939l214762n96840L321424P310898O875895J05256o568645n193784
$$ -3219939 -6434701 -7031541 -3710117 3600781 10476676 10581932 4013287 -1180497
40559a180497K505541O867544K935926l997649o341413l389497l66069m99466
$$ -1180497 1325044 8192588 11128514 7130865 789452 -2600045 -2966114 -3465580
40551c465580r76681K186909O887057O260886j270357p670961n480412J297207
$$ -3465580 -4442261 -2255352 4631705 10892591 9622234 1951273 -3529139 -2231932
40543b231932L199170l12228j298283K368116L608517n74523l100537O11410L881171
$$ -2231932 967238 655010 -643273 1724843 5333360 4758837 1658300 2269710 6150881
40534F150881K33046m709005k325627M294382N445358N19001k521387j276252
$$ 6150881 6383927 1674922 -650705 3643677 9089035 9608036 7086649 5810397
40526E810397j040605k760652n15115O063620P555445j252619j1336331j0826164
$$ 5810397 4769792 2009140 1494025 7557645 15113090 13860471 2524140 -8302024
40518h302024j189249N689709L842053r58799j439623J920118M167171L622053
$$ -8302024 -9491273 -3801564 40489 -918310 -2357933 -437815 3729356 7351409
40510G351409K486533J803135j41706l937073o502151m427330J269262N779488
$$ 7351409 9837942 11641077 11499371 7562298 1060147 -3367183 -2097921 3681567
40502C681567N849891K876702M12485J04602Q13422P22366m71461j253862l82299
$$ 3681567 9531458 12408160 12820645 12925247 13738669 14461035 13989574 12735712 12353413
40493A2353413N25343j799906o807028q186855j383526Q152546R726957J232011
$$ 12353413 12878756 11078850 4271822 -3915033 -5298559 2853987 12580944 13812955
40485A3812955p461494p348526j081915K870488J861796m75769j698977k262771
$$ 13812955 6351461 -997065 -2078980 791508 2653304 2177535 478558 -1784213
40477a784213j799372K71145J428923r73826m003659k161350L778031O724390
$$ -1784213 -3583585 -3312440 -1883517 -2857343 -6861002 -9022352 -5244321 1480069
40469A480069L156770k250365l646227j062171J576573J595708j165860m754184
$$ 1480069 4636839 2386474 -1259753 -2321924 -745351 850357 -315503 -5069687
40461e069687n289613m08260O179474P631528K905628j787123k140319r60225
$$ -5069687 -10359300 -10767560 -4588086 3043442 5949070 4161947 2021628 1061403
40453A061403j492383j526238J295599L674575K039505o15113J96047K181630
$$ 1061403 -430980 -1957218 -661619 3012956 5052461 4437348 4633395 6815025
40445F815025L80233l356714l212752M5005L55639k297680j554665L180909M490009
$$ 6815025 7195258 3838544 625792 670797 1026436 -1271244 -2825909 355000 4845009
40436D845009L5949k233628K601135P271995L805813l877005p415931p027398
$$ 4845009 4880958 2647330 5248465 12520460 16326273 12449268 5033337 -1994061
40428a994061p188780n438694K572123J0764963Q639295j430216o059494j001385
$$ -1994061 -9182841 -14621535 -12049412 -1284449 7354846 5924630 -134864 -1136249
40420a136249L721204J686797m48989K846061N057783j85754o358773m160806
$$ -1136249 2584955 4271752 3822763 6668824 11726607 11540853 5182080 1021274
40412A021274L131107N437202J578595j642982k083956l101513m241036j721114
$$ 1021274 4152381 9589583 11168178 9525196 7441240 4339727 98691 -1622423
40404a622423K753120L388135J70436j593471j059949j957620l282689j1335N982818
$$ -1622423 1130697 4518832 4689268 3095797 2035848 78228 -3204461 -3215796 2767022
40395B767022O151697j060671o615148m516495J35929J031408j95755P7129M07674
$$ 2767022 8918719 7858048 1242900 -3273595 -3137666 -2106258 -2302013 -2224884 -1817210
40386a817210p89691l55532L209983M771225O23999m110045l055732J434702K996505
$$ -1817210 -2606901 -2962433 247550 5018775 5642774 1532729 -1523003 -88301 2908204
40377B908204J590656J647522L246953K683015k78791k423218k788985k661374
$$ 2908204 4498860 6146382 9393335 12076350 11797559 9374341 6585356 3923982
40369C923982j776807J66390N98542j926943l544122n60481L795524M205023J720078
$$ 3923982 2147175 2313565 2912107 985164 -2558958 -3119439 676085 4881108 6601186
40360F601186O77516L98811k272172m998556l287627K54040n20192l735014j812297
$$ 6601186 7278702 7677513 5405341 406785 -2880842 -2626802 -3146994 -6882008 -8694305
40351h694305M700385O684280J531356k510089n51394J276911k259396n940181
$$ -8694305 -3993920 2690360 4221716 1711627 1160233 2437144 177748 -5762433
40343e762433l518771J695040L561349L373702M949684N396789J67752o669321
$$ -5762433 -9281204 -7586164 -4024815 -651113 4298571 9695360 9863112 3193791
40335C193791o730908P0354N689001N613716K606902m44488l549145n221782k682827
$$ 3193791 -3537117 -3466763 2222238 7835954 10442856 9998368 6449223 1227441 -1455386
40326a455386K051393K947968j078088l889092j303113K901680L372520R06404
$$ -1455386 596007 3543975 2465887 -1423205 -2726318 175362 3547882 4454286
40318D454286j41582J217414K394086J904643O00450o96404j840241k328384j972095
$$ 4454286 4312704 5530118 7924204 9828847 10429297 9732893 7892652 5564268 3592173
40309C592173j954581l090081l669177j361435K912652N343814L931897Q06188
$$ 3592173 1637592 -1452489 -5121666 -6483101 -3570449 1773365 5705262 6511450
40301F511450j050587j526851k123170k305853J07809M599124O725455L314782
$$ 6511450 5460863 3934012 1810842 -495011 -387202 4211922 10937377 14252159
40293A4252159k603032m820943j747564J618861M80338l484197m757934j437854
$$ 14252159 11649127 6828184 5080620 6699481 7179819 3695622 -1062312 -2500166
40285b500166K662740L306397Q25772j226124q53105O61721J353563J074941P24170
$$ -2500166 162574 3468971 4294743 3068619 2215514 2877235 4230798 5305739 6029909
40276F029909L64623m24437j070374p52383l39113j286772k480895j172916K027538
$$ 6029909 6394532 5970095 4899721 4147338 3808225 2521453 40558 -1132358 895180
40267H95180K812508J9341j362343J944392M659771L04861p213449p597395L64049
$$ 895180 3707688 3727029 2364686 4309078 8968849 9273710 2060261 -5537134 -5173085
40258e173085O158259K881082l334850m094248j310869j734940m492151l052260
$$ -5173085 985174 3866256 531406 -3562842 -4873711 -6608651 -11100802 -14153062
40250a4153062K822616N959659K846416j600545k009391O13733K379255K251093
$$ -14153062 -11330446 -5370787 -2524371 -4124916 -6134307 -5520574 -3141319 -890226
40242h90226J530733P35017m17363j629852k300517k148554j085562M16865J142035
$$ -890226 640507 1375524 958161 -671691 -2972208 -5120762 -6206324 -5789459 -4647424
40233d647424Q22011J222180L477088N295985L499781j223100m789766m563453
$$ -4647424 -3825413 -2603233 873855 6169840 9669621 8446521 3656755 -906698
40225i06698j356586K507732M510109K644082j903570m139784j137456K949299
$$ -906698 -2263284 244448 4754557 7398639 5495069 1355285 217829 3167128
40217C167128K325759j479964j983113J661388L536997J254103l53097J408062
$$ 3167128 5492887 4012923 2029810 3691198 7228195 8482298 8129201 9537263
40209I537263J600112l498405q371658n822304J446419M011353j046076o522816
$$ 9537263 11137375 7638970 -732688 -6554992 -5108573 -1097220 -2143296 -8666112
40201h666112n070323J980729P134301N435864m80563l415301N3412M809770L395401
$$ -8666112 -13736435 -11755706 -4621405 814459 333896 -3081405 -3027993 1781777 5177178
40192E177178l264653o236148j391908M168749K940404j380606k31404N514778
$$ 5177178 1912525 -4323623 -5715531 -1546782 1393622 13016 -218388 5296390
40184E296390O449733o21859p486341o443297m35728K702188J056625j095186
$$ 5296390 11746123 11124264 3637923 -2805374 -3241102 -538914 517711 -577475
40176e77475q08708O43723J469404J748041J495165n33491m186222n809350j793651
$$ -577475 -1386183 -742460 726944 2474985 3970150 3436659 -749563 -6558913 -8352564
40167h352564N426082Q104309K506568m898462m943027J716798N510428J971283
$$ -8352564 -2926482 5177827 7684395 2785933 -2157094 -440296 5070132 7041415
40159G041415k375271j386534R49444j434333n063961k378689M724391O859159
$$ 7041415 4666144 3279610 4229054 2794721 -2269240 -4647929 76462 6935621
40151F935621J788105k832701k373637j178645k688656k870598J416115N186889
$$ 6935621 8723726 5891025 3517388 2338743 -349913 -3220511 -1804396 3382493
40143C382493K902364k381161m006710j577786O45283J736134L694338N324856
$$ 3382493 6284857 3903696 -103014 -1680800 -1035517 700617 4394955 9719811
40135I719811L378967j020749l229943k262196j597993k540651k179176Q34170
$$ 9719811 13098778 12078029 8848086 6585890 4987897 2447246 268070 1102240
40127A102240L319342K398230m28584k089128j833095m49531J592267L069439
$$ 1102240 4421582 6819812 6391228 4302100 2469005 2019474 3611741 6681180
40119F681180J591043k991435o412672m293162J858076N715491L701074q06265
$$ 6681180 8272223 5280788 -1131884 -5425046 -3566970 2148521 5849595 5043330
40111E043330k134875N11872K877707K172683P49829J717496L356439J337405
$$ 5043330 2908455 3420327 6298034 8470717 9220546 10938042 14294481 15631886
40103A5631886m082216o994137l415472L041869N483419J901979l449404n695952
$$ 15631886 11549670 4555533 1140061 4181930 9665349 11567328 8117924 2421972
40095B421972l819815q0049K507745J969630j229828m045504l664325r00499O90120
$$ 2421972 -1397843 -1477892 1029853 2999483 1769655 -2275849 -5940174 -6840673 -6150553
40086f150553m60184j833743n68747K317850L487298K257521J359460K334385
$$ -6150553 -6610737 -8444480 -9013227 -6695377 -3208079 -950558 408902 2743287
40078B743287L088717J847722Q13937K455480M070664J065199m709814o025230
$$ 2743287 5832004 7679726 8493663 10949143 15019807 16085006 11375192 5349962
40070E349962j390179J527742k274942o320615k522685N118187N875903j046975
$$ 5349962 3959783 5487525 3212583 -3108032 -5630717 -512530 5363373 4316398
40062D316398n434197j946581L068962L346777J717274K503279L145464l9806
$$ 4316398 -1117799 -3064380 4582 3351359 5068633 7571912 10717376 10677570
40054A0677570l937041l533960m41793K08255j643512j663750J578473N093638
$$ 10677570 6740529 3206569 2764776 2973031 1329519 -334231 1244242 6337880
40046F337880N770693K673888k653856n625102k272472L870286M176768k241307
$$ 6337880 12108573 14782461 12128605 6503503 4231031 8101317 12278085 10036778
40038A0036778n463901j1076N492032K496138k362995J271518P876063L776059
$$ 10036778 4572877 4561801 10053833 12549971 10186976 11458494 19334557 23110616
40030B3110616q790053j2968405l799856M043599J12289o470592m119093K648356
$$ 23110616 14320563 1352158 -2447698 1595901 1708190 -4762402 -8881495 -6233139
40022f233139L169874j208954j536602K902683N245108L602224K184175K150103
$$ -6233139 -3063265 -4272219 -5808821 -2906138 2338970 5941194 8125369 10275472
40014A0275472P43573j746018k313338j634509k971694n473630n082312j419009
$$ 10275472 11019045 9273027 6959689 5325180 2353486 -3120144 -8202456 -9621465
40006i621465K134467M269836N947627N956133K324853k535299l943168j790848
$$ -9621465 -7486998 -3217162 2730465 8686598 11011451 8476152 4532984 2742136
39998B742136Q9510O56718K092723M062200L484926J73421k702423l793129m056998
$$ 2742136 2831646 3488364 5581087 9643287 13128213 13301634 10599211 6806082 2749084
39989B749084k732624J148305L778715K93759o017650o052677J556231P147694
$$ 2749084 16460 1164765 4943480 5237239 -780411 -6833088 -5276857 1870837
39981A870837L939929k207469k327356K576195M828647K245486m78791n90593
$$ 1870837 5810766 3603297 1275941 3852136 8680783 10926269 10447478 9856885
39973I856885l61023j340160j620422k06768O72080l13566q93262P83695K272255
$$ 9856885 9495862 8155702 6535280 6328512 7000592 6687026 5793764 6577459 8849714
39964H849714L18979l355511l690509K14159L260890J851589n93247N21282K602609
$$ 8849714 9168693 5813182 2122673 2336832 5597722 7449311 6856064 7377346 9979955
39955I979955m49008p086841q473079k126989K964764J24451l737370R34931R838650
$$ 9979955 9530947 2444106 -6028973 -8155962 -5191198 -5066747 -8804117 -7869186 1969464
39946A969464J0386793J302952n552672l682113o8688j199391k705691M01022
$$ 1969464 12356257 13659209 8106537 4424424 4355736 3156345 450654 851676
39938H51676L286679J15542m443262k813532J974376J543065k538799q46048P075572
$$ 851676 4138355 4253897 -189365 -3002897 -1028521 514544 -2024255 -2870303 4205269
39929D205269J0107932K554371o782060p575762j744326J992072J011755q09103
$$ 4205269 14313201 16867572 10085512 2509750 765424 2757496 3769251 2960148
39921B960148j445078k117435k204148M95295M483152N210390J968362n61042
$$ 2960148 1515070 -602365 -2806513 -2311218 2171934 7382324 9350686 8789644
39913H789644O74106K525604P00216l591567n464080l329705l67725R19247J937123
$$ 8789644 9463750 11989354 12689570 9098003 3633923 304218 -63507 855740 2792863
39904B792863M141088M991464J266385m671547o062250m10199O321528O715327
$$ 2792863 6933951 11925415 13191800 8520253 2458003 2047804 8369332 15084659
39896A5084659J005207l956675l770643q63612N76791L78808Q66287J901128Q09976
$$ 15084659 16089866 12133191 8362548 7498936 8075727 8454535 9320822 11221950 12031926
39887A2031926k838303n277442l024148K048158M349315J418280k932799l558596
$$ 12031926 9193623 3916181 892033 2940191 7289506 8707786 5774987 2216391
39879B216391l91056K327217K252590J290197J489006J886525R37952p07892j928289
$$ 2216391 1825335 4152552 6405142 7695339 9184345 11070870 12008822 11300930 9372641
39870I372641l185801m478165l675109m5592K685642P91353l267638l510436J143367
$$ 9372641 6186840 1708675 -1966434 -2012026 673616 1464969 -1802669 -5313105 -4169738
39861d169738N589111N902875L471919R08262j474577l235781k257844J494805
$$ -4169738 1419373 7322248 10794167 11702429 10227852 6992071 4734227 6229032
39853F229032M103829K697975l68225j249316O5349J263305K047400L277644L650729
$$ 6229032 10332861 13030836 12662611 11413295 11478644 12741949 14789349 18066993 21717722
39844B1717722J284653k207978k867644N18997N181432P950128Q082124P525720
$$ 21717722 23002375 20794397 17926753 18445750 23627182 31577310 39659434 47185154
39836D7185154J0126722J8109405K6313659K3237989L666809k1084383l2367199
$$ 47185154 57311876 75421281 101734940 124972929 128639738 107555355 75188156
39829G5188156k4667645j0763654m528923n205347l313660L272233O767537K017492
$$ 75188156 50520511 39756857 35227934 30022587 26708927 29981160 36748697 38766189
39821C8766189n254375n541424K461972J0397349J0182869K624775n166966q817330
$$ 38766189 33511814 27970390 30432362 40829711 51012580 53637355 48470389 39653059
39813C9653059r666717r008462m625893L608586R232583O426550o07376k666440
$$ 39653059 29986342 20977880 16351987 19960573 29193156 35619706 35012330 32345890
39805C2345890Q18369J366589m177352p939161l768351K733182L509056N32636
$$ 32345890 33164259 34530848 30353496 22414335 18645984 21379166 24888222 25420858
39797B5420858P48509L516235K589207j932449l329293K68897K983859J051203
$$ 25420858 26169367 29685602 32274809 30342360 27013067 27281964 30265823 31317026
39789C1317026k143497k909815k234252j483448M58439K846249J889543k612316
$$ 31317026 29173529 26263714 24029462 22546014 23004453 25850702 27740245 25127929
39781B5127929m990303j997515J823625J611396L2847J893955N005949L616545
$$ 25127929 20137626 18140111 19963736 21575132 21607979 23501934 28507883 32124428
39773C2124428j097767j685646L945569Q531814N747604r30062l785650j662620
$$ 32124428 31026661 29341015 33286584 41818398 47566002 46635940 42850290 41187670
39765D1187670P0317j033905j014690L063056P707424R376453J2041496K0986253
$$ 41187670 41257987 40224082 39209392 42272448 49979872 59356325 71397821 92384074
39757I2384074L0200127K5315695K743367k2050800l1613729k5700365j6246675
$$ 92384074 122584201 147899896 150643263 128592463 96978734 71278369 55031694
39750E5031694r509130l694412j39992l408949r896478r176167J26412P157486
$$ 55031694 45522564 41828152 41688160 38279211 28382733 19206566 19332978 26490464
39742B6490464N504602J727051J991446J952787k390273m950966o54760L508081
$$ 26490464 31995066 33722117 35713563 37666350 35276077 30325111 29670351 33178432
39734C3178432J39686m323889k06518P665171P913852L350762O729386J7206187
$$ 33178432 33318118 28994229 28787711 36452882 44366734 47717496 54446882 71653069
39726G1653069J8845315N766215p086752m465030J0566250K5025769L1649060
$$ 71653069 90498384 96264599 89177847 84712817 95279067 120304836 151953896
39719A51953896K8652978J4132132r482034l1202859l9959935l4462400k0978914
$$ 151953896 180606874 194739006 185256972 154054113 114094178 79631778 58652864
39712E8652864o642641J875388N57821n898841o830527O52267P541302P107069
$$ 58652864 52010223 53885611 54443432 48544591 41714064 42366331 49907633 57014702
39704E7014702M436138N357407N511349L7715m458425P7941P361901M865300n544761
$$ 57014702 61450840 66808247 72319596 72357311 67898886 67976827 75338728 80204028 74659267
39695G4659267r443592j975425O126150P321134Q484802J6840573K5286315K1063793
$$ 74659267 65215675 63240250 69366400 76687534 85172336 102012909 127299224 148363017
39687A48363017L676921j4150330k1499273j9224904j5267228j4410455j4306672
$$ 148363017 152039938 137889608 116390335 97165431 81898203 67487748 53181076
39680E3181076j0451128l319399J646415J552398p3837M54036R20030j668937
$$ 53181076 42729948 39410549 41056964 42609362 42535525 42989561 43909591 42240654
39672D2240654l460886J564227J0809512J4704059R454876R37334n102307r265421
$$ 42240654 38779768 40343995 51153507 65857566 75312442 76249776 71147469 61882048
39664F1882048j2802507j3153390r157920m905446m031339m575019l338602j351975
$$ 61882048 49079541 35926151 26768231 21862785 17831446 13256427 9917825 8565850
39656H565850j207641k380461k761936k023941o09643J706723L836944L232921
$$ 8565850 7358209 4977748 2215812 191871 -417772 1288951 5125895 8358816
39648H358816J08005j663135k12001J502751R22342k72886k93043n99807j750316
$$ 8358816 8466821 6803686 6591685 8094436 9016778 8743892 8450849 7851042 6100726
39639F100726o96370L469496N690248K096535k940544k691181K072142N029758
$$ 6100726 5404356 8873852 14564100 16660635 13720091 11028910 13101052 18130810
39631A8130810L787132J507291P65288J305706K546725L279443O79057n155365
$$ 18130810 21917942 23425233 24190521 25496227 28042952 31322395 32001452 26846087
39623B6846087q019348l251682L583934L237971l199837n563882m75019L484009
$$ 26846087 18826739 15575057 19158991 22396962 19197125 13633243 13158224 16642233
39615A6642233l24627o205539n434045N27624L289911L32966k683250j390989
$$ 16642233 16317606 10112067 4678022 5205646 8495557 8828523 6145273 4754284
39607D754284J681407K116556N1370o57578J946381N117536M623169R8444m156194
$$ 4754284 6435691 8552247 8603617 7946039 9892420 15009956 19633125 19731569 15575375
39598A5575375m402383j889082l54716q28174j730549k670426m202287m532883
$$ 15575375 11172992 9283910 8929194 8101020 6370471 3700045 -502242 -5035125
39590e035125j166456L843587N213809K218967J54803J923370L293834O6891m534292
$$ -5035125 -6201581 -2357994 2855815 5074782 5229585 7152955 10446789 10513680 5979388
39581E979388m476405j0127L004685J563802j366432k073048o20806N35451r4903
$$ 5979388 1502983 1492856 4497541 6061343 4694911 2621863 2001057 2536508 2441605
39572B441605j885920k986181k114642lJ555038K207396L064582L775336K147036
$$ 2441605 555685 -2430496 -4545138 -4545141 -2990103 -782707 2281875 6057211 8204247
39563H204247k082119n626821n531261k388333J731376N603033P350667M468762
$$ 8204247 6122128 495307 -5035954 -7424287 -5692911 -89878 7260789 11729551
39555A1729551j613461m733356j806741J979250O46378l125900k253941L210666
$$ 11729551 10116090 5382734 3575993 5555243 6201621 3075721 821780 4032446
39547D032446O044312K922740j745676l940843m813887n202360k396808L702953
$$ 4032446 10076758 12999498 11253822 7312979 2499092 -2703268 -5100076 -1397123
39539a397123P077781L319620l299299n586740l033573n12396m9620L18364R23708
$$ -1397123 5680658 9000278 5700979 114239 -2919334 -3431730 -3481350 -3162986 -2239278
39530b239278j69464j971558m58643M589093P336959L361592l867163p198063
$$ -2239278 -2408742 -4380300 -4838943 -249850 7087109 10448701 6581538 -616525
39522f16525m478619K29996K941388L580028L238936J226332k829621o057918
$$ -616525 -5095144 -4865148 -1923760 1656268 4895204 6121536 3291915 -2766003
39514b766003m902515m37731K105484L49326j600847Q76636N505094N694503J10824
$$ -2766003 -7668518 -8106249 -6000765 -5651439 -7252286 -6375650 -870556 4823947 4934771
39505D934771m850082l740977P25631K375067P03241O53299L875285N286223N50709
$$ 4934771 84689 -3656288 -2930657 -555590 147651 800950 4676235 9962458 10513167
39496A0513167o601506q515940l876466N16735o79809l874619j968251M965973
$$ 10513167 3911661 -4604279 -8480745 -7964010 -8643819 -12518438 -14486689 -9520716
39488i520716R220250N968463m04577k767285k87852K521661L082391K520820
$$ -9520716 -300466 5667997 5263420 2496135 2208283 4729944 7812335 10333155
39480A0333155J434623j193447m457165n136223k146981J733419L627507L247025
$$ 10333155 11767778 10574331 6117166 980943 -1166038 567381 4194888 7441913
39472G441913J280872j542683k981647o75285L574182M759332J651687j301095
$$ 7441913 8722785 7180102 4198455 3523170 7097352 11856684 13508371 12207276
39464A2207276j252930j322526m153836o050709k951774J607890J258215k708434
$$ 12207276 10954346 9631820 5477984 -572725 -3524499 -1916609 -658394 -3366828
39456c366828k973590K106900N848323L683260n01374j410123p1789l93562k043319
$$ -3366828 -6340418 -4233518 1614805 5298065 4796691 3386568 3314779 2921217 877898
39447H77898j547506J516958L681717K503219o03668k562543j928070J47625J413294
$$ 877898 -669608 847350 4529067 7032286 6428618 3866075 1938005 2085630 3498924
39438C498924R89878K04809L69468O77855Q1711K14504L466705Q459595J0834062
$$ 3498924 4488802 4693611 5063079 5740934 5822645 6037149 9503854 17963449 28797511
39429B8797511Q770660M276243j022037o845688j0509935q023184j258119J824791
$$ 28797511 37568171 41844414 40822377 33976689 23466754 15443570 14185451 16010242
39421A6010242k115299o358140m205467R05418J781073q25399j084686O85207
$$ 16010242 13894943 7536803 3331336 4236754 6017827 5192428 4107742 4792949
39413D792949o81792l926839j916267N151278P498707P61246o084660l951283
$$ 4792949 4111157 184318 -1731949 3419329 10918036 11679282 5594622 1643339
39405A643339K824893L949688j290601m673139k342010J085677J217399o42424
$$ 1643339 4468232 8417920 7127319 2454180 112170 1197847 2415246 1772822
39397A772822j695718j625947r46244L01821J016466k58996k325174k216135M53537
$$ 1772822 77104 -1548843 -2495087 -2193266 -1176800 -1435796 -3760970 -5977105 -5523568
39388e523568L050602L870441L372902J816873o30702j750727M10418L056307
$$ -5523568 -2472966 1397475 4770377 6587250 5956548 4205821 4616239 7672546
39380G672546J421104l338563m570591j28770L842702K181911j674215j740816
$$ 7672546 9093650 5755087 1184496 1055726 4898428 7080339 5406124 3665308
39372C665308J330718K474142N30018j258516j321509j065242r23479J92279J781695
$$ 3665308 4996026 7470168 8000186 6741670 5420161 4354919 3431440 3623719 5405414
39363E405414K144428J665829K117059L157997L164583K856623M103157N750885
$$ 5405414 7549842 9215671 11332730 14490727 17655310 20511933 24615090 30365975
39355C0365975N137223L344838L730504M967782J561656o976556j3428598j2478428
$$ 30365975 35503198 38848036 42578540 47546322 49107978 42131422 28702824 16224396
39347A6224396p716889n020195l910763r91941K010655P22184l141411k977918
$$ 16224396 8507507 3487312 -423451 -1415392 595263 1317447 -1823964 -4801882
39339d801882K183672N226288J463653m143921m295936K76380K721269J47145
$$ -4801882 -2618210 2608078 4071731 -72190 -4368126 -4091746 -1370477 -1223332
39331a223332l361668l491033r01441J357554K043846J544417J65205j285922
$$ -1223332 -4585000 -8076033 -8977474 -7619920 -5576074 -4031657 -3866452 -5152374
39323e152374j124655Q17616J874711j62722l610149n046528l824382j819547
$$ -5152374 -6277029 -5459413 -3584702 -3747424 -7357573 -12404101 -16228483 -18048030
39315a8048030K69696K993123M945195L457895p96249l576364k664998k94649
$$ -18048030 -17778334 -14785211 -9840016 -6382121 -7178370 -10754734 -13419732 -13714381
39307a3714381J151442J954555K070336M3269k477184l81784O436867R369053
$$ -13714381 -12562939 -10608384 -8538048 -8494779 -10971963 -11353747 -4916880 4452173
39299D452173K116316q429463r980487j406660O649047P038170L398006J110326
$$ 4452173 6568489 -1860974 -11841461 -13248121 -6599074 439096 3837102 4947428
39291D947428l27313k513219l096421l07964K772122K975906J762683J301099
$$ 4947428 4620115 2106896 -989525 -1297489 1474633 4450539 6213222 7514321
39283G514321K63249k359383l622230j481376O76922n88693k460135n15686L269733
$$ 7514321 7777570 5418187 1795957 314581 991503 402810 -2057325 -2573011 696722
39274F96722L335432n25047l179061k216972j89687J015506K499116M365105M197853
$$ 696722 4032154 3507107 328046 -1888926 -2078613 -1063107 1436009 5801114 9998967
39265I998967Q66086l572197o627804p309499n259471r44684L247047M866764
$$ 9998967 10865053 7292856 665052 -6644447 -11903918 -12848602 -9601555 -4734791
39257d734791M217150K979054J148126j715028l709463k892666j073535j091751
$$ -4734791 -517641 2461413 3609539 1894511 -1814952 -4707618 -5781153 -6872904
39249f872904j614178L99665L133377J853461k598681l776166N61125M875264
$$ -6872904 -8487082 -8087417 -4954040 -3100579 -5699260 -9475426 -8914301 -4039037
39241d039037M463073J835126J278629K197384J769396J12881j112887j871346
$$ -4039037 424036 2259162 3537791 5735175 7504571 7617452 6504565 4633219
39233D633219k062123j58994K995997K897109j879551n389874k075342M226137
$$ 4633219 2571096 2412102 5408099 8305208 6425657 1035783 -1039559 3186578
39225C186578N216346K38496l368642j766219N39210q46619l163136j778779J758130
$$ 3186578 8402924 8641420 5272778 3506559 4045769 3199150 36014 -1742765 15365
39216A5365J924284k142501m813183j488793N066610P897255M318618r98879k199268
$$ 15365 1939649 -202852 -5016035 -6504828 -1438218 6459037 10777655 9778776 7579508
39207G579508K52478P87645k815145n815379l411152J826572L344321o2156l007613
$$ 7579508 7831986 8619631 5804486 -10893 -3422045 -1595473 1748848 1686692 -1320921
39198a320921j797963Q57953J267780N13960J295752K226941Q9946l552999l281381
$$ -1320921 -3118884 -2260931 -993151 -479191 816561 3043502 3133448 -419551 -3700932
39189c700932J834775N528579K650597l151040l921852J854689P059246M976953
$$ -3700932 -1866157 3662422 6313019 3161979 -759873 1094816 8154062 13131015
39181A3131015k658373q320932p392661k031224K832448M903155N045619M009074
$$ 13131015 10472642 2151710 -5240951 -7272175 -4439727 463428 5509047 9518121
39173I518121R64651l988289p629230o256900m92583M728063N694204L507015
$$ 9518121 10482772 6494483 -1134747 -7391647 -7884230 -3156167 2538037 6045052
39165F045052J242249l7537p16844o27996k72158j722572m955681n524069k95535
$$ 6045052 7287301 7249764 6532920 5904924 5632766 3910194 -1045487 -6569556 -6865091
39156f865091O272638P072827K614029k7669J386162J282602l381178p426424
$$ -6865091 -592453 6480374 9094403 9066734 10452896 11735498 8354320 927896
39148I27896o050794k269571n62763P10655M116190N829015J464216m597933m414957
$$ 927896 -5122898 -7392469 -7955232 -7244577 -3128387 2700628 4164844 -433089 -4848046
39139d848046J034058L368200K32626j689847J650908N357283M101654J47530
$$ -4848046 -3813988 -445788 -213162 -1903009 -252101 5105182 9206836 9354366
39131I354366j376964k62709K26943o25448o76452Q45318K043247J121663j186847
$$ 9354366 7977402 7714693 7941636 7316188 6639736 7485054 9528301 10649964 9463117
39122I463117k223883l73278K631923L532371J934795M99768Q239j768025m151077
$$ 9463117 7239234 6865956 9497879 13030250 14965045 15464813 15473052 13705027 9553950
39113I553950j865750O090059J1133380N720709m569221p888447k519337K684532
$$ 9553950 7688200 13778259 24911639 30632348 26063127 18174680 15655343 18339875
39105A8339875K863939K118102L483299M151724L075519M086648Q018062R806973
$$ 18339875 21203814 23321916 26805215 30956939 34032458 38119106 46137168 55944141
39097E5944141O925452L173681Q93611k763547q280600j0593799p756960n029493
$$ 55944141 62869593 66043274 66936885 64173338 55892738 45298939 37541979 32512486
39089C2512486n800124o211205l600009k076232m023089m291134M83636M651374
$$ 32512486 26712362 20501157 16901148 14824916 10801827 6510693 6994329 11645703
39081A1645703K957115l56186L21557K191413R60414L3827K985665M031305k511811
$$ 11645703 14602818 14246632 14568189 16759602 17720016 17753843 20739508 24770813 22259002
39072B2259002r331752n674266M386681O994410j79019n498330k347336K801892
$$ 22259002 12927250 7252984 11639665 18634075 18455056 12956726 10609390 13411282
39064A3411282L436829J970273J975519J879034Q06867K017581O060875P781770
$$ 13411282 16848111 18818384 20793903 22672937 23479804 25497385 31558260 39340030
39056C9340030M125783j289696m401511n369229m639254r62734L916712N067041
$$ 39340030 43465813 42176117 37774606 32405377 27766123 26803389 30720101 35787142
39048C5787142J885993q6689K490204O494767Q654192R631707R297619M940160
$$ 35787142 37673135 37586446 40076650 46571417 55225609 64857316 74154935 79095095
39040G9095095k442025o929890o587371o759636j0303954j1846118p305429k055533
$$ 79095095 76653070 69723180 63135809 56376173 46072219 34226101 26920672 24865139
39032B4865139k476318n339433l819372N17043Q32596k659736l042038J199732
$$ 24865139 22388821 17049388 13230016 13747059 14579655 11919919 8877881 10077613
39024A0077613L558082N11724k980386k221391k31360j750722m793143m035520
$$ 10077613 13635695 14147419 11167033 8945642 8714282 6963560 2170417 -1865103
39016a865103M4386J585003j429428m000400j799207K649535M505199L665570
$$ -1865103 -1820717 -235714 -1665142 -5665542 -7464749 -4815214 -310015 3355555
39008C355555L038659K354922q14458m819791m788963m51442K800092K339439
$$ 3355555 6394214 8749136 7934678 3114887 -1674076 -2125518 674574 3014013
39000C014013J722101L075618K661101j703561n126364l291677p069m17151j837505
$$ 3014013 4736114 7811732 10472833 8769272 3642908 351231 344162 -72989 -1910494
38991a910494P96724M726148L555854j439818l454118j447991m9118L1066J741474
$$ -1910494 -1113770 3612378 7168232 5728414 2274296 826305 777187 808253 2549727
38982B549727L314108O56187k758306J71186O390449N434647k697958o047309
$$ 2549727 5863835 6520022 3761716 3932902 10323351 15757998 13060040 7012731
38974G012731m51882L424945j202531n576911j345651M454988J771866n176993
$$ 7012731 6560849 9985794 8783263 3206352 1860701 6315689 8087555 2910562
38966B910562n601355K28665L659009K664377K026100K331000M57011j628813
$$ 2910562 -2690793 -2462128 1196881 3861258 5887358 8218358 8675369 7046556
38958G046556L28668L213568N06316n377437n607436M53199M001801J214044j599448
$$ 7046556 7375224 10588792 11095108 5717671 110235 563434 4565235 5779279 4179831
38949D179831J56511K020560p73650n012371n030056j066892K380874K700528
$$ 4179831 4336342 6356902 5583252 570881 -4459175 -5526067 -3145193 -444665
38941d44665L33711k907014m256785j865724J922077K387502r45318l051678n66059
$$ -444665 -110954 -3017968 -7274753 -9140477 -7218400 -4830898 -5776216 -8827894 -9393953
38932i393953L337681L678524N03423j770118l23525K978952L977299O81748m306948
$$ -9393953 -6056272 -2377748 -1874325 -3644443 -3967968 -989016 2988283 3670031 -636917
38923f36917n939373k117960L592749N917570L795996P04697l15089n586j173515
$$ -636917 -6576290 -8694250 -5101501 816069 4612065 5316762 5001673 4996087 3822572
38914C822572m766554p887549o088575J093631P631331P026378P93003l145343
$$ 3822572 -943982 -8831531 -14920106 -13826475 -6195144 831234 1624237 -1521106
38906a521106j208790J878565J708671N57473J315638J288931k080989m526109
$$ -1521106 -2729896 -851331 857340 1414813 2730451 4019382 1938393 -2587716
38898b587716j133048M654669N798366K464986J84734l08098k608211n404644
$$ -2587716 -3720764 933905 6732271 9197257 9381991 9073893 6465682 1061038
38890A061038l351050K298317L439209k101786o141342k271963M857419P033281
$$ 1061038 -2290012 8305 3447514 1345728 -4795614 -7067577 -2210158 4823123
38882D823123L533341k46880j152382o24374j099986l366815n978748n897780
$$ 4823123 8356464 8109584 6957202 6332828 5232842 1866027 -4112721 -10010501
38874a0010501j811932K966614M099637K415975K094688L087063J469581k071993
$$ -10010501 -11822433 -8855819 -4756182 -2340207 -245519 2841544 4311125 2239132
38866B239132j615370L512294N291305j102208q608780p930713q52883L355683
$$ 2239132 623762 4136056 9427361 8325153 -283627 -8214340 -9067223 -5711540
38858e711540J558310r19473k15505J314883J031272M32257J372357K216832N59686
$$ -5711540 -4153230 -5072703 -5288208 -3973325 -2942053 -2509796 -1137439 1079393 1639079
38849A639079k673103m222491k540902O37700K347723J294424j134876k512026
$$ 1639079 -1034024 -5256515 -7797417 -7159717 -4811994 -3517570 -4652446 -7164472
38841g164472j843134r2662J365599J837098J155498q9829l11096J330385L053325
$$ -7164472 -9007606 -9100268 -7734669 -5897571 -4742073 -4831902 -5142998 -3812613 -759288
38832g59288K529570P29698P39285K356159J627656k627128n671681l179944K306960
$$ -759288 1770282 2499980 3239265 5595424 7223080 4595952 -1075729 -4255673 -1948713
38823a948713M882410L094545L21744j251427k619242m075369l663634p94969
$$ -1948713 2933697 6028242 6349986 5098559 2479317 -1596052 -5259686 -6054655
38815f054655J821577J748446J90845p2670J332927K400213J964919J010800P14673
$$ -6054655 -4233078 -2484632 -2293787 -2366457 -1033530 1366683 3331602 4342402 5057075
38806E057075P22535R1243r14867j032163L8772Q15263j91591k319346l267314
$$ 5057075 5779610 5870853 4955986 3923823 3962595 4777858 4586267 2266921 -1000393
38797a000393j871549M77274J682152J419334P45962k35701k474013n184664n102907
$$ -1000393 -2871942 -2394668 -712516 706818 1452780 1217079 -1256934 -6441598 -11544505
38788a1544505o13336M742059N976180L478787K309387M060009M204043P7729
$$ -11544505 -12157841 -7415782 -1439602 2039185 4348572 8408581 12612624 12690353
38780A2690353l519199j535303K618648K171301j915358k872611K1336O12608
$$ 12690353 9171154 7635851 10254499 12425800 10510442 7637831 7659167 8271775
38772H271775k163720j280133N718592J0224697M921497m698368q454549n516219
$$ 8271775 6108055 4827922 10546514 20771211 25692708 20994340 12539791 7023572
38764G023572k674805k849819l154707j710763O63616L516913N598323L401812
$$ 7023572 4348767 1498948 -1655759 -3366522 -2702906 814007 6412330 9814142
38756I814142l190603p327222m020319J190065K66549m312015l950189J415777
$$ 9814142 6623539 -703683 -4724002 -3533937 -3267388 -7579403 -11529592 -10113815
38748a0113815L810457J342539N40701L612555M390876k20339m673872m420945
$$ -10113815 -6303358 -4960819 -4420118 -807563 3583313 3362974 -1310898 -5731843
38740e731843k438738k097961j423063J239863K924505J693962L18058O33183
$$ -5731843 -8170581 -10268542 -11691605 -10451742 -7527237 -5833275 -5515217 -4882034
38732d882034L85842j094865o06838K342184L479098J547166Q79646K710081J921579
$$ -4882034 -4496192 -5591057 -6197895 -3855711 -376613 1170553 2050199 4760280 6681859
38723F681859l077384n540247j178054M079194L697835O12702M35766J392256
$$ 6681859 3604475 -1935772 -3113826 965368 4663203 5275905 5711671 7103927
38715G103927q57224m083423l613969j019087o35678j468031k50761J360995L69026
$$ 7103927 6246703 2163280 -1450689 -2469776 -3105454 -4573485 -4824246 -3463251 -3094225
38706c094225o43996J959570N041438L432250q53899k319726j611021k848625
$$ -3094225 -3738221 -1778651 3262787 6695037 5841138 3521412 1910391 -938234
38698i38234m381693j464552M027568N868639L815437K491831J697654k170544
$$ -938234 -5319927 -6784479 -2756911 3111728 6927165 9418996 11116650 8946106
38690H946106o224772l712291L053907L767409l590627q389818l248967N330279
$$ 8946106 2721334 -990957 2062950 5830359 2239732 -6150086 -9399053 -4068774
38682d068774P417988K832841j720368k485139l65182K420541L139187N4549l976944
$$ -4068774 3349214 6182055 4461687 1976548 1611366 4031907 7171094 7225643 3248699
38673C248699l863924k21660P20006k560682l451226K107881Q215226P575473
$$ 3248699 -615225 -836885 -116879 -2677561 -6128787 -4020906 4194320 11769793
38665A1769793J921081k009727k448495k373617k643341j623155J57840M13258
$$ 11769793 13690874 11681147 9232652 6859035 4215694 2592539 2750379 3163637
38657C163637p81987j477888j446801j768889k016295j045657O12895J867608
$$ 3163637 2381650 903762 -543039 -2311928 -4328223 -5373880 -4760985 -2893377
38649b893377K968390L781076K350039j793182n056256l971812j96518K062406
$$ -2893377 75013 3856089 6206128 4412946 -643310 -4615122 -4811640 -2749234
38641b749234J872476J236579O74558n93780j110691J484292N438487N590633
$$ -2749234 -876758 359821 1034379 440599 -670092 814200 6252687 11843320
38633A1843320L84366n187277n464600p87839L378514K720195j753245n171051
$$ 11843320 12227686 7040409 1575809 787970 4166484 6886679 5133434 -37617
38625c7617l872883O25731L025337L54157m075678m440436K83327N024374N149264
$$ -37617 -3910500 -3284769 -259432 94725 -3980953 -8421389 -8138062 -3113688 2035576
38616B035576K009564L01945J470135K342338K03202l444793n419210n080187
$$ 2035576 4045140 4347085 5817220 8159558 8362760 4917967 -501243 -5581430
38608e581430l873952k024216J408411N432553P100467N176503J341459k562404
$$ -5581430 -9455382 -11479598 -10071187 -4638634 2461833 7638336 8979795 6417391
38600F417391n479644n223945j72383N755687N299736j816119o454834k812236
$$ 6417391 937747 -4286198 -4458581 1297106 6596842 4780723 -1674111 -4486347
38592d486347K285325R4982n274538l142165N314416P275201j614272r452330
$$ -4486347 -2201022 -2106040 -7380578 -10522743 -5208327 2066874 452602 -8999728
38584h999728n561709M322580P841930L502639l13148Q02979L093667K445863
$$ -8999728 -14561437 -10238857 -2396927 1105712 792564 1595543 4689210 7135073
38576G135073o91023l796428m743032k427993J389058K423141o45671l428783
$$ 7135073 6444050 2647622 -2095410 -4523403 -3134345 -711204 -1356875 -4785658
38568d785658k103297P70715J076629K28851J775303L996544K632869j026724
$$ -4785658 -6888955 -6118240 -5041611 -4812760 -3037457 959087 3591956 2565232
38560B565232j952521j37594q7891j882783p57073L337267L914897j438340n955858
$$ 2565232 612711 475117 387226 -1495557 -2252630 1084637 4999534 3561194 -2394664
38551b394664l382727L113636O326792M469664N66707l302676n937890m647092
$$ -2394664 -5777391 -2663755 3663037 8132701 8699408 5396732 -541158 -5188250
38543e188250J288187O763033N905315M6040m115294l640494j877503j869000
$$ -5188250 -3900063 2862970 8768285 8814325 4699031 1058537 -818966 -2687966
38535b687966k126808m15688K128771K917707J531910n70743k295411l096436
$$ -2687966 -4814774 -5230462 -3101691 -183984 1347926 777183 -1518228 -4614664
38527d614664k226091K88496K473958K000044q31320k965127k090788O77427K647026
$$ -4614664 -6840755 -6552259 -4078301 -2078257 -2909577 -5874704 -7965492 -7288065 -4641039
38518d641039L282551M095982M769430K393705l465257p762877n869451q20406
$$ -4641039 -1358488 2737494 7506924 9900629 6435372 -1327505 -7196956 -8017362
38510h017362L12072l025216l903694R70766N614786M141395k8452l46177J884078
$$ -8017362 -7705290 -10730506 -14634200 -13663434 -8048648 -3907253 -3935705 -4281882 -2397804
38501b397804M25860m309594n315044r02585K021879o48586l119077J141175Q661037
$$ -2397804 -1971944 -6281538 -11596582 -12499167 -10477288 -11125874 -14244951 -13103776 -4442739
38492d442739J0359652L717735m775558p912746m327058K165054O176644M468303
$$ -4442739 5916913 9634648 4859090 -3053656 -7380714 -5215660 960984 5429287
38484E429287r27786l978413j385107L214815M164503J092548j789710k003161
$$ 5429287 4501501 523088 -862019 2352796 6517299 7609847 5820137 3816976
38476C816976o23738J154183L097931L637093M59711n598256j0108738r580245
$$ 3816976 3193238 4347421 7445352 11082445 11542156 5943900 -4164838 -13745083
38468a3745083m722217R53112M086536L432222Q58110l9108J921585L764036K667672
$$ -13745083 -18467300 -17514188 -13427652 -9995430 -9137320 -9176428 -7254843 -3490807 -823135
38459h23135J99921n59622m0644m60612r00434J049244L778066L216322k15624
$$ -823135 -623214 -1182836 -1223480 -1684092 -2584526 -1535282 2242784 5459106 5243482
38450E243482j757274q8966N00360k760554o731308p015344k985186L203061Q638730
$$ 5243482 3486208 3397242 3897602 1137048 -5594260 -12609604 -15594790 -12391729 -3752999
38441c752999R853434N428251p94149l628999l708828n135769o547211k539358
$$ -3752999 6100435 11528686 10734537 7105538 3396710 -1739059 -8286270 -10825628
38433a0825628N164167P552628K315467j987526l93482M13482m504212p594379
$$ -10825628 -5661461 1891167 4206634 2219108 1825626 2239108 -2265104 -9859483
38425i859483j517139O618412O024897Q9824k90428M006913K986336l133032l501554
$$ -9859483 -11376622 -4758210 1266687 1356511 1066083 5072996 8059332 4926300 1424746
38416A424746L651420O729398P3399o752125n003128L88330J397270l87043j8192
$$ 1424746 5076166 11805564 11878963 5126838 123710 512040 1909310 1522267 1504075
38407A504075Q10557j009773k033332J364042M450289J153381m846207n137188
$$ 1504075 2314632 1304859 -728473 635569 5085858 6239239 1393032 -3744156
38399c744156L72539M051613K214088j745828m495343n523843l709932J479361
$$ -3744156 -3371617 679996 2894084 1148256 -3347087 -8870930 -12580862 -11101501
38391a1101501N642753L486847k434799m058162J53977K774108o98847m660412
$$ -11101501 -5458748 -1971901 -4406700 -8464862 -8310885 -5536777 -6235624 -10896036
38383a0896036k460975L111780M440934Q38738r45546K550475O251751M050031
$$ -10896036 -13357011 -10245231 -5804297 -4965559 -5911105 -3360630 2891121 6941152
38375F941152k425247n868213k560244L539206O036330L124334j543169l543796
$$ 6941152 4515905 -1352308 -3912552 -373346 5662984 8787318 7244149 3700353
38367C700353k068372j54693j100766m266847m969569k25654N881711N870287
$$ 3700353 1631981 1477288 376522 -3890325 -8859894 -9085548 -3203837 2666450
38359B666450j124186o878118m350484L056861O517379L373215j158409k215873
$$ 2666450 1542264 -5335854 -9686338 -6629477 -112098 3261117 2102708 -113165
38351a13165m3596K811163M148664K267650j975324l890633n90656L209634J034509
$$ -113165 -156761 2654402 6803066 9070716 7095392 3204759 2614103 5823737 6858246
38342F858246m668142n289217K15717L180488q21249m923874k536042K220390
$$ 6858246 2190104 -3099113 -2883396 297092 -524157 -5448031 -7984073 -5763683
38334e763683K147042j498200k560299l06488J399264J863836L105638L911552
$$ -5763683 -3616641 -5114841 -7675140 -7981628 -6582364 -4718528 -1612890 2298662
38326B298662J477541k285524k694341P449R75445j195018k475866l50101K184771
$$ 2298662 3776203 1490679 -1203662 -1196213 -220768 -1415786 -3891652 -4241753 -2056982
38317b056982J376675j863708l273396m69476M194723N829655K426098k422411
$$ -2056982 -680307 -2544015 -5817411 -6286887 -2092164 3737491 6163589 3741178
38309C741178m073948l183670l629335m746250j942224L766226M706825j138827
$$ 3741178 -332770 -3516440 -7145775 -11892025 -13834249 -10068023 -5361198 -6500025
38301f500025m840973J58705O859223N369024j308926k582115K530460M935361
$$ -6500025 -11340998 -11182293 -4323070 1045954 -262972 -2845087 -314627 4620734
38293D620734R41407l039546k355750n92624j480085k755481j607916L51815Q93540
$$ 4620734 5562141 2522595 166845 -425779 -1905864 -4661345 -6269261 -5917446 -5023906
38284e023906Q06550J256306J784087K234776K563874P88141l938133p078311
$$ -5023906 -4217356 -2961050 -1176963 1057813 3621687 4409828 471695 -6606616
38276f606616l820757K432190M125101J451459J312296M253403L055498l380758
$$ -6606616 -10427373 -7995183 -3870082 -2418623 -1106327 3147076 6202574 2821816
38268B821816o052608n91610M699629K390503k098239n61611M086584L848796
$$ 2821816 -3230792 -3822402 877227 3267730 1169491 607880 4694464 8543260
38260H543260n26099k130720k02649L28710j018374l65224J732822R09615k041416
$$ 8543260 8017161 5886441 5683792 6012502 4994128 4628904 6361726 7271341 5229925
38251E229925j718748J923249K662463j529746n019865l782461r77711k74320
$$ 5229925 3511177 5434426 8096889 6567143 1547278 -2235183 -3212894 -3487214
38243c487214j2259K176931M182201L099253L26550q92513k21693O24858R58807
$$ -3487214 -3499473 -1322542 2859659 5958912 6285462 5392949 5171256 5796114 6754921
38234F754921O04085j176254l630660l950525j435403M26203r03338k494553m63816
$$ 6754921 7359006 6182752 2552092 -1398433 -2833836 -2407633 -3310971 -5805524 -6269340
38225f269340L225980L292881n69195l082627j361304J498308K175942J765750
$$ -6269340 -3043360 249521 -319674 -3402301 -4763605 -3265297 -1089355 676395
38217F76395K216833K354433Q47601l91915J77753j61117l754165o745298m081924
$$ 676395 2893228 5247661 6095262 5703347 5881100 5719983 1965818 -4779480 -8861404
38208h861404J365432K201647j217484p43512N250487P225870l59107q220390
$$ -8861404 -7495972 -5294325 -6511809 -7255321 -2004834 5221036 4861929 -3358461
38200c358461n432804L185442M049580m162946q607042j860974P776281R122895
$$ -3358461 -8791265 -5605823 -1556243 -5719189 -14326231 -16187205 -8410924 711971
38192G11971K511197l503449l698876K17641L507836K533739j991832m549693
$$ 711971 3223168 -280281 -3979157 -3761516 -253680 2280059 288227 -4261466
38184d261466j258616L471351K435202k552373k442631M147997P426489J750759
$$ -4261466 -5520082 -2048731 386471 -2165902 -4608533 -460536 6965953 8716712
38176H716712n058820m051903J589795L459726J092698n32388j013380k763018
$$ 8716712 3657892 -394011 1195784 4655510 5748208 5215820 4202440 1439422
38168A439422l554781k41218L360904J621836k590925k298812J177997N69721
$$ 1439422 -2115359 -2356577 1004327 2626163 35238 -2263574 -1085577 -515856
38160e15856l748923l681830K246841N503028J387691l632655k739487J514330
$$ -515856 -4264779 -7946609 -5699768 -196740 1190951 -2441704 -5181191 -3666861
38152c666861L327678K512300J847278J122154q38089k292334j336485O33722
$$ -3666861 -339183 2173117 4020395 5142549 4304460 2012126 675641 1309363
38144A309363J681155K329848K941961J682741j856425m335317k965294O61601
$$ 1309363 2990518 5320366 8262327 9945068 8088643 3753326 788032 1449633
38136A449633L344662L993481K855473L87497j547599j054464j7175k129535n986677
$$ 1449633 4794295 8787776 11643249 12030746 10483147 9428683 9411508 7281973 1295296
38127A295296n793551r45919J618990j903145n711613l472516K089229M549599
$$ 1295296 -4498255 -5444174 -3825184 -5728329 -11439942 -14912458 -12823229 -8273630
38119h273630L568739K693758J702397j548377m715245l869138q63843o48111
$$ -8273630 -4704891 -2011133 -308736 -1857113 -6572358 -10441496 -11305339 -11953450
38111a1953450k478865r57567M465667P856962N457643K32855l302706l967438
$$ -11953450 -14432315 -15389882 -10924215 -3067253 2390390 2623245 -679461 -4646899
38103d646899k677849n84828P08189N05190O08596K267252K683551j010926n464800
$$ -4646899 -7324748 -7909576 -7201387 -6696197 -6087601 -3820349 -1136798 -2147724 -7612524
38094g612524m406272J883290O231454M591227Q63161R2871J847676K588035O38418
$$ -7612524 -12018796 -10135506 -3904052 687175 1550336 1643207 3490883 6078918 6717336
38085F717336l289873p295974q506093n109122P05010M485624M467485K128976
$$ 6717336 3427463 -3868511 -12374604 -17483726 -16778716 -12293092 -7825607 -5696631
38077e696631j105899l799514k757976K985393P525218M363903k872908m004462
$$ -5696631 -6802530 -10602044 -13360020 -10374627 -2849409 1514494 -1358414 -5362876
38069e362876K499780O894386L354950j797480j861133k95648k316736m242790
$$ -5362876 -2863096 4031290 7386240 5588760 3727627 3431979 1115243 -3127547
38061c127547n00828M885391M089476j151673k395046J293524K276520k548298
$$ -3127547 -3628375 1257016 5346492 4194819 1799773 3093297 5369817 2821519
38053B821519p073447o009289j562579K150376M456905N247876K770082k428411
$$ 2821519 -4251928 -10261217 -11823796 -9673420 -5216515 31361 2801443 373032
38045C73032n825641m236903K55323L519864L727651J510424j197087j786689
$$ 373032 -5452609 -9689512 -9434189 -5914325 -2186674 -676250 -1873337 -3660026
38037c660026N50864K736649J293008k391626l919845k419497q72213l92060P72173
$$ -3660026 -3109162 -372513 920495 -1471131 -5390976 -7810473 -8682686 -9074746 -8302573
38028h302573K474025K276615M27738l3656J168447J268653K76367J010805K563742
$$ -8302573 -5828548 -3551933 -3124195 -3157851 -1989404 -720751 -444384 566421 3130163
38019C130163P49436l314063k932959K823527N714626J068106l944603j451606
$$ 3130163 3879599 565536 -2367423 456104 6170730 7238836 3294233 1842627
38011A842627M417522M172404k454093p269617o191048k744931m01503R01287
$$ 1842627 6260149 10432553 7978460 708843 -5482205 -8227136 -8628639 -7727352
38003g727352R32592j211080l280085j635039K554547M101430J365864j746464
$$ -7727352 -6794760 -8005840 -11285925 -12920964 -10366417 -6264987 -4899123 -6645587
37995f645587j882362J45091K369939M042762M357877K672073N19117N52K75697
$$ -6645587 -8527949 -8382858 -6012919 -1970157 2387720 5059793 5578910 5579462 5855159
37986E855159p41997j871586l89221K130128J088828l373382n456694k331464
$$ 5855159 5113162 3241576 2852355 4982483 6071311 2697929 -2758765 -5090229
37978e090229J448852R04655k346815l436461j319339J239351K671224L836012
$$ -5090229 -3641377 -2736722 -5083537 -8519998 -9839337 -8599986 -5928762 -2092750
37970b092750M886876M078324N36846l412522m157601j198923J589388O74846
$$ -2092750 2794126 6872450 7409296 3996774 -160827 -1359750 229638 904484
37962I04484j978588j608805J375110R88816m425559p441306j879580O622416
$$ 904484 -1074104 -2682909 -1307799 -318983 -4744542 -12185848 -14065428 -7443012
37954g443012P625012Q14595m250792k437613J477615K464079J897894J985575
$$ -7443012 182000 996595 -3254197 -5691810 -4214195 -1750116 147778 2133353
37946B133353J208304q85730r14921K046665L191925m35253m276519l147781P41379
$$ 2133353 3341657 2455927 1541006 3587671 6779596 6344343 2067824 -1079957 -338578
37937c38578J958037K64264o59590n3523j59035j292788j724167j285818j084202
$$ -338578 1619459 1883723 1224133 1170610 1011575 -281213 -2005380 -3291198 -4375400
37928d375400p69876M37180J282947J67348j986390l093091k531930n41674K397675
$$ -4375400 -5145276 -4708096 -3425149 -3257801 -5244191 -8337282 -10869212 -11410886 -9013211
37919i013211L803398P51905m228694l799157L626982R306097N892797j364246
$$ -9013211 -5209813 -4457908 -8686602 -12485759 -8858777 447320 6340117 4975871
37911D975871k710150J102981J433842k905147l906041J166382M333488q0126
$$ 4975871 2265721 3368702 4802544 1897397 -2008644 -842262 3491226 3411100
37903C411100n938360m811781J465145M612379K308252j23986J006664K770301
$$ 3411100 -2527260 -7339041 -5873896 -1261517 1046735 922749 1929413 4699714
37895D699714Q13232m113627o730475l550755K419585M543239Q76139k571192
$$ 4699714 5512946 1399319 -5331156 -8881911 -6462326 -1919087 -1042948 -3614140
37887c614140R1204N399373M923631j491450m212849J719483P913410M428115
$$ -3614140 -3522936 1876437 6800068 5308618 1095769 2815252 10728662 15156777
37879A5156777n075040q242574j862074M162757J805399m231405m731541R04170
$$ 15156777 10081737 1839163 -22911 4139846 5945245 1713840 -3017701 -2113531
37871b113531N523644M928438J563591j375053l509739m207677j507367L359327
$$ -2113531 3410113 8338551 9902142 8527089 5017350 809673 -697694 2661633
37863B661633M933112P51755l869904k796079J902559L369015O05641j055294
$$ 2661633 7594745 8346500 4476596 1680517 3583076 6952091 7557732 6502438
37855F502438P5937o00470m423022n133744R88514P241066N522482j514020m953575
$$ 6502438 6578375 5977905 1554883 -3578861 -2590347 4650719 10173201 8659181 3705606
37846C705606k949718j208434j950712j406489J417180K255212j07079r85524
$$ 3705606 755888 -452546 -2403258 -3809747 -2392567 -137355 -244434 -1229958
37838a229958J676929L208862N61668j998593m81921J607898l60075l526170k104766
$$ -1229958 446971 3655833 4217501 2218908 1736987 3344885 2984810 -541360 -2646126
37829b646126K897571N432504L608578N16769k402187n916646p849900m661252
$$ -2646126 251445 5683949 9292527 9809296 7407109 1490463 -6359437 -11020689
37821a1020689J332733L291737n1281k198786Q03443M282223K923039q50426j600721
$$ -11020689 -9687956 -6396219 -6447500 -8646286 -7842843 -3560620 -637581 -1488007 -3088728
37812c088728L14148N89931j009102o90171K174741L612859J394959j762544k482238
$$ -3088728 -2774580 -2184649 -3193751 -3883922 -1709181 1903678 3298637 1536093 -946145
37803i46145o73084J795290L242588K266874j081345l486340j357648L297843
$$ -946145 -1619229 176061 3418649 5685523 4604178 1117838 -239810 3058033
37795C058033M133238n50799m596468k842967J343120J963813k39277n69557L12528
$$ 3058033 7191271 6640472 2044004 -798963 544157 2507970 2268693 1699136 2011664
37786B011664k260110o885689n979043J975496P886812M396618l343101n183458
$$ 2011664 -248446 -7134135 -13113178 -11137682 -3250870 1145748 -2197353 -7380811
37778g380811o2241M057339K189443k241450l827867j713808J249671K162478
$$ -7380811 -7443052 -3385713 -1196270 -3437720 -7265587 -8979395 -7729724 -5567246
37770e567246N9223l123101l537144J13588L807678K995839p19145j688075J331160
$$ -5567246 -5508023 -8631124 -12168268 -12054680 -8247002 -5251163 -5970308 -7658383 -6327223
37761f327223L555385J864421p31828n65699R69442O27268p65168J84751L252736
$$ -6327223 -2771838 -907417 -1639245 -2204944 -1235502 -608234 -1373402 -1188651 2064085
37752B064085M068591L26598m517104n367613j679250K378067L378414K073208
$$ 2064085 6132676 6459274 1942170 -3425443 -5104693 -2726626 651788 2724996
37744B724996O72464q97888l370015m300288l55299N960535O971675K34875o204381
$$ 2724996 3397460 2499572 -870443 -5170731 -5526030 434505 7406180 7641055 1436674
37735A436674l835909M238806P399454K115032m354655n183260k115472j19256
$$ 1436674 -2399235 1839571 9239025 11354057 6999402 1816142 -299330 -418586
37727d18586K08229J010504J990172J216807r03829k006663j249397j14668k87663
$$ -418586 -210357 800147 2790319 4007126 3103297 1096634 -152763 -267431 -555094
37718e55094j924017l272501j770629K950002P163310O355274O17649n460649
$$ -555094 -2479111 -5751612 -7522241 -4572239 2591071 8946345 9563994 4103345
37710D103345p993832o252304r75457N568915Q441382M375812k263736l731846
$$ 4103345 -3890487 -10142791 -11118248 -5549333 2892049 7267861 5004125 1272279
37702A272279q2183Q01109l609106n574237p0468N592434K843434l948139m056038
$$ 1272279 1190096 1991205 -1617901 -7192138 -7262606 -1670172 1173262 -2774877 -6830915
37693f830915K768458O623089L341032m40729O08986K804982J234388k343477
$$ -6830915 -4062457 2560632 5901664 5460935 6069921 8874903 10109291 7765814
37685G765814l822585l354884l118990k645799o40924J544212K026223J690099
$$ 7765814 3943229 588345 -2530645 -5176444 -5817368 -4273156 -2246933 -556834
37677e56834K212301K812324J901923K44399l22963j537l46985j449307j954604
$$ -556834 1655467 4467791 6369714 6614113 6291150 6289613 5942628 4493321 2538717
37668B538717j157323N86839K586320L440032J265795l609430p135249n248625
$$ 2538717 1381394 1968233 4554553 7994585 9260380 5650950 -1484299 -6732924
37660f732924Q24622N113210L531601j425672l677959n39389M447491N686504
$$ -6732924 -5908302 -795092 2736509 1310837 -2367122 -2906511 1540980 7227484
37652G227484J615720l928605n932409l095070J274502K683946P3947k680008
$$ 7227484 8843204 4914599 -1017810 -4112880 -2838378 -154432 -80485 -2760493
37644b760493j008616L875599N117188n41310o239197k966077O928608J1247502
$$ -2760493 -3769109 106490 5223678 4682368 -1556829 -4522906 2405702 13653204
37636A3653204M588377m075692m712423O4711J494918r72837j055183J888301
$$ 13653204 18241581 14165889 9453466 9518177 11013095 10040258 8985075 10873376
37628A0873376J992266j890003l858660j443608M73848r75738j603258J483170
$$ 10873376 12865642 10975639 7116979 5673371 6147219 5171481 3568223 5051393
37620E051393L863861J338433k621364k731489m01265l97168k641023l287310
$$ 5051393 8915254 10253687 7632323 4900834 4499569 4102401 1461378 -1825932
37612a825932j535269N8916M28373N47732N73329L58440J178272L307048L888269
$$ -1825932 -3361201 -3302285 -2873912 -2326180 -1752851 -1394411 -216139 3090909 6979178
37603F979178J026236k158123j706860R93024J655602j37939j438092j704795
$$ 6979178 8005414 5847291 4140431 5133455 6789057 6651118 5213026 3508231
37595C508231k858081m255487k878891J175284L928613K912320k83729l069736
$$ 3508231 650150 -3605337 -6484228 -5308944 -1380331 1531989 1248260 -1821476
37587a821476m064646k423468J416601M412287L888398J616392J342346K773170
$$ -1821476 -5886122 -8309590 -6892989 -2480702 1407696 3024088 4366434 7139604
37579G139604K155289j447273m900379o027951n305609k490741L106643Q115484
$$ 7139604 9294893 7847620 2947241 -3080710 -8386319 -10877060 -7770417 345067
37571C45067O661956j094013o903848m281324L165058O605787K654117l909360
$$ 345067 7007023 5913010 -990838 -5272162 -2107104 4498683 7152800 3243440
37563C243440o497166l383777J347105K495229l07355k313004o53323J005661
$$ 3243440 -3253726 -6637503 -5290398 -2795169 -3102524 -5415528 -6068851 -5063190
37555e063190j538544n148189l504913K420606N488524L789656K598830L784267
$$ -5063190 -6601734 -11749923 -15254836 -12834230 -7345706 -3556050 -957220 2827047
37547B827047K506225k442895m529974q13671J772280j664760m423042N51321
$$ 2827047 5333272 2890377 -1639597 -2453268 -680988 -2345748 -6768790 -6217469
37539f217469P303924N543198k521562n594329o71105M337314M165203J587894
$$ -6217469 1086455 6629653 4108091 -1486238 -2157343 2179971 6345174 7933068
37531G933068o85432l283862m579176j496561K900893K016874k841254l452570
$$ 7933068 7247636 3963774 -615402 -2111963 788930 2805804 -35450 -3488020
37523c488020J204875K678056j901097l960218J625085O673528K867130m287529
$$ -3488020 -2283145 394911 -1506186 -5466404 -3841319 2832209 5699339 1411810
37515A411810m395257J634698M605270J786159j399735j833530j456200q15384
$$ 1411810 -2983447 -1348749 3256521 5042680 3642945 1809415 353215 -462169
37507d62169J574642L704891J671870k771414l333404J055279L934436O15167
$$ -462169 1112473 4817364 6489234 3717820 384416 1439695 5374131 5989298
37499E989298n368456p316458l200349L291775O931272N257473O94904j675986
$$ 5989298 620842 -6695616 -9895965 -6604190 327082 5584555 6279459 4603473
37491D603473j071K244971K024126J453013K945559L220731j671220p691539o894818
$$ 4603473 4602402 6847373 8871499 10324512 13270071 16490802 14819582 7128043 233225
37482B33225R8591L762950m00138n187696k723469M111041O561418K261661l009980
$$ 233225 331816 4094766 3694628 -1493068 -4216537 -105496 6455922 8717583 5707603
37473E707603m046677j778515n9649k88984n26443J136468L464100L296101R7507
$$ 5707603 1660926 -117589 -177238 -466222 -992665 143803 3607903 6904004 7001511
37464G001511k687070k558411j850465l336429m282395l21953N659265N375097
$$ 7001511 4314441 1756030 -94435 -3430864 -7713259 -8035212 -2375947 2999150
37456B999150k608197r162398o718648N65402L745292J746595P19486L108616
$$ 2999150 390953 -8771445 -15490093 -14924691 -11179399 -9432804 -8713318 -5604702
37448e604702M372147J126671l243536l604267j8756L278876L786070K571886
$$ -5604702 -1232555 -105884 -3349420 -6953687 -6972443 -3693567 92503 2664389
37440B664389J008638j148111l543999l779651o14604K838608K387551j011146
$$ 2664389 3673027 2524916 -1019083 -4798734 -5413338 -2574730 -187179 -1198325
37432a198325k012328J251329M142835K556047j062279k175459r56462r0426J012258
$$ -1198325 -3210653 -1959324 2183511 4739558 3677279 1501820 545358 454932 1467190
37423A467190M109711O442630L573989l003844p343491p621879o827375n294502
$$ 1467190 5576901 12019531 15593520 12589676 5246185 -2375694 -9203069 -14497571
37415a4497571j85215O571169P919421K195119l193703k405150R75174J063496
$$ -14497571 -14682786 -8111617 -192196 2002923 -1190780 -3595930 -2620756 -1557260
37407a557260j321469j975808o61471L60757J246602K759004K839199L0500k466096
$$ -1557260 -2878729 -4854537 -5516008 -5155251 -3908649 -1149645 1689554 1720054 -746042
37398g46042r41886K908041M410808K078981k098691n763614o317822j555110
$$ -746042 -1687928 1220113 5630921 7709902 5611211 -152403 -6470225 -8025335
37390h025335N881731Q448934K806980m416647m943732K50223L646641J944323
$$ -8025335 -2143604 6305330 9112310 4695663 -248069 2154 3648795 5593118
37382E593118j560635l268584k553985k75231J467930m0001l826347m465458J98614
$$ 5593118 4032483 763899 -1790086 -2065317 -597387 -637388 -4463735 -8929193 -8730579
37373h730579M453861K967629p97696q11013J402511P70417j132947P92818M560454
$$ -8730579 -4276718 -1309089 -2106785 -2917798 -1515287 -744870 -1877817 -1084999 3475455
37364C475455L702868q57218j967674R50174J035416l019280m186567j16355J861799
$$ 3475455 7178323 6321105 4353431 5303605 6339021 3319741 -866826 -983181 878618
37355H78618k586574o832636m104834J838620L760776K201834K383194M515815
$$ 878618 -1707956 -8540592 -12645426 -10806806 -7046030 -4844196 -2461002 2054813
37347B054813M421596J263130j378693j054622R89148J997367K84084k959277
$$ 2054813 6476409 7739539 6360846 5306224 6295372 8292739 8576823 5617546
37339E617546l720995K33163M788861L823642j654029m310103j339961K056245
$$ 5617546 1896551 2129714 6918575 10742217 9088188 4778085 3438124 5494369
37331E494369J996404J491423L258494M002844P08554l336602m028429k871230
$$ 5494369 7490773 8982196 12240690 16243534 16952088 13615486 9587057 6715827
37323F715827k919192l158193j928883j164527k071333j351233K782746N453598
$$ 6715827 3796635 638442 -1290441 -2454968 -4526301 -5877534 -3094788 2358810
37315B358810J970344m158825o001904k504997K357086N884196O746055L153532
$$ 2358810 4329154 170329 -5831575 -8336572 -5979486 -95290 6650765 9804297
37307I804297l097612n149250l8412N319942L878188p14578r06186K060857J700666
$$ 9804297 6706685 1557435 1519023 6838965 10717153 10002575 9096389 11157246 12857912
37298A2857912j452545j718759K15481j215754m815074l912978Q15156J481074
$$ 12857912 11405367 9686608 9902089 8686335 3871261 -41717 773439 2254513
37290B254513k863150l922296J307961N140398K470284j353616j266946r08456
$$ 2254513 -608637 -4530933 -3222972 1917426 4387710 3034094 1767148 858692
37282H58692l662015m635401K74238N098114K707558k927478k932589K121305
$$ 858692 -2803323 -7438724 -7164486 -2066372 641186 -2286292 -5218881 -3097576
37274c097576L743062n97864m231484k044196K996271N334941L336216r94082
$$ -3097576 645486 47622 -4183862 -6228058 -3231787 2103154 5439370 4445288
37266D445288m670391n090455j775394K625762M915716M341210J625764k671123
$$ 4445288 -225103 -5315558 -7090952 -4465190 450526 4791736 6417500 3746377
37258C746377o398784n471372P50994O236078N164380J44594j673674P85563J993062
$$ 3746377 -2652407 -8123779 -7372785 -1136707 4027673 4172267 2498593 3284156 5277218
37249E277218l79195k013431o0191J768303j52744k825228j680202J444222J188727
$$ 5277218 4898023 2884592 2824401 4592704 4439960 1614732 -65470 1378752 2567479
37240B567479k214847k986959O43361L100064N07201k165084J640931Q632333
$$ 2567479 352632 -2634327 -1990966 1109098 1616299 -548785 1092146 9724479
37232I724479Q549813j126197j0310160r483959k021309K085802O16769j53651
$$ 9724479 18274292 17148095 6837935 -2646024 -4667333 -2581531 -1964762 -2118413
37224b118413K575656L839147J79787m133935l927195o56020J304909J607292
$$ -2118413 457243 4296390 4476177 342242 -3584953 -4240973 -2936064 -1328772
37216a328772K210279J966412j490037o021201o487492j912613L037910M168152
$$ -1328772 881507 2847919 1357882 -4663319 -11150811 -13063424 -10025514 -5857362
37208e857362K084859l4239k82489R68685J924332Q49094j958571l914739l067286
$$ -5857362 -3772503 -3806742 -4089231 -3120546 -1196214 -347120 -2305691 -6220430 -9287716
37199i287716m77113J626556K840915M027096M996935M706744K816560l75302
$$ -9287716 -9764829 -8138273 -5297358 -1270262 3726673 8433417 11249977 10874675
37191A0874675m101471o059435l730944J383832M021763K248202N06418J946174
$$ 10874675 6773204 713769 -3017175 -1633343 2388420 4636622 5143040 7089214
$$ [...]
##END NTUPLES=NMR SPECTRUM
##END=
