##TITLE=31Pdec_SR152_EtAc
 , 24 sc
 14.11.2022
##JCAMPDX= 6.0         $$ Bruker NMR JCAMP-DX V2.0
##DATA TYPE= NMR SPECTRUM
##DATA CLASS= NTUPLES
##ORIGIN= UXNMR, Bruker Analytische Messtechnik GmbH
##OWNER= root
$$ XWIN-NMR		Version 3.5
$$ Mon Nov 14 16:08:28 2022 Russian Standard Time (UT+4h)  she@DPX200
##.OBSERVE FREQUENCY= 81.013821
##.OBSERVE NUCLEUS= ^31P
##.ACQUISITION MODE= SIMULTANEOUS
##.ACQUISITION SCHEME= undefined
##.AVERAGES= 24
##.DIGITISER RES= 16
##SPECTROMETER/DATA SYSTEM= spect
##.PULSE SEQUENCE= zgpg30
##.SOLVENT NAME= CDCl3
##.SHIFT REFERENCE= (INTERNAL, CDCl3, 0, 248.564)
##AUDIT TRAIL= $$ (NUMBER, WHEN, WHO, WHERE, WHAT)
$$ ##TITLE= Audit trail, XWIN-NMR		Version 3.5
$$ ##JCAMPDX= 5.01
$$ ##ORIGIN= Bruker BioSpin GmbH
$$ ##OWNER= she
$$ F:/spectra/data/she/nmr/P31/1/pdata/1/auditp.txt
$$ ##AUDIT TRAIL=  $$ (NUMBER, WHEN, WHO, WHERE, WHAT)
(   1,<2022-11-14 16:07:00.14 +0400>,<she>,<DPX200>,
      <created by zg, POWCHK disabled, PULCHK disabled
       configuration hash MD5:
       00 E9 B6 7A A2 85 ED C7 34 08 36 98 17 FE 4E 26
       data hash MD5: 32K
       15 70 62 10 08 1F 70 07 35 20 55 0A 72 0F 04 3A>)
(   2,<2022-11-14 16:07:02.45 +0400>,<she>,<DPX200>,
      <Start of raw data processing
       efp BC_mod = 2 LB = 1 FT_mod = 6 PKNL = 1 PHC0 = -10279.64 PHC1 = 50.6559 SI = 64K 
       data hash MD5: 64K
       A2 30 31 4D 3E 45 E0 EA D7 30 1C BF 56 2A CF 97>)
(   3,<2022-11-14 16:07:10.68 +0400>,<she>,<DPX200>,
      <pk PHC0 = 133.7054 PHC1 = 0 
       data hash MD5: 64K
       80 A3 2D C3 FC BB 83 7A EF 3D 06 B3 CB BC C2 8B>)
(   4,<2022-11-14 16:07:47.85 +0400>,<she>,<DPX200>,
      <pk PHC0 = -80.76333 PHC1 = -24.20001 
       data hash MD5: 64K
       2F FB DC 73 8C 01 6D 23 F7 02 6F 6C D9 14 74 39>)
(   5,<2022-11-14 16:07:51.60 +0400>,<she>,<DPX200>,
      <abs ABSG = 5 
       data hash MD5: 64K
       DF D5 EE F7 CE 98 5B D5 AF 35 B3 0F 37 32 EE E9>)
$$ ##END=
$$ 
$$ hash MD5
$$ 12 94 E8 4D A2 28 24 D4 D0 BE 65 90 AE 24 16 26
##$RELAX= 
##$RELAX= 
##$RELAX= 
##$RELAX= 
##$RELAX= 
##$RELAX= 
##$RELAX= 
##$RELAX= 
##$RELAX= 
$$ Bruker specific parameters
$$ --------------------------
##$DU= <F:/spectra>
##$EXPNO= 1
##$NAME= <P31>
##$PROCNO= 1
##$TYPE= <nmr>
##$USER= <she>
##$AMP= (0..31)
100 100 100 100 100 100 100 100 100 100 100 100 100 100 100 100 100 100 
100 100 100 100 100 100 100 100 100 100 100 100 100 100 
##$AQSEQ= 0
##$AQ_mod= 1
##$AUNM= <au_zg>
##$AUTOPOS= <>
##$BF1= 81.014009
##$BF2= 200.13
##$BF3= 200.13
##$BF4= 200.13
##$BF5= 200.13
##$BF6= 200.13
##$BF7= 200.13
##$BF8= 200.13
##$BYTORDA= 1
##$CFDGTYP= 0
##$CFRGTYP= 5
##$CHEMSTR= <none>
##$CNST= (0..31)
1 1 145 1 1 1 1 1 1 1 1 1 1 1 1 1 1 1 1 1 1 1 1 1 1 1 1 1 1 1 1 1 
##$CPDPRG= <waltz16>
##$CPDPRG1= <>
##$CPDPRG2= <waltz16>
##$CPDPRG3= <>
##$CPDPRG4= <mlev>
##$CPDPRG5= <mlev>
##$CPDPRG6= <mlev>
##$CPDPRG7= <mlev>
##$CPDPRG8= <mlev>
##$CPDPRGB= <>
##$CPDPRGT= <>
##$D= (0..31)
$$ [...]
##$SUBNAM3= <"">
##$SUBNAM4= <"">
##$SUBNAM5= <"">
##$SUBNAM6= <"">
##$SUBNAM7= <"">
##$SUBNAM8= <"">
##$SUBNAM9= <"">
##$SW= 501.771253377433
##$SWIBOX= (0..15)
0 1 3 0 0 0 0 0 0 0 0 0 0 0 0 0 
##$SW_h= 40650.406504065
##$TD= 32768
##$TD0= 1
##$TE= 0
##$TE2= 300
##$TE3= 300
##$TEG= 300
##$TL= (0..7)
0 120 53 12 22 120 120 120 
##$TP= (0..7)
150 150 150 150 150 150 150 150 
##$TP07= 0
##$TPNAME0= <>
##$TPNAME1= <>
##$TPNAME2= <>
##$TPNAME3= <>
##$TPNAME4= <>
##$TPNAME5= <>
##$TPNAME6= <>
##$TPNAME7= <>
##$TPOAL= (0..7)
0.5 0.5 0.5 0.5 0.5 0.5 0.5 0.5 
##$TPOFFS= (0..7)
0 0 0 0 0 0 0 0 
##$TUNHIN= 0
##$TUNHOUT= 0
##$TUNXOUT= 0
##$USERA1= <user>
##$USERA2= <user>
##$USERA3= <user>
##$USERA4= <user>
##$USERA5= <user>
##$V9= 5
##$VALIST= <valist>
##$VCLIST= <CCCCCCCCCCCCCCC>
##$VD= 0
##$VDLIST= <DDDDDDDDDDDDDDD>
##$VPLIST= <PPPPPPPPPPPPPPP>
##$VTLIST= <TTTTTTTTTTTTTTT>
##$WBST= 1024
##$WBSW= 4
##$XGAIN= (0..3)
0 0 0 0 
##$XL= 0
##$YL= 0
##$YMAX_a= 4675
##$YMIN_a= -5954
##$ZGOPTNS= <>
##$ZL1= 120
##$ZL2= 120
##$ZL3= 120
##$ZL4= 120
##$ABSF1= 248.5645
##$ABSF2= -253.2056
##$ABSG= 5
##$ABSL= 3
##$ALPHA= 0
##$AQORDER= 0
##$ASSFAC= 0
##$ASSFACI= 0
##$ASSFACX= 0
##$ASSWID= 0
##$AUNMP= <proc_1d>
##$AZFE= 0.1
##$AZFW= 0.5
##$BCFW= 0
##$BC_mod= 2
##$BYTORDP= 0
##$COROFFS= 0
##$CY= -3
##$DATMOD= 1
##$DC= 0
##$DFILT= <>
##$DTYPP= 0
##$F1P= 0
##$F2P= 0
##$FCOR= 1
##$FTSIZE= 65536
##$FT_mod= 6
##$GAMMA= 0
##$GB= 0
##$INTBC= 1
##$INTSCL= 6.047779e-11
##$ISEN= 30
##$LB= 1
##$LEV0= 0
##$LPBIN= 0
##$MAXI= 10000
##$MC2= 0
##$MEAN= 0
##$ME_mod= 0
##$MI= 50
##$NCOEF= 0
##$NC_proc= -8
##$NLEV= 6
##$NOISF1= 182.463
##$NOISF2= 159.3651
##$NSP= 0
##$NTH_PI= 0
##$NZP= 0
##$OFFSET= 248.5645
##$PC= 4
##$PHC0= -10226.69
##$PHC1= 26.45589
##$PH_mod= 1
##$PKNL= yes
##$PPARMOD= 0
##$PSCAL= 0
##$PSIGN= 0
##$REVERSE= no
##$SF= 81.0140089999694
##$SI= 65536
##$SIGF1= 159.3651
##$SIGF2= -187.1042
##$SINO= 113.3802
##$SIOLD= 16384
##$SREGLST= <1H.CDCl3>
##$SSB= 0
##$STSI= 65536
##$STSR= 0
##$SW_p= 40650.406504065
##$SYMM= 0
##$S_DEV= 0
##$TDeff= 32768
##$TDoff= 0
##$TI= <>
##$TILT= no
##$TM1= 0
##$TM2= 0
##$TOPLEV= 0
##$USERP1= <user>
##$USERP2= <user>
##$USERP3= <user>
##$USERP4= <user>
##$USERP5= <user>
##$WDW= 1
##$XDIM= 65536
##$YMAX_p= 252880187
##$YMIN_p= -226223381
$$ End of Bruker specific parameters
$$ ---------------------------------
##NTUPLES= NMR SPECTRUM
##VAR_NAME=  FREQUENCY,     SPECTRUM/REAL,   SPECTRUM/IMAG
##SYMBOL=    X,             R,               I
##VAR_TYPE=  INDEPENDENT,   DEPENDENT,       DEPENDENT
##VAR_FORM=  AFFN,          ASDF,            ASDF
##VAR_DIM=   65536,         65536,           65536
##UNITS=     HZ,            ARBITRARY UNITS, ARBITRARY UNITS
##FACTOR=    0.620285442955139, 1,           1
##FIRST=     20137.2065510682, 0,            0
##LAST=      -20513.1999529968, 0,           0
##MIN=       -20513.1999529968, -226223381,  0
##MAX=       20137.2065510682, 252880187,    0
$$ Real data points
##PAGE= N=1
##DATA TABLE= (X++(R..R)), XYDATA
$$ [...]
$$ plain form
42216 1521346 3731388 3917777 2295355 433725 -1734182 -5043106 -7792207 -6967103
42208 -6967103 -3192112 -708723 -1328428 -2174636 -1033693 65584 -794165 -1251788 1393440
42199 1393440 4687435 3669065 -2087496 -7556541 -7963309 -2901555 4506403 10095544
42191 10095544 10871495 7129367 2423814 130117 510149 1887905 3088485 3388458
42183 3388458 2030569 -272448 -1234166 -526165 -1229037 -4915638 -7527493 -4254385 2684866
42174 2684866 5854141 2364936 -2750923 -4180900 -2870216 -2225045 -1685418 1260149
42166 1260149 4475201 2280213 -5656026 -11389061 -8161017 304324 4657223 2542951
42158 2542951 603658 3439028 7115593 6872522 5277665 7015771 9952089 8639933
$$ packed form
42216A521346K210042J86389j622422j861630k167907l308924k749101Q25104
42208f967103L774991K483389o19705q46208J140943J099277q59749m57623K645228
42199A393440L293995j018370n756561n469045m06768N061754P407958N589141
42191A0095544P75951l742128m705553k293697L80032J377756J200580K99973
42183C388458j357889k303017r61718P08001p02872l686601k611855L273108O939251
42174B684866L169275l489205n115859j429977J310684O45171N39627K945567
42166A260149L215052k194988p936239n733035L228044Q465341M352899k114272
42158B542951j939293K835370L676565k43071j594857J738106K936318j312156
$$ plain form
42150 8639933 4265362 3114252 5755484 5908391 1093927 -3544063 -4414063 -4898927 -8011198
42141 -8011198 -10537098 -9162321 -6598727 -6552392 -7510132 -6482509 -4401212 -2986332 -831748
42132 -831748 2476993 3266384 243133 -1178635 2560811 5594504 1461286 -5257291
42124 -5257291 -5448080 -97866 1951817 -1078819 -2345727 271582 556230 -4062069
42116 -4062069 -7373727 -5218344 -2279691 -2969239 -3408772 1391125 8434297 11128674
42108 11128674 8540408 4788657 2543988 1841175 2458905 3363788 2412156 -35726 -177842
42099 -177842 3488525 6989056 6737098 4716302 3970377 3015717 -354980 -3297989 -1774840
42090 -1774840 2236922 3327059 920385 -910263 -1002198 -2359557 -5601735 -7021739
$$ packed form
42150H639933m374571j151110K641232J52907m814464m637990q70000m84864l112271
42141h011198k525900J374777K563594M6335r57740J027623K081297J414880K154584
42132h31748L308741P89391l023251j421768L739446L033693m133218o718577
42124e257291j90789N350214K049683l030636j266908K617309K84648m618299
42116d062069l311658K155383K938653o89548m39533M799897P043172K694377
42108A1128674k588266l751751k244669p02813O17730R04883r51632k447882j42116
42099a77842L666367L500531k51958k020796p45925r54660l370697k943009J523149
42090a774840M011762J090137k406674j830648r1935j357359l242178j420004
$$ plain form
42082 -7021739 -4651448 -1320180 288173 1289436 2901365 2984635 -428444 -4873760
42074 -4873760 -6320064 -4768544 -3594787 -4088998 -4111457 -2347224 -463715 323971 1765508
42065 1765508 4998065 6687245 2703411 -4904316 -9028670 -6752558 -3274014 -4105938
42057 -4105938 -7293636 -7388469 -4030878 -1334114 -684572 -227022 -717547 -4892863 -10004480
42048 -10004480 -8369285 1269247 9389021 7700984 405473 -2595276 103490 1191435
42040 1191435 -3088405 -7940406 -8158514 -5110210 -3205989 -3739979 -5037745 -5945436 -6544909
42031 -6544909 -6842259 -6521244 -5204992 -2313539 2127198 6169378 7052334 4297368 350038
42022 350038 -2305572 -3212770 -2819313 -1254552 800107 1749564 1028124 257148 1051291
$$ packed form
42082g021739K370291L331268J608353J001263J611929Q3270l413079m445316
42074d873760j446304J551520J173757m94211k2459J764233J883509P87686J441537
42065A765508L232557J689180l983834p607727m124354K276112L478544q31924
42057d105938l187698r4833L357591K696764O49542M57550m90525m175316n111617
42048a0004480J635195R638532Q119774j688037p295511l000749K698766J087945
42040A191435m279840m852001k18108L048304J904221n33990j297766r07691n99473
42031f544909k97350L21015J316252K891453M440737M042180Q82956k754966l947330
42022C50038k655610r07198L93457J564761K054659R49457p21440p70976P94143
$$ plain form
42013 1051291 2501030 2318357 97228 -1960286 -1666963 768435 3185081 3606642 1722805
42004 1722805 -1191092 -3479276 -4515490 -5152508 -6551900 -8465991 -9182380 -7636013
41996 -7636013 -5094685 -3823779 -4210446 -4420838 -3216547 -1678847 -1178781 -1052508 -90603
41987 -90603 523226 -1840467 -7165795 -11789341 -12392327 -9496061 -6058793 -3928756 -2892607
41978 -2892607 -2307997 -2245622 -3051281 -4466559 -5260165 -3831531 190148 4893155 7472520
41969 7472520 6938741 4733872 2615607 979033 -489063 -1702026 -2361824 -2413105 -1803511
41960 -1803511 -539258 700231 917023 205954 -24456 1253658 3332229 4345188 2811918
41951 2811918 -1020623 -4593848 -4556330 -391675 4059813 4701593 2432211 1836236 4634750
$$ packed form
42013A051291J449739j82673k221129k057514K93323K435398K416646M21561j883837
42004A722805k913897k288184j036214o37018j399392j914091p16389J546367
41996g636013K541328J270906l86667k10392J204291J537700N00066J26273R61905
41987i0603O13829k363693n325328m623546o02986K896266L437268K130037J036149
41978b892607N84610O2375q05659j415278p93606J428634M021679M703007K579365
41969G472520n33779k204869k118265j636574j468096j212963o59798n1281O09594
41960a803511J264253J239489K16792p11069k30410J278114K078571J012959j533270
41951B811918l832541l573225L7518M164655M451488O41780k269382n95975K798514
$$ plain form
41942 4634750 7409343 6657521 3141558 -348876 -2938397 -5284957 -7246729 -8063900
41934 -8063900 -7475775 -5101771 -459148 4816831 7009974 4872559 2029698 1977560 2596044
41925 2596044 -587840 -6684782 -9419948 -5583717 160722 824603 -4806404 -11573893
41917 -11573893 -14081904 -11453453 -6400603 -1495102 2536611 5424513 6092945 4187846
41909 4187846 1988963 2454385 5005749 5664101 2544724 -1096057 -1163531 1934640 4630337
41900 4630337 5244906 4861640 4257197 3156393 2269769 3022049 4873092 5487356 4158188
41891 4158188 2796281 2799329 3007787 1736332 -777554 -2870778 -3190570 -1349825 1981174
41882 1981174 5158592 6727191 6662455 5568343 3239554 -229788 -2516606 -1049879
$$ packed form
41942D634750K774593p51822l515963l490434k589521k346560j961772q17171
41934h063900N88125K374004M642623N275979K193143k137415k842861n2138O18484
41925B596044l183884o096942k735166L836231N744439O63881n631007o767489
41917a1573893k508011K628451N052850M905501M031713K887902O68432j905099
41909D187846k198883M65422K551364O58352l119377l640781o7474L098171K695697
41900D630337O14569l83266o04443j100804q86624P52280J851043O14264j329168
41891D158188j361907L048K08458j271455k513886k093224l19792J840745L330999
41882A981174L177418J568599o4736j094112k328789l469342k286818J466727
$$ plain form
41874 -1049879 2669419 3650332 -356549 -5722456 -7800153 -6618219 -5366837 -5150144
41866 -5150144 -4427378 -2732467 -1383710 -177827 3164212 8565416 11314589 7169395
41858 7169395 -1262698 -6308208 -3914896 1871704 4507391 3104104 2484059 5664836
41850 5664836 9247801 7664942 287967 -7680672 -10948569 -9082715 -5538708 -3188304
41842 -3188304 -1902421 -288503 1335159 899213 -2162748 -4844402 -3465122 1479456
41834 1479456 5383144 5282916 3635083 4632627 8200963 10153418 7889844 3313102
41826 3313102 -441705 -2745435 -4469314 -5056100 -3006478 1005844 3744779 3160007
41818 3160007 1292070 1918418 5545445 8334535 6733835 1976000 -1441009 -1186097
$$ packed form
41874a049879L719298R80913m006881n365907k077697J181934J251382K16693
41866e150144P22766J694911J348757J205883L342039N401204K749173m145194
41858G169395q432093n045510K393312N786600K635687j403287o20045L180777
41850E664836L582965j582859p376975p968639l267897J865854L544007K350404
41842c188304J285883J613918J623662m35946l061961k681654J379280M944578
41834A479456L903688j00228j647833R97544L568336J952455k263574m576742
41826C313102l754807k303730j723879n86786K049622M012322K738935n84772
41818C160007j867937O26348L627027K789090j600700m757835l417009K54912
$$ plain form
41810 -1186097 760084 1553551 1201749 1712281 3817506 6151140 7226339 6702822 4568944
41801 4568944 492351 -5022676 -9403177 -9337252 -4200308 2338442 5424696 4091220
41793 4091220 2031958 2583458 4376944 3588390 -607724 -5125485 -7109194 -6608852 -5072102
41784 -5072102 -3616220 -3322229 -4949278 -7525993 -9156543 -9774214 -10943031 -12506740
41776 -12506740 -12196174 -9450869 -6618872 -5026209 -3066164 -35106 1546966 19698
41768 19698 -2324852 -3395453 -5224077 -9615179 -12845752 -10040419 -3170118 954382
41760 954382 144572 -1266343 -243655 960730 238888 -205058 1941918 4604072 4375636
41751 4375636 1539835 -1080350 -2624046 -4673744 -7933204 -10623546 -10323541 -6579064
$$ packed form
41810a186097J946181P93467l51802N10532K105225K333634J075199n23517k133878
41801D568944m076593n515027m380501O5925N136944O538750L086254j333476
41793D091220k059262N51500J793486p88554m196114m517761j983709N00342J536750
41784e072102J455882K93991j627049k576715j630550o17671j168817j563709
41776a2506740L10566K745305K831997J592663J960045L031058J582072j527268
41768A9698k344550j070601j828624m391102l230573K805333O870301M124500
41760I54382q09810j410915J022688J204385p21842m43946K146976K662154k28436
41751D375636k835801k620185j543696k049698l259460k690342L00005L744477
$$ plain form
41743 -6579064 -1761979 838061 552623 350215 2897554 6565761 7663111 5662517
41735 5662517 2851755 -666519 -7047064 -14845249 -17930652 -13022725 -4704655 301529
41727 301529 1106319 1606166 3807129 5951524 6040144 3839897 82419 -3513549 -4189193
41718 -4189193 -979167 2896430 3240164 254455 -1862961 -583901 2275647 3751501
41710 3751501 3126410 1470717 -196005 -1380811 -2017762 -2391183 -2302670 -680761 2553105
41701 2553105 4856839 3614219 233937 -1063611 767694 1925221 -6962 -1063851
41693 -1063851 4088113 13243103 17328436 11519063 2187707 -485156 4905622 9786272
41685 9786272 7051548 -438225 -4885523 -3698239 -872655 -47902 -701335 -1301684 -1941976
$$ packed form
41743f579064M817085K600040k85438k02408K547339L668207J097350k000594
41735E662517k810762l518274o380545p798185l085403M907927Q318070N006184
41727C01529Q04790M99847K200963K144395Q8620k200247l757478l595968o75644
41718d189193L210026L875597L43734k985709k117416J279060K859548J475854
41710C751501o25091j655693j666722j184806o36951l73421Q8513J621909L233866
41701B553105K303734j242620l380282j297548J831305J157527j932183j056889
41693a063851N151964R154990M085333n809373r331356k672863N390778M880650
41685I786272k734724p489773m447298J187284K825584Q24753o53433o00349o40292
$$ plain form
41676 -1941976 -2398050 -1115508 1718275 2900816 425372 -3349766 -5209357 -5449036
41668 -5449036 -5741016 -4828637 -471427 5224847 6757370 2055275 -4977248 -9462376
41660 -9462376 -10174804 -8499102 -5915925 -3992221 -4322246 -6633086 -8522404 -8276640 -6461089
41651 -6461089 -4140051 -1753762 -604524 -2628360 -6908462 -8997285 -6079821 -735946
41643 -735946 2836153 4126933 4837819 4263034 376140 -5330727 -8515311 -7848129 -6295009
41634 -6295009 -5738907 -4242405 -375488 3276527 3626528 1681447 726453 1331184 869223
41625 869223 -2492481 -7316947 -10318809 -9285588 -5087202 -1233700 -351582 -981181 110735
41616 110735 2278009 1103518 -4363272 -8539380 -6782209 -2402754 -1609624 -4151140
$$ packed form
41676a941976m56074J282542K833783J182541k475444l775138j859591k39679
41668e449036k91980R12379M357210N696274J532523m702095p032523m485128
41660i462376p12428J675702K583177J923704l30025k310840j889318K45764J815551
41651f461089K321038K386289J149238k023836m280102k088823K917464N343875
41643g35946L572099J290780P10886n74785l886894n706867l184584O67182J553120
41634f295009N56102J496502L866917L652015L50001j945081r54994O04731m61961
41625H69223l361704m824466l001862J033221M198386L853502Q82118o29599J091916
41616A10735K167274j174491n466790m176108J757171M379455P93130k541516
$$ plain form
41608 -4151140 -4706785 -2132321 -872363 -3056941 -5611275 -6514710 -7598261 -8780943
41600 -8780943 -5981730 1232718 5744309 2176271 -4356258 -5169171 -503057 2038362
41592 2038362 -133468 -1587091 1138523 3927845 2333835 -1334406 -2245183 -512523
41584 -512523 -88937 -2399536 -5153761 -6614923 -7544674 -8700291 -8949134 -6704480 -1973339
41575 -1973339 3510377 7510492 8606108 6975177 4026163 1013929 -1778810 -4294966
41567 -4294966 -5717389 -4990007 -2370409 37783 -194255 -3410207 -7002215 -7529985 -4128488
41558 -4128488 608555 3547437 4141237 3877362 3432738 2004123 -547866 -2672185 -3178909
41549 -3178909 -3109295 -4154841 -5770782 -5616779 -3244976 -1560849 -3019141 -5523655 -4786570
$$ packed form
41608d151140n55645K574464J259958k184578k554334r03435j083551j182682
41600h780943K799213P214448M511591l568038o532529q12913M666114K541419
41592B038362k171830j453623K725614K789322j594010l668241r10777J732660
41584e12523M23586k310599k754225j461162r29751j155617k48843K244654M731141
41575a973339N483716M000115J095616j630931k949014l012234k792739k516156
41567d294966j422423P27382K619598K408192k32038l215952l592008n27770L401497
41558d128488M737043K938882N93800k63875m44624j428615k551989k124319n06724
41549c178909O9614j045546j615941J54003K371803J684127j458292k504514P37085
$$ plain form
41540 -4786570 -854261 1016089 -2236788 -6358044 -5553237 -1106907 709647 -1410490
41532 -1410490 -1827142 2718227 7582010 7464732 4465258 4010203 5896203 5143590 665176
41523 665176 -2493272 -398790 4476228 6861129 4915660 1281927 -462643 880902
41515 880902 3611119 5071745 3958642 653386 -3801314 -7476351 -7280205 -2279129
41507 -2279129 2666612 1177152 -5233762 -7275420 -605189 6965456 6087011 -1068396
41499 -1068396 -5103570 -3198865 -632971 -370905 234278 2144174 2245001 -2065 -663981
41490 -663981 1534758 2523936 -22813 -2766015 -2803275 -2217381 -3163806 -3266258 427480
41481 427480 6666834 12045350 14224728 11235749 2368057 -7751087 -11234550 -6512045
$$ packed form
41540d786570L932309J870350l252877m121256Q04807M446330J816554k120137
41532a410490m16652M545369M863783j17278k999474m55055J886000p52613m478414
41523F65176l158448K094482M875018K384901j945469l633733j744570J343545
41515H80902K730217J460626j113103l305256m454700l675037J96146N001076
41507b279129M945741j489460o410914k041658O670231P570645q78445p155407
41499a068396m035174J904705K565894K62066O05183J909896J00827k247066o61916
41490f63981K198739R89178k546749k743202l7260N85894r46425j02452L693738
41481D27480O239354N378516K179378k988979q867692j0119144l483463M722505
$$ plain form
41473 -6512045 -942131 -347018 -1315327 1534629 6033110 6367294 2559693 -543320 -1203444
41464 -1203444 -1455315 -1630763 -307394 1208346 15025 -2976123 -3761180 -1582175 -192132
41455 -192132 -2144387 -5160673 -4851267 945578 10015711 16237125 13982092 4552101
41447 4552101 -3770251 -4895988 -1810414 -1066036 -3362210 -4316596 -2456878 -878541
41439 -878541 -1557270 -2980494 -3533755 -3222966 -2168555 -948044 -1704835 -5142265 -7511916
41430 -7511916 -4963382 93600 1856553 -303389 -1497043 549683 2750882 2878702
41422 2878702 2851110 4029546 4400615 2885621 1968344 3220778 4042964 1896565 -1351917
41413 -1351917 -2389945 -1243346 -56749 996080 3453449 7050312 9046592 7303129
$$ packed form
41473f512045N569914N95113r68309K849956M498481L34184l807601l103013o60124
41464a203444k51871j75448J323369J515740j193321k991148p85057K179005J390043
41455a92132j952255l016286L09406N796845R070133O221414k255033r429991
41447D552101q322352j125737L085574P44378k296174r54386J859718J578337
41439h78541o78729j423224n53261L10789J054411J220511p56791l437430k369651
41430g511916K548534N056982J762953k159942j193654K046726K201199J27820
41422B878702k7592J178436L71069j514994r17277J252434Q22186k146399l248482
41413a351917j038028J146599J186597J052829K457369L596863J996280j743463
$$ plain form
41405 7303129 2880325 -720295 -1033593 398885 -440648 -4523219 -7574362 -5793882
41397 -5793882 -1978132 -2018580 -6039807 -7748109 -3455566 2568567 3666640 -1533372
41389 -1533372 -8903704 -13599756 -13356573 -9430345 -5858118 -5708514 -7009471 -4851568
41381 -4851568 1492317 6627947 5900184 1227518 -2155098 -2155998 -350538 1759895 3693496
41372 3693496 4158761 1435343 -4030405 -9258965 -11523733 -10700857 -8698284 -7032449
41364 -7032449 -5216144 -1845352 2652938 5507956 4961904 3077224 3404821 6526795
41356 6526795 9796818 10805410 8999447 4743745 -498660 -3646102 -2784392 -338544
41348 -338544 -327589 -2490524 -2600586 1041857 5122229 6246508 4893894 3171843 1812149
$$ packed form
41405G303129m422804l600620l13298J432478q39533m082571l051143J780480
41397e793882L815750m0448m021227j708302M292543O024133J098073n200012
41389a533372p370332m696052K43183L926228L572227J49604j300957K157903
41381d851568O343885N135630p27763m672666l382616r00J805460K110433J933601
41372C693496M65265k723418n465748n228560k264768Q22876K002573J665835
41364g032449J816305L370792M498290K855018n46052j884680L27597L121974
41356F526795L270023J008592j805963m255702n242405l147442Q61710K445848
41348c38544J0955k162935j10062L642443M080372J124279j352614j722051j359694
$$ plain form
41339 1812149 879024 715499 902914 769481 1567466 5044444 9275117 9806078 6152372
41330 6152372 2964735 2899075 2769741 -370345 -3575872 -2511988 1384326 2684088 -591235
41321 -591235 -5054475 -6797726 -5357459 -3185680 -2833672 -4120338 -3723288 618802 5637263
41312 5637263 5829224 1738697 -82541 2612985 3464208 -2164518 -8211588 -6109969
41304 -6109969 1803009 5276974 1310816 -2076920 1464146 7682637 8957261 4845291
41296 4845291 773514 -378333 -518133 -1489645 -2278210 -1560179 -179114 188268 -701209
41287 -701209 -2061031 -3890318 -6712499 -9541711 -10101914 -8128136 -6555867 -7428170 -8338013
41278 -8338013 -5968671 -1875043 -618982 -2587928 -3667580 -2756115 -3848168 -8223213
$$ packed form
41339A812149r33125j63525J87415j33433P97985L476978M230673N30961l653706
41330F152372l187637o5660j29334l140086l205527J063884L896314J299762l275323
41321e91235m463240j743251J440267K171779L52008j286666L97050M342090N018461
41312E637263J91961m090527j821238K695526Q51223n628726o047070K101619
41304f109969P912978L473965l966158l387736L541066O218491J274624m111970
41296D845291m071777j151847j39800r71512p88565P18031J381065L67382q89477
41287g01209j359822j829287k822181k829212n60203J973778J572269q72303r09843
41278h338013K369342M093628J256061j968946j079652R11465j092053m375045
$$ plain form
41270 -8223213 -10390050 -6248237 -583294 -772031 -6194430 -9849059 -8455762 -4968655
41262 -4968655 -2237132 -271055 348990 -1770848 -4873102 -5104403 -2792540 -2819691 -7040467
41253 -7040467 -10865304 -9712141 -4951960 -746912 1688881 3518999 4448079 2962724
41245 2962724 -526841 -3463645 -3918772 -2070959 756839 3370903 5149929 5831553
41237 5831553 4910146 1726811 -2979227 -6220856 -5177052 -581441 3739422 4857697
41229 4857697 3010836 107835 -2245561 -3064252 -2150757 -618207 -49953 -704277 -1454713
41220 -1454713 -1521895 -1289578 -1583609 -3061337 -5735684 -8000543 -7109874 -2259479 3709180
41211 3709180 7420752 8573182 8279248 5502073 -1223472 -9184689 -12821786 -10445080
$$ packed form
41270h223213k166837M141813N664943j88737n422399l654629J393297L487107
41262d968655K731523J966077O20045k119838l102254k31301K311863k7151m220776
41253g040467l824837J153163M760181M205048K435793J830118R29080j485355
41245B962724l489565k936804m55127J847813K827798K614064J779026O81624
41237E831553r21407l183335m706038l241629J043804M595611M320863J118275
41229D857697j846861k903001k353396q18691R13495J532550N68254o54324p50436
41220a454713o7182K32317k94031j477728k674347k264859Q90669M850395N968659
41211C709180L711572J152430k93934k777175o725545p961217l637097K376706
$$ plain form
41203 -10445080 -6132556 -3832982 -2860734 -830906 1921530 3157419 2108403 31698
41195 31698 -1532041 -1878819 -1581140 -2348879 -5002309 -7355668 -6195271 -1831336 1719587
41186 1719587 1891369 386263 -197062 262769 1099659 3145929 6706549 9157624 7526234
41177 7526234 2759619 -870893 -412913 3131490 6300275 6176086 2644028 -1289753
41169 -1289753 -2211260 -134003 1467736 220707 -2078365 -2119195 737239 4400042 6793278
41160 6793278 7071578 5384575 3161163 2506734 3569540 3594535 446734 -3983556 -5918752
41151 -5918752 -4269319 -895758 2663355 5890250 7223013 4711178 -438937 -3789457
41143 -3789457 -2626972 964381 3317958 3562454 3072706 2248973 289555 -2529105 -4752371
$$ packed form
41203a0445080M312524K299574R72248K029828K752436J235889j049016k076705
41195C1698j563739l46778K97679p67739k653430k353359J160397M363935L550923
41186A719587J71782j505106n83325M59831Q36890K046270L560620K451075j631390
41177G526234m766615l630512M57980L544403L168785j24189l532058l933781
41169a289753r21507K077257J601739j247029k299072m0830K856434L662803K393236
41160F793278K78300j687003k223412o54429J062806K4995l147801m430290j935196
41151e918752J649433L373561L559113L226895J332763k511835n150115l350520
41143c789457J162485L591353K353577K44496m89748q23733j959418k818660k223266
$$ plain form
41134 -4752371 -5918594 -6643061 -6215547 -2613938 3672963 7979571 6180280 164817
41126 164817 -4155680 -4262875 -3479150 -5006669 -6581677 -3846992 2585582 6961887 5565436
41117 5565436 1282211 -371292 1969965 4580435 3915683 896480 -917274 -303253
41109 -303253 406476 -486364 -827220 2103437 6311183 6702897 2389175 -1533541 -1370338
41100 -1370338 -147381 -2072264 -4830422 -2549019 4696170 9718062 7425409 980838
41092 980838 -2867780 -1565015 1793101 2624647 -793822 -5701725 -7253712 -4024463
41084 -4024463 -369865 -885738 -3788433 -3722728 -341822 1154794 -1496303 -4414354 -4688321
41075 -4688321 -4850161 -7102624 -8621011 -6904495 -4811050 -5013967 -3938146 2345862
$$ packed form
41134d752371j166223p24467M27514L601609O286901M306608j799291o015463
41126A64817m320497j07195P83725j527519j575008K734685O432574M376305j396451
41117E565436m283225j653503K341257K610470o64752l019203j813754O14021
41109c03253P09729q92840l40856K930657M207746L91714m313722l922716J63203
41100a370338J222957j924883k758158K281403P245189N021892k292653o444571
41092I80838l848618J302765L358116Q31546l418469m907903j551987L229249
41084d024463L654598n15873k902695O5705L380906J496616k651097k918051k73967
41075d688321j61840k252463j518387J716516K093445k02917J075821O284008
$$ plain form
41067 2345862 9711389 10961369 7172226 5970502 8949446 9313560 3696629 -1843484
41059 -1843484 -1459841 1612630 1135754 -2077909 -2354278 1241681 3474058 576295 -5238341
41050 -5238341 -9164990 -8472528 -3720727 1837921 3894248 638413 -4867437 -7630292
41042 -7630292 -5971281 -2163430 1417664 4091866 4977092 2565673 -2553603 -6951752
41034 -6951752 -7901309 -6041290 -3442583 -1029113 586859 -107916 -3412789 -6462557
41026 -6462557 -6147957 -3325025 -1430909 -1256524 -69001 3703974 7849878 9518820
41018 9518820 8566980 6498226 4300612 2736007 2554651 2742921 781898 -3368096 -5890543
41009 -5890543 -4270333 -1481232 -1651967 -3594109 -3013192 -32657 558021 -3134714 -7166714
$$ packed form
41067B345862P365527J249980l789143j201724K978944L64114n616931n540113
41059a843484L83643L072471m76876l213663k76369L595959K232377k897763n814636
41050e238341l926649O92462M751801N558648K056327l255835n505850k762855
41042g630292J659011L807851L581094K674202Q85226k411419n119276m398149
41034f951752r49557J860019K598707K413470J615972o94775l304873l049768
41026f462557L14600K822932J894116J74385J187523L772975M145904J668942
41018I518820r51840k068754k197614j564605j81356J88270j961023m149994k522447
41009e890543J620210K789101j70735j942142N80917K980535N90678l692735m032000
$$ plain form
41000 -7166714 -7722990 -5713452 -3566371 -1552046 104758 -844888 -5171254 -9232487
40992 -9232487 -9103486 -5854226 -3498296 -3306204 -3564678 -3736862 -5033821 -7048398 -7346985
40983 -7346985 -5184254 -3089720 -3742916 -6804230 -9446453 -8960082 -4746353 1132674
40975 1132674 5258840 5521675 2498513 -1929085 -6232365 -8940584 -8439558 -4752137
40967 -4752137 -506562 1441181 626344 -1795539 -5048186 -8546655 -11155312 -12271108
40959 -12271108 -12327440 -10894669 -6346031 672863 5828850 5898574 2893345 369143 -2098155
40950 -2098155 -6782395 -11939232 -12836946 -8186944 -1409931 4156349 7447022 7832320
40942 7832320 5545302 3497056 4084377 4762216 1931376 -1562444 547366 7254592
$$ packed form
41000g166714n56276K009538K147081K014325J656804r49646m326366m061233
40992i232487J29001L249260K355930J92092k58474j72184j296959k014577k98587
40983g346985K162731K094534o53196l061314k642223M86371M213729N879027
40975A132674M126166K62835l023162m427598m303280k708219N01026L687421
40967d752137M245575J947743q14837k421883l252647l498469k608657j115796
40959a2271108n6332J432771M548638P018894N155987O9724l005229k524202k467298
40950b098155m684240n156837q97714M650002O777013N566280L290673L85298
40942G832320k287018k048246N87321O77839k830840l493820K109810O707226
$$ plain form
40934 7254592 10371857 7090871 4130168 5710468 5954958 -551250 -8191492 -8717404
40926 -8717404 -4717585 -5010699 -9754984 -10470466 -4438252 820692 -507363 -4425175
40918 -4425175 -4524920 -1076926 1410108 990267 -1478969 -5487960 -10310513 -13346193 -12265541
40909 -12265541 -7823898 -2748645 1007241 2957161 3777878 5090728 7545973 8654438
40901 8654438 5178987 -1584105 -6011322 -4971114 -1419436 473210 725321 1817604
40893 1817604 4212297 6272195 6875758 5892653 3567481 1096806 47652 -150644 -1779374
40884 -1779374 -4464201 -4353288 68564 4599359 4909421 2614969 2082862 3745101 4812645
40875 4812645 4526992 4057673 2814123 -100559 -1909154 791417 5291296 4963969 -957803
$$ packed form
40934G254592L117265l280986k960703J580300K44490o506208p640242n25912
40926h717404L999819k93114m744285p15482O032214N258944j328055l917812
40918d425175r9745L447994K487034m19841k469236m008991m822553l035680J080652
40909a2265541M441643N075253L755886J949920Q20717J312850K455245J108465
40901H654438l475451o763092m427217J040208L551678J892646K52111J092283
40893A817604K394693K059898O03563r83105k325172k470675j049154j98296j628730
40884a779374k684827J10913M421852M530795L10062k294452n32107J662239J067544
40875D812645k85653m69319j243550k914682j808595K700571M499879l27327n921772
$$ plain form
40866 -957803 -5524116 -3820973 704023 2270079 313717 -2305598 -4455359 -6079568
40858 -6079568 -5681580 -2848151 -1064094 -3684879 -8466679 -10104776 -7344664 -3761380
40850 -3761380 -1902097 -394497 2836744 7657886 12556336 15662622 14526310 7823853
40842 7823853 -1567836 -7727476 -7668034 -4625683 -3900816 -6679484 -9569977 -9375221 -6432062
40833 -6432062 -3250414 -1590646 -1782312 -3779792 -7192125 -10270798 -10705283 -8566154
40825 -8566154 -7073612 -8602903 -10834425 -9314000 -3605113 1885091 3659868 2760057
40817 2760057 1521675 -145455 -2973024 -5354266 -5127230 -2914593 -1032552 -161581
40809 -161581 500980 933813 638556 150723 -396400 -2843056 -7843586 -11271623 -8081718
$$ packed form
40866i57803m566313J703143M524996J566056j956362k619315k149761j624209
40858f079568L97988K833429J784057k620785m781800j638097K760112L583284
40850c761380J859283J507600L231241M821142M898450L106286j136312o702457
40842G823853r391689o159640N9442L042351P24867k778668k890493J94756K943159
40833f432062L181648J659768j91666j997480l412333l078673m34485K139129
40825h566154J492542j529291k231522J520425N708887N490204J774777q99811
40817B760057j238382j667130k827569k381242K27036K212637J882041Q70971
40809a61581O62561M32833k95257m87833n47123k446656n000530l428037L189905
$$ plain form
40800 -8081718 -18808 4699005 932445 -7219210 -11509603 -8418752 -1324596 4132378
40792 4132378 4990874 2526856 450793 1129146 3159795 3345370 689486 -3009049 -5981411
40783 -5981411 -7667782 -7340190 -4412453 -631617 812138 -773144 -3139305 -5316611
40775 -5316611 -8943933 -13782603 -15481716 -10968377 -3684026 153446 -717750 -2066290
40767 -2066290 -861743 1046177 725119 -1238751 -1855935 -90747 1967132 2340059 1966591
40758 1966591 3127509 5838106 7644890 7243183 6146401 5577473 4032707 286543
40750 286543 -3206179 -3290890 -1211092 -821510 -2384710 -2514500 -244117 1647874 1969701
40741 1969701 2522616 2798290 -805650 -7473693 -9480142 -2056684 8659108 13048115
$$ packed form
40800h081718Q062910M717813l766560q151655m290393L090851P094156N456974
40792D132378Q58496k464018k076063O78353K030649J85575k655884l698535k972362
40783e981411j686371L27592K927737L780836J443755j585282k366161k177306
40775e316611l627322m838670j699113M513339P284351L837472q71196j348540
40767b066290J204547J907920l21058j963870o17184J765188K057879L72927l73468
40758A966591J160918K710597J806784m01707j096782n68928j544766l746164
40750B86543l492722q4711K079798L89582j563200j29790K270383J891991L21827
40741A969701N52915K75674l603940o668043k006449P423458J0715792M389007
$$ plain form
40733 13048115 10102141 6325863 5120215 3800199 313876 -3364966 -5259439 -5905428
40725 -5905428 -5953031 -5204502 -4531555 -4958330 -4584888 -538112 5419592 7476698 3220727
40716 3220727 -3285463 -7271757 -8413697 -8427926 -7122369 -3649565 615190 3210003
40708 3210003 3495109 2593769 1295330 -642723 -3624987 -7267270 -9933882 -9705776 -6954915
40699 -6954915 -5075581 -6683252 -9827066 -10403475 -7705423 -4775311 -3804888 -4440972 -6195475
40690 -6195475 -8538404 -8477482 -2677457 6667949 12342210 10490078 4882498 963019
40682 963019 -441370 -1075036 -1015899 -16551 114168 -1655561 -2745663 -721568 2167208
40673 2167208 2149161 42154 3179 2945607 5296889 4398632 1587926 -684748 -1830593
$$ packed form
40733A3048115k945974l776278j205648j320016l486323l678842j894473o45989
40725e905428m7603P48529O72947m26775L73442M046776N957704K057106m255971
40716C220727o506190l986294j141940j4229J305557L472804M264755K594813
40708C210003K85106r01340j298439j938053k982264l642283k666612K28106K750861
40699f954915J879334j607671l143814n76409K698052K930112R70423o36084j754503
40690f195475k342929O0922N800025R345406N674261j852132n607580l919479
40682I63019j404389o33666N9137R99348J30719j769729j090102K024095K888776
40673B167208j8047k107007l8975K942428K351282q98257k810706k272674j145845
$$ plain form
40664 -1830593 -2297865 -2107787 -1343853 -585829 96571 1691196 5090784 9616794 12823238
40655 12823238 12091020 7308045 1865956 -420166 581734 2074598 2882365 4072953
40647 4072953 4592504 774320 -7248873 -12790112 -10392771 -3426018 676877 415925
40639 415925 138055 1458088 1083738 -2218320 -4384516 -2213129 1472134 1797770 -1647079
40630 -1647079 -4936392 -4924761 -2220046 159440 -90010 -2343346 -3736917 -2564556 -246378
40621 -246378 1093580 1482434 1545394 -55062 -4358563 -8551076 -8628340 -5143353 -2337356
40612 -2337356 -1832536 -1490714 -499576 -728467 -2385197 -3279764 -3381074 -4859954 -6403314
40603 -6403314 -3654721 2376767 4072782 -1679662 -7568172 -6445618 -2029021 -2234159
$$ packed form
40664a830593m67272J90078P63934P58024O82400J594625L399588M526010L206444
40655A2823238p32218m782975n442089k286122J001900J492864Q07767J190588
40647D072953N19551l818184q023193n541239K397341O966753M102895k60952
40639D15925k77870J320033l74350l302058k166196K171387L685263L25636l444849
40630a647079l289313J1631K704715K379486k49450k253336j393571J172361K318178
40621b46378J339958L88854O2960j600456m303501m192513p7264L484987K805997
40612b337356N04820L41822R91138k28891j656730q94567j01310j478880j543360
40603f403314K748593O031488J696015n752444n888510J122554M416597k05138
$$ plain form
40595 -2234159 -6551999 -8044648 -4884138 -1540977 34235 2079988 3981484 1575507
40587 1575507 -5131147 -10371453 -10600000 -8370670 -6894486 -6436771 -7367383 -10638306 -13514187
40578 -13514187 -11231484 -5219251 -3069273 -7286410 -10929150 -8633622 -5113564 -6847440
40570 -6847440 -11229094 -11181706 -6384407 -2452094 -1671824 -1709530 -1678419 -2550397 -2636488 660968
40560 660968 5101244 5968974 3990889 4557642 8731109 11369449 9301086 5414508 2995462
40551 2995462 1491793 -100765 -618874 364756 1371748 2370979 4758811 6698203 3982849
40542 3982849 -2350017 -5235702 -1715820 1947146 -215466 -4502513 -3435334 2899251
40534 2899251 7752171 7613017 5051273 2791761 678940 -1388598 -2163293 -1320798 221183
$$ packed form
40595b234159m317840j492649L160510L343161J575212K045753J901496k405977
40587A575507o706654n240306k28547K229330J476184M57715r30612l270923k875881
40578a3514187K282703O012233K149978m217137l642740K295528L520058j733876
40570f847440m381654M7388M797299L932313P80270l7706L1111q71978q6091L297456
40560F60968M440276Q67730j978085N66753M173467K638340k068363l886578k419046
40551B995462j503669j592558n18109R83630J006992R99231K387832J939392k715354
40542C982849o332866k885685L519882L662966k162612m287047J067179O334585
40534B899251M852920j39154k561744k259512k112821k067538p74695Q42495J541981
$$ plain form
40525 221183 2277330 4917895 6597988 5623356 2771300 -207464 -3353768 -6649213
40517 -6649213 -7230084 -2852739 2873303 3753392 -232088 -2224466 2207525 9185195
40509 9185195 11850600 8399965 2704818 -821527 -977932 341007 631451 -475546
40501 -475546 -1028638 71241 1026188 50373 -1195229 93162 3154779 4514924 2975828
40492 2975828 430794 -1917141 -4606615 -7230311 -8188009 -7320387 -5699532 -3168955
40484 -3168955 458895 2647852 1095667 -1217201 601752 5047319 5671305 1662879
40476 1662879 -346815 2482012 3813743 -1419010 -8000381 -8140984 -3036579 202738
40468 202738 -513452 -1449746 -723736 94332 669803 1883813 2100948 -571012 -3162850
$$ packed form
40525B21183K056147K640565J680093r74632k852056k978764l146304l295445
40517f649213n80871M377345N726042Q80089l985480j992378M431991O977670
40509I185195K665405l450635n695147l526345j56405J318939K90444j106997
40501d75546n53092J099879R54947r75815j245602J288391L061617J360145j539096
40492B975828k545034k347935k689474k623696r57698Q67622J620855K530577
40484c168955L627850K188957j552185k312868J818953M445567O23986m008426
40476A662879k009694K828827J331731n232753o581371j40603N104405L239317
40468B02738p16190r36294P26010Q18068N75471J214010K17135k671960k591838
$$ plain form
40459 -3162850 -1129481 3732012 5027211 1536587 -1309576 -541528 548948 -372161
40451 -372161 -374705 2459666 4287072 1495733 -2922056 -3741074 -1190621 247415 -1349296
40442 -1349296 -3795822 -4671761 -3308142 -58214 3445156 4430679 2112174 -445258
40434 -445258 -91894 2077623 2761604 1391478 55037 -354046 -689370 -989541 -545472
40425 -545472 -74059 -749704 -1494347 -495905 882404 -569042 -4404541 -6289724 -4306516
40416 -4306516 -1652924 -1282965 -1461498 695534 4113620 5359396 3569669 885230
40408 885230 -846532 -1320686 -782699 -57840 -574435 -2296901 -2830773 -673799 2159025
40399 2159025 3191946 3362233 4639661 5480233 2829216 -2233361 -5397010 -5454599 -5001623
$$ packed form
40459c162850K033369M861493J295199l490624k846163P68048J090476r21109
40451c72161k544K834371J827406k791339m417789q19018K550453J438036j596711
40442a349296k446526q75939J363619L249928L503370R85523k318505k557432
40434d45258L53364K169517O83981j370126j336441m09083l35324l00171M44069
40425e45472M71413o75645p44643R98442J378309j451446l835499j885183J983208
40416d306516K653592L69959j78533K157032L418086J245776j789727k684439
40408H85230j731762m74154N37987P24859n16595j722466n33872K156974K832824
40399B159025J032921J70287J277428Q40572k651017n062577l163649n7589M52976
$$ plain form
40390 -5001623 -4647016 -1987033 2376871 3633711 406802 -1723243 1670365 6744406
40382 6744406 7186805 3548821 1417943 2763533 4602271 4822868 4128343 2968425 1263623
40373 1263623 598790 2350998 4433698 4256769 3679962 5909498 8725809 7160015 2611518
40364 2611518 2068809 6970945 10160943 6790177 1432882 111283 1220079 -58874
40356 -58874 -2782155 -2056556 2448327 5599080 3870136 -900736 -4649981 -4945193 -2007500
40347 -2007500 1861854 4236829 5071532 5981039 6580285 4498063 297443 -1425433 1647925
40338 1647925 5823264 7105671 6934349 8184967 8942228 5557950 -216460 -2714665
40330 -2714665 -311078 2826144 2822170 30690 -3045025 -4435060 -3486717 -1751821 -2467852
$$ packed form
40390e001623L54607K659983M363904J256840l226909k130045L393608N074041
40382F744406M42399l637984k130878J345590J838738K20597o94525j159918j704802
40373A263623o64833J752208K082700j76929n76807K229536K816311j565794m548497
40364B611518n42709M902136L189998l370766n357295j321599J108796j278953
40356e8874k723281P25599M504883L150753j728944m770872l749245k95212K937693
40347b007500L869354K374975Q34703R09507N99246k082222m200620j722876L073358
40338A647925M175339J282407j71322J250618P57261l384278n774410k498205
40330b714665K403587L137222l974k791480l075715j390035R48343J734896p16031
$$ plain form
40321 -2467852 -6599033 -10553595 -10456603 -7046530 -3539556 -988752 658708 -394646
40313 -394646 -4875171 -8672206 -7416356 -3403114 -2357268 -4418008 -4446963 -788929 2815719
40304 2815719 4398601 6151082 8376745 7686848 3628824 1081469 2780009 4569603
40296 4569603 1833577 -3445565 -5857898 -3760079 48320 2446033 2003942 -1049750
40288 -1049750 -4544419 -5743849 -4548510 -3540630 -4081475 -4838911 -4831538 -4878323 -5052266
40279 -5052266 -3782781 -622505 2825418 5295581 6309059 4551446 -272376 -4436200
40271 -4436200 -4109397 -2059284 -4211697 -9158995 -8799989 -1472574 3951041 1221720
40263 1221720 -4032887 -3960814 -67582 2087793 3418109 7735666 12180301 10819371
$$ packed form
40321b467852m131181l954562R6992L410073L506974K550804J647460j053354
40313c94646m480525l797035J255850M013242J045846k060740k8955L658034L604648
40304B815719J582882J752481K225663o89897m058024k547355J698540J789594
40296D569603k736026n279142k412333K097819L808399K397713m42091l053692
40288a049750l494669j199430J195339J007880n40845p57436P373m6785j73943
40279e052266J269485L160276L447923K470163J013478j757613m823822m163824
40271d436200L26803K050113k152413m947298L59006P327415N423615k729321
40263A221720n254607P2073L893232K155375J330316M317557M444635j360930
$$ plain form
40255 10819371 5509095 3837829 6842176 7518916 2386148 -3440233 -4844579 -3661667
40247 -3661667 -3907317 -5092909 -3873278 541188 5441896 7775048 6961152 5325808
40239 5325808 5570706 7157887 6890565 4347326 3653306 7020317 9992679 7647832 2676496
40230 2676496 1606423 4804314 6561065 4523649 2558038 3505468 5085358 4783528
40222 4783528 3812099 3902292 3980363 2337201 -447542 -2306416 -1765099 949126 3276607
40213 3276607 2007034 -2093313 -3530384 558906 5001530 3497637 -1626664 -2976126
40205 -2976126 419918 2720899 1740546 1529434 3684648 4466894 2791246 3088886 6943107
40196 6943107 9262843 6778292 3682708 4473519 7224180 8375467 8458597 8557522 6722503
$$ packed form
40255A0819371n310276j671266L004347O76740n132768n826381j404346J182912
40247c661667k45650j185592J219631M414466M900708K333152q13896j635344
40239E325808K44898J587181k67322k543239o94020L367011K972362k344847m971336
40230B676496j070073L197891J756751k037416j965611R47430J579890l01830
40222D783528r71429R0193P8071j643162k784743j858874N41317K714225K327481
40213C276607j269573m100347j437071M089290M442624j503893n124301j349462
40205b976126L396044K300981r80353k11112K155214P82246j675648K97640L854221
40196F943107K319736k484551l095584P90811K750661J151287Q3130R8925j835019
$$ plain form
40187 6722503 2634539 397145 1916678 3035182 1099344 265113 3632365 6566790
40179 6566790 4723559 2372479 4524992 6684984 2248328 -4634697 -4736634 717565
40171 717565 2108591 -2068267 -3129732 2061097 5411250 1629080 -2623226 394030
40163 394030 7502716 10110662 6166267 597930 -2272661 -1663791 1415192 4721809
40155 4721809 5699796 4500014 3844249 4539155 4511720 3443046 3950989 6537516 8193128
40146 8193128 7991484 8728912 10489557 8521341 1227435 -5486637 -6465269 -4572056 -4550138
40137 -4550138 -4890378 -2119336 1407726 1339323 -406450 1120433 4767116 5334321 3351465
40128 3351465 4417553 8758518 9831260 5095590 600793 1696477 5346323 5531060
$$ packed form
40187F722503m087964k237394J519533J118504j935838q34231L367252K934425
40179F566790j843231k351080K152513K159992m436656o883025j01937N454199
40171G17565J391026m176858j061465N190829L350153l782170m252306L017256
40163C94030P108686K607946l944395n568337k870591O08870L078983L306617
40155D721809R77987j199782o55765O94906k7435j068674N07943K586527J655612
40146H193128k01644P37428J760645j968216p293906o714072r78632J893213K1918
40137d550138l40240K771042L527062o8403j745773J526883L646683N67205j982856
40128C351465J066088M340965J072742m735670m494797J095684L649846J84737
$$ plain form
40120 5531060 1709750 -1919938 -2455296 -528365 1245000 260784 -3379036 -5589571
40112 -5589571 -2981143 1083791 -14663 -5694103 -7368679 -961805 5987989 4678929
40104 4678929 -2484791 -6043431 -2854469 1417053 1712801 -943070 -3346501 -3898486
40096 -3898486 -1784131 2756287 6198873 4132359 -2551617 -7583218 -7066943 -3827793
40088 -3827793 -2143470 -1698532 255151 3371579 4564030 2874633 715327 217377
40080 217377 971089 2061964 4154560 7872535 11116612 10251992 4806810 -549199 -786544
40071 -786544 2995134 4376589 -174635 -6576392 -8826423 -7014108 -5907369 -6802897
40063 -6802897 -5686260 -393633 5038858 5935002 3632979 3078986 5646506 7997360
$$ packed form
40120E531060l821310l629688n35358J926931J773365r84216l639820k210535
40112e589571K608428M064934j098454n679440j674576O406874O949794j309060
40104D678929p163720l558640L188962M271522K95748k655871k403431n51985
40096c898486K114355M540418L442586k066514o683976n031601N16275L239150
40088c827793J684323M44938J953683L116428J192451j689397k159306m97950
40080B17377P53712J090875K092596L717975L244077q64620n445182n356009k37345
40071g86544L781678J381455m551224o401757k250031J812315J106739q95528
40063f802897J116637N292627N432491Q96144k302023n53993K567520K350854
$$ plain form
40055 7997360 7461834 5221707 3752899 3680044 4098384 4342312 4490385 4998354 6268583
40046 6268583 7972862 8971010 8778065 8610153 9542666 10121878 8044875 4468342 3964921
40037 3964921 8608782 14183008 14688141 9564160 3938524 2200985 4043419 6950620
40029 6950620 9430916 10419776 8441773 4035157 1065247 2416414 5485444 5543456 3137234
40020 3137234 3821672 9562136 14899539 14372922 10033991 7643390 8045107 7209210 3703774
40011 3703774 901621 1249201 3061351 4590577 7097187 11275953 13925396 11577117
40003 11577117 5633285 775073 -782713 -802321 -1451062 -2808782 -3957224 -4437085 -4118993
39994 -4118993 -2955790 -1299515 289942 1663396 3023349 4439638 5777729 6664631
$$ packed form
40055G997360n35526k240127j468808p2855M18340K43928J48073N07969J270229
40046F268583J704279R98148j92945j67912R32513N79212k077003l576533n03421
40037C964921M643861N574226N05133n123981n625636j737539J842434K907201
40029F950620K480296R88860j978003m406616k969910J351167L069030N8012k406222
40020C137234O84438N740464N337403n26617m338931k390601M01717q35897l505436
40011C703774k802153L47580J812150J529226K506610M178766K649443k348279
40003A1577117n943832m858212j557786j9608o48741j357720j148442m79861L18092
39994d118993J163203J656275J589457J373454J359953J416289J338091Q86902
$$ plain form
39986 6664631 6336119 4434502 2282785 1990267 3474541 3878566 1362546 -1765255 -1546082
39977 -1546082 2657951 7484817 9588585 8645788 6314851 3907932 2001046 1543890
39969 1543890 4042441 9772766 15908698 17885922 14123468 8664071 7138497 10404654
39961 10404654 14426413 16090508 15905550 14634531 11398988 6921062 4707654 6224160
39953 6224160 8271506 8153816 7825277 9149984 8992682 4409830 -464884 595278 5840600
39944 5840600 7679523 4309665 1568374 2383170 2362012 -1398149 -4496618 -2497395 2084594
39935 2084594 4970430 7062908 10707068 13487385 12144191 9584272 11277019 16285679
39927 16285679 18342474 15421435 12342620 13409914 17597721 21871538 24654407 24926172
$$ packed form
39986F664631l28512j901617k151717k92518J484274M04025k516020l127801K19173
39977a546082M204033M826866K103768r42797k330937k406919j906886m57156
39969A543890K498551N730325O135932J977224l762454n459397j525574L266157
39961A0404654M021759J664095j84958j271019l235543m477926k213408J516506
39953F224160K047346j17690l28539J324707j57302m582852m874714J060162N245322
39944E840600J838923l369858k741291Q14796k1158l760161l098469J999223M581989
39935B084594K885836K092478L644160K780317j343194k559919J692747N008660
39927A6285679K056795k921039l078815J067294M187807M273817K782869K71765
$$ plain form
39919 24926172 22265147 19327732 20355655 25312734 28854915 27057404 22059846 17990353
39911 17990353 15484419 13137526 11762290 13390581 17102231 19384511 18767068 17381410
39903 17381410 17364947 18010321 17584380 16219800 15331670 15087591 14417853 13511697 14223420
39894 14223420 16956437 18960147 17805967 15400639 15653060 18415313 19242086 16078612
39886 16078612 12448568 11779400 12121022 10066119 7026317 6823505 8654778 7865048 3570422
39877 3570422 157212 207096 1051370 332192 179176 2817141 6078102 6994788 6596497
39868 6596497 7065401 6922840 3884797 700519 2713137 9813680 15829563 16719745 14932113
39859 14932113 14259280 14705709 14926003 16069470 19601501 23495314 24370485 22583651 21889401
$$ packed form
39919B4926172k661025k937415J027923M957079L542181j797511m997558m069493
39911A7990353k505934k346893j375236J628291L711650K282280o17443j385658
39903A7381410j6463O45374m25941j364580q88130k44079o69738r06156P11723
39894A4223420K733017K003710j154180k405328K52421K762253Q26773l163474
39886A6078612l630044o69168L41622k054903l039802k02812J831273p89730m294626
39877C570422l413210M9884Q44274p19178j53016K637965L260961R16686l98291
39868F596497M68904j42561l038043l184278K012618P100543O015883Q90182j787632
39859A4932113o72833M46429K20294J143467L532031L893813Q75171j786834o94250
$$ plain form
39850 21889401 24181483 27587114 30268337 33303184 38482109 45536189 53642857 64285826
39842 64285826 80013633 100419112 121481618 139277214 152191333 158541103 154810766
39835 154810766 139523312 117964429 99181193 87120983 77682235 66203797 54783928
39828 54783928 48987604 49471338 51238603 50730856 49284814 48903731 49031528 49572138 53208433
39819 53208433 61424110 70832101 76849696 78986751 79050133 76320506 69269807 60960005
39811 60960005 57182181 58633697 60183743 59363988 60050228 64655423 68004568 64223699
39803 64223699 56142127 51558176 51873422 51141628 46472759 42425959 42685583 43570965 40348689
39794 40348689 35501265 34706902 36806367 34490620 25602091 17783890 18885830 26791302
$$ packed form
39850B1889401K292082L405631K681223L034847N178925P054080Q106668J0642969
39842F4285826J5727807K0405479K1062506J7795596J2914119O349770l730337
39835A54810766j5287454k1558883j8783236j2060210r438748j1478438j1419869
39828E4783928n796324M83734J767265n07747j446042l81083J27797N40610L636295
39819E3208433Q215677R407991O017595K137055O3382k729627p050699q309802
39811F0960005l777824J451516J550046q19755O86240M605195L349145l780869
39803F4223699q081572m583951L15246p31794m668869m046800K59624Q85382l222276
39794D0348689m847424p94363K099465k315747q888529p818201J101940P905472
$$ plain form
39786 26791302 32776301 32644547 30029135 29292175 29822246 28784642 25915328 23043946
39778 23043946 21119728 20321616 21376904 23861812 24594907 21317213 17345897 18401797
39770 18401797 24311182 28292265 26375784 23324248 25752656 32508838 36415248 34152520
39762 34152520 29842122 28692757 31013246 33787470 35431493 37181395 40906147 46695258
39754 46695258 52469222 56070978 57801627 59701010 61880869 61783456 58567091 55633298
39746 55633298 56137517 58359557 58978456 58691568 60072608 61573774 59324231 54524346
39738 54524346 53057182 56763157 60743010 61086967 59876367 60076913 60782010 61053695 63925016
39729 63925016 72213597 83424052 92751111 98963756 104488517 112277257 124925232 143141531
$$ packed form
39786B6791302N984999j31754k615412p36960N30071j037604k869314k871382
39778B3043946j924218p98112J055288K484908P33095l277694l971316J055900
39770A8401797N909385L981083j916481l051536K428408O756182L906410k262728
39762C4152520m310398j149365K320489K774224J644023J749902L724752N789111
39754D6695258N773964L601756J730649J899383K179859r7413l216365k933793
39746E5633298N04219K222040O18899k86888J381040J501166k249543m799885
39738E4524346j467164L705975L979853L43957j210600K00546P05097K71685K871321
39729F3925016Q288581J1210455R327059O212645N524761P788740J2647975J8216299
$$ plain form
39721 143141531 161849967 171707506 168633202 158529282 148673774 138637171 124847130
39714 124847130 109547814 97616726 87264052 72729310 55936339 46711363 49203908
39707 49203908 55339306 55314987 49115198 43632978 42500039 43291527 42829714 41386676 41548226
39698 41548226 44550754 48145670 48543464 45024420 41123487 39726961 39263962 37513033
39690 37513033 36494448 39186919 43585767 45656761 46853618 52218048 61428595 69018972
39682 69018972 74365837 83677152 99504269 115919188 128393937 141711469 162366470
39675 162366470 188183093 211330312 227656291 237359134 240107969 235998756 229200840
39668 229200840 224677571 222590877 220954094 221889345 229328308 241386487 250799863 252880187
$$ packed form
39721A43141531J8708436R857539l074304j0103920r855508j0036603j3790041
39714A24847130j5299316j1931088j0352674j4534742j6792971r224976K492545
39707D9203908O135398k4319o199789n482220j132939P91488m61813j443038J61550
39698D1548226L002528L594916L97794l519044l900933j396526m62999j750929
39690C7513033j018585K692471M398848K070994J196857N364430R210547P590377
39682F9018972N346865R311315J5827117J6414919J2474749J3317532K0655001
39675A62366470K5816623K3147219J6325979R702843K748835m109213o797916
39668B29200840m523269k086694j636783R35251P438963J2058179R413376K080324
$$ plain form
39660 252880187 247979919 236533044 217794403 194642028 173849494 158868612 146400422
39653 146400422 132710331 119871224 112735714 112117510 114025643 114563272 113324797 112392920
39645 112392920 113418619 115655535 116575209 114766584 111573249 108523771 104088918 95713383
39637 95713383 85018057 77538228 75831297 75872032 72787587 67820804 66157727 69062837
39629 69062837 72342591 73177649 74400193 79497564 86393993 90155576 90512190 91913818
39621 91913818 95472176 95689976 88028354 76080768 67256168 63650862 61475022 57937987
39613 57937987 53940736 50636617 48239516 48193157 51420613 53986363 50156310 41249433
39605 41249433 35695806 37851793 42442035 43365324 42077738 42436237 42758179 39675791
$$ packed form
39660B52880187m900268j1446875j8738641k3152375k0792534j4980882j2468190
39653A46400422j3690091j2839107p135510o18204J908133N37629j238475r31877
39645A12392920J025699K236916R19674j808625l193335l049478m434853q375535
39637I5713383j0695326p479829j706931M0735l084445m966783j663077K905110
39629F9062837L279754Q35058J222544N097371O896429L761583L56614J401628
39621I1913818L558358K17800p661622j1947586q824600l605306k175840l537035
39613E7937987l997251l304119k397101m6359L227456K565750l830053q906877
39605D1249433n553627K155987M590242R23289j287586L58499L21942l082388
$$ plain form
39597 39675791 36092218 37831581 44089951 48249545 47779412 46923603 49060421 52172557
39589 52172557 53246836 52395781 50896944 48833546 46282531 44153855 42927581 42665367
39581 42665367 44003936 46474094 46627182 41450656 33360943 28065386 27550646 29032056
39573 29032056 30740249 34153736 39532566 43606223 43726184 41333304 39672320 40340743
39565 40340743 42976399 46098701 47804715 47791869 48362647 50820986 51988966 48267904
39557 48267904 42374383 40942464 45067077 48528758 46717983 42139648 38962962 37060024
39549 37060024 34492033 31804098 30323532 29144228 27059949 25351549 25939396 28332939
39541 28332939 30272471 29980107 26951045 22498401 19779785 20619635 22380273 21426973
$$ packed form
39597C9675791l583573J739363O258370M159594m70133q55809K136818L112136
39589E2172557J074279q51055j498837k063398k551015k128676j226274k62214
39581D2665367J338569K470158J53088n176526q089713n295557n14740J481410
39573B9032056J708193L413487N378830M073657J19961k392880j660984O68423
39565D0340743K635656L122302J706014j2846N70778K458339J167980l721062
39557D8267904n893521j431919M124613L461681j810775m578335l176686j902938
39549C7060024k567991k687935j480566j179304k084279j708400N87847K393543
39541B8332939J939532k92364l029062m452644k718616Q39850J760638r53300
$$ plain form
39533 21426973 19328100 20871871 25827354 28595921 27293214 26698936 29635132 31887983
39525 31887983 29427565 24728273 21645176 19728334 18353883 20612824 27262688 32270566
39517 32270566 31123209 28795810 32107428 38512224 40844442 39727667 41983002 48911627
39509 48911627 56130749 64293402 79089096 98455335 109721800 104215361 87803497
39502 87803497 72493176 63123268 56508920 48833225 39314626 29739479 23690131 23428327
39494 23428327 25505431 23278114 15926913 10411378 11552631 15129976 15096085 13048367
39486 13048367 14644241 19643770 22263270 20545607 18890262 20213973 21135721 17665848
39478 17665848 11845487 9111483 10817367 12892559 11954733 9896595 10867088 15245956
$$ packed form
39533B1426973k098873J543771M955483K768567j302707n94278K936196K252851
39525C1887983k460418m699292l083097j916842j374451K258941O649864N007878
39517C2270566j147357k327399L311618O404796K332218j116775K255335O928625
39509D8911627P219122Q162653J4795694J9366239J1266465n506439j6411864
39502H7803497j5310321r369908o614348p675695r518599r575147o049348k61804
39494B3428327K077104k227317p351201n515535J141253L577345l3891k047718
39486A3048367J595874M999529K619500j717663j655345J323711R21748l469873
39478A7665848n820361k734004J705884K075192r37826k058138R70493M378868
$$ plain form
39470 15245956 19014288 19268012 18132014 19696545 24406312 28514049 28691390 25380193
39462 25380193 21637438 20241435 21951934 25138314 27044296 26689920 26289220 28358121
39454 28358121 31982497 34132969 34548947 36672115 42904644 51162055 57433883 60158643
39446 60158643 60754465 61165671 62577084 66088204 73058870 83951320 96954986 108548264
39438 108548264 116458177 121933053 127531116 132367697 131891389 123786334 111755544 101155689
39430 101155689 92947311 84876902 76769155 70819686 67534276 65158865 62705007 59950723
39422 59950723 55064139 46512927 37345738 33055716 34475354 37092686 38216610 40040065
39414 40040065 44099349 47829352 49428544 51582929 56649816 61810922 63234304 62473085
$$ packed form
39470A5245956L768332K53724j135998J564531M709767M107737J77341l311197
39462B5380193l742755j396003J710499L186380J905982l54376m00700K068901
39454B8358121L624376K150472M15978K123168O232529Q257411O271828K724760
39446F0158643N95822M11206J411413L511120O970666J0892450J3003666J1593278
39438A08548264P909913N474876N598063M836581m76308q105055j2030790j0599855
39430A01155689q208378q070409q107747n949469l285410k375411k453858k754284
39422E9950723m886584q551212r167189m290022J419638K617332J123924J823455
39414D0040065M059284L730003J599192K154385N066887N161106J423382p61219
$$ plain form
39406 62473085 64525518 71164002 79870801 88028883 94580621 98524669 99392417 98991604
39398 98991604 99599835 100325561 97923448 91657563 85132062 82326979 83017804 83089419 79292260
39389 79292260 73223987 69686653 70545518 71857164 69272014 64763804 64067101 67774084
39381 67774084 69974302 67173905 63645075 65090859 71204285 77857259 82691927 84560635
39373 84560635 81363674 73716990 67787712 68420822 71165914 67421686 56830799 48009729
39365 48009729 46229180 46760839 42870192 35086975 28880756 26704380 26276300 24928017
39357 24928017 22311989 19411481 17194336 16218118 16322081 16748365 17014913 17325488 18091195
39348 18091195 19625172 21970113 24131693 24108993 21090409 17107335 14898510 14612228
$$ packed form
39406F2473085K052433O638484Q706799Q158082O551738L944048Q67748m00813
39398I8991604O08231P25726k402113o265885o525501k805083O90825P1615l797159
39389G9292260o068273l537334Q58865J311646k585150m508210o96703L706983
39381F7774084K200218k800397l528830J445784O113426O652974M834668J868708
39373H4560635l196961p646684n929278O33110K745092l744228j0590887q821070
39365D8009729j780549N31659l890647p783217o206219k176376m28080j348283
39357B4928017k616028k900508k217145r76218J03963M26284K66548L10575P65707
39348A8091195J533977K344941K161580k2700l018584l983074k208825k86282
$$ plain form
39340 14612228 14384717 13541395 12876752 12057426 9555711 5720550 3405492 4449693 7392501
39331 7392501 9713813 10794464 11652487 12993832 14493021 15271573 14675760 13279925 12985488
39322 12985488 14976741 17701163 18257635 15879209 12830213 11853269 13782303 17326706
39314 17326706 19989778 19727327 17055622 14826207 14578270 14455445 12666162 11137161
39306 11137161 12520395 15067489 14769939 12078356 11691421 15084674 18106659 17580586
39298 17580586 15682192 15352916 15611632 14639342 13935465 15577003 17943877 18020128 16094029
39289 16094029 14606053 13921396 12821536 11891583 12693365 14305778 14254939 12629096 12121565
39280 12121565 14169076 17919889 22563337 27424914 30095949 28383011 24703673 24646376
$$ packed form
39340A4612228k27511q43322o64643q19326k501715l835161k315058J044201K942808
39331G392501K321312J080651Q58023J341345J499189P78552n95813j395835k94437
39322A2985488J991253K724422N56472k378426l048996r76944J929034L544403
39314A7326706K663072k62451k671705k229415k47937j22825j789283j529001
39306A1137161J383234K547094k97550k691583l86935L393253L021985n26073
39298A7580586j898394l29276K58716r72290p03877J641538K366874P6251j926099
39289A6094029j487976o84657j099860r29953Q01782J612413n0839j625843n07531
39280A2121565K047511L750813M643448M861577K671035j712938l679338n7297
$$ plain form
39272 24646376 29614387 34247726 33245459 27934120 23512143 22043997 21364135 19764019
39264 19764019 18433053 18982480 20983861 22827201 23575001 23256359 22406107 21991631 22870985
39255 22870985 24405847 24180522 20267623 13917143 9122523 8990545 12933749 17727253
39247 17727253 20627697 20835620 18878186 16162125 14835224 16106103 18258524 18282260
39239 18282260 16326002 16301488 20298749 24484738 23474503 17756777 13471861 14712132
39231 14712132 19105100 21867479 21507768 20046771 19723678 21230397 23726233 25052934
39223 25052934 23231417 19213178 16856685 18538693 21896785 22652140 19753883 15970093
39215 15970093 14110836 14392407 14990506 13747650 10128634 6868882 8286762 14964880
$$ packed form
39272B4646376M968011M633339j002267n311339m421977j468146o79862j600116
39264A9764019j330966N49427K001381J843340P47800l18642q50252m14476Q79354
39255B2870985J534862k25325l912899o350480m794620j31978L943204M793504
39247A7727253K900444K07923j957434k716061j326901J270879K152421K3736
39239A8282260j956258k4514L997261M185989j010235n717726m284916J240271
39231A4712132M392968K762379l59711j460997l23093J506719K495836J326701
39223B5052934j821517m018239k356493J682008L358092P55355k898257l783790
39215A5970093j859257K81571N98099j242856l619016l259752J417880O678118
$$ plain form
39207 14964880 21728756 23710855 22902255 25043115 31265588 37528315 41850551 46521034
39199 46521034 52807748 60412849 74121037 102084375 140752700 168509205 164914991
39192 164914991 134521664 102164530 84841739 78151146 72498050 71171462 83650604
39185 83650604 106964779 123947430 120399268 98037945 69831739 47392620 34443103
39178 34443103 28541973 25481294 22260818 17963305 13424799 10504475 10586065 12501760
39170 12501760 12855596 10353086 8752345 12328825 18897381 21582223 18098257 13457355
39162 13457355 11773026 10710844 7392962 4612827 5972373 8708728 7528322 3268366
39154 3268366 1457955 3418296 5005259 4077438 3323827 4903937 7457171 9459308
$$ packed form
39207A4964880O763876J982099q08600K140860O222473O262727M322236M670483
39199D6521034O286714P605101J3708188K7963338L8668325K7756505l594214
39192A64914991l0393327l2357134j7322791o690593n653096j326588J2479142
39185H3650604K3314175J6982651l548162k2361323k8206206k2439119j2949517
39178C4443103n901130l060679l220476m297513m538506k920324Q1590J915695
39170A2501760L53836k502510j600741L576480O568556K684842l483966m640902
39162A3457355j684329j062182l317882k780135J359546K736355j180406m259956
39154C268366j810411J960341J586963r27821p53611J580110K553234K002137
$$ plain form
39146 9459308 10836177 10338090 6242269 962101 -140325 3450147 5705877 2792594
39138 2792594 -1226858 -965212 2158393 2883172 369931 -1378942 -95002 2197017
39130 2197017 3185770 3301020 3865494 4544960 3954924 1969014 390248 881212 2467563
39121 2467563 2459378 662140 607169 4240640 7517410 5429661 219346 -880380 3616631
39112 3616631 7032212 4736845 659459 79618 1633933 1686898 2049061 6735432 13609006
39103 13609006 16027739 12150980 6762365 3735752 1971069 -436651 -2749874 -3749773
39095 -3749773 -3604670 -2240165 906069 4316162 4820873 2175171 331806 2174315
39087 2174315 5200034 4618615 -609589 -6764747 -9774378 -9222189 -8013715 -8661713 -10145590
$$ packed form
39146I459308J376869m98087m095821n280168j102426L590472K255730k913283
39138B792594m019452K61646L123605P24779k513241j748873J283940K292019
39130B197017R88753J15250N64474O79466n90036j985910j578766M90964J586351
39121B467563q185j797238n4971L633471L276770k087749n210315j099726M497011
39112C616631L415581k295367m077386n79841J554315N2965L62163M686371O873574
39103A3609006K418733l876759n388615l026613j764683k407720k313223r99899
39095c749773J45103J364505L146234L410093N04711k645702j843365J842509
39087B174315L025719n81419n228204o155158l009631N52189J208474o47998j483877
$$ plain form
39078 -10145590 -9057411 -4333382 311099 216731 -4613236 -9562172 -10715086 -8156562
39070 -8156562 -4027193 434658 5026078 9284362 12231391 13016031 11522515 8685524
39062 8685524 6012151 4389687 3827837 4510750 6656897 8599682 7157509 1989664
39054 1989664 -2098285 -65473 6873668 12378574 12217006 7790587 2848015 -274105
39046 -274105 -857491 771800 2990723 4121735 4588995 5960789 7700296 7416215 4952824
39037 4952824 3471004 5114610 7933510 8805063 7583541 6515853 6781674 7289130 6210474
39028 6210474 2690490 -2108422 -4941465 -2803642 3515493 9319134 10723495 8594971
39020 8594971 6535146 5911960 4723422 1237714 -3060588 -5060202 -3732366 -1152628
$$ packed form
39078a0145590J088179M724029M644481r4368m829967m948936j152914K558524
39070h156562M129369M461851M591420M258284K947029P84640j493516k836991
39062H685524k673373j622464n61850O82913K146147J942785j442173n167845
39054A989664m087949K032812O939141N504906j61568m426419m942572l122120
39046b74105n83386J629291K218923J131012M67260J371794J739507k84081k463391
39037D952824j481820J643606K818900Q71553j221522j067688K65821N07456j078656
39028F210474l519984m798912k833043K137823O319135N803641J404361k128524
39020H594971k059825o23186j188538l485708m298302j999614J327836K579738
$$ plain form
39012 -1152628 233444 409844 1036600 2421212 2732487 701201 -2173494 -3122392 -1113149
39003 -1113149 2356030 4722379 4157235 1136867 -1109294 698381 5722352 9340753
38995 9340753 8943149 7162815 7325487 8156359 6236189 1975694 -680725 173711 2559614
38986 2559614 3893223 2994587 -479092 -5181562 -7346214 -4675595 -395883 612615
38978 612615 -996905 -644356 1815285 1518387 -2625294 -5157997 -2691573 860076 1427423
38969 1427423 1519448 4900120 9249349 9938123 7734433 6756929 7148050 5842962 3063864
38960 3063864 1855038 1780826 -646277 -4731214 -4910659 661275 5969516 4780590 -1066931
38951 -1066931 -4460490 -2033137 2910250 5680532 5435145 4395611 3679416 1890109
$$ packed form
39012a152628J386072J76400O26756J384612L11275k031286k874695r48898K009243
39003a113149L469179K366349n65144l020368k246161J807675N023971L618401
38995I340753l97604j780334J62672Q30872j920170m260495k656419Q54436K385903
38986B559614J333609q98636l473679m702470k164652K670619M279712J008498
38978F12615j609520L52549K459641k96898m143681k532703K466424L551649N67347
38969A427423R2025L380672M349229O88774k203690r77504L91121j305088k779098
38960C063864j208826p4212k427103m084937j79445N571934N308241j188926n847521
38951a066931l393559K427353M943387K770282k45387j039534p16195j789307
$$ plain form
38943 1890109 -1751899 -4557430 -2926429 2422229 6596085 6902516 6068011 6996796 7411395
38934 7411395 3458403 -3270140 -6850487 -4858380 -1057850 147481 -1643400 -4502825
38926 -4502825 -6985861 -7711889 -5013257 803285 6437302 8612749 7282484 4865769
38918 4865769 3214260 2147946 395015 -2421204 -4517216 -3434361 233927 1929692
38910 1929692 -1790633 -8037778 -10386784 -6966995 -2669029 -2355709 -4792681 -5236018
38902 -5236018 -2034210 1722737 2496468 451154 -1000181 728415 4121519 5016992
38894 5016992 1702773 -2669374 -3974068 -2018511 428812 2077034 3523475 4016348
38886 4016348 1631141 -2841563 -5688243 -5037629 -2819916 -959278 1080435 3385941
$$ packed form
38943A890109l642008k805531J631001N348658M173856L06431q34505R28785M14599
38934G411395l952992o728543l580347J992107L800530J205331j790881k859425
38926d502825k483036p26028K698632N816542N634017K175447j330265k416715
38918D865769j651509j066314j752931k816219k096012J082855L668288J695765
38910A929692l720325o247145k349006L419789M297966L13320k436972m43337
38902e236018L201808L756947P73731k045314j451335J728596L393104Q95473
38894E016992l314219m372147j304694J955557K447323J648222J446441M92873
38886D016348k385207m472704k846680O50614K217713J860638K039713K305506
$$ plain form
38878 3385941 3566840 75033 -4926248 -8346576 -9628014 -9222433 -6081179 316198
38870 316198 7102170 10365240 9697042 8069528 7855163 8880553 9548381 8099738 3788590
38861 3788590 -1494243 -3991627 -2174881 1307456 3260007 3378964 2144292 -1665334
38853 -1665334 -7755122 -11163685 -7293019 871503 5435345 3373738 -963613 -3207486
38845 -3207486 -3648444 -3415866 -1342082 2547795 4671828 2593467 -827971 -1382206 676596
38836 676596 2021901 1496204 474710 -635868 -2620327 -4640563 -4443899 -1617296 1733621
38827 1733621 3646065 3700287 2145248 -65440 -638220 1905885 5033693 3910989 -2428545
38818 -2428545 -8780436 -9367679 -4364696 957408 2730504 2054088 1977263 2994818 3154006
$$ packed form
38878C385941J80899l491807n001281l420328j281438M05581L141254O397377
38870C16198O785972L263070o68198j627514k14365J025390O67828j448643m311148
38861C788590n282833k497384J816746L482337J952551J18957j234672l809626
38853a665334o089788l408563L870666Q164522M563842k061607m337351k243873
38845c207486m40958K32578K073784L889877K124033k078361l421438n54235K058802
38836F76596J345305n25697j021494j110578j984459k020236J96664K826603L350917
38827A733621J912444N4222j555039k210688n72780K544105L127808j122704o339534
38818b428545o351891n87243N002983N322104J773096o76416p6825J017555J59188
$$ plain form
38809 3154006 1835574 1100462 2340341 3572834 2397247 534448 2068821 6964364
38801 6964364 10137062 8617432 5932016 6468255 8825417 8859033 6642700 5183327 3917546
38792 3917546 -274922 -5766022 -6566770 -1524529 3175310 3208606 1549006 1156640 -1080312
38783 -1080312 -7262490 -11207540 -6476214 1828613 2530768 -5289020 -10638864 -6538029
38775 -6538029 1110974 3864907 2338880 2347473 5071212 6958411 6052310 3202227 -727500
38766 -727500 -4435814 -5088515 -1880469 1180663 234006 -2396338 -1510182 2912689 5540232
38757 5540232 3021495 -2667629 -7814458 -9902280 -7372981 -793116 5552959 7271599
38749 7271599 5404338 4615215 5947939 5884675 2882197 -371658 -2491196 -5799693 -10814501
$$ packed form
38809C154006j318432p35112J239879J232493j175587j862799J534373M895543
38801F964364L172698j519630k685416N36239K357162L3616k216333j459373j265781
38792C917546m192468n491100q00748N042241M699839L3296j659600l92366k236952
38783a080312o182178l945050M731326Q304827P02155p819788n349844M100835
38775f538029P649003K753933j526027Q593K723739J887199r06101k850083l929727
38766g27500l708314o52701L208046L061132r46657k630344Q86156M422871K627543
38757E540232k518737n689124n146829k087822K529299O579865O346075J718640
38749G271599j867261p89123J332724o3264l002478l253855k119538l308497n014808
$$ plain form
38740 -10814501 -13351173 -10509825 -5395669 -2260036 -703782 1350606 2551065 826827
38732 826827 -1520681 -741148 1947188 2082069 -641684 -1801137 638733 3130468 1571290
38723 1571290 -3741700 -9117060 -11001594 -8287162 -3463585 -1253704 -3600769 -6628757
38715 -6628757 -5485731 -1305628 374710 -2405800 -5902105 -6562790 -4612378 -1265387
38707 -1265387 2846877 5287191 2802411 -3173852 -6536916 -4584046 -1746487 -2292851
38699 -2292851 -3741783 -1666246 2564913 3744182 372202 -4179045 -6645145 -6358862
38691 -6358862 -4244683 -2610428 -4098074 -7572078 -7527499 -1546977 4540693 4248622 643465
38682 643465 2075648 8760855 11643229 6168911 -346292 1030870 8822226 14114165
$$ packed form
38740a0814501k536672K841348N114156L135633J556254K054388J200459j724238
38732H26827k347508P79533K688336J34881k723753j159453K439870K491735j559178
38723A571290n312990n375360j884534K714432M823577K209881k347065l027988
38715f628757J143026M180103J680338k780510l496305o60685J950412L346991
38707a265387M112264K440314k484780n976263l363064J952870K837559n46364
38699b292851j448932K075537M231159J179269l371980m551247k466100K86283
38691f358862K114179J634255j487646l474004M4579N980522O087670k92071l605157
38682F43465J432183O685207K882374n474318o515203J377162P791356N291939
$$ plain form
38674 14114165 12017460 5595082 347971 -1325238 -920189 -1585422 -4617132 -7284252
38666 -7284252 -5781475 -994599 1459047 -1590554 -6545453 -7952222 -5071538 -1227839
38658 -1227839 863692 484128 -2099809 -5136650 -5658085 -2966260 -277308 -458605 -1956786
38649 -1956786 -1515262 1074169 3783547 5809241 6978504 5816492 2078707 -557004
38641 -557004 1279417 4943397 4998976 1492993 -5620 3235442 7795638 10086830 10681008
38632 10681008 10814867 9164346 4949540 759641 -778760 -606893 -760927 -531292 2034034
38623 2034034 6370354 9828477 10925654 10141144 8465005 7004356 7124807 9254964
38615 9254964 12169655 14626217 16872091 19822661 24316953 32006061 44401731 58811049
$$ packed form
38674A4114165k096705o422378n247111j673209M05049o65233l031710k667120
38666g284252J502777M786876K453646l049601m954899j406769K880684L843699
38658a227839K091531l79564k583937l036841n21435K691825K688952j81297j498181
38649a956786M41524K589431K709378K025694J169263j162012l737785k635711
38641e57004J836421L663980N5579l505983j498613L241062M560196K291192N94178
38632A0681008J33859j650521m214806m189899j538401J71867j54034K29635K565326
38623B034034M336320L458123J097177p84510j676139j460649J20451K130157
38615I254964K914691K456562K245874K950570M494292P689108J2395670J4409318
$$ plain form
38607 58811049 67431698 63996981 50890962 36913252 28067364 22974063 17347834 10155516
38599 10155516 4146807 2172346 4513170 9008871 12625490 13187214 10479179 6063684
38591 6063684 2109496 225150 652730 1906346 1671461 -900996 -3761037 -3771052 -393400
38582 -393400 3059841 2549857 -2411175 -8094535 -10236719 -7938099 -3726042 -532962
38574 -532962 422371 -751051 -3337232 -5732447 -5936333 -3482650 53555 3289270 6359628
38565 6359628 8853711 8401440 3778828 -1829184 -3668833 -1188781 1775265 2434290
38557 2434290 1736394 1379201 1222029 660498 -30553 -898423 -2616214 -4484480 -4262354
38548 -4262354 -1171760 2757129 5203241 5523001 3674498 -353227 -5097530 -8041076
$$ packed form
38607E8811049Q620649l434717j3106019j3977710q845888n093301n626229p192318
38599A0155516o008709j974461K340824M495701L616619N61724k708035m415495
38591F063684l954188j884346M27580J253616k34885k572457k860041j0015L377652
38582c93400L453241n09984m961032n683360k142184K298620M212057L193080
38574e32962R55333j173422k586181k395215k03886K453683L536205L235715L070358
38565F359628K494083m52271m622612n608012j839649K480052K964046O59025
38557B434290o97896l57193j57172n61531o91051q67870j717791j868266K22126
38548d262354L090594L928889K446112L19760j848503m027725m744303k943546
$$ plain form
38540 -8041076 -8495434 -7709146 -5498496 -64664 7507110 12180239 10753814 5824755
38532 5824755 1729709 -461691 -1399801 -190481 3763830 7930087 9100785 7138229
38524 7138229 3777142 -42756 -3061885 -2880974 309818 2064981 -284447 -2797207
38516 -2797207 -759613 3440676 4000250 1177977 426354 2822179 3440905 142579 -2744539
38507 -2744539 -1857449 -225730 -1947931 -5663882 -6924314 -4386718 -623336 1553103
38499 1553103 1345947 -358233 -2255690 -4099468 -6635448 -9011235 -7990060 -2543920
38491 -2543920 2569354 2073282 -2066703 -3140035 520463 3899138 3770789 2669086
38483 2669086 3050303 3720353 4254265 6694362 9851752 8384288 1863149 -1350088 4982615
$$ packed form
38540h041076m54358P86288K210650N433832P571774M673129j426425m929059
38532E824755m095046k191400r38110J209320L954311M166257J170698j962556
38524G138229l361087l819898l019129J80911L190792J755163k349428k512760
38516b797207K037594M200289N59574k822273p51623K395825O18726l298326k887118
38507b744539Q87090J631719j722201l715951j260432K537596L763382K176439
38499A553103k07156j704180j897457j843778k535980k375787J021175N446140
38491b543920N113274m96072m139985j073332L660498L378675j28349j101703
38483B669086L81217O70050N33912K440097L157390j467464o521139l213237O332703
$$ plain form
38474 4982615 15057511 18345970 13072799 5871282 1101758 -2149333 -3998036 -2277990
38466 -2277990 2283316 5489821 5620325 5355167 6754412 8390910 8454076 7100693 4932152
38457 4932152 2520330 2030673 5702504 11657797 14515987 11583240 5791717 1307989
38449 1307989 -1215871 -3541818 -6077434 -7009504 -4514284 852730 5672210 6212317
38441 6212317 2463378 -1425245 -2092453 -768572 -239611 -284539 593330 984291 -1198211
38432 -1198211 -3371618 -717188 5580286 8119642 3211070 -3944261 -6751896 -5442579
38424 -5442579 -4082088 -3056274 513521 6504157 10680375 10010043 5816830 1225612
38416 1225612 -1939622 -3083889 -1912972 1034539 3875958 4604577 2945903 675469
$$ packed form
38474D982615J0074896L288459n273171p201517m769524l251091j848703J720046
38466b277990M561306L206505J30504k65158J399245J636498O3166j353383k168541
38457D932152k411822m89657L671831N955293K858190k932747n791523m483728
38449A307989k523860k325947k535616r32070K495220N367014M819480N40107
38441F212317l748939l888623o67208J323881N28961m4928Q77869L90961k182502
38432a198211k173407K654430O297474K539356m908572p155331k807635J309317
38424e442579J360491J025814L569795N990636M176218o70332m193213m591218
38416A225612l165234j144267J170917K947511K841419P28619j658674k270434
$$ plain form
38408 675469 -177561 501043 986191 280696 -293785 789645 2372623 1801434 -1085708
38399 -1085708 -3336454 -2861567 -1098362 -680373 -2024579 -3442940 -3459088 -1848426 684784
38390 684784 2768262 3029107 1505975 -79509 -190656 842836 1639597 1864610 2742827
38381 2742827 5164033 7455499 6048058 -165060 -6506584 -6419468 8951 4617177
38373 4617177 1229336 -5733122 -7227090 -2091311 2515479 2696639 2595768 5498244
38365 5498244 7138003 2581582 -5240380 -9517773 -8846762 -6916412 -5165046 -1814440
38357 -1814440 2391918 3344343 -228437 -3779874 -1906792 5935605 15276346 20251386
38349 20251386 17594500 9369742 1634328 -1610300 -2353710 -4247016 -6140801 -3973012
$$ packed form
38408F75469q53030O78604M85148p05495n74481J083430J582978n71189k887142
38399a085708k250746M74887J763205M17989j344206j418361j6148J610662K533210
38390F84784K083478K60845j523132j585484j11147J033492P96761K25013Q78217
38381B742827K421206K291466j407441o213118o341524Q7116O428419M608226
38373D617177l387841o962458j493968N135779M606790J81160j00871K902476
38365E498244J639759m556421p821962m277393O71011J930350J751366L350606
38357a814440M206358R52425l572780l551437J873082P842397R340741M975040
38349B0251386k656886q224758p735414l244628p43410j893306j893785K167789
$$ plain form
38341 -3973012 1795590 5568567 3986437 -674440 -5431064 -9929619 -12862167 -10336098
38333 -10336098 -1854430 5897940 6104110 482468 -3682541 -3658152 -3486610 -6534280 -10978360
38324 -10978360 -13954418 -15732758 -17190976 -16410987 -11391276 -4774300 -2365743 -6477082
38316 -6477082 -12813012 -14738456 -9583172 -514070 6566913 7576934 3210173 -1462226
38308 -1462226 -1265179 3836016 8278229 7041004 1693150 -1580911 222766 3701866
38300 3701866 4434107 2797683 2172701 3309353 3650068 1785899 -277856 170509 3465382
38291 3465382 7646081 10268181 10086134 8253528 7577672 9086155 9960739 7030193 1837639
38282 1837639 -614406 1508915 4332821 3298764 -1678457 -7091584 -9577768 -7703915
$$ packed form
38341c973012N768602L772977j582130m660877m756624m498555k932548K526069
38333a0336098Q481668P752370K06170n621642m165009K4389J71542l047670m444080
38324a0978360k976058j778340j458218P79989N019711O616976K408557m111339
38316f477082o335930j925444N155284R069102P080983J010021m366761m672399
38308a462226J97047N101195M442213j237225n347854l274061J803677L479100
38300C701866P32241j636424o24982J136652L40715j864169k063755M48365L294873
38291C465382M180699K622100j82047j832606o75856J508483Q74584k930546n192554
38282A837639k452045K123321K823906j034057m977221n413127k486184J873853
$$ plain form
38274 -7703915 -2427310 2719157 3899144 916683 -2660397 -3977125 -3172123 -681399
38266 -681399 4028097 9105718 9562520 3373435 -4350593 -7037892 -4561308 -1932471
38258 -1932471 -2106136 -4165333 -7010405 -10046146 -10802745 -6723931 207946 4758963
38250 4758963 5015230 3931209 3779191 3186618 1052333 -466680 819234 3507290 4267591
38241 4267591 1568405 -3238845 -6918525 -6233806 -1054570 4401781 5986038 4881609
38233 4881609 5196663 7068806 6981824 4943966 5186209 7951543 7106880 -300400 -7858877
38224 -7858877 -8308699 -3745819 -1550361 -3541926 -5396766 -4637885 -2945937 -1578645
38216 -1578645 -209320 222869 -1204760 -1731375 2101073 7887913 9266208 4876071
$$ packed form
38274g703915N276605N146467J179987k982461l577080j316728Q05002K490724
38266f81399M709496N077621M56802o189085p724028k687299K476584K628837
38258a932471j73665k059197k845072l035741p56599M078814O931877M551017
38250D758963K56267j084021j52018n92573k134285j519013J285914K688056P60301
38241D267591k699186m807250l679680O84719N179236N456351J584257j104429
38233D881609L15054J872143q6982k037858K42243K765334q44663p407280p558477
38224g858877m49822M562880K195458j991565j854840P58881J691948J367292
38216a578645J369325M32189j427629n26615L832448N786840J378295m390137
$$ plain form
38208 4876071 66045 -1293706 -1301916 -2656176 -4014795 -3419828 -2135470 -2119671 -2941756
38199 -2941756 -3811032 -5646521 -8543482 -9902384 -7733612 -3706560 -731622 516854
38191 516854 990002 1453739 2798217 5560321 7695939 5995519 1507835 -193461 3165456
38182 3165456 6321783 3811836 -1874646 -4179328 -1968755 224889 111680 163023 2040944
38173 2040944 3541017 2509909 176549 -950316 15540 2470328 5152390 6320103
38165 6320103 5181079 3278523 2337678 1197603 -2229799 -6415135 -7510224 -5570213
38157 -5570213 -5127609 -8046032 -10144044 -7678552 -3365644 -2082975 -3383091 -2906923
38149 -2906923 225143 2329329 1376221 -394013 -1234349 -3015348 -7145063 -10703348
$$ packed form
38208D876071m810026j359751q210j354260j358619N94967J284358J5799q22085
38199b941756q69276j835489k896961j358902K168772M027052K974938J248476
38191E16854M73148M63737J344478K762104K135618j700420m487684j701296L358917
38182C165456L156327k509947n686482k304682K210573K193644j13209N1343J877921
38173B040944J500073j031108k333360j126865R65856K454788K682062J167713
38165F320103j139024j902556r40845j140075l427402m185336j095089J940011
38157e570213M42604k918423k098012K465492M312908J282669j300116M76168
38149b906923L132066K104186r53108j770234q40336j780999m129715l558285
$$ plain form
38141 -10703348 -10148366 -6983527 -5905500 -7904046 -9003000 -6412934 -2348778 -73724
38133 -73724 753152 2176378 3827010 4146531 4221150 6344204 9165346 8718353 5184566
38124 5184566 4165044 8819991 14549772 15056590 10914574 7802302 7868862 7772341 5259912
38115 5259912 2880418 3432313 5333363 5149138 2642761 695908 1096056 2563862 2948349
38106 2948349 1943159 1071637 1397618 1858473 558323 -2242180 -3785928 -2489672 -460006
38097 -460006 -307913 -713531 1640808 5986277 7248251 3271175 -1324579 -1182565 2540556
38088 2540556 4408934 2623394 710378 1318323 2152402 -169259 -4578151 -6279048
38080 -6279048 -2446742 4467993 9325475 9289521 5854724 2424599 714024 -47541 -986009
$$ packed form
38141a0703348N54982L164839J078027j998546j098954K590066M064156K275054
38133g3724Q26876J423226J650632L19521P4619K123054K821142m46993l533787
38124E184566j019522M654947N729781N06818m142016l112272O6560r6521k512429
38115E259912k379494N51895J901050j84225k506377j946853M00148J467806L84487
38106B948349j005190q71522L25981M60855j300150k800503j543748J296256K029666
38097d60006J52093m05618K354339M345469J261974l977076m595754J42014L723121
38088B540556J868378j785540j913016O07945Q34079k321661m408892j700897
38080f279048L832306O914735M857482l5954l434797l430125j710575p61565r38468
$$ plain form
38071 -986009 -1886018 -1883458 -771386 1035168 2948811 3894903 2607006 -540314 -2859715
38062 -2859715 -2166472 125008 499910 -2007704 -4401847 -3412889 867194 5518306 7508165
38053 7508165 5435456 491142 -3174227 -935271 7433875 16391887 20073845 18406281
38045 18406281 15994969 15857620 16791909 16594544 14886694 12102164 8407031 4892448
38037 4892448 3547911 4524924 5399330 4694203 4047090 4950516 5529693 3337088 -246253
38028 -246253 -1592910 100843 2500874 4197355 5477503 5194875 1089231 -5459896
38020 -5459896 -8714234 -5044735 2264786 7008416 7101850 5392719 4715772 4541984 2493930
38011 2493930 -2052775 -6084903 -5044545 1886013 8955033 8867555 1342528 -5984684
$$ packed form
38071i86009r00009K560J112072J806554J913643R46092j287897l147320k319401
38062b859715O93243K291480L74902k507614k394143R88958M280083M651112J989859
38053G508165k072709m944314l665369K238956Q369146Q958012L681958j667564
38045A8406281k411312j37349R34289j97365j707850k784530l695133l514583
38037D892448j344537R77013Q74406p05127o47113R03426N79177k192605l583341
38028b46253j346657J693753K400031J696481J280148k82628m105644o549127
38020e459896l254338L669499P309521M743630R3434j709131o76947j73788k048054
38011B493930m546705m032128J040358O930558P069020q7478p525027p327212
$$ plain form
38003 -5984684 -6441335 -1403211 3165150 4304085 3495773 2882967 3361646 5090522 6918156
37994 6918156 6304868 2421454 -1819170 -3350610 -3054959 -3383163 -3753708 -2272402 -581268
37985 -581268 -2021329 -5245651 -4980003 -132041 4003416 3683303 2039540 3265054 5594034
37976 5594034 4516833 414499 -1920840 -553485 1308901 796173 -618124 -199599
37968 -199599 1561831 1806644 -505929 -3392856 -4768779 -4812699 -4596858 -3635293 -601923
37959 -601923 3643229 5892089 4651900 2715615 3631871 6523453 6952511 2978294 -2183639
37950 -2183639 -4505275 -4100988 -4210058 -6393677 -8634228 -8272705 -5585063 -3607912 -4500871
37941 -4500871 -6837589 -7312011 -4787928 -1212070 1658208 4321432 7138091 8112755
$$ packed form
38003e984684m56651N038124M568361J138935q08312o12806M78679J728876J827634
37994F918156o13288l883414m240624j531440K95651l28204l70545J481306J691134
37985e81268j440061l224322K65648M847962M135457l20113j643763J225514K328980
37976E594034j077201m102334k335339J367355J862386n12728j414297M18525
37968a99599J761430K44813k312573k886927j375923m3920K15841R61565L033370
37959f01923M245152K248860j240189j936285R16256K891582M29058l974217n161933
37950b183639k321636M04287j09070k183619k240551L61523K687642J977151q92959
37941d500871k336718m74422K524083L575858K870278K663224K816659R74664
$$ plain form
37933 8112755 5529814 1466188 -90891 1932027 5121106 7112737 7139339 4835430
37925 4835430 668643 -2681059 -2603683 -322472 689382 -93955 -252653 427313 -630877
37916 -630877 -3277750 -3494999 -41518 2366504 -160033 -4557662 -5345507 -2177865 1340315
37907 1340315 3870438 6689431 9326334 9571702 7506143 5593768 4809500 4051400 3260073
37898 3260073 3759496 5403825 6546728 7005999 8004984 9115164 8646570 7386929 8118128
37889 8118128 10363960 9658895 4223701 -1318420 -2200699 -643644 -2398880 -7608013
37881 -7608013 -10164262 -6888181 -2614873 -3295154 -7346531 -8218159 -4250261 -850812
37873 -850812 -1722488 -2854925 973947 6982097 7192792 -154674 -7536367 -7983487 -3324252
$$ packed form
37933H112755k582941m063626j557079K022918L189079J991631K6602k303909
37925D835430m166787l349702P7376K281211J011854p83337j58698O79966j058190
37916f30877k646873k17249L453481K408022k526537m397629p87845L167642L518180
37907A340315K530123K818993K636903K45368k065559j912375p84268p58100p91327
37898C260073M99423J644329J142903M59271R98985J110180m68594j259641P31199
37889H118128K245832p05065n435194n542121q82279J557055j755236n209133
37881g608013k556249L276081M273308o80281m051377q71628L967898L399449
37873h50812q71676j132437L828872O008150K10695p347466p381693m47120M659235
$$ plain form
37864 -3324252 116167 129204 -970463 -1848862 -3303620 -4758728 -4033889 -1149755 1062115
37855 1062115 1100656 737521 1627150 2464559 1314576 -955617 -1761339 -704702 -335156
37846 -335156 -2463891 -5087418 -4477236 -263623 3264900 2215252 -1750324 -3487264
37838 -3487264 -1102447 2224655 3487880 3526303 3841590 3094214 -222262 -4011434 -5085489
37829 -5085489 -4061645 -4185522 -6112582 -7467086 -7260196 -7138665 -8021958 -8829794 -8952273
37820 -8952273 -8741609 -7154251 -2598389 2925164 4583294 1600305 -481257 2534634
37812 2534634 6963232 6608942 2350258 934411 4387185 6240473 802017 -7920564
37804 -7920564 -10815802 -5547997 720735 1108836 -2517972 -3481550 34314 3455706
$$ packed form
37864c324252L440419J3037j099667q78399j454758j455108P24839K884134K211870
37855A062115L8541l63135Q89629Q37409j149983k270193q05722J056637L69546
37846c35156k128735k623527O10182M213613L528523j049648l965576j736940
37838c487264K384817L327102J263225L8423L15287p47376l316476l789172j074055
37829e085489J023844j23877j927060j354504K06890J21531q83293q07836j22479
37820h952273K10664J587358M555862N523553J658130k982989k081562L015891
37812B534634M428598l54290m258684j415847L452774J853288n438456q722581
37804g920564k895238N267805O268732L88101l626808r63578L515864L421392
$$ plain form
37796 3455706 3499419 2805396 4857079 7719190 6596758 1286523 -2960009 -2583164 -379262
37787 -379262 -1032588 -4067180 -4235624 1067752 7464718 8593203 4256674 634391 1689201
37778 1689201 3589086 563556 -5999689 -8940378 -5356738 -93182 1955571 1718883
37770 1718883 1451032 -322503 -4616579 -6853207 -2087764 6723309 11770819 10778553
37762 10778553 8498934 8175531 7697922 5259481 3103608 3459960 5124324 6058506 5718326
37753 5718326 3556889 -731224 -4429310 -4034545 -1655252 -3604041 -10269565 -13581328
37745 -13581328 -8588032 -1598733 -998939 -4862395 -4955932 92501 3737622 2689127
37737 2689127 1183125 2786553 4709987 3247470 57319 -480065 2628422 6404868
$$ packed form
37796C455706M3713o94023K051683K862111j122432n310235m246532L76845K203902
37787c79262o53326l034592j68444N303376O396966J128485m336529l622283J054810
37778A689201J899885l025530o563245k940689L583640N263556K048753k36688
37770A718883k67851j773535m294076k236628M765443Q811073N047510r92266
37762A0778553k279619l23403m77609k438441k155873L56352J664364R34182l40180
37753E718326k161437m288113l698086L94765K379293j948789o665524l311763
37745a3581328M993296O989299N99794l863456r3537N048433L645121j048495
37737B689127j506002J603428J923434j462517l190151n37384L108487L776446
$$ plain form
37729 6404868 7959244 7361327 7307901 10357560 15389332 17489011 13583703 7347061 5146422
37720 5146422 7471560 8719178 6227025 4542254 8014290 13347806 13769302 8329671
37712 8329671 2798377 2072012 5212382 7966668 7417455 3883205 332326 82290 3366830
37703 3366830 6332431 5184436 1016676 -1454294 360051 4784324 9305788 13030233
37695 13030233 14868166 12565289 5991376 -573490 -2162627 1614930 6903871 10135260
37687 10135260 10160481 7104664 2128089 -1920216 -2689915 -1670194 -2580184 -5738771 -7050271
37678 -7050271 -3958344 591618 2303749 1086533 -158565 -52633 1123629 3993345
37670 3993345 8938149 13184468 12869180 8082261 2630166 -1140690 -3825383 -5263197
$$ packed form
37729F404868J554376n97917n3426L049659N031772K099679l905308o236642k200639
37720E146422K325138J247618k492153j684771L472036N333516M21496n439631
37712H329671n531294p26365L140370K754286n49213l534250l550879k50036L284540
37703C366830K965601j147995m167760k470970J814345M424273M521464L724445
37695A3030233J837933k302877o573913o564866j589137L777557N288941L231389
37687A0135260K5221l055817m976575m048305p69699J019721r09990l158587j311500
37678g050271L091927M549962J712131j217216j245098J05932J176262K869716
37670C993345M944804M246319l15288m786919n452095l770856k684693j437814
$$ plain form
37662 -5263197 -3583268 780411 3893597 3166571 546167 -894223 -828758 -467933 -323523
37653 -323523 -1006065 -3291121 -5389007 -3424328 2811173 7943509 7949725 5545480 4837008
37644 4837008 4310194 558879 -3882170 -3259078 1823015 4444158 1509877 -2612894
37636 -2612894 -3956170 -4049266 -4680404 -3717869 -69984 2335918 327753 -2741439 -2112017
37627 -2112017 735040 1207438 -43136 1592021 5881747 7108496 3388839 344398
37619 344398 2500643 6113616 4935120 -246899 -2995563 -842277 1666769 445155
37611 445155 -1746594 946363 9292910 17371345 19049422 14286028 8481314 6559076
37603 6559076 8387562 9774342 7469512 2826234 171158 1653782 4713880 5481158
$$ packed form
37662e263197J679929M363679L113186p27026k620404j440390O5465L60825J44410
37653c23523o82542k285056k097886J964679O235501N132336O216k404245p08472
37644D837008n26814l751315m441049O23092N082093K621143k934281m122771
37636b612894j343276r3096o31138R62535L647885K405902k008165l069192O29422
37627b112017K847057M72398j250574J635157M289726J226749l719657l044441
37619C44398K156245L612973j178496n182019k748664K153286K509046j221614
37611D45155k191749K692957Q346547Q078435J678077m763394n804714j922238
37603F559076J828486J386780k304830m643278k655076J482624L060098P67278
$$ plain form
37595 5481158 3748829 2744507 4093521 5411715 4077444 1313566 336408 1715499
37587 1715499 3215771 3745025 4466175 5472124 4327290 -274065 -5356223 -6466058
37579 -6466058 -2900703 1708794 3779332 3204666 2319323 2735957 3864089 4116204 3001979
37570 3001979 1677573 1307978 1432464 768195 -666802 -1522230 -1397765 -1715937 -3501546
37561 -3501546 -5373924 -4852330 -1191732 3785357 7282353 7611409 5377385 2969241
37553 2969241 2215825 2469498 1992554 1026764 1617886 4077620 5946052 5489918 3812417
37544 3812417 1967391 -1209916 -5688837 -7244329 -2070704 6623742 11059781 8265955
37536 8265955 3065402 742679 728292 -187755 -1696734 -584289 3918092 8721359 10821680
$$ packed form
37595E481158j732329j004322J349014J318194j334271k763878r77158J379091
37587A715499J500272N29254P21150J005949j144834m601355n082158j109835
37579f466058L565355M609497K070538n74666q85343M16634J128132K52115j114225
37570C001979j324406l69595J24486o64269j434997q55428J24465l18172j785609
37561c501546j872378N21594L660598M977089L496996L29056k234024k408144
37553B969241p53416K53673m76944r65790N91122K459734J868432m56134j677501
37544C812417j845026l177307m478921j555492N173625Q694446M436039k793826
37536H265955n200553k322723j4387r16047j508979J112445M502381M803267K100321
$$ plain form
37527 10821680 10305227 8975648 7773933 6512408 5170029 4223598 3658124 2533299
37519 2533299 290009 -1771421 -1405569 1730885 5071273 5804169 3927193 1886808
37511 1886808 1829172 3922033 6543485 7330870 5114634 1682034 206438 1035307 1327188
37502 1327188 417687 2172938 8481899 13586512 10629760 2516951 -324931 6298612
37494 6298612 15078424 17597133 14119136 9974296 7546527 6091944 5371176 4840773
37486 4840773 2281452 -2392472 -4593767 -758924 5572867 7847297 5128797 2478339
37478 2478339 3853001 8353561 12477644 12852662 8177367 1608892 -726785 2999002
37470 2999002 6987940 5705753 2149950 3000903 8131274 11393949 10368821 8456785
$$ packed form
37527A0821680n16453j329579j201715j261525j342379r46431n65474j124825
37519B533299k243290k061430L65852L136454L340388P32896j876976k040385
37511A886808n7636K092861K621452P87385k216236l432600j475596Q28869K91881
37502A327188r09501J755251O308961N104613k956752q112809k841882O623543
37494F298612Q779812K518709l477997m144840k427769j454583p20768n30403
37486D840773k559321m673924k201295L834843O331791K274430k718500k650458
37478B478339J374662M500560M124083L75018m675295o568475k335677L725787
37470B999002L988938j282187l555803Q50953N130371L262675j025128j912036
$$ plain form
37462 8456785 7764453 6837427 5745487 6491964 7428172 4175785 -2306959 -5419321 -2854091
37453 -2854091 -149135 -1651552 -4675596 -6018161 -7451023 -10220199 -10487741 -5909198
37445 -5909198 -1389880 -2059785 -4827781 -3407588 1640953 4536037 3530062 1960843
37437 1960843 1435452 263927 -1570787 -1376616 1714820 5197616 6587604 5549646
37429 5549646 3223170 2031984 4719312 10550617 14204586 11803129 6232614 2973804
37421 2973804 2855716 3079999 3112559 4412836 5869178 4992215 2896272 2809500 4107873
37412 4107873 3183005 79195 -1280274 159064 1217749 788502 1829841 5204729
37404 5204729 6825761 3805397 -693882 -1784423 1062264 4798297 6888553 6237466
$$ packed form
37462H456785o92332r27026j091940P46477R36208l252387o482744l112362K565230
37453b854091K704956j502417l024044j342565j432862k769176k67542M578543
37445e909198M519318o69905k767996J420193N048541K895084j005975j569219
37437A960843n25391j171525j834714J94171L091436L482796J389988j037958
37429E549646k326476j191186K687328N831305L653969k401457n570515l258810
37421B973804j18088K24283L2560J300277J456342q76963k095943q6772J298373
37412D107873r24868l103810j359469J439338J058685m29247J041339L374888
37404E204729J621032l020364m499279j090541K846687L736033K090256o51087
$$ plain form
37396 6237466 2628239 -2112059 -4214410 -1706656 2906420 5335231 4123207 1611554
37388 1611554 1103799 3666276 7094574 7995866 5405148 1580271 -1361243 -3598663
37380 -3598663 -4930194 -2907414 3039747 8160929 7626915 3579623 1938140 3360393
37372 3360393 3187802 66446 -1865922 -536896 597725 -1031427 -2815199 -2081435
37364 -2081435 -630799 -810392 -1325181 -551021 -265694 -2225352 -4127659 -2910091 349967
37355 349967 2511528 3266269 4341183 5488343 4933480 2894667 1406523 1039796 482519
37346 482519 -701822 -1107846 319200 2363098 2324925 -1218072 -6160320 -7998975 -4289215
37337 -4289215 2759092 9411500 14603218 18868872 21452125 22567815 26563889 36736817
$$ packed form
37396F237466l609227m740298k102351K507754M613076K428811j212024k511653
37388A611554n07755K562477L428298R01292k590718l824877k941514k237420
37380c598663j331531K022780N947161N121182n34014m047292j641483J422253
37372C360393j72591l121356j932368J329026J134621j629152j783772P33764
37364b081435J450636j79593n14789P74160K85327j959658j902307J217568L260058
37355C49967K161561P54741J074914J147160n54863k038813j488144l66727n57277
37346D82519j184341m06024J427046K043898l8173l542997m942248j838655L709760
37337d289215P048307O652408N191718M265654K583253J115690L996074J0172928
$$ plain form
37329 36736817 47161230 46582465 32579155 15901035 7721557 7867430 9158143 8201474
37321 8201474 6974606 7273966 8608232 9755513 8956111 4619994 -1408278 -4035960
37313 -4035960 -1313747 2283021 2085793 -338133 -507433 2207506 5089140 6762338
37305 6762338 7222782 5265330 134351 -5509532 -7810417 -5896660 -1397594 4102215
37297 4102215 8306338 7577321 1043185 -6261288 -8051248 -3713973 1970363 4510376
37289 4510376 2791783 -1410174 -4402258 -3111765 960647 2563157 -587753 -4900544
37281 -4900544 -6554196 -5914359 -3877588 972051 7655411 10623564 7545445 4318133
37273 4318133 6183399 8669644 4940965 -1787053 -2142070 5054683 11346451 11312983 8345403
$$ packed form
37329C6736817J0424413n78765j4003310j6678120q179478J45873J290713r56669
37321H201474j226868K99360J334266J147281p99402m336117o028272k627682
37313d035960K722213L596768j97228k423926j69300K714939K881634J673198
37305F762338M60444j957452n130979n643883k300885J913757M499066N499809
37297D102215M204123p29017o534136p304473j789960M337275N684336K540013
37289D510376j718593m201957k992084J290493M072412J602510l150910m312791
37281d900544j653652O39837K036771M849639O683360K968153l078119l227312
37273D318133J865266K486245l728679o728018l55017P196753O291768l3468k967580
$$ plain form
37264 8345403 6860563 6314736 4944930 3320807 1962652 129635 -1495748 -977204
37256 -977204 1140494 1938109 208297 -2878053 -6337258 -8889807 -7606293 -1692505
37248 -1692505 4109376 5013079 3102606 3163829 4217743 2247053 -998935 -467266 2160242
37239 2160242 212329 -6124763 -9246120 -6548390 -3841169 -4327006 -3863381 -305235
37231 -305235 2080676 1802553 4373960 11772035 16250024 11511810 3026082 96200
37223 96200 3410223 7289391 9078899 9291928 6869854 1462859 -2811488 -2335836 -21634
37214 -21634 -739672 -3557294 -4019782 -1477599 1192515 2657902 2901359 610441 -4083799
37205 -4083799 -6829166 -4194408 720033 2758748 2312194 3243237 5599932 6055122 4028674
$$ packed form
37264H345403j484840n45827j369806j624123j358155j833017j625383N18544
37256i77204K117698P97615j729812l086350l459205k552549J283514N913788
37248a692505N801881R03703j910473O1223J053914j970690l245988N31669K627508
37239B160242j947913o337092l121357K697730K707221m85837M63625L558146
37231c05235K385911k78123K571407P398075M477989m738214q485728k929882
37223I6200L314023L879168J789508K13029k422074n406995m274347M75652K314202
37214b1634p18038k817622m62488K542183K670114J465387K43457k290918m694240
37205d083799k745367K634758M914441K038715m46554R31043K356695M55190k026448
$$ plain form
37196 4028674 2031886 1052150 349712 615695 2829531 5247414 5661775 4988235 4631974
37187 4631974 2811752 -1687474 -4831375 -2402994 2167360 1629382 -4188090 -7815588
37179 -7815588 -4784528 1088679 4073749 3090670 515872 -1452205 -1786949 -870316 -404837
37170 -404837 -1072188 -1102430 560348 1706924 664361 5548 2181175 4223870 2208402
37161 2208402 -1493558 -1775587 331977 -495331 -4347320 -6111643 -4657758 -3826207 -3814367
37152 -3814367 -338816 5886438 7847337 3676344 797869 4093870 7983505 6128486
37144 6128486 1846112 1796829 5039555 6042815 4381159 3713455 4034424 2442139 -191877
37135 -191877 -248694 2115621 3724814 4434920 6139377 6924288 3215678 -2535918 -3614024
$$ packed form
37196D028674j996788r79736p02438K65983K213836K417883M14361o73540l56261
37187D631974j820222m499226l143901K428381M570354n37978n817472l627498
37179g815588L031060N873207K985070r83079k574798j968077l34744R16633M65479
37170d04837o67351l0242J662778J146576j042563o58813K175627K042695k015468
37161B208402l701960k82029K107564q27308l851989j764323J453885Q31551J1840
37152c814367L475551O225254J960899m170993k878475L296001L889635j855019
37144F128486m282374m9283L242726J003260j661656o67704L20969j592285k634016
37135a91877n6817K364315J609193P10106J704457P84911l708610n751596j078106
$$ plain form
37126 -3614024 671823 3538064 1274420 -1759807 -1406312 -85225 -736778 -593560 3310512
$$ packed form
37126c614024M285847K866241k263644l034227L53495J321087o51553J43218L904072
$$ [...]
##END NTUPLES=NMR SPECTRUM
##END=
