##TITLE=31Pdec_SR151_rm1h
 , 24 sc
 15.11.2022
##JCAMPDX= 6.0         $$ Bruker NMR JCAMP-DX V2.0
##DATA TYPE= NMR SPECTRUM
##DATA CLASS= NTUPLES
##ORIGIN= UXNMR, Bruker Analytische Messtechnik GmbH
##OWNER= root
$$ XWIN-NMR		Version 3.5
$$ Tue Nov 15 15:32:53 2022 Russian Standard Time (UT+4h)  she@DPX200
##.OBSERVE FREQUENCY= 81.013821
##.OBSERVE NUCLEUS= ^31P
##.ACQUISITION MODE= SIMULTANEOUS
##.ACQUISITION SCHEME= undefined
##.AVERAGES= 24
##.DIGITISER RES= 16
##SPECTROMETER/DATA SYSTEM= spect
##.PULSE SEQUENCE= zgpg30
##.SOLVENT NAME= CDCl3
##.SHIFT REFERENCE= (INTERNAL, CDCl3, 0, 248.564)
##AUDIT TRAIL= $$ (NUMBER, WHEN, WHO, WHERE, WHAT)
$$ ##TITLE= Audit trail, XWIN-NMR		Version 3.5
$$ ##JCAMPDX= 5.01
$$ ##ORIGIN= Bruker BioSpin GmbH
$$ ##OWNER= she
$$ F:/spectra/data/she/nmr/P31/1/pdata/1/auditp.txt
$$ ##AUDIT TRAIL=  $$ (NUMBER, WHEN, WHO, WHERE, WHAT)
(   1,<2022-11-15 15:31:24.51 +0400>,<she>,<DPX200>,
      <created by zg, POWCHK disabled, PULCHK disabled
       configuration hash MD5:
       00 E9 B6 7A A2 85 ED C7 34 08 36 98 17 FE 4E 26
       data hash MD5: 32K
       EC 62 90 5B F7 8A 21 C7 D1 C8 E2 FD 04 2F F1 CA>)
(   2,<2022-11-15 15:32:06.12 +0400>,<she>,<DPX200>,
      <Start of raw data processing
       efp BC_mod = 2 LB = 1 FT_mod = 6 PKNL = 1 PHC0 = -10352.23 PHC1 = 290.456 SI = 64K 
       data hash MD5: 64K
       3A A5 47 18 DF 47 A2 2B 6B 26 80 83 E7 F0 3C 1D>)
(   3,<2022-11-15 15:32:21.87 +0400>,<she>,<DPX200>,
      <pk PHC0 = 4.696797 PHC1 = 0 
       data hash MD5: 64K
       71 A8 0F 27 AD 05 D4 10 F8 99 6E 4F 33 FC C0 7D>)
(   4,<2022-11-15 15:32:30.54 +0400>,<she>,<DPX200>,
      <abs ABSG = 5 
       data hash MD5: 64K
       39 18 4E 4A 2F D4 5A B0 FA D0 4E 23 66 63 54 71>)
$$ ##END=
$$ 
$$ hash MD5
$$ 75 90 58 3D CD E4 46 BA 07 CC 1F C7 E1 D7 32 C7
##$RELAX= 
##$RELAX= 
##$RELAX= 
##$RELAX= 
##$RELAX= 
##$RELAX= 
##$RELAX= 
##$RELAX= 
##$RELAX= 
$$ Bruker specific parameters
$$ --------------------------
##$DU= <F:/spectra>
##$EXPNO= 1
##$NAME= <P31>
##$PROCNO= 1
##$TYPE= <nmr>
##$USER= <she>
##$AMP= (0..31)
100 100 100 100 100 100 100 100 100 100 100 100 100 100 100 100 100 100 
100 100 100 100 100 100 100 100 100 100 100 100 100 100 
##$AQSEQ= 0
##$AQ_mod= 1
##$AUNM= <au_zg>
##$AUTOPOS= <>
##$BF1= 81.014009
##$BF2= 200.13
##$BF3= 200.13
##$BF4= 200.13
##$BF5= 200.13
##$BF6= 200.13
##$BF7= 200.13
##$BF8= 200.13
##$BYTORDA= 1
##$CFDGTYP= 0
##$CFRGTYP= 5
##$CHEMSTR= <none>
##$CNST= (0..31)
1 1 145 1 1 1 1 1 1 1 1 1 1 1 1 1 1 1 1 1 1 1 1 1 1 1 1 1 1 1 1 1 
##$CPDPRG= <waltz16>
##$CPDPRG1= <>
##$CPDPRG2= <waltz16>
##$CPDPRG3= <>
##$CPDPRG4= <mlev>
##$CPDPRG5= <mlev>
##$CPDPRG6= <mlev>
##$CPDPRG7= <mlev>
##$CPDPRG8= <mlev>
##$CPDPRGB= <>
##$CPDPRGT= <>
##$D= (0..31)
0 1 0 0 0 0 0 0 0 0 0 0.03 2e-05 3e-06 0 0 0 0 0 0 0 0 0 0 0 0 0 0 0 0 
0 0 
##$DATE= 1668511883
##$DBL= (0..7)
120 120 120 11 120 120 24 19 
##$DBP= (0..7)
150 150 150 150 150 150 150 150 
##$DBP07= 0
##$DBPNAM0= <>
##$DBPNAM1= <>
##$DBPNAM2= <>
$$ [...]
##$SUBNAM3= <"">
##$SUBNAM4= <"">
##$SUBNAM5= <"">
##$SUBNAM6= <"">
##$SUBNAM7= <"">
##$SUBNAM8= <"">
##$SUBNAM9= <"">
##$SW= 501.771253377433
##$SWIBOX= (0..15)
0 1 3 0 0 0 0 0 0 0 0 0 0 0 0 0 
##$SW_h= 40650.406504065
##$TD= 32768
##$TD0= 1
##$TE= 0
##$TE2= 300
##$TE3= 300
##$TEG= 300
##$TL= (0..7)
0 120 53 12 22 120 120 120 
##$TP= (0..7)
150 150 150 150 150 150 150 150 
##$TP07= 0
##$TPNAME0= <>
##$TPNAME1= <>
##$TPNAME2= <>
##$TPNAME3= <>
##$TPNAME4= <>
##$TPNAME5= <>
##$TPNAME6= <>
##$TPNAME7= <>
##$TPOAL= (0..7)
0.5 0.5 0.5 0.5 0.5 0.5 0.5 0.5 
##$TPOFFS= (0..7)
0 0 0 0 0 0 0 0 
##$TUNHIN= 0
##$TUNHOUT= 0
##$TUNXOUT= 0
##$USERA1= <user>
##$USERA2= <user>
##$USERA3= <user>
##$USERA4= <user>
##$USERA5= <user>
##$V9= 5
##$VALIST= <valist>
##$VCLIST= <CCCCCCCCCCCCCCC>
##$VD= 0
##$VDLIST= <DDDDDDDDDDDDDDD>
##$VPLIST= <PPPPPPPPPPPPPPP>
##$VTLIST= <TTTTTTTTTTTTTTT>
##$WBST= 1024
##$WBSW= 4
##$XGAIN= (0..3)
0 0 0 0 
##$XL= 0
##$YL= 0
##$YMAX_a= 8466
##$YMIN_a= -12333
##$ZGOPTNS= <>
##$ZL1= 120
##$ZL2= 120
##$ZL3= 120
##$ZL4= 120
##$ABSF1= 248.5645
##$ABSF2= -253.2056
##$ABSG= 5
##$ABSL= 3
##$ALPHA= 0
##$AQORDER= 0
##$ASSFAC= 0
##$ASSFACI= 0
##$ASSFACX= 0
##$ASSWID= 0
##$AUNMP= <proc_1d>
##$AZFE= 0.1
##$AZFW= 0.5
##$BCFW= 0
##$BC_mod= 2
##$BYTORDP= 0
##$COROFFS= 0
##$CY= -3
##$DATMOD= 1
##$DC= 0
##$DFILT= <>
##$DTYPP= 0
##$F1P= 0
##$F2P= 0
##$FCOR= 1
##$FTSIZE= 65536
##$FT_mod= 6
##$GAMMA= 0
##$GB= 0
##$INTBC= 1
##$INTSCL= 6.047779e-11
##$ISEN= 30
##$LB= 1
##$LEV0= 0
##$LPBIN= 0
##$MAXI= 10000
##$MC2= 0
##$MEAN= 0
##$ME_mod= 0
##$MI= 50
##$NCOEF= 0
##$NC_proc= -7
##$NLEV= 6
##$NOISF1= 182.463
##$NOISF2= 159.3651
##$NSP= 0
##$NTH_PI= 0
##$NZP= 0
##$OFFSET= 248.5645
##$PC= 4
##$PHC0= -10347.53
##$PHC1= 290.456
##$PH_mod= 1
##$PKNL= yes
##$PPARMOD= 0
##$PSCAL= 0
##$PSIGN= 0
##$REVERSE= no
##$SF= 81.0140089999694
##$SI= 65536
##$SIGF1= 159.3651
##$SIGF2= -187.1042
##$SINO= 113.3802
##$SIOLD= 16384
##$SREGLST= <1H.CDCl3>
##$SSB= 0
##$STSI= 65536
##$STSR= 0
##$SW_p= 40650.406504065
##$SYMM= 0
##$S_DEV= 0
##$TDeff= 32768
##$TDoff= 0
##$TI= <>
##$TILT= no
##$TM1= 0
##$TM2= 0
##$TOPLEV= 0
##$USERP1= <user>
##$USERP2= <user>
##$USERP3= <user>
##$USERP4= <user>
##$USERP5= <user>
##$WDW= 1
##$XDIM= 65536
##$YMAX_p= 515981190
##$YMIN_p= -152331339
$$ End of Bruker specific parameters
$$ ---------------------------------
##NTUPLES= NMR SPECTRUM
##VAR_NAME=  FREQUENCY,     SPECTRUM/REAL,   SPECTRUM/IMAG
##SYMBOL=    X,             R,               I
##VAR_TYPE=  INDEPENDENT,   DEPENDENT,       DEPENDENT
##VAR_FORM=  AFFN,          ASDF,            ASDF
##VAR_DIM=   65536,         65536,           65536
##UNITS=     HZ,            ARBITRARY UNITS, ARBITRARY UNITS
##FACTOR=    0.620285442955139, 1,           1
##FIRST=     20137.2065510682, 0,            0
##LAST=      -20513.1999529968, 0,           0
##MIN=       -20513.1999529968, -152331339,  0
##MAX=       20137.2065510682, 515981190,    0
$$ Real data points
##PAGE= N=1
##DATA TABLE= (X++(R..R)), XYDATA
$$ [...]
44779 4466094 4354438 4900922 5414066 3862960 -479212 -4909644 -5626162 -2516623 205668
44770 205668 -730054 -3388719 -3544889 -717345 1373083 277960 -2041369 -2512368 -1014145
44761 -1014145 546711 1469405 2386026 3089837 2563609 1128573 525388 1253150 1402530
44752 1402530 -814394 -4363283 -6469004 -5985325 -4374565 -3197207 -2009045 275155
44744 275155 2896029 3800762 2613215 1340669 1499114 2060494 1349078 -318703 -1361609
44735 -1361609 -1343130 -1004091 -564511 251463 939349 775658 378314 850758 1586643 1012323
44725 1012323 -485068 -707230 837093 1903008 872449 -994895 -1794310 -1486232 -851028
44716 -851028 219626 1743635 2441649 1310176 -547161 -1197164 -265920 1153456 2191513
44707 2191513 2677271 2646963 2322620 1937505 1135478 -367445 -1320100 -8110 2642110
44698 2642110 3418400 1422238 -360556 162970 812183 -742918 -2353640 -812482 2168997
44689 2168997 2120901 -972395 -2603805 -1060438 159039 -1460756 -3420806 -2673307 -340604
44680 -340604 875388 1016812 1497486 1729863 448604 -1164141 -967224 458041 688459
44671 688459 -560803 -1361655 -1246965 -1832850 -3394875 -3875289 -2399468 -1093504 -1710274
44662 -1710274 -2632061 -1421852 1172698 2306630 1405285 815817 1976655 3397650 3356822
44653 3356822 2534649 2384657 2330976 653284 -2400288 -4447204 -4090932 -2471157 -1162995
44644 -1162995 -111222 1323642 2464983 1890052 -525776 -3237605 -4566968 -3935865
44636 -3935865 -1959606 -91188 228951 -1017355 -2159093 -1894470 -1222837 -2053442 -4063036
44627 -4063036 -4614237 -2360514 570527 1152499 -744996 -2499905 -2168485 -286770 1709344
44618 1709344 3243155 4093125 3519522 1338097 -756426 -629193 1369781 2434471 898908
44609 898908 -1546635 -2299526 -1320747 -583741 -829246 -907241 -294074 -161105 -1261767
44600 -1261767 -2502557 -2682291 -2327870 -2637693 -3671256 -4806570 -6051840 -7483120 -8048216
44591 -8048216 -6536525 -3604626 -1442521 -1208846 -1814447 -1550487 -185229 919930 422069
44582 422069 -1493352 -3176652 -3204274 -1910687 -769611 -411568 -232524 -37683 -597653
44573 -597653 -1872465 -2251278 -926600 291037 -579895 -2300357 -1774735 1327134 3707826
44564 3707826 2944786 858488 937460 3627559 5993061 5830165 4395289 4225240 5303051
44555 5303051 4995594 1934184 -1706802 -3031135 -2309610 -2075152 -2954044 -2999719 -1452832
44546 -1452832 -325537 -991559 -1787818 -921029 470167 485316 -261673 -249271 -216887 -1515062
44536 -1515062 -2597439 -895640 2399643 3394697 1448936 63421 1030689 1774229 240648
44527 240648 -1341708 -287796 1896549 1911969 -192801 -1511177 -841485 280807 726114
44518 726114 1192968 2180214 2674917 1633688 -433952 -1963553 -1892570 -664619 -25581
44509 -25581 -1420084 -4140364 -5685760 -4528443 -1802290 347189 1131270 1017817 375127
44500 375127 -513979 -913904 -524150 -351514 -1338194 -2580105 -2317941 -413402 1513642
44491 1513642 2192467 1597645 -36884 -2522738 -4892090 -5764530 -5014951 -3932464 -3317001
44482 -3317001 -2549159 -1050660 474669 1079143 1047513 1445631 2610191 3778372 3988099
44473 3988099 2922490 1144010 -218907 -415896 36510 -57580 -813850 -876467 609653
44464 609653 2461268 2927562 2105674 1525734 1564401 932487 -865544 -2196435 -1514137
44455 -1514137 214316 678492 -737752 -2361117 -2411692 -709857 1561728 2786817 1887332
44446 1887332 -556532 -2451248 -2559341 -2207094 -3163243 -4463452 -3579696 -617016 1352318
44437 1352318 799219 -91952 964772 3046363 4032337 3686629 2711136 826288 -1782876
44428 -1782876 -2971119 -1401068 659517 305019 -1469931 -1503393 183688 567458 -990261
44419 -990261 -1455789 942472 3905997 4577627 3165493 1624526 929803 1021106 1636134
44410 1636134 2042192 1462236 468907 347020 775940 254227 -826153 -125419 2799259
44401 2799259 5219090 5025503 3375604 2203304 1465162 462318 -275246 -226645 -249249
44392 -249249 -1104102 -2101180 -2372198 -1899444 -597309 1460518 2359702 -87695 -4066146
44383 -4066146 -4609412 -523285 3232885 2514622 -433964 -1523403 -1149356 -1821673 -2709849
44374 -2709849 -1495644 643663 996491 525644 1907590 3711107 2144614 -1951977
44366 -1951977 -3564122 -1178343 1448917 1862345 1830367 2474058 1837791 -670152 -2280016
44357 -2280016 -1701241 -1513036 -3129725 -3719608 -1243218 1475588 1360526 264176 1490485
44348 1490485 3985429 4324405 2446642 1122312 1086849 794257 123529 430062 1309838
44339 1309838 859219 -940078 -2199130 -2320109 -2260454 -1895676 -323360 1272236 508829
44330 508829 -2018279 -2914964 -1264088 -263623 -1986393 -3772720 -2388394 699081
44322 699081 1361906 -1158453 -3408580 -2697605 -192547 1538142 1913620 2019602 2234144
44313 2234144 1850869 872081 699608 2254074 4144548 3916484 1166877 -1748040 -2639699
44304 -2639699 -2010793 -1681525 -1925401 -1567878 -421980 276421 7505 -221582 281049
44295 281049 828814 870858 1062850 1799406 1989429 561363 -1789309 -3578599 -4388213
44286 -4388213 -4565091 -4059406 -3007038 -2555574 -3379858 -4078477 -2958435 -871356 -104382
44277 -104382 -754902 -694896 735022 1710479 1299362 1135718 2436678 3864469 4080711
44268 4080711 4115431 5061545 5487558 3715908 1033857 -129754 84977 -67838 -505120
44259 -505120 -65579 342493 -872756 -1972026 422451 5224728 6982153 3562577 -402615
44250 -402615 -50298 3348391 5393306 4885571 3852906 3513663 3598433 4124396 4750066
44241 4750066 3738531 570157 -1780816 -449560 2561529 2787733 -197067 -2415561
44233 -2415561 -1534204 463941 1178953 791556 18765 -1714277 -4313257 -5695140 -4365035
44224 -4365035 -1673532 60056 372980 390030 970230 2198437 3606408 4032289 2412561
44215 2412561 -500901 -2372456 -1936771 -282826 985288 1405025 916963 -718821 -2730726
44206 -2730726 -3270491 -1900150 -673688 -1268387 -2444652 -2104481 -627076 -3540 -427692
44197 -427692 -146853 1391817 2593179 2478075 2325564 3344720 4271687 3095331 506501
44188 506501 -380337 1890342 4968243 5708417 4162946 2969652 3384261 4002441 3614233
44179 3614233 3071846 3220633 2975891 1268525 -600080 -760323 78969 -255649 -1670786
44170 -1670786 -1844848 -106598 1290794 505622 -1349770 -1917648 -283415 2703262 5312737
44161 5312737 5685151 3344414 454925 -142481 1431147 2388910 1624272 1154521 2141562
44152 2141562 2385363 -23022 -2973691 -3231200 -1495828 -1283891 -3413679 -4945186 -3895502
44143 -3895502 -1945082 -1288792 -1261543 18812 2167741 2897995 1472535 -145807 -46776
44134 -46776 1140275 1473381 527341 -332679 -216465 265184 546887 1141408 2226825
44125 2226825 2573753 1280205 -452238 -915842 -486898 -770644 -1722214 -1736293 -441753
44116 -441753 766679 1160085 1523976 2168067 2135553 1043530 -136639 -808825 -1510566
44107 -1510566 -2340087 -2482932 -2013728 -2245271 -3386257 -3714362 -2115726 251730 1791303
44098 1791303 2281398 2027984 1101403 359355 1214857 3290689 4334170 3539060 2655774
44089 2655774 2579053 1581658 -1152183 -2968745 -1352123 2089796 4069637 4224928 4312372
44080 4312372 4380434 3101439 1103474 760007 2750235 5269394 6520993 6043865 4071683
44071 4071683 1508825 -75978 -242477 -589271 -2101460 -2942763 -1148085 1861178 3081694
44062 3081694 1994412 37961 -2564494 -6019202 -8119851 -6256661 -2036266 41317
44054 41317 -1231250 -2650541 -2092265 -1202905 -1604887 -2200562 -1877240 -1615643 -2060434
44045 -2060434 -1882117 -501787 200922 -969677 -2035754 -870095 1180636 1212701 -934199
44036 -934199 -2652162 -2229259 -654094 37754 -981432 -2580268 -2688633 -591055 1778403
44027 1778403 1960158 288557 -716032 -402699 -937794 -3255317 -4745984 -3014831 95104
44018 95104 844290 -1128570 -2491107 -955634 1905560 3024208 1426433 -1323602 -3373267
44009 -3373267 -4305167 -4636504 -4399256 -3157189 -1449371 -871645 -1798733 -2291704 -854924
44000 -854924 822457 103485 -2342889 -3280848 -1776566 -300417 -458803 -773178 61560
43991 61560 720158 -33889 -757945 113782 1088496 -322328 -3592477 -5824635 -5735525
43982 -5735525 -4642774 -3723185 -2460217 -225223 2080847 2710012 988339 -1679647
43974 -1679647 -2884612 -1742354 -100714 -294466 -2005669 -2815879 -1703382 -64332
43966 -64332 839141 1162018 802666 -930384 -3075133 -3177142 -1065266 233972 -969784
43957 -969784 -2386677 -1743577 -509835 -807262 -1291620 310488 2579623 2247588 -603030
43948 -603030 -3017627 -3975397 -4891483 -5869056 -5388783 -3707732 -2787452 -2564642 -984406
43939 -984406 1748285 2694622 860585 -1273415 -2062528 -2856035 -4244305 -3921385 -768763
43930 -768763 2192364 1968434 127440 -69857 1102557 1131675 242695 978298 3257688
43921 3257688 3868863 1482384 -1281430 -1943582 -1294949 -798703 389136 3318314 6060159
43912 6060159 5644148 2460068 -146767 -683552 -1078651 -2663518 -3383240 -992510 2912081
43903 2912081 4654524 3362987 1523136 999752 1158654 1192520 1617154 2498265 2588635
43894 2588635 1608174 1275265 2447858 3228103 1883645 -184901 -780692 -608469 -1745896
43885 -1745896 -3528097 -3266099 -772082 1100091 783756 -131469 -87574 210822 -87819
43876 -87819 -146220 775634 1713113 1676710 1222105 983365 403044 -591316 -475727 1437671
43866 1437671 3106368 2542687 1181229 1836744 4050789 4410399 1697405 -1000080 -409749
43857 -409749 2639599 4521134 3261556 225170 -2146200 -2880246 -2539781 -1729468 -409885
43848 -409885 1330451 2597223 2500644 1447905 773654 901311 733720 -664763 -2581963
43839 -2581963 -3523251 -2884595 -1044222 1439329 3687801 4252540 2458067 -166292 -1154769
43830 -1154769 109539 2051220 3297877 3911778 4005976 2990219 1178625 509357 2089247
43821 2089247 4158059 4324314 3076962 2959541 4502988 5357628 3999863 2040298 1582519
43812 1582519 2115687 1782391 442419 -533915 -742727 -895912 -840758 343021 2093811
43803 2093811 2414067 863198 -502375 -283623 15026 -1469348 -3616618 -3682395 -1353491
43794 -1353491 753407 764396 -174801 38318 1536929 2631928 2113256 438815 -1077818
43785 -1077818 -1515573 -824672 355647 1144964 988827 95411 -688274 -639838 114816
43776 114816 812024 1056110 1266147 1806758 2040705 887674 -1695973 -4306055 -5224780
43767 -5224780 -3728228 -566417 2405982 3501467 2782463 1958359 2009512 1719460 -191161
43758 -191161 -2382052 -2384487 -364199 1052473 851924 841874 2031499 2576005 845237
43749 845237 -1851786 -3470402 -4099333 -4640917 -4571773 -3268622 -1827257 -1152065 119876
43740 119876 3125332 5754897 5198067 2351578 456737 225590 -230845 -1236113 -1138061
43731 -1138061 -79516 -323979 -2186472 -3252913 -2593326 -2206665 -2974174 -2737263 -338977
43722 -338977 1661090 805053 -1347337 -1832827 -759879 -349069 -978634 -1015251 181242
43713 181242 1505430 1974055 1458977 -46953 -2227900 -3827085 -3664325 -2059443 -238839
43704 -238839 1178192 2175743 2559668 2292995 2037859 2360692 2884701 2961451 2520797 1663305
43694 1663305 354118 -816665 -716886 629948 1582671 1068707 111307 223640 1437929
43685 1437929 2867479 3937222 4073552 2690542 728393 576513 2825386 4573977
43677 4573977 2918644 -1023227 -3582457 -3120813 -1122980 595334 1665644 2354749
43669 2354749 2713342 2643129 1857296 116774 -1885415 -2880950 -2979196 -3720499 -5171745
43660 -5171745 -5052771 -2464446 -225120 -959538 -2868660 -2563265 -505713 112820 -1030631
43651 -1030631 -1023352 1119923 2943267 2904434 2615065 3497413 4305942 3489597 1529896
43642 1529896 -417354 -1944673 -2317019 -425762 2745630 3985793 2031897 -94139
43634 -94139 998636 4282813 5616470 3092911 -754670 -1963685 694915 4453562
43626 4453562 5090326 1232970 -3835379 -5555110 -3138999 78093 1150972 435111
43618 435111 -301070 -470786 -408983 -323720 -593692 -1622211 -2512773 -1481441 1469498
43609 1469498 3889036 3870043 2131569 233459 -1415708 -2603707 -2359285 -609161 821227
43600 821227 566160 -299353 -222860 327327 75631 -700215 -928050 -729264 -733706 -394674
43590 -394674 1071995 2864931 3583884 3367553 3297964 3350954 2714603 1591266 994600
43581 994600 1211590 1877072 2840400 3522350 2490154 -452226 -2755971 -1924165 897572
43572 897572 2412358 1650913 467869 -26891 -680648 -1730020 -1840206 -598569 367713
43563 367713 -39890 -525046 625700 3029690 4857338 5089635 4190465 3142802 2468543
43554 2468543 1875131 762753 -555681 -647036 1094621 2885745 2412538 -20196 -1829061
43545 -1829061 -1629083 -714408 -842735 -2107204 -3424723 -3843474 -3046671 -1681582 -1206720
43536 -1206720 -2176138 -2922813 -1555981 999399 1988468 816511 -270104 195119 1100088
43527 1100088 1312309 1497056 2197982 2508490 2171308 2715444 4633971 5577931 3714551
43518 3714551 1122660 1072175 3069129 3608439 1494944 -523770 57915 2083379 2623819
43509 2623819 768915 -1729209 -2928553 -2784420 -2708568 -3488699 -4134377 -3204367 -966036
43500 -966036 752460 956762 509648 315590 -137039 -1516274 -3195765 -4281979 -5059017
43491 -5059017 -6063851 -6589786 -5595620 -3519172 -1779945 -904248 -372898 165442 740534
43482 740534 1547617 2349205 2074311 402901 -1013766 -585821 656088 503824 -910623
43473 -910623 -1303363 112468 1504285 1363987 425005 -61176 -37740 196774 751237
43464 751237 1123166 130125 -2014756 -3136022 -1905099 155770 832101 84491 -728174
43455 -728174 -1219385 -1722842 -1667658 -385141 940267 396876 -1547939 -2301236 -995813
43446 -995813 136268 -613049 -1439802 352299 3962822 5784232 4340056 2173560 2039970
43437 2039970 3222852 3232984 1847288 1264010 2506524 3836540 3385545 1674230 409818
43428 409818 3094 -352705 -915649 -1218523 -1367241 -2109209 -3519413 -4729454 -5098932
43419 -5098932 -4688747 -3550100 -1739403 -281903 -734840 -2994354 -4671862 -3859066 -1835210
43410 -1835210 -1593940 -3764756 -5415153 -3512904 1354702 5610381 6567358 4707200
43402 4707200 2222865 481062 -545535 -1293970 -2092260 -3207939 -4454274 -4991568 -4393524
43393 -4393524 -3512409 -3159315 -2458306 -265223 2030560 1542938 -1707468 -4004714 -2920383
43384 -2920383 -636287 -250660 -1044313 -293980 1901319 3088055 2857543 3019637 3452764
43375 3452764 1665601 -2567142 -5669372 -5085365 -2777566 -1849759 -2023761 -900055 1875067
43366 1875067 4156837 4223360 2232805 -674715 -3171492 -4091729 -3268373 -1749827 -539982
43357 -539982 171865 178857 -861925 -1928710 -848871 2523408 5002088 3839282 497182
43348 497182 -1377361 -627407 996228 2174895 3185789 4000051 3717903 2241077 620924
43339 620924 -516703 -1259650 -1130341 594945 3052970 4146725 3204836 1614099 344147
43330 344147 -1336365 -3837637 -5634001 -5008009 -2418441 88254 1304829 1791661 2669941
43321 2669941 4129581 5142858 4613343 2918451 1804383 2145992 2577087 1618339 474260
43312 474260 1643227 4731741 6077714 3538453 -458112 -2282122 -1851390 -1798175 -2863023
43303 -2863023 -2849631 -497461 2022986 1973692 42649 -455686 1873905 4589637 4713562
43294 4713562 2551897 906260 1303805 2714856 3759429 4197000 3806848 1873493 -1012310
43285 -1012310 -2408078 -980695 1286608 1677182 397982 -413809 -310810 -573608 -1144319
43276 -1144319 -426978 1589499 2725235 1878547 519615 4671 -298817 -1004768 -1043239
43267 -1043239 340339 1710844 1419275 104927 -599818 -740656 -1460278 -2502026 -2379833
43258 -2379833 -960559 -86436 -1092800 -2773256 -2559092 441723 3974553 4692511 1965910
43249 1965910 -1105506 -1428697 207131 750481 -332741 -665383 527167 850079 -977314
43240 -977314 -2479045 -1393275 417743 39696 -1582179 -1289294 1030790 2485353 1925781
43231 1925781 1114712 1173318 1279937 1324946 2511908 4351730 4190447 1267777 -1382031
43222 -1382031 -909057 1586936 3153470 3027614 2482232 2013306 981374 -566560 -1683844
43213 -1683844 -1937261 -1598167 -710486 690325 1704499 1342990 193344 -561 1273528
43204 1273528 2399878 1652702 -616364 -2433242 -2500402 -1478977 -1015016 -1936537 -3642927
43195 -3642927 -4983569 -5247193 -4325890 -2623933 -1202108 -1333609 -3121509 -4896914 -4788956
43186 -4788956 -2726953 -273872 1114978 887899 -882031 -3203562 -3954370 -1693263
43178 -1693263 2088773 4116719 3218441 1619511 1765111 3332056 4314222 3802900 2574670
43169 2574670 1810701 2163934 3319952 3825858 2348547 -316185 -1821668 -1540457 -1443507
43160 -1443507 -2526300 -2581647 195474 3301182 2908250 -197939 -1412997 847565 2941235
43151 2941235 1858988 -288757 -50746 1851371 2032499 -36100 -1470160 -654723 668279
43142 668279 667649 198804 941765 2542679 3292934 2703584 1823916 1430178 1337657 1447457
43132 1447457 2086888 2901182 2592316 645153 -1409155 -1541408 232851 1941863 2255011
43123 2255011 1723130 1057200 -309549 -2672888 -4212379 -2748842 780564 2663266
43115 2663266 905689 -2276467 -3491392 -2268686 -742214 -393694 -899953 -1596336 -2150714
43106 -2150714 -1875822 -249920 1539615 1298761 -1224711 -3550519 -3527024 -1954288 -1088879
43097 -1088879 -1565549 -2102380 -1642715 -487885 512481 910358 827938 749051 923474
43088 923474 684738 -893742 -3135259 -3684472 -1449123 1376244 1826171 12097 -1437109
43079 -1437109 -1408989 -1533504 -3086177 -4900645 -5355682 -4640235 -3710647 -2360320 113626
43070 113626 3109735 5059988 5307761 4646750 4177143 4299234 4563914 4049455 2320989
43061 2320989 359366 -170019 976218 2068938 1523297 -298709 -1969039 -2603682 -1844459
43052 -1844459 474746 3406215 4730062 3260076 616106 -706274 -338452 322186
43044 322186 647968 1099984 1482721 849007 -889808 -2916836 -4942296 -7004780 -8066356
43035 -8066356 -6801516 -3875962 -1463881 -291132 817130 2213698 2634273 1826263
43027 1826263 1585662 3001289 4789689 5687184 6399852 7570624 7828421 5858463 2733895
43018 2733895 115112 -2250768 -4929580 -6382921 -5160382 -3341362 -4246292 -7034921
43010 -7034921 -7318406 -3762862 -430929 -908172 -3233320 -3202955 -504620 1490493 951944
43001 951944 -512814 -1198080 -1709227 -2902035 -3404605 -1146740 3182798 5968698 4550193
42992 4550193 383247 -2536734 -2113463 -88283 569052 -817756 -2423065 -2482584 -999897
42983 -999897 774927 1461886 254981 -2296467 -4056623 -3085905 -143694 1672092 456081
42974 456081 -2286544 -3731507 -3076560 -1659509 -502751 675955 2070567 2939228 2757339
42965 2757339 2221044 2296163 2797321 2677262 1476547 -240313 -1836150 -3185831 -3992361
42956 -3992361 -3300376 -657208 2393854 3146991 724484 -2456911 -3150189 -959951 1394992
42947 1394992 1527059 70397 -547083 741606 2507330 2630421 609022 -2083069 -3678489
42938 -3678489 -3876485 -3731777 -3963337 -4088354 -3587348 -3006134 -2878482 -2341130 -483864
42929 -483864 1266430 270707 -3399838 -6357403 -6216979 -4410420 -3224846 -2246616 -128039
42920 -128039 1870068 1289322 -1290373 -2604870 -1263180 997204 2750180 4323951
42912 4323951 5100047 2939021 -1811537 -4756006 -2562425 2429229 5367406 4976644
42904 4976644 3637107 2727944 1297396 -862443 -1994474 -1001122 860134 1727267 1202683
42895 1202683 295771 416050 2334551 4965674 5677165 3361636 512794 164169 1411572
42886 1411572 772325 -2133541 -3609804 -1457472 1718446 2507150 1253197 365642 287970
42877 287970 -130641 -683831 -78789 1389769 1877341 681867 -939709 -1684005 -1453477
42868 -1453477 -694090 226091 870363 897648 421636 -257439 -851833 -679784 901193
42859 901193 2944485 3098581 534078 -2495216 -3392886 -2356795 -1253410 -673413 -110596
42850 -110596 60485 -797378 -1696272 -1240289 -258625 -625372 -1747206 -1135829 1331227
42841 1331227 2751029 1593800 -63344 31075 1124625 1325234 616794 271304 753910
42832 753910 1706270 2704459 2876066 1327820 -878183 -1100030 950021 1730334 -1388646
42823 -1388646 -5736110 -6677149 -4157794 -2422206 -3408115 -4152558 -1937957 1147582 1127522
42814 1127522 -2189375 -4993631 -4358675 -1220838 1619962 2715804 2458728 1555825 255588
42805 255588 -1117955 -1854987 -1510704 -532577 87111 -279068 -1390995 -2356753 -2301725
42796 -2301725 -1110578 383889 1230108 1392222 1506655 1666547 1342322 770699 1219342
42787 1219342 2990279 4204659 2887672 -376492 -3171964 -4067027 -3338070 -1548862
42779 -1548862 747981 2156091 1306324 -1117289 -2839681 -2700715 -1380303 505016
42771 505016 3000657 5226296 5411114 3363673 1090205 161090 178069 442779 1081611
42762 1081611 1701959 1147099 -363014 -1112157 -991874 -2044031 -4405974 -4846691 -1812736
42753 -1812736 1088364 61204 -2927327 -3335220 -1376022 -1269975 -3823947 -5014366
42745 -5014366 -2864596 -945645 -2842558 -6814652 -8702669 -7553952 -5521558 -3928063
42737 -3928063 -2322516 -697491 -131421 -1070693 -2482805 -2961916 -1957403 -80612 1265800
42728 1265800 972919 -512112 -1449453 -807059 517602 952498 162705 -869593 -1214119
42719 -1214119 -816756 -221079 -24977 -554219 -1675804 -2797223 -3177170 -2505927 -1429979
42710 -1429979 -1236477 -2357184 -3338098 -2415231 -248590 520265 -838245 -1605363 434387
42701 434387 3304710 3600015 1732858 1282525 3366487 4958769 3550165 551577 -1336474
42692 -1336474 -1745265 -1868539 -1957937 -1659259 -1691053 -3104904 -5221801 -5905002 -4009675
42683 -4009675 -679301 1864610 2402478 1709697 1652842 3104305 4960951 5701626 5360920
42674 5360920 4924408 4356549 2890045 1057052 436025 1106555 1370548 594615 301778
42665 301778 1503742 2872531 2794621 1553148 152573 -1409199 -3182995 -4033683 -3076613
42656 -3076613 -1300612 -230153 83726 385553 626695 509956 530593 951910 858410
42647 858410 -159829 -618084 664253 2225316 2141716 1448667 2517956 4643342 4616895
42638 4616895 2020107 503438 2375225 4812067 3743060 -397155 -3400349 -2886805
42630 -2886805 -689270 348652 -167197 -649102 -23931 1308450 2348430 2395703 1348739
42621 1348739 -109611 -711340 256317 1904626 2541592 1687404 465046 -318099 -1306685
42612 -1306685 -2952777 -3939250 -2829061 -559530 614837 385134 505817 1527387 1717669
42603 1717669 83927 -1584041 -1078126 1229632 3071772 2935085 1002472 -1492419
42595 -1492419 -2894847 -2166491 -198431 872902 231666 -976444 -1890502 -2902855 -3751933
42586 -3751933 -3048989 -916779 424379 301737 1025472 3488800 4419857 1347734 -2387645
42577 -2387645 -1906561 1712041 2989348 280088 -2462878 -2209784 -328131 1292513
42569 1292513 3030160 4896470 5164375 3628514 2789295 3717684 3914431 1529400 -1217268
42560 -1217268 -1333571 676689 2266266 2355207 1115557 -1430161 -4069251 -3929055 -278735
42551 -278735 3109621 2534536 -277943 -725245 1947228 4042769 3034145 356618 -1499429
42542 -1499429 -1643641 -166301 2397134 4349492 3905979 1706412 376058 1091050 2352710
42533 2352710 2493374 1524567 142334 -1161250 -1522323 -188115 1823424 2431073 1479470
42524 1479470 1041745 2011988 2652110 1755990 951779 1900148 3100342 2041507 -592529
42515 -592529 -1643225 -119615 1511941 1132106 -206395 -295584 1113423 2613056 3432548
42506 3432548 3871442 3953928 3152687 1493476 -243642 -1627909 -2823068 -3433853 -2350087
42497 -2350087 407851 2696051 2404303 146824 -1487868 -1144506 186534 1188514
42489 1188514 1756731 2132245 2064812 1664595 1786441 2563515 2682402 1249459 -608893
42480 -608893 -1265975 -868570 -728133 -1145753 -1346871 -1128063 -1052842 -1214916 -1154547 -820817
42470 -820817 -369983 660175 2532639 3939740 3099234 256013 -2426754 -3523353 -3387460
42461 -3387460 -2596960 -1186488 319527 976701 1007241 1521252 2179200 1224516 -1311892
42452 -1311892 -2711720 -1339395 731304 781000 -588179 -858298 346420 1305027 1646606
42443 1646606 2871160 5210029 6558666 5463717 3210318 1749459 1008580 -375177
42435 -375177 -2573036 -4221087 -4247373 -2960431 -1327979 28926 965023 1518270 1813033
42426 1813033 1979539 1886741 1146143 -240368 -1335841 -995288 608088 1853969 1665410
42417 1665410 981088 1294018 2305229 2468786 1637063 1365249 2287385 3104939 2999879
42408 2999879 3135885 4366646 5156791 3740036 1173553 34989 662197 862791 -720193
42399 -720193 -2878784 -3708843 -2730321 -976993 -151920 -1499755 -4201666 -5317323 -3047851
42390 -3047851 291242 686469 -2208411 -4558008 -3683055 -1311953 -271000 -345612 479937
42381 479937 2263445 3046216 2067972 993134 1657354 3819306 5570634 5445267 3852373
42372 3852373 2410094 1859344 1232668 -207952 -1049321 566047 3646232 4978561 3398206
42363 3398206 1149853 242473 -92093 -987779 -1513074 -742571 -191280 -1642332 -4013369
42354 -4013369 -4952262 -4401611 -3992385 -3894262 -3038913 -1741930 -1205590 -888776 599437
42345 599437 2212188 1338216 -1783668 -3819384 -3213990 -2073052 -2104660 -2015632 -709875
42336 -709875 40984 -1372092 -3148949 -2727461 -957947 -711925 -2385916 -3564986 -2643294
42327 -2643294 -364846 1933536 3446841 3483405 1978677 404165 375842 1443348 1943076
42318 1943076 1718744 1942112 2400662 1444355 -881086 -2057691 -507470 2245360 4087833
42309 4087833 5108702 6241526 6797731 5579523 3482831 2593626 2980332 2716928 1292906
42300 1292906 575225 1420532 1648607 -620568 -3227674 -2404387 1431937 3432642 976415
42291 976415 -2079291 -189238 6370831 11798619 12288625 10117301 9238361 9684421 8709382
42282 8709382 5743540 3131938 2176536 1273257 -1113479 -3738069 -4374787 -3091375 -1992843
42273 -1992843 -2119922 -2216200 -879263 1271376 2395255 1872871 1016653 1190661 1926900
42264 1926900 1639033 80238 -882647 367500 2657326 3052055 556411 -2407534 -2942020
42255 -2942020 -1130725 648679 1275016 2024630 3937713 5855982 6317465 6177000 7502498
42246 7502498 10220168 11776778 10569343 8079679 6669542 6539055 6187180 5043862
42238 5043862 4041319 3763349 3530130 2674587 1612494 1049264 836256 268840 -785378
42229 -785378 -1560506 -1215080 133977 1237956 816693 -952789 -2370402 -2072855 -706295
42220 -706295 -188347 -1429477 -3329830 -4009504 -2648490 -250688 1108970 192170 -1808979
42211 -1808979 -2177100 156538 3075983 3949039 3051597 2744876 3704116 4045069 2498817
42202 2498817 426261 -320577 -23407 -331359 -1842738 -3629224 -4596005 -4396384 -3413165
42193 -3413165 -2511398 -2419300 -2882918 -2899539 -2109117 -1300789 -1178847 -1380561 -1208924 -651662
42183 -651662 -120604 309094 949685 2097559 3629503 4619204 3795803 1294877 -607492
42174 -607492 -1924 1786483 1774941 -299353 -1491813 42986 2716402 4340554 4789316
42165 4789316 4542790 3132509 927212 193658 2042807 4099111 3605690 1342318 37653
42156 37653 285199 644288 639369 904640 1155070 692679 317736 1160422 2190961 1518630
42146 1518630 -318913 -1051818 -278126 383031 443083 925233 1632754 1053120 -657865
42137 -657865 -1430863 -563924 353270 308512 109363 257675 168950 62354 1009055 2497717
42127 2497717 2618249 1272208 381230 283708 -885147 -3281819 -4293003 -2878761 -1551174
42118 -1551174 -2077530 -2548856 -1118003 547876 457174 84161 1673870 4123957 5009514
42109 5009514 4711918 4954190 5007696 3267716 1233949 1674149 3558686 3228431 575244
42100 575244 -406157 1922751 4060722 2813940 -32846 -942664 154285 734833 157183
42091 157183 319055 2255583 4463857 5035173 3931727 2463595 1400731 485691 -419366
42082 -419366 -674357 85824 883124 503289 -493713 -298419 1330913 2432770 1827018
42073 1827018 987131 1526477 2409067 1639563 -389141 -1439015 -674694 738713 1829099
42064 1829099 2507126 2385787 1088445 -342865 -426988 411122 571685 241207 1151334
42055 1151334 3168431 3859862 2289754 655792 867619 1845393 1865649 1533240 2383354
42046 2383354 4035826 4881733 4656486 4367295 4261553 3634175 2340933 1068769 371062
42037 371062 565220 2032781 4315954 5502071 4118507 1379106 -92424 257937 426359
42028 426359 -857558 -2143357 -1522911 503017 1843226 1808521 1795293 3010036 4778962
42019 4778962 5607978 5114377 4255296 4070026 4793199 5902254 6397435 5301734 2754297
42010 2754297 552749 549040 2253115 3212162 2365767 1659791 3056756 5139786 4758308
42001 4758308 1654623 -884668 -479406 1380394 1987286 1268936 1195424 2371524 3277272
41992 3277272 2759415 1524152 784075 753828 1040365 1457861 1757436 1398821 429984
41983 429984 -26647 897034 2401681 2928617 2217712 1309352 591369 -664104 -2402570
41974 -2402570 -3069580 -1924818 -716071 -1425075 -3339089 -4320384 -4278449 -4932541 -6247599
41965 -6247599 -5910677 -3137474 -416803 -84474 -1367209 -2429880 -3161112 -3798811 -2828550
41956 -2828550 835524 4781043 5301419 2315542 -593336 -922800 488261 1950566
41948 1950566 3082753 3988362 4473229 4713165 5001971 4620361 2731954 364084 -568770
41939 -568770 -113453 204402 485729 2054651 3838414 2856356 -666157 -2504691 -593401
41930 -593401 1727248 1175839 -305224 655776 2835220 2491741 -305560 -1824482 -395360
41921 -395360 1963621 3338308 3704566 3019263 1052565 -668781 -99603 1743898 1630578
41912 1630578 -1002170 -3209908 -3099589 -1798185 -117119 2875883 6369004 6745969
41904 6745969 2628583 -2074089 -3101632 -1434647 -976884 -2703878 -4364837 -4559778
41896 -4559778 -3852546 -2691406 -1207975 -503661 -1408907 -2488246 -1920232 -787310 -1605443
41887 -1605443 -3875515 -4163492 -877316 3750625 6780916 7122450 4825151 762786
41879 762786 -2410399 -2009494 912219 2288121 644302 -883120 465825 3137687
41871 3137687 4407716 4618915 5525894 6636310 6283119 4840567 3943682 3644493 3078276
41862 3078276 2852448 3907926 4922302 3844266 1378749 -28504 -114788 -554320 -1237689
41853 -1237689 -372858 1603522 1971017 371781 -51169 2515768 5764539 6838264 5771568
41844 5771568 3739979 842699 -2301709 -3485668 -1947959 -339488 -1240436 -3587573
41836 -3587573 -4820954 -4600655 -3934959 -2612724 -352286 1205166 689469 -254382 485895
41827 485895 1611731 569952 -1565084 -1338725 1434122 3348987 2879623 2126231 2418867
41818 2418867 2173724 520420 -586974 160320 931092 -46503 -1348989 -765603 1213097
41809 1213097 2582854 2762121 2185584 616730 -1819118 -3286861 -2343149 -420268 55655
41800 55655 -788889 -889786 230236 969966 485343 -301495 -731216 -1354681 -2323969 -2621538
41790 -2621538 -1695482 -528232 -237844 -583224 -632504 -202080 118945 -7857 -200929
41781 -200929 183013 1322852 2574750 2952279 2270591 1608816 2064915 3107012 2903087
41772 2903087 622877 -2128735 -2762358 -475913 2900646 4891004 4675492 3049479
41764 3049479 725364 -2137388 -4645659 -4962408 -2522531 503415 1418453 140504
41756 140504 -1332769 -2009736 -2399779 -2073145 627927 5424268 8918147 8375625 5266281
41747 5266281 3214085 3427762 4058096 3507661 2392864 2062202 2624900 2968766 2112298
41738 2112298 398159 -447642 1035966 3934156 5387346 3945031 1541491 960253
41730 960253 2216591 3023130 2253925 1093512 841103 1412415 2356645 3679094 4961297
41721 4961297 5101251 3940211 3095678 3985014 5656074 5893075 4355245 3264690 4331887
41712 4331887 5947085 4787190 238163 -4211174 -4907272 -2292536 260660 1131131
41704 1131131 1766139 3304015 4527952 4371408 4126561 5158831 6167916 5156227 2959024
41695 2959024 2148436 3033720 3509364 2765429 2328170 2947174 3153582 1981609 856931
41686 856931 1405065 3121518 4475520 4749558 3660674 967381 -2076619 -2688401 87563
41677 87563 3485772 4616766 4519306 5937674 8216011 8021357 5218923 4177704 7620966
41668 7620966 12272404 13182383 10320679 7829498 7747324 7777671 5594822 2476861 1222631
41659 1222631 2240458 3422194 3104009 1716327 754181 1150288 2617394 3911237 3805107
41650 3805107 2253337 386821 -943046 -2046064 -3275534 -3803700 -2618520 -309681
41642 -309681 1461063 2194140 2874602 3859083 3983075 2591003 1167111 1592472 3417691
41633 3417691 4305588 3147483 1486536 1403523 2871939 3963259 3285747 1393658 -283557
41624 -283557 -1118890 -1378093 -1263412 -871113 -888898 -2006798 -3306081 -2724947 -112604
41615 -112604 1592699 -63800 -3247580 -3794854 -746185 2393351 2406430 268309 -739065
41606 -739065 849965 3789733 6213980 7235637 7042520 6482970 6317670 6368708 5823526
41597 5823526 4588786 3593984 3539885 4229151 5245139 6156252 6023569 4340072 2777942
41588 2777942 4023274 8006521 11204663 10895976 8329328 6307996 5480154 4802768 4012295
41579 4012295 3478295 2812747 1745431 1398816 2642455 4086057 3777462 2076841 788705
41570 788705 295370 -229662 -546476 288311 1821244 2849588 3680244 5270661 6573563
41561 6573563 5506753 2473118 128513 -515839 -976675 -1937834 -1925708 -237416 1412358
41552 1412358 1401936 333587 -384681 -308934 475843 1811572 2879591 2906776 2769285
41543 2769285 3863815 5272999 4690911 2546422 2073557 4292686 6178465 5387042 3611927
41534 3611927 3181788 3440949 3150175 3563977 5753981 7192104 4903525 621372 -1164645
41525 -1164645 314605 1423355 -3352 -1776163 -1355199 233698 162626 -2294003 -5121499
41516 -5121499 -5911040 -3907183 -344377 2652262 3824885 3594965 2960108 2085915 597076
41507 597076 -1286182 -2744353 -3149719 -2291967 -413482 1432315 1927416 1060085 145941
41498 145941 -313667 -1286278 -2813622 -2987503 -1102056 86333 -2153740 -6056665 -7267088
41489 -7267088 -4582948 -971877 861350 1098512 900577 609744 418545 597898 562361
41480 562361 -324399 -876772 685237 3403670 4053538 1568605 -1506360 -2759225 -2536432
41471 -2536432 -1865724 -553947 1097042 1331303 -237408 -1116488 403339 2064503 842463
41462 842463 -2216980 -3451305 -2045102 -830377 -1578074 -2448394 -1088679 1843918 3564005
41453 3564005 2452574 -475560 -2778847 -2751998 -863552 724761 448426 -925840 -1320181
41444 -1320181 172824 2482791 3949546 3736240 2097119 136268 -758499 -70200 1201088
41435 1201088 1654889 1133027 602512 644429 929010 1116421 1354931 1711001 1825177 1369689
41425 1369689 406126 -721588 -1437541 -1092026 321999 1784909 2234775 1792446 1423412
41416 1423412 1713500 2723370 4571625 6998688 8624508 8081758 6025498 4605570
41408 4605570 4561310 4285196 2515926 585183 688369 2709973 4195660 3360559 1028697
41399 1028697 -651836 -729383 -244005 -640392 -1744011 -1801891 220189 2986763 4263481
41390 4263481 3685538 2934382 3263024 4209322 4962444 5449865 5443440 4148873 1751870
41381 1751870 51080 272536 1336623 1582724 1096917 831940 550785 -454081 -1466937
41372 -1466937 -1324894 -717740 -1202054 -2204395 -1521174 1034238 2995475 2762924 1330783
41363 1330783 -175845 -2047684 -3906274 -3787883 -1245104 907269 298595 -1366105
41355 -1366105 -1010052 929265 1386847 -271077 -1316534 -26821 1892775 2187762 1106094
41346 1106094 262333 12742 -578888 -1910175 -3146835 -3237308 -2112234 -849245 -542327
41337 -542327 -868167 -335572 1538500 3126592 2775669 1244221 649253 1472980 2241372
41328 2241372 2005352 1466436 1490760 2015369 2714421 3460859 3904006 3727598 3320702 3037722
41318 3037722 2167676 214422 -1288412 -426428 1813927 2501303 1238934 781682 2359527
41309 2359527 3497025 2145551 99470 -80124 803801 345231 -1245669 -1608242 108437
41300 108437 2693091 5113711 6723590 6072611 2466209 -1590195 -2451282 -58067 2025168
41291 2025168 1626154 330519 135743 449471 -147352 -1277221 -1693554 -1459921 -1528069
41282 -1528069 -1954636 -1911109 -1007479 346343 1494454 1835375 1125197 8014 -376653
41273 -376653 221433 860443 888819 846476 1296157 1654460 1032853 -407374 -1793176 -2745864
41263 -2745864 -3424960 -3725289 -3276618 -2173092 -1090670 -629635 -834718 -1264455 -1317216
41254 -1317216 -670383 391776 1221878 1463323 1319319 1269314 1754846 2836469 3668804
41245 3668804 2761219 -291363 -3554056 -4407186 -2539718 -119484 1132226 1573436 1975251
41236 1975251 2023298 1572416 1776326 3277250 4387070 3036611 -51499 -2122255 -2087659
41227 -2087659 -1440668 -1366592 -1131532 -130745 438618 -627679 -2439411 -3289559 -3106804
41218 -3106804 -2957400 -2702270 -1093042 1712561 3550171 2890152 799255 -605561 -684774
41209 -684774 -275339 65606 577758 1336986 1928931 2163129 2240624 2120354 1585582 1120643
41199 1120643 1731615 3324285 4084606 2444746 -615775 -2196367 -636916 2565458
41191 2565458 4452049 3893060 2496937 2060042 1956202 242838 -2754289 -3754243 -678649
41182 -678649 3795784 5012607 2314837 -235522 349486 2088614 1586226 -701978 -1447061
41173 -1447061 373494 2255818 2201190 1282040 1288341 1939411 1873378 1058533 684732 1281179
41163 1281179 2161475 2503590 2191083 1756629 1953083 3085404 4470383 5008782 4503980
41154 4503980 3754636 3139121 2114965 642806 -66671 732841 1800087 1465085 156915
41145 156915 -116935 1323823 2854052 2665845 760083 -1385437 -2168056 -817347 1831080
41136 1831080 3302998 1536205 -2468304 -5182099 -4402479 -1516518 732008 1422040
41128 1422040 1326128 931077 304747 149271 1052809 1930498 1072376 -1138056 -2315801
41119 -2315801 -1304442 278354 368928 -1027845 -2368087 -2464494 -1248936 219927 63240
41110 63240 -2661150 -5921805 -6193170 -2968802 80532 -98569 -1942848 -2138233 -656434
41101 -656434 -15796 -645441 -448455 1052063 1477240 -620262 -3466066 -4797660 -4646475
41092 -4646475 -4012733 -2732158 -372423 2122784 3385227 3403042 3038406 2491149 1475414
41083 1475414 420810 341610 1563531 3183619 3796178 2717213 764982 -434344 -385167
41074 -385167 -289703 -822382 -514948 1833111 4215882 3622468 715106 -891135 -143174
41065 -143174 251622 -1028252 -1475363 653837 2905053 2488870 627249 40503 597366
41056 597366 685010 762571 2068335 3426875 2838990 1038292 183008 151253 -617903 -1794284
41046 -1794284 -2106180 -2421851 -4071217 -5083378 -2378584 2713512 5563669 4975026 4354002
41037 4354002 5600524 6384956 4797727 2433071 1004204 -296989 -1983353 -2334495
41029 -2334495 -637994 745305 56281 -910289 -126047 976599 35339 -2094540 -2761347
41020 -2761347 -1661256 -749383 -953211 -1395527 -1222531 -250974 1533840 3525811 4360568
41011 4360568 3600348 2532074 2053844 1140285 -1179512 -3843809 -5372289 -5886319 -5766166
41002 -5766166 -4075988 -610092 2113934 1749630 -14460 499068 3458331 5099689
40994 5099689 3118935 -246373 -1557703 -565282 235184 -597045 -1625898 -703077 1865609
40985 1865609 3366985 2341298 1050374 2573245 6002986 7145064 4411272 1060447
40977 1060447 156044 233050 -1576123 -4548981 -5714790 -4612748 -3306167 -2520272 -1207637
40968 -1207637 276277 -30695 -2203641 -3638542 -2662046 -572302 873363 1859117 3182721
40959 3182721 4277464 4032927 2592872 1168550 629099 985802 1747513 2254900 2034508
40950 2034508 1101977 -301122 -2058862 -3782417 -4485862 -3565473 -1925298 -1183526 -1733693
40941 -1733693 -2393675 -2061299 -1031544 -446572 -771303 -1007552 357533 3290754 5554832
40932 5554832 5113470 2858369 1396258 1281292 653446 -1047187 -1807663 -746887 -243463
40923 -243463 -2188525 -4549030 -4352727 -2089433 -192790 1071093 2852767 4311282
40915 4311282 3692271 1919296 1288407 1170483 -840658 -3611577 -2954013 1517472 4424553
40906 4424553 1723621 -3676335 -6059629 -4208927 -1798181 -1932962 -3795242 -4373107
40898 -4373107 -2128769 1040239 1486375 -1744418 -4808575 -3368130 1454466 4259748
40890 4259748 2687134 182902 358674 2041697 2164879 793894 384111 1742389 3480741
40881 3480741 4502562 4700594 3848288 1845746 -229390 -851583 320300 2348231 3954743
40872 3954743 4010670 2202282 -72172 -760688 116111 290042 -1318294 -2720291 -1642557
40863 -1642557 1452207 4431612 5914831 5310407 2411979 -1256696 -2595104 -595011
40855 -595011 1755630 1453544 -307844 -498555 755475 750671 -1134534 -2726286 -2780065
40846 -2780065 -2264188 -1751626 -543042 1010116 1069386 -781957 -2414764 -1993902 -121189
40837 -121189 1721690 3056122 3769902 3337912 1901225 772026 682022 628364 -457067
40828 -457067 -1896068 -2258163 -1389188 -310000 427393 1227380 2409964 3430581 3324348
40819 3324348 1813741 18058 -187595 2004055 5304632 7632042 8110558 7102095
40811 7102095 4908583 1850968 -661505 -1015510 229409 580827 -950100 -2259908
40803 -2259908 -1218901 1082916 1877381 675702 -214308 1041838 3721375 5969951
40795 5969951 6854575 6504003 5497668 4905653 5873521 8091555 9424173 8355428 6386121
40786 6386121 6425318 8642271 9602068 6506236 1067216 -2288381 -1494312 1344834 3035283
40777 3035283 2735952 2078100 3001130 5811259 8561933 8420302 4821471 1119813 1331512
40768 1331512 4968442 7289979 5563778 2570178 2032876 3043556 2218979 -162129
40760 -162129 -355208 2459725 4191606 1911082 -1511741 -1592672 1253994 2751295 1278054
40751 1278054 -158266 1180363 3885343 4838007 3545718 2255703 2752243 4649606
40743 4649606 6370389 6441437 4169453 480886 -1982315 -1124238 1951478 3974184 3634331
40734 3634331 3038893 4140783 5556544 4812146 2445025 1331565 2328555 3215522 2363159
40725 2363159 1023498 971416 1888526 2421808 2256597 1739547 767482 -522338 -1113108
40716 -1113108 -587007 -143018 -653502 -861707 666292 2766991 3021226 1375263 210177
40707 210177 831765 1957598 2025601 1210870 593042 739337 1625605 2785423 3198307
40698 3198307 2187435 672405 302403 1098906 1295275 -83857 -1799029 -2082676 -566775
40689 -566775 1982953 4620777 6229714 5749525 3352978 698752 -677884 -658627 119097
40680 119097 1353040 2966333 4615005 5792478 5962115 4638210 2230584 623456
40672 623456 1436437 3530643 3928720 1703094 -861371 -1710247 -1529429 -1530339 -943097 1099637
40662 1099637 2899117 2221726 120954 -174302 2013696 4049122 4282323 4240962 5394244
40653 5394244 6270889 4751090 1553830 -766599 -1422068 -1815464 -2614004 -2531945 -625939
40644 -625939 1813174 2814729 2351325 2210036 3460022 5118941 5618813 4808472 3871472
40635 3871472 3635937 3731451 3500426 3108697 3295783 4215172 4942774 4337977 2391119
40626 2391119 549936 379618 1809042 3164091 3275180 2974305 3745440 5323336 5762416
40617 5762416 3893056 641493 -2225011 -3597205 -3154493 -1337048 434055 919099
40609 919099 940719 2463321 5125118 5872458 3498989 1192739 2099325 4398033 4206569
40600 4206569 1978893 1708123 4052826 5096540 3126993 1875836 4326961 7359827
40592 7359827 6407983 2529664 373485 882004 806926 -1087789 -2113716 -595878 1466833
40583 1466833 2094232 2156793 2719657 2637707 1050655 -225460 645117 2295560 2138877
40574 2138877 231345 -1327588 -1843373 -2355038 -3118733 -3229391 -2579030 -1940843 -1056871
40565 -1056871 1163441 4140727 5371894 3552621 446000 -1307460 -1123705 -289402
40557 -289402 312011 1175795 2944422 4832933 4794471 1763829 -2306274 -3787447 -1552919
40548 -1552919 1278716 1133653 -1429165 -2829241 -1578772 160545 361737 -1709 1033772
40539 1033772 3431507 5608211 6677762 6977124 7178578 7818388 8930894 9462481 8027663
40530 8027663 4963795 2517025 2118614 2619311 2232444 1033192 242451 112373 97830
40521 97830 342865 1257827 2012803 1222940 -757705 -1726258 -303127 2259275 3469909
40512 3469909 2298608 115327 -910272 -202894 611069 -219169 -2234084 -3366230 -2687996
40503 -2687996 -1279382 -273490 360795 646756 10150 -1315995 -2118553 -2413444 -3706670
40494 -3706670 -5715411 -5418875 -1661029 1831236 1293663 -1234862 -935035 2275002 3952783
40485 3952783 2540171 1455514 2782709 3775574 1872110 -994761 -2030094 -2079782 -3127134
40476 -3127134 -4037284 -2570821 221000 1414565 916654 1164549 2762590 3864964 3712964
40467 3712964 3486382 3430106 2296409 282143 -422391 930239 2237881 1870897 1098892
40458 1098892 1623533 2693801 2651950 1923129 2273718 3745808 4349568 2858867 443493
40449 443493 -870852 -515226 260819 28742 -1048647 -1278043 426114 2770176 3362949
40440 3362949 1818067 398420 1069374 3061105 4197295 3628852 2157345 684416
40432 684416 -329960 -404380 537681 1467565 1274664 427684 382530 1379380 2212391 2344497
40422 2344497 2708870 3825030 4563721 3782887 2100598 917782 531687 438862 810839
40413 810839 2186650 3970966 4755399 4315102 3956664 4410876 4549133 3027722 413958
40404 413958 -1380901 -1507925 -989570 -937305 -887378 258685 2018623 2334331 387590
40395 387590 -1656907 -1128452 1390692 2658714 1393957 173556 1543691 4220676
40387 4220676 5215459 4305843 3793550 4567471 5268800 5266096 5535424 6128204 5666711 4295987
40377 4295987 4263142 6112766 7086189 5269242 2696866 1817778 1356256 -944243 -3306037
40368 -3306037 -1782182 3396462 7353136 6978177 4417574 3144640 3524614 3833497 3378649
40359 3378649 2755372 2392047 2356396 2753018 3351992 3589580 3475648 3609612 4034372 4219005
40349 4219005 4343708 5154262 6250156 6152919 4615543 3256982 3203021 3601604 3251376
40340 3251376 2346705 1888035 2541079 4440757 6779769 7624141 6122612 4899640 7517121
40331 7517121 13011273 16131717 14280360 10899936 10062349 11188381 11994175 13278099
40323 13278099 16631340 19780065 19032792 15330324 13258695 14285436 15273356 13937670
40315 13937670 11601905 9797249 8177208 7154692 8810974 13093620 16177308 15051425
40307 15051425 11563736 9666303 10354612 11447566 11130561 9814459 9180992 10566098
40299 10566098 13570944 15771284 15069281 12640490 11685283 12834729 13270603 11340818
40291 11340818 9199667 9141546 10081289 10077587 9881637 10994203 12174499 11291517 9316031
40282 9316031 8905172 9780839 9192344 6842901 5670899 7082708 8737403 8338980 6883269
40273 6883269 6511828 7237005 7563978 7004815 6453035 6850591 8401728 10371740 11245950
40264 11245950 10162121 8509401 8720671 11012377 12901234 12680600 11689525 11957646 13082158
40255 13082158 13040066 11217068 9076952 8182119 8705549 9697153 9984838 8975316 7100799
40246 7100799 5296675 3945078 2915349 2561077 3486780 5077317 5718433 5125272 4930529
40237 4930529 5972854 6583440 5077256 2605982 1583813 2150036 2387765 1739180 1890842
40228 1890842 3793862 5778030 5790484 4349984 3933680 5715960 7963484 8032592 5503435
40219 5503435 2677104 1826379 2730937 3747643 4630056 6614860 9641664 11466373 10540013
40210 10540013 8218526 6793942 6570556 6354178 5777306 5464093 5595513 5910463 6597135
40201 6597135 7728390 8410841 8011961 7626413 8677172 10581382 11542380 11244122 10958286
40192 10958286 11270116 11520758 11335323 10944361 10155724 8751021 7670061 7962011 8814102
40183 8814102 8597668 7635331 7785002 9424715 11125985 12275597 13662573 15452539 17001233
40174 17001233 18575422 20545903 21094622 18144685 13768560 12697388 15464459 17169290
40166 17169290 14808882 11716675 12092579 14843225 16201276 15484911 14620222 14177127 13452141
40157 13452141 12847069 12951754 12669039 11042104 9370610 8936970 8658631 7770570 8319855
40148 8319855 11497430 14059429 12717898 9885748 10096668 12453812 12273928 9282633
40140 9282633 8019476 9905665 11060750 9264479 7307930 7354181 7294983 5522661 4646033
40131 4646033 7047880 10467553 11502075 10589347 10276592 11063592 12071722 13623746 16104178
40122 16104178 18052548 18137093 17404455 17191563 16663167 14873478 13271911 13384858 13870796
40113 13870796 12937829 12043306 13717732 16740320 17102192 13626543 9519899 8065329
40105 8065329 9332963 11516536 13254713 14008167 13878564 13727881 14388717 15460686 15682124
40096 15682124 14443266 12316951 10482511 10098294 11380877 12732845 12046484 9685810
40088 9685810 8624926 10532442 13538362 15372506 16615322 18603390 20103517 19154743
40080 19154743 16976840 16677863 18551401 19922702 19689036 19797752 21558845 23379044
40072 23379044 23384813 22083978 21068853 20724766 20527930 20400480 20526332 20546918 19943347
40063 19943347 18932122 18424944 19167015 20996892 22915369 24144189 25044969 26215677
40055 26215677 26766544 25095755 21919864 20540978 22773872 26484069 28874967 30202937
40047 30202937 31899366 33081717 32327238 31590558 34357498 40130106 44628232 45976113
40039 45976113 47046368 50608205 55609530 60088210 64975100 72728058 84008337 97818374
40031 97818374 113814412 132773379 155503447 182836158 216904598 261878937 321965948
40024 321965948 395048801 465404844 505876691 494920067 435414453 354086132 279975242
40017 279975242 224909873 184615357 152521971 126999292 108019314 93794667 82611106
40010 82611106 74594930 69977955 67419333 65043347 61976875 58545609 56062918 56311974
40002 56311974 59808868 64579546 68099920 70477666 74205628 80740524 89257394 99435012
39994 99435012 113482011 133803409 160015697 190593982 227013182 272671412 324748548
39987 324748548 368409888 383794106 362260243 315141956 264417699 225228646 199010963
39980 199010963 181176667 169682959 164525869 164383318 168760007 181066634 204872417
39973 204872417 238680805 279602649 330815215 396946143 468202070 515981190 513029420
39966 513029420 458435930 378238083 301647459 241089464 194417207 157886337 130841323
39959 130841323 111636045 96412032 82941934 71715827 62576904 53772560 45193232
39952 45193232 39109632 36128891 33381773 28700770 24027147 22289196 22950413 23216879
39944 23216879 22043085 20333105 18560483 16980411 17076042 19721758 22515469 21992761
39936 21992761 18312937 14914016 13662100 13320179 12877789 13122589 14220410 14815966 14635391
39927 14635391 15247475 17056445 18168590 17581850 16938025 17560761 18216961 17575988 16528883
39918 16528883 16079468 15214677 13222121 12093195 13882936 17152675 18789153 18301257
39910 18301257 17695719 18031412 18876663 20539008 23806123 27441415 28817527 27733561
39902 27733561 27234127 29591526 33318778 35438172 35434125 35513637 37383758 39948911 40606188
39893 40606188 38519944 35965866 35773783 37749939 38957918 37879091 36665891 38102137
39885 38102137 41684796 44442810 44852841 44094263 43708863 43793764 43745187 43449527 43267871
39876 43267871 43527174 44168449 44522996 43793750 42238417 41242909 41582835 42431901 42912797
39867 42912797 43622565 45475656 48079224 50767589 54339897 59946778 66915488 73798051
39859 73798051 81389281 92547692 108739339 128876250 152611676 183205673 224987903
39852 224987903 276738204 327056245 357383611 353132988 315155419 260121423 207636025
39845 207636025 166758308 135438289 110042985 90842744 78415289 69888815 61675261
39838 61675261 53385004 46518411 41060307 35753985 30468372 25955705 22021425 18051084
39830 18051084 14900142 14237265 15982342 17977244 18387356 17308439 16004758 15591752
39822 15591752 16390929 17583518 17617388 15948224 14173578 14274159 15842441 16407755 14666950
39813 14666950 11976405 10156219 9211949 8158518 6983864 6522567 6967437 7707580 8355296
39804 8355296 8910031 9229751 9531532 11207309 15638855 21920940 27215593 30008434 31708646
39795 31708646 34227844 37392598 39968489 41810866 43151661 42888983 40063471 36561465
39787 36561465 35517341 36672768 36171482 32091782 27491908 26027559 26778181 26061901
39779 26061901 22944383 19933829 18708183 18130223 16881469 15497770 14831787 14521828
39771 14521828 14201190 14582924 15882951 16456147 14796156 12164121 11223235 12090818 11823100
39762 11823100 8696491 5213706 4992682 7561051 8677264 6133954 2824763 2592437
39754 2592437 4945430 6235687 5024037 3475505 3490108 4216147 4183414 3535863 2903794
39745 2903794 2009719 880607 881638 2952309 5946114 8048566 8716908 8069197 5880398
39736 5880398 2817565 1237876 2642648 5213972 5935813 4579380 3627436 4643286
39728 4643286 6622583 7823371 7593023 6434051 5623257 6626734 9742798 13655852
39720 13655852 17289749 21277595 26351860 31328956 34367227 35341986 35244324 34234188
39712 34234188 32335843 31130214 32427654 35927353 40363364 45833082 52045149 55253533
39704 55253533 50990206 40362774 30083184 25084154 24036695 23370336 22772209 24726786
39696 24726786 30544968 38640135 45628968 48299348 45863627 40844165 36339251 32417416
39688 32417416 27186032 21097942 17047570 15672229 14070453 10653357 7944963 8355498
39680 8355498 10025617 9634971 7294249 5846502 6659117 8610966 10323208 11257375 11251053
39671 11251053 10630319 10270155 10577467 11276035 12592109 14917307 16824561 15960501 12977991
39662 12977991 11706910 13761241 15972063 15326750 13295747 12428773 11860007 9962523
39654 9962523 8696421 10695941 13867481 13801777 10624336 8617641 9380204 10183379 9407166
39645 9407166 8825996 9377255 8973697 6286979 3255311 2082515 2614743 4065630 6374213
39636 6374213 8364314 7561174 3744503 143221 -746341 -169609 -215544 -473823 203533
39627 203533 895964 254408 -610292 452868 3142158 4808439 3622064 169815 -3451687
39618 -3451687 -4955455 -3198329 619900 3972258 6032799 8326267 11512438 13551202
39610 13551202 12750097 10825257 10762779 12985206 15860042 18787513 22154162 24819484
39602 24819484 24331697 19981913 13948919 9234822 7534596 8605024 10362480 10195593
39594 10195593 7619480 5016108 4510843 5329137 5946067 7227326 10669876 14617898
39586 14617898 15580756 13049885 9732322 6984596 3612997 -165897 -1461136 821881
39578 821881 3482396 3276456 1105382 -351117 -765119 -1183405 -969979 988654 3189726
39569 3189726 2929040 467912 -1111475 -307140 1050321 793310 -954471 -2626692 -3023041
39560 -3023041 -1974910 -645443 -1095973 -3935461 -6672381 -6436241 -4121026 -3247953 -4525210
39551 -4525210 -4685320 -1909763 769286 -139174 -3200933 -4166420 -2149922 -424045 -1277995
39542 -1277995 -3102955 -3314647 -1848334 -501279 -279146 -693699 -915651 -556937 374540
39533 374540 1586974 2662332 3429267 4070008 4772124 5496091 6081328 6273889 5696101
39524 5696101 4217944 2437300 1414983 1726021 2849820 3479299 2470892 -93274
39516 -93274 -2528046 -2748734 -478297 2039191 2252510 143570 -1834581 -1644855 308374
39507 308374 2275273 3387002 3912005 3665090 1495388 -2828746 -6956038 -7648923 -4434230
39498 -4434230 -271340 2083882 2903488 3412549 2715211 -445203 -3840936 -3500054 161797
39489 161797 1883209 -918218 -3868517 -2006633 2640164 4161001 1593067 -341156
39481 -341156 998527 2692798 1774527 -132096 -83385 1399192 1647591 58983 -1613020
39472 -1613020 -2094584 -1544910 -321641 1369529 2853420 3417297 3346722 3633334 4623903
39463 4623903 5402846 4503617 1316038 -2870515 -5612301 -5798644 -4834362 -4379218 -3869195
39454 -3869195 -1963955 539906 1762458 2147442 3732767 5964954 5685928 2141528
39446 2141528 -1361660 -2166310 -1410686 -820287 267691 2340006 3334641 1814518 -47276
39437 -47276 235728 1420327 981948 -520691 -1033045 -1068431 -2314057 -3625060 -2524803
39428 -2524803 187828 1429122 913747 1154689 2570886 2780754 1105555 -279919 -424673
39419 -424673 -956119 -2329948 -2506600 -867420 31357 -1452463 -3122268 -2160929 1046972
39410 1046972 4116420 5619700 5272502 3205085 645228 -446438 198007 711853 15916
39401 15916 -730178 -416345 496500 1583160 3071240 3941446 2356118 -730962 -1634701
39392 -1634701 580357 2040295 -109868 -3155405 -3193525 -1035179 -12823 -407950 -253875
39383 -253875 118047 -1236870 -3597339 -4093979 -2059763 643988 2892152 4289256 3001824
39374 3001824 -1932258 -6658929 -5889783 -651217 2338153 106581 -2859538 -2258021
39366 -2258021 -131538 -113404 -1059498 58216 2091661 1603991 -926268 -1771859 -261828
39357 -261828 293693 -1509460 -2601883 -328274 3403451 5022693 4041577 2535512 1392090
39348 1392090 -287868 -2451749 -3220948 -1496956 1119442 2145595 1174518 -51396
39340 -51396 -51578 1118601 2875303 4982275 7016527 8271858 8960553 10422672 13464929
39331 13464929 17912787 24550735 34988308 47291293 54242407 50202078 38941333 30205530
39323 30205530 28403283 29581519 30427303 33914156 42136874 48895156 45852277 33810419
39315 33810419 21737929 15313019 12140861 8498436 4908428 3031936 1831179 -122751
39307 -122751 -1671171 -1266261 33009 192338 -848297 -1817297 -2157930 -1802418 -535120
39298 -535120 915129 930925 -348581 -475826 1486637 2881065 1492508 -489712 547192
39289 547192 4324998 7431510 8165274 7414894 5618474 2354952 -1230606 -2883049 -2389123
39280 -2389123 -1511755 -738558 965729 3034696 3217019 1331831 -11720 533883 1268363
39271 1268363 900222 701151 1539958 1767205 292361 -881975 144755 1661634 1007030
39262 1007030 -995790 -1516350 -496083 -523027 -2313649 -3677251 -3390385 -3096330 -4234382
39253 -4234382 -5427507 -4490742 -1592248 1071389 1958693 1335089 178914 -962576 -1908322
39244 -1908322 -2347192 -1987949 -1228584 -1131148 -2146860 -3169635 -2787930 -1425110 -1012036
39235 -1012036 -2240099 -3540255 -3489747 -2798344 -2772358 -3094821 -2667761 -1785779 -1827084 -3189065
39225 -3189065 -4871457 -5780904 -5383807 -3623425 -1308190 83406 173644 461118 1988412
39216 1988412 3232266 2144459 -488612 -1881234 -1064682 293358 718628 358860 -458902
39207 -458902 -1771589 -2698213 -1894107 52793 866653 65126 -58619 1820592 3556210
39198 3556210 2659369 190733 -822841 123244 561604 -1077603 -3344821 -4028474 -2879410
39189 -2879410 -1225800 -30325 559874 381867 -666169 -1637770 -927053 1534568 3402098
39180 3402098 2597197 380280 -94524 1592259 2219318 -262387 -3277223 -3177978 -655668
39171 -655668 273879 -1927881 -4510596 -4688537 -3024400 -1649810 -1217458 -849143 265945
39162 265945 2204887 4253166 5010159 3632229 1265346 37053 468058 1253483 1620711
39153 1620711 2143117 3021284 3514136 3481636 3508996 3149498 1401928 -543220 54432
39144 54432 2887763 3761615 473108 -3314860 -3022712 246036 1596817 -475803 -2593023
39135 -2593023 -1977238 29233 665530 -626891 -2347392 -3011993 -2270707 -1064960 -967937
39126 -967937 -2390383 -3651114 -3058681 -1440521 -934469 -1715448 -2078500 -1661218 -2013038
39117 -2013038 -3380583 -3567438 -1441905 590464 -319025 -3264077 -4688572 -3058931
39109 -3058931 -334703 1206649 1726093 2761452 4659663 5976640 4989803 1349202
39101 1349202 -3417213 -6808006 -7279681 -5674650 -4323470 -4377063 -4577278 -3256350 -912712
39092 -912712 366158 -140029 -845746 -300370 831956 1216303 1120060 1778498 3132431
39083 3132431 3833740 3381835 2734642 2602023 2495576 1902815 1275180 1285128 1870672 2414080
39073 2414080 2329329 1476996 656303 1335455 3823046 6132488 6199370 4978769 5460737
39064 5460737 8639093 12711567 16583838 21350626 26968053 30114649 27754748 21292953
39056 21292953 14923761 10895806 8458870 6497549 4798998 3032708 692967 -1675570
39048 -1675570 -2762892 -2264155 -1230746 -613039 -466471 -539275 -659488 -538653 19203
39039 19203 736947 1189543 1245429 864429 68534 -582661 -469940 -289711 -1568704 -4003091
39029 -4003091 -4878239 -2480201 1347619 3637757 3916958 3537853 2753381 912243 -1184855
39020 -1184855 -1745236 -782510 -305494 -1544577 -3709672 -5472189 -5996642 -4679021 -1775884
39011 -1775884 660927 397589 -2100746 -4001148 -3556813 -1734493 -277367 242558 172207
39002 172207 72218 557537 1565600 1788625 300634 -1367791 -643842 2369644 4514827
38993 4514827 3531519 688995 -1309373 -1522815 -893615 -405692 -317207 -641725 -1433561
38984 -1433561 -2566054 -3436708 -3021879 -845571 1745429 2264981 -23095 -2825894 -3535181
38975 -3535181 -2138761 -98635 2219725 4926370 6711271 6268459 4883793 4851735 5873225
38966 5873225 5946511 5316736 6142566 8443290 10273933 12299385 17798974 26577320 32962746
38957 32962746 32361325 26653174 20656263 16303906 13198989 12078943 13916685 17036443
38949 17036443 18543805 18020173 17318398 17526247 18504308 20661823 24894200 31291271 39713449
38940 39713449 50619648 63114422 73035753 75537123 69609024 58526554 46430998
38933 46430998 36029598 28564889 23661957 19482563 14931339 11396737 10700336 12033311
38925 12033311 12819946 11950753 10177261 8048761 5748203 4389227 4926835 5994098
38917 5994098 5322123 3245272 2240067 2904931 3182245 2098911 1453819 2629244 4143720
38908 4143720 3890164 1955080 -256771 -2127420 -3559320 -3910417 -2783775 -1120617
38900 -1120617 -284327 -607820 -1614972 -2887064 -3958523 -4224902 -3751964 -3357295 -3190221
38891 -3190221 -2216850 3232 1992892 1926304 -120589 -2479406 -3881080 -4197738 -3751541
38882 -3751541 -2956223 -2400060 -2393024 -2492035 -2004865 -767311 889840 2463289 3264587
38873 3264587 2842127 1861074 1606224 1958818 1066876 -1838037 -4471494 -4044424 -1052312
38864 -1052312 1382417 1582941 700986 102742 -340663 -824768 -698946 -50752 -265455
38855 -265455 -1636814 -2177553 -517855 1541055 1411361 -550765 -1959127 -2081073 -2047677
38846 -2047677 -2044720 -1264745 -556387 -1864350 -4407529 -4727661 -1923056 333338 -896095
38837 -896095 -3319984 -3004067 -169109 1858235 1876713 1444778 1201994 225569 -1089550
38828 -1089550 -970957 502963 1179202 406442 -69541 535076 778470 124876 361370
38819 361370 2343647 3995383 3399306 1583023 339329 -502322 -1519818 -1594308 28287
38810 28287 1293671 -143346 -3075779 -4294454 -3285090 -2504046 -3217567 -3943011 -3419013
38801 -3419013 -2525506 -2234936 -1644243 516420 3474827 4860689 3403799 479185 -1327143
38792 -1327143 -1169840 -964216 -2668995 -4962791 -4433291 -553069 2700103 1714731 -2078632
38783 -2078632 -4473766 -3952524 -2351381 -1166550 -297343 -243054 -2321383 -5865187 -7774306
38774 -7774306 -6143090 -2564478 210751 1307006 1432452 1143819 678393 373088 75701
38765 75701 -970533 -2691275 -3587545 -2670878 -1181103 -1145097 -2698050 -3984058 -3499156
38756 -3499156 -1539426 616400 2066388 2650970 2619036 2291404 1836547 1220000 458069
38747 458069 -142033 -254829 -121200 -560968 -2024842 -3666030 -3872976 -2078213 340614
38738 340614 1481843 961067 -45671 -417759 115784 1430176 2989734 3474169 1920108
38729 1920108 -505312 -1384508 -138128 1319238 1496072 1053533 845897 334804 -747914
38720 -747914 -1238299 -750685 -1042326 -3092636 -4764375 -3883070 -1821351 -1031652 -688956
38711 -688956 1508666 4345449 4277531 1536867 557299 3241306 5797123 4136221 -755938
38702 -755938 -4851635 -5864777 -4047642 -599173 2546151 3220954 1402806 -347867
38694 -347867 -413424 -360931 -1978102 -3984297 -3910163 -1782583 356290 1470962 1838429
38685 1838429 1309773 -358884 -1970567 -1912002 -557253 194604 -349804 -1068427 -1033870
38676 -1033870 -574930 -310593 -436744 -997046 -1808441 -2229963 -1865707 -1144013 -477184
38667 -477184 319480 815049 -543293 -4027168 -6831702 -5968577 -2385005 237271 558488
38658 558488 740088 2202215 3161616 1779137 -585910 -1225203 312328 2366167 3824270
38649 3824270 4655626 4457462 2611385 -46709 -1537857 -1241739 -700531 -1275628 -2235443
38640 -2235443 -2139968 -1146406 -581834 -698580 -427750 500692 819371 -37720 -341668 1679028
38630 1679028 4680518 5293003 2565097 -600799 -1395795 -831107 -1806575 -4430506 -5572219
38621 -5572219 -3376416 -225713 123142 -2661952 -5132364 -4365179 -1195348 1408871
38613 1408871 2088955 2006565 2405062 2747427 1849994 -168815 -2073790 -3133151 -3501054
38604 -3501054 -3190088 -1830394 253833 1660068 1232188 -646141 -2544867 -3513896 -3731637
38595 -3731637 -3769633 -3638741 -2875351 -1585299 -895185 -1634575 -2717755 -2066518 330999
38586 330999 1636695 -259270 -3380225 -3760865 -603218 2612967 2484696 -545445 -3412519
38577 -3412519 -3982350 -2473681 -381941 946639 1044113 276371 -882985 -2259655 -3274104
38568 -3274104 -2668941 -222389 1924223 1524655 -463663 -1062873 143209 289268 -2060255
38559 -2060255 -4232977 -3254955 -176423 1554034 510711 -1971849 -4173666 -5001519
38551 -5001519 -3762557 -1170392 225893 -1207168 -3643405 -4083280 -2458461 -1108288
38543 -1108288 -801740 -137966 1138216 1312269 -32598 -773390 286019 1134512 -254933
38534 -254933 -2294919 -1845490 1030098 3008848 2267465 896379 1531262 3357466 3333365
38525 3333365 733961 -1638520 -1334990 379248 482121 -1534203 -3314266 -3310259 -2649717
38516 -2649717 -2776923 -3218576 -2911040 -2187665 -1895587 -1667419 -743538 270668 165583
38507 165583 -851181 -1515926 -1538564 -1616308 -1579255 -297649 2191585 3910531 3036895
38498 3036895 73049 -2539534 -2687434 -503577 1726587 1927254 655079 282092 1480318
38489 1480318 2140258 873953 -265972 1282651 4255091 4920457 2331401 -546427
38481 -546427 -1130337 -117617 494918 78565 -776613 -1336956 -955586 272419 738946
38472 738946 -1094439 -4092943 -5424230 -4497622 -3641636 -4219764 -4650541 -3497384 -1970394
38463 -1970394 -1565207 -1460862 -455044 370924 -593417 -2413073 -2835894 -1728185 -857585
38454 -857585 -840581 -706354 -231317 -379059 -1305448 -1968057 -1994325 -2153146 -2687664 -2879372
38444 -2879372 -2611465 -2689918 -3125121 -2735817 -1180629 115649 9305 -627573 -280143
38435 -280143 1079449 2346558 3001183 3269958 3070066 2089693 858048 539532 1279683
38426 1279683 1596502 51140 -2839267 -4914855 -4528017 -2023372 861877 2615702
38418 2615702 2843718 2052875 1068815 556840 652517 947030 1030736 993807 1176800 1621650
38408 1621650 2121185 2561874 2705165 1927658 -2419 -1988980 -2424524 -1128543 417700
38399 417700 982016 732642 175874 -826268 -2239652 -3179217 -3114594 -2925333 -3588796
38390 -3588796 -4455825 -4107313 -2535657 -1190714 -1014343 -1605287 -2250226 -2592084 -2221678
38381 -2221678 -822788 946676 1710767 910198 -667594 -2071871 -2972273 -2998258 -1482413
38372 -1482413 1282966 3324324 2663764 -364866 -3240880 -3844586 -2503864 -1290065
38364 -1290065 -1499513 -2150058 -1239967 1559345 4060015 3907937 1359127 -1086242 -1623656
38355 -1623656 -710165 378410 1297493 2219592 2648647 1864059 292000 -624225 -93381
38346 -93381 1170634 1978920 2021784 1886792 2047688 2184173 1501420 -345097 -2622756
38337 -2622756 -3946543 -3595701 -2423265 -2145413 -3517598 -5379255 -5780952 -4074345 -1650720
38328 -1650720 -437823 -800723 -1266304 -440051 1178995 1778351 548909 -1207361 -1615949
38319 -1615949 -387609 1142978 1816657 1633874 915847 -468187 -2389750 -3740871 -3438635
38310 -3438635 -1855018 -284216 800176 1782583 2251690 927267 -2088391 -4520281
38302 -4520281 -4657128 -3676412 -3610099 -3993954 -2767254 -115949 1199577 -114893 -1953153
38293 -1953153 -2084285 -1219498 -1140702 -1613440 -1381011 -913475 -1524562 -2335171 -930907
38284 -930907 2631036 4951042 3423908 -492369 -3182803 -2777827 -325208 1721815
38276 1721815 1362634 -1436753 -4208099 -4057146 -1161365 981462 -128867 -2642408
38268 -2642408 -2785290 301069 3852911 5078437 3722565 1248997 -795849 -1378549
38260 -1378549 -418057 890416 1212163 791615 1078330 2582148 4274017 5210939 5328357
38251 5328357 4346091 1696681 -1502748 -2137578 1526085 7222981 11477665 14621575
38243 14621575 20799106 32238162 45009705 51752934 48303208 37138734 24829297
38236 24829297 16763581 13956334 13833332 13330654 11285010 8454387 5977081 4213620
38228 4213620 2890223 1855386 1375550 1733669 2757119 3908815 4795233 5359093 5566802
38219 5566802 5332290 4974243 5141896 5632028 4874987 1848766 -1641723 -2250970 673934
38210 673934 3629772 3031959 -269833 -2229741 -896625 1417242 1546293 -630778 -2671892
38201 -2671892 -2889126 -1905251 -1155697 -959144 -557938 363891 919006 157170 -1322761
38192 -1322761 -1650679 145947 2881423 4642119 4939656 4727975 4712594 4585848 3842791
38183 3842791 2526541 1145416 525001 1640820 4793023 8934121 12616529 15747112
38175 15747112 19758652 25916159 33820117 41251825 44978460 42643077 35429026 28510349
38167 28510349 27008761 31320400 38152060 46081364 57106504 71116678 81607371 80468318
38159 80468318 66829664 48563139 34491104 26917458 22341433 17454028 12557043 9620280
38151 9620280 8823996 8078617 5666363 2423415 668757 1248635 2484430 2288933 618878
38142 618878 -691664 -108601 2086203 4169402 4471506 2745484 364245 -1040482 -1267132
38133 -1267132 -1539856 -2751119 -4238690 -4533386 -2878960 114492 2824388 3607195 2153484
38124 2153484 -25862 -1150645 -1154847 -1208948 -1457887 -735659 1219345 2963929 3489802
38115 3489802 3568599 3987760 4033810 3076217 2271252 3060924 4980971 6513470 7221645
38106 7221645 7533552 7394298 6872106 7209422 9285389 11683763 12423176 12228542 13817408
38097 13817408 17930774 22369647 25499788 28660965 34062878 41677081 49279112 54797301
38089 54797301 57864826 59454066 60340298 59813358 56270211 49510376 41724285 35359423
38081 35359423 30760304 26928006 23560950 20728471 17413421 12539621 7237324 4139769
38073 4139769 4393309 6918995 10238890 13088179 13619796 10555521 5544024 2228786
38065 2228786 2348229 4352521 5951223 6139576 4805642 2706866 1991578 4176441 7276138
38056 7276138 7695212 5370576 3786229 4109545 3253351 -337823 -3013360 -1331826 2058608
38047 2058608 2161330 -800346 -2183963 -486143 620333 -1532053 -4491526 -4646790
38039 -4646790 -2433895 -1132198 -1967296 -2862187 -1847711 207866 1059002 275665 -355434
38030 -355434 266836 642570 -1108989 -3951215 -4802083 -2758845 -458927 -539157 -2506622
38021 -2506622 -4128819 -4337153 -3492026 -2097658 -645363 199806 371279 516060 659240
38012 659240 46382 -981849 -725146 1137912 2420331 1548765 -9558 -229638 378480
38003 378480 328308 140660 1171571 2663243 2688287 1328984 418248 645921 1218122
37994 1218122 1846150 2832120 3719940 3994976 4404696 5435588 5585170 3781551 2294313
37985 2294313 3860885 6741679 6555134 2902318 64907 578294 2219243 2564390 2524742
37976 2524742 3384558 3838990 2490232 604161 -56855 59243 -49280 319409 1987901
37967 1987901 4025986 5596010 7692983 10798336 12810069 11899355 9671703 8738387
37959 8738387 8723918 7645110 5839573 5145854 5082546 3445891 493296 -950356 108486
37950 108486 1511428 1650590 1457612 1688185 1074715 -1247595 -3693755 -4276353 -3080133
37941 -3080133 -1379233 114000 876089 162130 -1533913 -2154736 -829514 493752 -84830
37932 -84830 -1364818 -1031815 470897 668237 -876856 -1925389 -1143700 127912 261919
37923 261919 -614173 -1707472 -2775814 -3375418 -2702562 -1251579 -951752 -2433362 -3749910
37914 -3749910 -3199490 -1821479 -1382866 -1393124 -298055 1487943 2232902 1942563 2171385
37905 2171385 2917867 2306299 -221996 -2729058 -3530660 -3138053 -2609959 -1762876 -67773
37896 -67773 2019840 3475562 3404564 1104161 -3018309 -6397505 -6245728 -3163921 -744171
37887 -744171 -851620 -1651194 -1309389 -886776 -1760757 -2758378 -2265994 -1135744 -969545
37878 -969545 -1321632 -1196436 -1509182 -3120316 -4132569 -2578417 -479204 -1404384 -4735681
37869 -4735681 -6344729 -4779323 -2745595 -2141417 -1692279 -428348 421464 472242 1516862
37860 1516862 3975317 5264811 3818759 1791544 1507360 2032982 1823106 2022677 3979183
37851 3979183 5738096 4665476 2074652 1495617 3154773 3895162 2359157 573098
37843 573098 -21354 -549519 -1627933 -1575914 460025 2228687 1516540 -400446 -996161
37834 -996161 -729045 -2036097 -4696894 -5488984 -3090759 -409575 -455795 -2149941 -2377670
37825 -2377670 -611239 1067346 1576773 1591055 985903 -1307042 -4301595 -4931305 -2476182
37816 -2476182 -270077 -968470 -2525120 -1469577 1735106 3657952 3019848 1777247
37808 1777247 1738554 2954850 5018893 7159992 7411418 4570774 761353 -887443 -800457
37799 -800457 -1842329 -3828565 -3283765 551548 3740095 3414939 1645321 1235262 1277158
37790 1277158 -117049 -1736954 -1467803 -261435 -208753 -315400 1915029 5566555 6845517
37781 6845517 4611081 2110300 2538467 5313996 7467270 6867602 3557883 -498314
37773 -498314 -2517780 -1104447 2147802 4133292 3407998 1143235 -729059 -1251841 -622205
37764 -622205 188244 68508 -1064827 -1912066 -1332122 196498 1416438 1933193 2056882
37755 2056882 1715770 745609 -199392 -186425 814757 2110255 3138876 3412500 2408544
37746 2408544 478938 -948560 -1078461 -772240 -874959 -712610 363628 1138465 58841
37737 58841 -2205400 -3519758 -2961881 -1071431 1714436 4795791 6239415 4367787 560150
37728 560150 -1793880 -1525163 -872343 -1884388 -3544894 -3516713 -1403733 895701 1405770
37719 1405770 -230965 -2921462 -5313131 -6741091 -7225765 -6921322 -6045474 -5158800 -4646521
37710 -4646521 -3915695 -2188439 -124773 813273 775842 1369621 2629950 2570799 788347
37701 788347 -219253 921446 1925545 831063 -216713 1494888 4196508 4160017 1726534
37692 1726534 444296 1046568 891612 -679279 -1079181 622833 1749282 341865 -2091347
37683 -2091347 -3505903 -3732760 -2723105 179616 3627610 4324840 1711892 -512309
37675 -512309 238551 1584438 354679 -2189553 -2629194 -869920 216819 -437729 -1038325
37666 -1038325 -322293 844354 1456798 1667200 1617047 719872 -1161574 -2818803 -2675594
37657 -2675594 -512129 1947571 2484435 894912 -445374 401308 1959899 1268967 -1470856
37648 -1470856 -2718148 -576355 2664205 4034605 3382483 1933741 -13547 -1912233
37640 -1912233 -1838069 893059 3722510 4024989 2818800 2729427 3648562 3348874 1463446
37631 1463446 -211850 -923755 -1476371 -1618048 131577 3521603 5931356 5511171 3103717
37622 3103717 483915 -1519400 -2594964 -2433483 -1489840 -961461 -1348856 -2061737 -2672628
37613 -2672628 -3253789 -3267074 -1743820 831431 2368884 1860417 980159 1849016 4060679
37604 4060679 5215519 4107870 2219186 1719681 2624763 2682042 334310 -2808952 -3533872
37595 -3533872 -1148687 1339553 1040361 -1112236 -1973755 -609611 847749 480161 -1254346
37586 -1254346 -2844727 -3399428 -2499936 -55427 2885034 4518262 4366156 3905629 4390980
37577 4390980 5172202 5014437 3954928 2803033 1801223 970600 887624 1733176 2288269
37568 2288269 1452998 283891 744634 2591303 3475616 2439432 1188415 987437 454623
37559 454623 -1746370 -3761603 -2780396 334791 1685672 -53293 -1616662 -100178
37551 -100178 2608444 2659964 -119926 -2177704 -1252615 1150327 2501680 2244468 1378309
37542 1378309 788761 896789 1753577 2666552 2626576 1684365 1050812 1410746 2110958 2481598
37532 2481598 2866391 3598617 3884106 2697919 392799 -1346343 -1142843 640709 2011254
37523 2011254 1191056 -1233852 -2623075 -1546190 121888 -214773 -2050738 -2675138 -1427789
37514 -1427789 -386835 -625756 -706772 202546 592518 -515920 -1623281 -1580553 -1839270
37505 -1839270 -3447564 -4079355 -1199547 3283773 4905581 2614139 -191458 -501625
37497 -501625 1187767 2889947 3780439 4057445 3920527 3520250 2952925 2058555 972647
37488 972647 511704 1015024 1431878 818017 12125 350289 1490054 2180344 2359709
37479 2359709 2579492 2245566 756458 -398635 539405 2128055 1250737 -1717141 -2595618
37470 -2595618 790397 5451621 7285012 5795082 3272615 1527084 1142219 2059264
37462 2059264 3108552 2483788 225742 -1283947 -722453 62207 -951942 -2720263 -3117870
37453 -3117870 -2536298 -2775479 -3492058 -2853172 -1266256 -1147243 -2562030 -2313017 1242502
37444 1242502 5089355 5343615 2380037 -132222 -235626 755620 1311061 1658923 2141366
37435 2141366 1974777 1066476 1265943 3810160 6627417 6521872 3691908 1647131 2268359
37426 2268359 3294345 1805685 -1715463 -4326170 -4277549 -2215043 245189 1693951
37418 1693951 1539817 778680 1338760 3501754 5110741 4690588 3888151 4838297 6466067
37409 6466067 6015880 3438818 1397241 1148767 1255214 589298 -37185 219922 1012955
37400 1012955 1965914 2877500 2487418 -437358 -4257662 -5381957 -2951519 -89183 534825
37391 534825 -214751 -496853 -365770 -314162 553920 2726677 4623756 4817492 4232798
37382 4232798 4284768 4618629 4577566 4941811 6027191 6011862 3680243 1089682 808998
37373 808998 2101714 2706492 2798170 3840791 4819287 3463163 627413 -428063 904666
37364 904666 2000707 1773655 2189432 4124244 5421835 4637230 3498720 3744495 4232900
37355 4232900 3238918 1344425 74845 -270464 415801 2979336 6655561 7995292 5029598
37346 5029598 940075 468109 3630275 6131870 5525411 3725176 3260327 4161902 5397711
37337 5397711 6655013 7384918 6337591 3685208 1899385 2795215 4962498 5803406 5072905
37328 5072905 4591156 5184357 5903589 6075774 6203977 6505017 6152526 4620905 2635696
37319 2635696 1181521 508410 620630 1700535 3310332 4120579 3422250 2283743 2231982
37310 2231982 3242150 4004952 3846743 3357857 3245988 3539734 3969280 4262190 3893144
37301 3893144 2319071 -139015 -2031623 -1750164 1060392 4697630 6107169 3487078
37293 3487078 -1120423 -2943557 455066 5916269 8068314 5543635 1977159 904720
37285 904720 1872716 2384741 1822089 1917852 4115063 7580854 9742323 8722473 5780558
37276 5780558 4853395 8254461 13096569 14002991 9597819 4028313 1436457 1609346 2492961
37267 2492961 4101783 7179784 9949157 9588729 6374131 3522571 3038176 4083115
37259 4083115 5363044 6669983 7731804 7796901 7123786 7141040 8345540 9439059 9274271
37250 9274271 8497367 8571988 10026625 12123821 13555649 13308160 11638506 10240956 10593441
37241 10593441 12220177 13558414 14347656 15869360 18743188 21788149 23448192 23414431
37233 23414431 22609795 22347507 23481109 25563878 27041730 27128208 26976843 27852632 28893892
37224 28893892 28435796 27025306 26930621 28682299 30330911 30457514 29777921 29297798 29046765
37215 29046765 29241047 30401519 31461176 30179566 26718160 24443832 25479444 27600908
37207 27600908 27570918 25623135 24234060 23960513 23187830 21152747 18686308 16414490 14469723
37198 14469723 13599143 14307840 15072310 13634201 10245492 7695437 7842750 9761137 11406702
37189 11406702 11438623 9424237 6249598 4545050 6486493 10473759 12106372 9541930
37181 9541930 5983208 5502537 8177411 11110202 12715543 13644638 14257765 13758956 12030275
37172 12030275 10229428 8960997 7537272 5784695 4966106 5775785 6805271 6552755
37164 6552755 5933505 6844596 8759949 9100780 7289708 6006683 7152826 8631225 7262410
37155 7262410 3688284 1915548 4233460 8728191 12005611 12504936 10791016 8375833
37147 8375833 6852313 6664798 6210934 3678843 156295 -997819 1425902 4795827
37139 4795827 6436761 6858624 7553683 7835881 6347682 4081366 3100264 3252947 2901955
37130 2901955 2152613 2416536 3181491 2418557 411534 -1301 2181124 4426352 4620590
37121 4620590 4059075 4809120 6348106 6846918 6113990 5240941 4610886 4170801 4554213
37112 4554213 5968520 6881259 5835903 3902242 3272572 3901451 3734107 2145395 850793
37103 850793 990070 1472632 1156122 847788 1809486 3620299 5043356 6071302 7404289
37094 7404289 8389264 7403207 4545627 2219448 2151706 3140291 2983081 1637632 776149
37085 776149 695318 -208849 -2473485 -4096523 -3233134 -846500 871750 1558898 2348875
37076 2348875 3366585 3743838 3809592 4955637 7065014 8202283 7438832 6043603 5173552
37067 5173552 4362335 3237758 2698780 3054164 2929167 1707207 1246848 3059677 5328026
37058 5328026 5300414 3631276 3494877 5734017 7727789 7401761 5834176 5096802 5590851
37049 5590851 6513959 7290808 7474457 6516278 4618707 2861252 1796379 856766 -359496
37040 -359496 -1295673 -1422678 -907033 158210 1963500 3963720 5071655 5483841 6734042
37031 6734042 9087796 10654603 10393051 10240885 12371389 15688397 17250544 16307129 14671037
37022 14671037 13666019 13074780 12856187 13375098 13722033 12369651 10198651 10328617 13588801
37013 13588801 16394859 15118585 11021939 8614287 9950881 12736642 13776639 12258566
37005 12258566 9420489 6752613 5209011 5002861 5420443 5443142 4908578 4516454 4621801
36996 4621801 4795278 4731315 4783584 5332157 6274038 7242509 7601801 6324791 3042475
36987 3042475 -636844 -2232890 -1275504 334292 1397204 2974740 5637033 7187505
36979 7187505 5500175 2355837 1587655 3833687 6071763 6522018 6840328 8363242 9216070
36970 9216070 7330598 4193022 2979587 4151327 5371665 5154632 4265063 3728673 3635538
36961 3635538 4063196 5230508 6318504 5862587 3955518 2598684 3056087 4032044 3415314
36952 3415314 1026937 -1310406 -2015468 -1242994 -195199 487913 1287609 2705844 4030879
36943 4030879 4007364 2799997 2130077 2825779 3462841 2575561 1083367 954105 2364617
36934 2364617 4006570 5426422 6905241 7600947 6365029 4242319 3424928 3567193 2154790
36925 2154790 -845341 -2026164 326379 3272151 3490188 1784096 839353 948988 942903
36916 942903 1326311 3033932 4406846 3063220 198978 -473914 1931209 4370546 4395930
36907 4395930 2873539 1704984 1590811 2740125 5182775 7459927 7395594 5194955 3584662
36898 3584662 3894481 4285664 3069191 1426316 1141305 1695225 1675260 1493184 2463751
36889 2463751 4167652 4867801 4111171 3203672 3323665 4447582 5854436 6627867 6023589
36880 6023589 4258600 2509914 1427065 356387 -1251894 -2707698 -3354016 -3838401
36872 -3838401 -4752139 -5024129 -3365737 -638864 999078 975119 657643 1012352 1502831
36863 1502831 1330511 338191 -1339128 -3184756 -3928912 -2716737 -664510 244577 -125485
36854 -125485 -115156 750346 767713 -1178097 -3642600 -4684414 -4520323 -4594305 -4940606 -4210700
36844 -4210700 -2053055 84179 795987 306774 -206050 -160795 97451 167058 162650 239421
36834 239421 -6200 -969425 -1816625 -800102 2403464 5395786 5417628 2768149 415162
36825 415162 141188 735935 469058 -499814 -1264078 -1995296 -2966960 -3102729 -1530614
36816 -1530614 339310 535951 -277240 138835 1557030 1254841 -1403597 -3426063 -2714689
36807 -2714689 -1311110 -1827003 -3000934 -1923041 817346 1777421 16398 -1647608
36799 -1647608 -1065820 719290 2125960 3086518 3157052 688418 -3914789 -6665170 -4577462
36790 -4577462 -110361 1902660 618735 -588006 362716 1856867 1998938 1323968 942618
36781 942618 398905 -996261 -2257216 -1773664 488428 2931382 3990833 3295198 1777409
36772 1777409 980831 1551939 2274070 1474454 -639903 -2277186 -2657588 -2630426 -2418544
36763 -2418544 -840137 2188443 4312420 3559129 1137365 -354294 -501816 -933098 -2180533
36754 -2180533 -2733098 -1427445 723732 1659479 490252 -1702157 -2905059 -2056041 -155047
36745 -155047 770779 -21100 -1299735 -1720834 -1492273 -1621676 -2330828 -2948952 -2783206
36736 -2783206 -1553497 418329 2133019 2836004 3124529 3985404 4855314 4521729 3951026
36727 3951026 5414647 8140701 8432042 5938471 5844126 11599208 19501383 25460312 33495642
36718 33495642 49880878 69790395 78448574 68327763 48492179 32972117 25528987
36711 25528987 20848158 15808299 12442354 11653343 10901045 8838594 7338650 7722694
36703 7722694 8650329 8848831 8800542 8613548 7074676 4149937 1979779 1937216 2722266
36694 2722266 2750734 2521589 3056192 3681702 3222307 2230243 2171229 3058797 3561445 3112730
36684 3112730 2449719 2140088 1820687 1080788 241237 9002 780032 2252396 3413099
36675 3413099 3198820 1653967 199170 263982 1808665 3519140 4131664 3194600 999875
36666 999875 -1610596 -3649225 -4762798 -5385575 -5714258 -5050056 -2848604 57246 2170520
36657 2170520 2922145 2642303 1407929 -755489 -2718337 -2922394 -1551182 -529872 -809711
36648 -809711 -1167747 -493512 411008 638704 1174844 3106890 5010220 4605984 2530030
36639 2530030 1749782 3035740 3759591 2121950 3578 -34497 1511624 2462989 2506089
36630 2506089 2933154 3774094 3738691 2718113 1950021 1624458 637957 -877363 -1087252
36621 -1087252 647422 2545651 3263052 3952995 5838848 7536958 7003894 4882980 3398183
36612 3398183 2685782 1081673 -1046707 -959608 1920303 4009759 2161267 -1769101 -3461062
36603 -3461062 -1995533 -426265 -918178 -2100658 -1741574 258644 2471731 3745005
36595 3745005 3441037 1487416 -749645 -1132212 547029 1970153 1638753 1163244 2482264
36586 2482264 4414865 4420516 2729384 1912023 2715532 3173227 2084913 730779 486594
36577 486594 1116223 2261919 4377393 7091960 8648374 8166881 6753949 5379431 3571584
36568 3571584 1348834 340291 1384337 2837257 2981268 2447224 2488969 2514528 1317250
36559 1317250 -671027 -2294614 -3422132 -3915663 -2602410 420214 2224892 639166
36551 639166 -2062730 -2149882 142683 1639899 1684078 2577075 4831969 6111474 5418736
36542 5418736 4496989 4163086 2987696 901034 393031 2232502 3391154 1614915 -895818
36533 -895818 -1098586 133211 -25686 -1538522 -2025908 -1020748 -414100 -917933 -964876
36524 -964876 525567 2539432 3699857 3891174 3528134 2558963 977194 -517320 -1122212
36515 -1122212 -860934 -421988 -201712 60765 519881 539235 -453203 -1511173 -858983
36506 -858983 1434251 3011080 2615407 2189974 3616876 5080340 3666153 423862 -895082
36497 -895082 209845 439942 -1428550 -2502429 -1052931 397186 -440509 -1888334 -1902551
36488 -1902551 -1881357 -3456276 -4606770 -3009155 -778043 -1402438 -3671888 -3362592 -120457
36479 -120457 2020297 981285 -859547 -1176499 -817754 -1216875 -1906680 -2064854 -2036359
36470 -2036359 -2026781 -1376608 -207672 139059 -726367 -1439442 -1124238 -668360 -823119 -723512
36460 -723512 555628 2273184 2930341 2007567 114513 -1704675 -2361020 -1422290 66362
36451 66362 320891 -1187981 -3109407 -3702669 -2346265 242523 2513302 3103792 2157294
36442 2157294 1163364 804667 34602 -1594105 -2233631 -392346 2062080 2218170 531586
36433 531586 -114538 790644 1013345 48392 128356 1806887 2299745 131435 -1791409
36424 -1791409 -300549 3259811 5122726 4234834 2557759 1409245 304705 -917011
36416 -917011 -1265836 -263176 1149783 1791454 1403614 454179 -551962 -1374829 -1903699
36407 -1903699 -1835435 -859056 418118 430298 -1318187 -2837060 -2051115 -219472 -549917
36398 -549917 -3261234 -4920211 -3692021 -2218303 -3232632 -4960463 -3879799 -390885
36390 -390885 1654623 528669 -1454026 -1858977 -1133731 -653701 -41283 1758623 3842134
36381 3842134 3723871 537661 -3328171 -4586990 -2707218 -361723 -46535 -1191827
36373 -1191827 -1435603 51759 1926741 2975473 3328078 3220347 2308618 842558 -21038
36364 -21038 121259 299160 -25357 6812 861242 1403041 823665 409458 1694569 3789025
36354 3789025 4361570 2869613 1214401 1256667 2905661 4689005 5305999 4599794 3561542
36345 3561542 3222937 3302693 2595005 1041695 354601 1720385 3796721 4111312 1910910
36336 1910910 -1318641 -3632190 -4015147 -2529410 -92723 2061153 3316832 3859947
36328 3859947 3778751 2781365 1155919 -10769 -171382 104531 457564 1450181 3167708
36319 3167708 4362165 4070178 3062595 2633822 2880133 3110628 2954711 2197470 718793
36310 718793 -498333 242423 2799594 4571864 3811148 2011752 1456116 2032651 2325098
36301 2325098 2177854 1987844 1050026 -868456 -1778637 -142703 2023008 1973396 1107995
36292 1107995 3214477 8204993 11669043 11228622 9550188 9833733 11638341 12762967
36284 12762967 12432901 10905866 8339487 5747275 4963547 6120238 7171362 7205236 7812228
36275 7812228 9586305 10013656 7234564 3516633 2091761 2483776 2231088 1653784 2974808
36266 2974808 5361847 5128674 1547050 -1413053 -802637 1081029 632904 -1349066 -1124414
36257 -1124414 1959119 4348248 3533831 1475792 1320575 2743395 2756310 301616 -2270957
36248 -2270957 -2564967 -1123039 -169357 -629166 -1520722 -1573835 -413057 1369988 2428823
36239 2428823 1498409 -1009544 -2840758 -2488825 -1343762 -1740748 -3333563 -3454393 -1261491
36230 -1261491 682009 209 -2098234 -2559569 -524288 2001811 2988448 2401552 1472208
36221 1472208 1157594 1546047 2017052 1786053 743636 -272850 -485559 -288785 -747638
36212 -747638 -2050275 -3175250 -3270240 -2674833 -2165621 -1808428 -1320406 -1202301 -2352612
36203 -2352612 -4295688 -4988709 -3320760 -927554 -187087 -981611 -1157445 14497 957306
36194 957306 716852 405302 670126 148630 -1731231 -2663349 -759439 1886743 2105786
36185 2105786 804013 1430825 3871695 4163813 893428 -2347693 -2507106 -1275107 -1409955
36176 -1409955 -2200335 -1638590 -495307 -731432 -1670861 -1398562 -785420 -2286876 -5137335
36167 -5137335 -5605838 -2570779 624083 1067461 42769 151407 1112669 778548 -1093941
36158 -1093941 -2505784 -2217475 -1122383 -486408 -294653 144795 915094 1536947 1949219
36149 1949219 2786112 4486845 6428224 7370670 6866881 5847836 5488925 5780329 5688793
36140 5688793 4584342 2936700 1518280 454309 -561965 -1358784 -1135175 480063
36132 480063 2487510 3293788 2627999 1915554 2106416 2016376 210964 -2009396 -1595796
36123 -1595796 1895888 5012994 4595693 1590843 -703978 -715358 744674 2530291 3802973
36114 3802973 3580243 1886641 792698 2130164 4647072 5718124 5390929 5986380 7850829
36105 7850829 8727224 7851678 7271785 7851912 7365623 4611756 2303084 3037763 4941424
36096 4941424 4617900 2459646 1342571 1444121 455693 -1637824 -2263630 -1070965 -952260
36087 -952260 -3149435 -5024829 -4384673 -2808811 -2655536 -3535473 -3948309 -3899333 -3554846
36078 -3554846 -1759141 1397570 2851390 631248 -2292733 -1894410 699847 1075045
36070 1075045 -1284002 -2384180 -504297 1194996 201965 -1508679 -1329181 -39678
36062 -39678 628292 1255742 2526381 2471500 -520711 -3879600 -3789801 -814088 1028484
36053 1028484 124834 -1391067 -1932107 -2366349 -3057783 -2460408 -17768 2258367 2674434
36044 2674434 2184172 2318106 2664351 2084498 969785 574309 1096841 1880705 2673396
36035 2673396 3342872 3088760 1324749 -1048225 -2345736 -1793005 192978 2777904 4875931
36026 4875931 5238490 3642496 1770787 1758428 3703980 5395407 4762894 2187914 142210
36017 142210 578482 2741330 3880440 2461184 150620 -266434 1481365 3026128 2822096
36008 2822096 1944970 1879561 2350752 2510540 2671175 3252265 3216315 1388296 -1421901
35999 -1421901 -3385037 -4194319 -4901908 -5673908 -5630488 -4787843 -4203455 -3970606 -2906141
35990 -2906141 -719745 1165551 1632518 1288636 1168546 1317533 1394373 1457668 1395408 766116
35980 766116 -32072 262652 1726288 2615147 2026284 1704584 3375953 5455127 4765839
35971 4765839 1097985 -2326698 -3069853 -1990978 -1144254 -1299413 -2346349 -4128657 -5664772
35962 -5664772 -5330504 -3289509 -2118144 -3258685 -4401978 -2713700 501399 1237203
35954 1237203 -1482408 -4334117 -4588616 -3380643 -2952003 -3213649 -2849659 -1888790 -1111404
35945 -1111404 -241514 1272315 2692742 3104363 3159272 3753305 3849870 1909491 -1063044
35936 -1063044 -2360218 -1306785 293861 1464517 3026419 4661893 3972100 152953
35928 152953 -3638669 -3778766 -753239 1698612 1209565 -1078311 -2404259 -1055646 2312325
35919 2312325 4913683 4105552 504419 -2095979 -1137736 1540503 2588975 1878287 1838428
35910 1838428 2818287 2324333 -580199 -3131027 -2738321 -847827 -846491 -3360654 -5722859
35901 -5722859 -5614872 -3451985 -1187308 -166292 -396165 -943871 -758013 368759 1637778
35892 1637778 2352730 2680309 2717011 1682303 -645885 -2375609 -1346494 1466441 2530757
35883 2530757 369738 -2514041 -3480584 -3351344 -4177824 -5231163 -4090567 -904519 1524185
35874 1524185 1991207 2341003 3985311 5591482 5402708 3678402 1572580 -401821 -1485776
35865 -1485776 -358790 2621582 4765420 4417522 3118990 2578293 1755182 -468473 -1965418
35856 -1965418 -263874 2740647 2979420 387205 -1251900 -507206 -13929 -1312928 -2296762
35847 -2296762 -1412258 -563538 -1555133 -2812607 -2235499 -794599 -594899 -1290249 -1081376
35838 -1081376 67757 585795 -222433 -1631475 -2589909 -2161019 -118353 1923497 1729158
35829 1729158 -152396 -422938 2201254 4932329 5460136 5507252 7087377 8223126 6235273
35820 6235273 3031414 2656836 4892751 5853547 4356810 3100470 3396154 3304711 2000421
35811 2000421 1850744 4411680 7601067 8711125 7702619 5934417 3964645 2195009
35803 2195009 1609981 2235535 2488985 1406694 102760 14067 1108471 2518519 3346086
35794 3346086 2376013 -944150 -4560947 -5138874 -2319604 613998 1420934 1705384 3456696
35785 3456696 5379865 5071349 2990891 1722809 2449935 4317079 6223840 7219186 6202511
35776 6202511 3406984 1356862 2256360 5091524 7224277 7965582 8340111 8157144 6149262
35767 6149262 2938709 1047962 1326260 1743891 661490 -811743 -937728 34214 980509
35758 980509 2184054 4461428 6732774 6708721 4278754 2350977 3328706 5974897 7080543
35749 7080543 5553929 3324263 2330168 2294160 2054119 1629287 1820375 2674226 3501800
35740 3501800 3797657 3232200 1618589 -46772 278003 2867361 4744300 3260665 248979
35731 248979 -215930 2238547 3901315 2863395 1719431 3105891 5874335 7754410
35723 7754410 8921505 10262744 10421132 7719679 3649470 1437140 1882847 3195621
35715 3195621 4285038 5594737 7003357 7463391 6888929 6345599 6217215 5983353 5836614
35706 5836614 6657788 8172669 8865338 8149120 7255800 7574811 9129793 10868592 11694825
35697 11694825 11465125 11697058 14438161 19196853 22093299 20068223 15252237 12792259
35689 12792259 14514784 17181108 17283113 15110410 13217078 12959551 13808970 14641045 14532562
35680 14532562 13258246 11830680 11706855 12907776 13798050 13128425 11349902 9558110
35672 9558110 8152841 6972264 5875358 4811880 3955755 3761735 4173124 4173072 3209031
35663 3209031 2488151 3303985 4630508 4471919 3377177 4093955 7294761 10098085 9763587
35654 9763587 6766393 3263429 601264 -552998 247483 2046933 2637647 1405668
35646 1405668 406562 1215894 2553358 2735293 2553526 3388676 3975051 1878009 -2361391
35637 -2361391 -5146280 -4074815 -451510 2680928 3652852 3079392 2609229 3029291 3480397
35628 3480397 2967493 2351521 3323867 5328202 5797734 4215579 3201005 4032407 4146138
35619 4146138 1651767 -640298 625792 3538175 3718027 1353103 430317 1680386
35611 1680386 1753693 -238283 -1027995 470770 712630 -1851736 -2860319 1179139 6329236
35602 6329236 6473761 2418807 367673 2608767 5061181 4190213 1514422 -103120
35594 -103120 -758232 -1932867 -3200011 -2883712 -808393 1425889 2491377 2585543 2771548
35585 2771548 3521007 3921062 2620597 -101461 -1939362 -1156498 1041493 1909801 440811
35576 440811 -2015883 -3814653 -4127949 -2518726 629388 3324341 3585058 2089228 1408369
35567 1408369 2437937 3611214 3947893 4423447 5382581 5094472 2564245 -253106 -1057965
35558 -1057965 -387282 -7903 397546 2198454 4302686 3805116 424262 -2445664 -2099089
35549 -2099089 168598 1337751 547814 -820617 -1739695 -2415753 -2975885 -2832355 -1604291
35540 -1604291 227495 1859300 2865622 3282144 3413428 3623550 4000010 4211705 3957394
35531 3957394 3492717 3409996 3905486 4511143 4548913 3713603 2361999 1402349 1553312 2263756
35521 2263756 1725419 -1165438 -4803172 -5837963 -2802869 1830772 4049885 2518865
35513 2518865 -337877 -1363966 47739 1932298 2322571 1253802 319475 618797 1447410
35504 1447410 1276645 -69661 -900711 244198 2627302 4214793 4005324 2460422 222276
35495 222276 -2024592 -2722647 -652112 2505403 3044513 -26244 -3058587 -2378311 827862
35486 827862 2556044 1641975 429867 244058 -497710 -2853397 -4881054 -4288185 -1711015
35477 -1711015 448862 1298790 1872292 2968945 4160288 4768045 4637289 3894449 2774156
35468 2774156 1808029 1632341 2394331 3473641 3838425 2869085 1121097 32990 379534
35459 379534 1283455 1417136 815456 544503 908707 1254119 1404795 1822831 2252555 1780742
35449 1780742 558737 -123070 95402 166825 -255481 -125470 766900 918157 -309152
35440 -309152 -1291884 -1007160 -1256461 -3696329 -6261024 -5443733 -1376737 2211113 2881154
35431 2881154 1626870 73066 -1564566 -2893505 -2446584 -111827 1483349 217983
35423 217983 -1985388 -1335151 2205714 3982859 595548 -5031466 -6847425 -3360603
35415 -3360603 713653 1224166 -60323 706924 2774246 2081187 -1631737 -3734536 -1654278
35406 -1654278 1414799 1779316 474536 471200 1800065 2681081 2996798 3299674 2549002
35397 2549002 288130 -1021874 398662 1768890 -200451 -3189811 -2325678 1753546
35389 1753546 3594982 1581452 -75581 1072905 2121454 902479 -10791 1335982
35381 1335982 1824222 -1618303 -6141266 -6764082 -3535342 -548187 421147 1009116 1985673
35372 1985673 2001199 689540 -216149 544479 2190806 3212111 2749617 817043 -1526129
35363 -1526129 -2579048 -1736650 -279041 484515 865851 1596992 2315117 2525236 2668361
35354 2668361 2815858 1862423 -321937 -1626373 -644136 715181 -8214 -1795452 -1645947
35345 -1645947 790474 2939008 3283143 2938038 3203321 3830135 3949343 2990154 762671
35336 762671 -1823490 -2617078 -561231 2409595 3656176 3253298 3031117 3145055 2283521
35327 2283521 672333 -146316 -329822 -1388717 -2741620 -2045241 379996 1039075 -1343297
35318 -1343297 -3261703 -1550466 1672613 2091794 -595219 -2710534 -2067418 -425456
35310 -425456 -263418 -1480199 -2244590 -1672709 -504073 328593 810430 1363661 1831512
35301 1831512 1611866 856777 738202 1892269 3249070 3403333 2693778 2607678 3242564
35292 3242564 2895052 618971 -2120772 -3141080 -2001708 -21647 1426740 1767649
35284 1767649 846937 -1238012 -3739288 -5316651 -5045143 -3412545 -1965676 -1658540 -1812547
35275 -1812547 -1242174 -127199 241842 -352354 -401200 1207440 3524074 4776015 4297267
35266 4297267 2477204 -52870 -2176446 -2444299 -834892 567424 18558 -1600548
35258 -1600548 -2262193 -1626447 -964660 -1185164 -2442026 -4707721 -7083926 -7614275 -5656666
35249 -5656666 -3397941 -3007904 -3452904 -2465389 -474005 251768 -558129 -1278862 -1619740
35240 -1619740 -2409688 -2703131 -884057 1428523 663236 -3014867 -5440950 -4826687 -4091985
35231 -4091985 -5248714 -5893756 -3883756 -1515969 -1673952 -2977131 -2459903 -650787 -191745
35222 -191745 -1154394 -1457341 -797830 -683507 -1257933 -1257948 -686563 -672018 -981690 -299412
35212 -299412 1240442 2168522 2085930 1796302 1472360 887241 892907 2213473 3250978 1797532
35202 1797532 -1265749 -2789988 -1992937 -1432110 -2857379 -4859768 -5571460 -5226258 -4852119
35193 -4852119 -4567177 -4473108 -5351680 -7056909 -7775620 -6272682 -3583057 -1300727 416660
$$ [...]
##END NTUPLES=NMR SPECTRUM
##END=
