##TITLE=31Pdec_SR151_rm1d
 , 24 sc
 16.11.2022
##JCAMPDX= 6.0         $$ Bruker NMR JCAMP-DX V2.0
##DATA TYPE= NMR SPECTRUM
##DATA CLASS= NTUPLES
##ORIGIN= UXNMR, Bruker Analytische Messtechnik GmbH
##OWNER= root
$$ XWIN-NMR		Version 3.5
$$ Wed Nov 16 13:46:15 2022 Russian Standard Time (UT+4h)  she@DPX200
##.OBSERVE FREQUENCY= 81.013821
##.OBSERVE NUCLEUS= ^31P
##.ACQUISITION MODE= SIMULTANEOUS
##.ACQUISITION SCHEME= undefined
##.AVERAGES= 24
##.DIGITISER RES= 16
##SPECTROMETER/DATA SYSTEM= spect
##.PULSE SEQUENCE= zgpg30
##.SOLVENT NAME= CDCl3
##.SHIFT REFERENCE= (INTERNAL, CDCl3, 0, 248.564)
##AUDIT TRAIL= $$ (NUMBER, WHEN, WHO, WHERE, WHAT)
$$ ##TITLE= Audit trail, XWIN-NMR		Version 3.5
$$ ##JCAMPDX= 5.01
$$ ##ORIGIN= Bruker BioSpin GmbH
$$ ##OWNER= she
$$ F:/spectra/data/she/nmr/P31/1/pdata/1/auditp.txt
$$ ##AUDIT TRAIL=  $$ (NUMBER, WHEN, WHO, WHERE, WHAT)
(   1,<2022-11-16 13:44:59.82 +0400>,<she>,<DPX200>,
      <created by zg, POWCHK disabled, PULCHK disabled
       configuration hash MD5:
       00 E9 B6 7A A2 85 ED C7 34 08 36 98 17 FE 4E 26
       data hash MD5: 32K
       47 6A 4A 95 42 1B 27 6F C8 70 CC 7F 38 A1 F9 EC>)
(   2,<2022-11-16 13:45:02.93 +0400>,<she>,<DPX200>,
      <Start of raw data processing
       efp BC_mod = 2 LB = 1 FT_mod = 6 PKNL = 1 PHC0 = -10341.43 PHC1 = 290.456 SI = 64K 
       data hash MD5: 64K
       81 69 74 62 3B C7 E2 27 57 12 F8 18 EB 36 94 F3>)
(   3,<2022-11-16 13:45:23.01 +0400>,<she>,<DPX200>,
      <pk PHC0 = 45.23629 PHC1 = -133 
       data hash MD5: 64K
       8A 48 12 EC 29 D2 90 65 0C 82 E2 56 4A A9 06 3E>)
(   4,<2022-11-16 13:45:27.25 +0400>,<she>,<DPX200>,
      <abs ABSG = 5 
       data hash MD5: 64K
       72 EE A2 E8 02 DF 12 4E 3A FC 5A 3F B4 68 B6 44>)
$$ ##END=
$$ 
$$ hash MD5
$$ E7 6C 12 50 49 BF 6C 5A F7 8C 5B D8 B5 51 32 F7
##$RELAX= 
##$RELAX= 
##$RELAX= 
##$RELAX= 
##$RELAX= 
##$RELAX= 
##$RELAX= 
##$RELAX= 
##$RELAX= 
$$ Bruker specific parameters
$$ --------------------------
##$DU= <F:/spectra>
##$EXPNO= 1
##$NAME= <P31>
##$PROCNO= 1
##$TYPE= <nmr>
##$USER= <she>
##$AMP= (0..31)
100 100 100 100 100 100 100 100 100 100 100 100 100 100 100 100 100 100 
100 100 100 100 100 100 100 100 100 100 100 100 100 100 
##$AQSEQ= 0
##$AQ_mod= 1
##$AUNM= <au_zg>
##$AUTOPOS= <>
##$BF1= 81.014009
##$BF2= 200.13
##$BF3= 200.13
##$BF4= 200.13
##$BF5= 200.13
##$BF6= 200.13
##$BF7= 200.13
##$BF8= 200.13
##$BYTORDA= 1
##$CFDGTYP= 0
##$CFRGTYP= 5
##$CHEMSTR= <none>
##$CNST= (0..31)
1 1 145 1 1 1 1 1 1 1 1 1 1 1 1 1 1 1 1 1 1 1 1 1 1 1 1 1 1 1 1 1 
##$CPDPRG= <waltz16>
##$CPDPRG1= <>
##$CPDPRG2= <waltz16>
##$CPDPRG3= <>
##$CPDPRG4= <mlev>
##$CPDPRG5= <mlev>
##$CPDPRG6= <mlev>
##$CPDPRG7= <mlev>
##$CPDPRG8= <mlev>
##$CPDPRGB= <>
##$CPDPRGT= <>
##$D= (0..31)
0 1 0 0 0 0 0 0 0 0 0 0.03 2e-05 3e-06 0 0 0 0 0 0 0 0 0 0 0 0 0 0 0 0 
0 0 
##$DATE= 1668591899
##$DBL= (0..7)
120 120 120 11 120 120 24 19 
##$DBP= (0..7)
150 150 150 150 150 150 150 150 
##$DBP07= 0
##$DBPNAM0= <>
##$DBPNAM1= <>
$$ [...]
##$SUBNAM3= <"">
##$SUBNAM4= <"">
##$SUBNAM5= <"">
##$SUBNAM6= <"">
##$SUBNAM7= <"">
##$SUBNAM8= <"">
##$SUBNAM9= <"">
##$SW= 501.771253377433
##$SWIBOX= (0..15)
0 1 3 0 0 0 0 0 0 0 0 0 0 0 0 0 
##$SW_h= 40650.406504065
##$TD= 32768
##$TD0= 1
##$TE= 0
##$TE2= 300
##$TE3= 300
##$TEG= 300
##$TL= (0..7)
0 120 53 12 22 120 120 120 
##$TP= (0..7)
150 150 150 150 150 150 150 150 
##$TP07= 0
##$TPNAME0= <>
##$TPNAME1= <>
##$TPNAME2= <>
##$TPNAME3= <>
##$TPNAME4= <>
##$TPNAME5= <>
##$TPNAME6= <>
##$TPNAME7= <>
##$TPOAL= (0..7)
0.5 0.5 0.5 0.5 0.5 0.5 0.5 0.5 
##$TPOFFS= (0..7)
0 0 0 0 0 0 0 0 
##$TUNHIN= 0
##$TUNHOUT= 0
##$TUNXOUT= 0
##$USERA1= <user>
##$USERA2= <user>
##$USERA3= <user>
##$USERA4= <user>
##$USERA5= <user>
##$V9= 5
##$VALIST= <valist>
##$VCLIST= <CCCCCCCCCCCCCCC>
##$VD= 0
##$VDLIST= <DDDDDDDDDDDDDDD>
##$VPLIST= <PPPPPPPPPPPPPPP>
##$VTLIST= <TTTTTTTTTTTTTTT>
##$WBST= 1024
##$WBSW= 4
##$XGAIN= (0..3)
0 0 0 0 
##$XL= 0
##$YL= 0
##$YMAX_a= 7843
##$YMIN_a= -11541
##$ZGOPTNS= <>
##$ZL1= 120
##$ZL2= 120
##$ZL3= 120
##$ZL4= 120
##$ABSF1= 248.5645
##$ABSF2= -253.2056
##$ABSG= 5
##$ABSL= 3
##$ALPHA= 0
##$AQORDER= 0
##$ASSFAC= 0
##$ASSFACI= 0
##$ASSFACX= 0
##$ASSWID= 0
##$AUNMP= <proc_1d>
##$AZFE= 0.1
##$AZFW= 0.5
##$BCFW= 0
##$BC_mod= 2
##$BYTORDP= 0
##$COROFFS= 0
##$CY= -3
##$DATMOD= 1
##$DC= 0
##$DFILT= <>
##$DTYPP= 0
##$F1P= 0
##$F2P= 0
##$FCOR= 1
##$FTSIZE= 65536
##$FT_mod= 6
##$GAMMA= 0
##$GB= 0
##$INTBC= 1
##$INTSCL= 6.047779e-11
##$ISEN= 30
##$LB= 1
##$LEV0= 0
##$LPBIN= 0
##$MAXI= 10000
##$MC2= 0
##$MEAN= 0
##$ME_mod= 0
##$MI= 50
##$NCOEF= 0
##$NC_proc= -7
##$NLEV= 6
##$NOISF1= 182.463
##$NOISF2= 159.3651
##$NSP= 0
##$NTH_PI= 0
##$NZP= 0
##$OFFSET= 248.5645
##$PC= 4
##$PHC0= -10296.19
##$PHC1= 157.456
##$PH_mod= 1
##$PKNL= yes
##$PPARMOD= 0
##$PSCAL= 0
##$PSIGN= 0
##$REVERSE= no
##$SF= 81.0140089999694
##$SI= 65536
##$SIGF1= 159.3651
##$SIGF2= -187.1042
##$SINO= 113.3802
##$SIOLD= 16384
##$SREGLST= <1H.CDCl3>
##$SSB= 0
##$STSI= 65536
##$STSR= 0
##$SW_p= 40650.406504065
##$SYMM= 0
##$S_DEV= 0
##$TDeff= 32768
##$TDoff= 0
##$TI= <>
##$TILT= no
##$TM1= 0
##$TM2= 0
##$TOPLEV= 0
##$USERP1= <user>
##$USERP2= <user>
##$USERP3= <user>
##$USERP4= <user>
##$USERP5= <user>
##$WDW= 1
##$XDIM= 65536
##$YMAX_p= 454765648
##$YMIN_p= -55218667
$$ End of Bruker specific parameters
$$ ---------------------------------
##NTUPLES= NMR SPECTRUM
##VAR_NAME=  FREQUENCY,     SPECTRUM/REAL,   SPECTRUM/IMAG
##SYMBOL=    X,             R,               I
##VAR_TYPE=  INDEPENDENT,   DEPENDENT,       DEPENDENT
##VAR_FORM=  AFFN,          ASDF,            ASDF
##VAR_DIM=   65536,         65536,           65536
##UNITS=     HZ,            ARBITRARY UNITS, ARBITRARY UNITS
##FACTOR=    0.620285442955139, 1,           1
##FIRST=     20137.2065510682, 0,            0
##LAST=      -20513.1999529968, 0,           0
##MIN=       -20513.1999529968, -55218667,   0
##MAX=       20137.2065510682, 454765648,    0
$$ Real data points
##PAGE= N=1
##DATA TABLE= (X++(R..R)), XYDATA
$$ [...]
42674c894893N85833K607320K601096L95280j131644J72609K404249J796383j962051
42665C574182m795276l518840m0042J486418K51448q24251L05153K339918L092894
42656A871604K311984J160395L63533q2026k70560l64901o54151j009079p76146
42647B550653K65233J285369J260809J90483r16100j129039n07980l4961o03591
42638B360876j907252k553817j608638K67403J645712J900983J360355L88894
42630A854516p03040j148131l21633J100122J693467J149615M81792K07861l44007
42621C970562j434904k018492j366129m23993l88979q86301r23902q49629j591564
42612e913331k322643j038078K022093L573578J391431k114035k477495R99435
$$ plain form
42674 -3894893 -3309060 -701740 1899356 2294636 1162992 1335601 3739850 5536233 3574182
42665 3574182 -1221094 -4739934 -4779976 -3293558 -3042110 -3866361 -3561208 -1221290 1871604
42656 1871604 4183588 5343983 5707516 5625490 5354930 4990029 4335878 3326799 2550653
42647 2550653 2815886 4101255 5362064 5552547 4636447 3507408 2999428 2964467 2360876
42638 2360876 453624 -2100193 -3708831 -3441428 -1795716 105267 1465622 1854516
42630 1854516 1151476 3345 -318288 781834 2475301 3624916 4106708 4314569 3970562
42621 3970562 2535658 517166 -848963 -1272956 -1661935 -2548236 -3472138 -4321767 -5913331
42612 -5913331 -8235974 -9274052 -7251959 -3678381 -2286950 -4400985 -6878480 -5879045
42604e879045M131650L172966n89381l007676k532901j292785j039908o32245
42596g669325J343885L482952L174859M21267k064217k425631j472061p03355
42588e911626l18968J10398M58554N26086O91996J146122J249107M90119n87384
42579b145596j125967r43783k13190R45230J869919J464455j35330j122655m54221
42570a861138M41335o4653r80862k39896J725647K416566J067141m66803q01302
42561A236035n52848k99892M76683J530499J340963k87447j312961n40270M98903
42552B089665K66841l88758l70179n19680j358110r63884J871621M354531L172481
42543H154528j52661j384039j28771J40165j602661k410621r56094J39519o40226
$$ plain form
42604 -5879045 -1747395 1425571 836190 -2171486 -4704387 -5997172 -7037080 -7669325
42596 -7669325 -6325440 -2842488 332371 753638 -1310579 -3736210 -5208271 -5911626
42588 -5911626 -6230594 -6120196 -5661642 -5135556 -4443560 -3297438 -2048331 -1558212 -2145596
42579 -2145596 -3271563 -4215346 -4428536 -3483306 -1613387 -148932 -284262 -1406917 -1861138
42570 -1861138 -1419803 -1484456 -2465318 -2705214 -979567 1436999 2504140 2037337 1236035
42561 1236035 683187 383295 859978 2390477 3731440 3443993 2131032 1590762 2089665
42552 2089665 2356506 1967748 1597569 1077889 -280221 -1244105 627516 4982047 8154528
42543 8154528 8001867 6617828 6489057 6629222 5026561 2615940 1659846 1799365 1159139
42534A159139q06269J294983K724849N81454k726115k863683r8345J662526R76637
42525A905176j01744m03118r21880j548953m26776K334639L511168J073294k573320
42516B848486l488587r91086K027714K765755J108621j126863k376030k353437
42508a585427j411880K31692K054968K676659J148827j201296j863899m82101
42500d32457P07042L79619j62618Q2289k02445j714609k130127L93599L294770
42491B15063K735539n65963k318929q57704J302105J936013J525488R14578m1916
42482D844274q66220n30293K65215k35538j479556j028129J134526K079034N86399
42473D769712j078926j225450j141876j912830k167949r45792K30856K32811M61797
$$ plain form
42534 1159139 352870 1647853 4372702 4954156 2228041 -635642 -733987 928539 1905176
42525 1905176 1803432 1400314 478434 -1070519 -1497295 837344 4348512 5421806 2848486
42516 2848486 -640101 -1631187 396527 3162282 4270903 3144040 768010 -1585427
42508 -1585427 -2997307 -2765615 -710647 1966012 3114839 1913543 49644 -432457
42500 -432457 274585 654204 491586 573875 371430 -1343179 -3473306 -3079707 215063
42491 215063 2950602 2384639 65710 -791994 510111 2446124 3971612 4886190 4844274
42482 4844274 3978054 3447761 3712976 3477438 1997882 969753 2104279 4183313 4769712
42473 4769712 3690786 2465336 1323460 -589370 -2757319 -3703111 -3472255 -3239444 -2777647
42464b777647J929829K878231J657725m14421j361749j420410j423434p42927
42456a674803Q08397J454289L35680n09790L43402Q41097q49192k395860q12181
42447b458961K216719K672357M38868r98660k65722N50557k6661j114045j764304
42438g49852j802411n47236K174411M040482K575609o78248j772461j72945O81134
42429C748483q63149k140857p78227J427043J327893r98952k579542j450574J147164
42420a160718K214650L09002k469358k594863K53002K368516J166630j073653
42412i86792j005683N35197N45189p55409p97979L00895K80732l93708O75916
42403a601642K334384Q44000k967024l560731M77839L459794J401173j849884
$$ plain form
42464 -2777647 -847818 2030413 3688138 3273717 1911968 491558 -931876 -1674803
42456 -1674803 -866406 587883 923563 413773 757175 1598272 749080 -1646780 -2458961
42447 -2458961 -242242 2430115 2868983 1870323 1604601 2155158 2128497 1014452 -749852
42438 -749852 -2552263 -3099499 -925088 3115394 5691003 5012755 3240294 3067349 3748483
42429 3748483 2885334 744477 -33750 1393293 2721186 1722234 -857308 -2307882 -1160718
42420 -1160718 1053932 1362934 -1106424 -3701287 -3448285 -1079769 86861 -986792
42412 -986792 -1992475 -1457278 -912089 -1667498 -2465477 -2164582 -1883850 -2277558 -1601642
42403 -1601642 732742 1576742 -1390282 -4951013 -4473174 -1013380 387793 -1462091
42395a462091j326542J284890J645166M16520J034835K627441J411784k135854
42387C496149l503188j411794N56632K53987j09339J172897J943300J48868k125755
42378D21757j580379J233074K597663P01743k192916k779218n25878K026330K252527
42369B154703K23309j671239j618608k00827R13330J158657J116666J056931O37751
42360C770673p1782l05995M23856J601898K109406J219114o11132j904336j651182
42351D580520o99793q35122k254926l064266j850814L66675J626273J436064O48463
42342d6926j45974p94234q13625J16287J179052J235320N06952K59522Q03041
42333B299415J025803K08576q28871j059952q78258j336047k065870j307440J387825
$$ plain form
42395 -1462091 -2788633 -1503743 141423 557943 1592778 4220219 5632003 3496149
42387 3496149 -7039 -1418833 -862201 -608214 -717553 455344 2398644 2547512 421757
42378 421757 -1158622 74452 2672115 3373858 1180942 -1598276 -2124154 -97824 2154703
42369 2154703 2378012 706773 -911835 -1112662 -199332 959325 2075991 3132922 3770673
42360 3770673 3698891 3392896 3816752 5418650 7528056 8747170 8136038 6231702 4580520
42351 4580520 3880727 3045605 790679 -2273587 -4124401 -3757726 -2131453 -695389 -46926
42342 -46926 -192900 -987134 -1800759 -1684472 -505420 729900 1236852 1496374 2299415
42333 2299415 3325218 3533794 2704923 1644971 766713 -569334 -2635204 -3942644 -2554819
42324b554819L600112K675200m52578j986329k75618J937854J557048n27722j257714
42315B715434j09739P65891M14131J66926Q73717J754781K344482L047974L332251
42306A5305848J913871o41690k043679j706339j464919k099804k038329o83320
42298F541639j0688j150287k210725j518884l43778j48480K10838J848966K854048
42289F072649J103880j785418k614354j309102k61383j47274K18955O40870l39144
42280A579679k178766k390593k62544K049572K590902J654225M89597j24743J45850
42271C553179R63526J104710J3912q64346l9690J429322J458568M17569M63739
42262H500489J656199J640838l94486k217537j935295n45056Q0651j58675l09224
$$ plain form
42324 -2554819 1045293 3720493 3267915 1281586 1005968 2943822 4500870 3973148 2715434
42315 2715434 2605695 3371586 3785717 3952643 4826360 6581141 8925623 11973597 15305848
42306 15305848 17219719 16578029 14534350 12828011 11363092 9263288 7224959 6541639
42298 6541639 6530951 5380664 3169939 1651055 1307277 1158797 1369635 3218601 6072649
42289 6072649 7176529 5391111 2776757 1467655 1206272 1058998 1277953 1918823 1579679
42280 1579679 -599087 -2989680 -3252224 -1202652 1388250 3042475 3532072 3407329 3553179
42271 3553179 4516705 5621415 5635327 4770981 4731291 6160613 7619181 8036750 8500489
42262 8500489 10156688 11797526 11403040 9185503 7250208 6705152 6785803 6627128 6317904
42253F317904l04202p93353j788582k475856k049000m31641J360580J715270J55424
42244A706544j565689j225464R80332K493479J593842n21595j350184o9847J641862
42235C683280J610208l17546k111603k178652j407497j454251j748076m66047
42227d390184J653033J595015q75462j856606Q70236L836917K808090q70342k572238
42218A98459j197789L37462K70701m03073r27921j508895j269702P91712K880638
42209h28408K145248n64149j441206M27278J793548N58394j385584j725446p47729
42200a768054L92615J285633J122534q64150k839590j693112J895706L383957
42192I15539R28699j740216j106268J137892J572797K85089n05420m62662n88347
$$ plain form
42253 6317904 6013702 5220349 3431767 955911 -1093089 -1524730 -164150 1551120 1706544
42244 1706544 140855 -1084609 -104277 2389202 3983044 3461449 2111265 2041418 3683280
42235 3683280 5293488 4975942 2864339 685687 -721810 -2176061 -3924137 -4390184
42227 -4390184 -2737151 -1142136 -2017598 -3874204 -3003968 832949 3641039 2770697 198459
42218 198459 -999330 -661868 -391167 -794240 -1722161 -3231056 -4500758 -3709046 -828408
42209 -828408 1316840 752691 -688515 -261237 1532311 2090705 705121 -1020325 -1768054
42200 -1768054 -1375439 -89806 1032728 168578 -2671012 -4364124 -2468418 915539
42192 915539 1844238 104022 -1002246 135646 1708443 1993532 1488112 1025450 437103
42183D37103o25335P0320O60826L22333j2755L89379K74421j181201k285688j613347
42173c563944n74925m89386L05195K946069M242310R46466l941726m411145l67687
42164d908773K152513K26315k034164p54730J593263Q78867j661690j624959J257393
42155d875965K697758N87812j954233j506668Q22975J646369L79221n94932n8847
42146b856510N14110n7448o00112K34361J549933J642149N46898o33330j782693
42137a442642l017339k892966j21021L309912L777450J120372r32089k66121P84470
42128C20026k88979j977003j370615J048638K163138Q37909q63116r52203N7525
42119a024680L95756n30531j458722p72005J308767K411002Q27774j710362j832445
$$ plain form
42183 437103 -188232 -117912 542914 865247 852492 1241871 1516292 335091 -1950597 -3563944
42173 -3563944 -4138869 -4628255 -4323060 -1376991 2865319 3811785 -129941 -4541086 -4908773
42164 -4908773 -2756260 -2529945 -4564109 -5318839 -3725576 -2846709 -4508399 -6133358 -4875965
42155 -4875965 -2178207 -1590395 -3544628 -5051296 -4228321 -2581952 -2202731 -2797663 -2856510
42146 -2856510 -2342400 -2399848 -2999960 -2765599 -1215666 426483 973381 340051 -1442642
42137 -1442642 -4459981 -7352947 -7473968 -4164056 -386606 733766 -198323 -464444 320026
42128 320026 31047 -1945956 -3316571 -2267933 -104795 733114 -130002 -1082205 -1024680
42119 -1024680 -628924 -1159455 -2618177 -3390182 -2081415 329587 1157361 -553001 -2385446
42110b385446P99826K832841J951575j24526p63990k47960l83242j064841p58486
42101a44249N05848J029454J19393j004954j095621l92196m8100o63477j433333
42092c127235q37242J253285K620492J272515j382503k037307j50211J480387
42084i07819J195463N02334O47215M33597q43877j445160l64856M65796l84005
42075g01312j088683j9446R54969j03773j245085P5094K160922J801104j51409
42066A682381n03523N09904Q4488j483791j118861J237950K173511O01969o73746
42057B510282l2016P47327M28278K77277P26662R0387j795901k455878j057406
42048e60988j30728j019180j279683Q85193K969609J958183q98409k233442j429797
$$ plain form
42110 -2385446 -1585620 1247221 3198796 3074270 2310280 2062320 1679078 614237 -144249
42101 -144249 361599 1391053 1510446 505492 -590129 -982325 -1030425 -1693902 -3127235
42092 -3127235 -3964477 -2711192 -90700 1181815 -200688 -2237995 -2388206 -907819
42084 -907819 287644 789978 1437193 1870790 1026913 -418247 -783103 -317307 -701312
42075 -701312 -1789995 -1809441 -854472 -958245 -2203330 -2128236 32686 1833790 1682381
42066 1682381 1178858 1688762 1773250 289459 -829402 408548 2582059 3184028 2510282
42057 2510282 2478266 3225593 3653871 3931148 4657810 4748197 2952296 496418 -560988
42048 -560988 -691716 -1710896 -2990579 -2105386 864223 2822406 1923997 -309445 -1739242
42039a739242l04288M21057J282747J777561P65213j220665k258249j466837K97026
42030b445677J702663J802036M62078j004818p18009J194815K206124P80903j333940
42021B646175j716766o60129j03721m96392q39873q79286j020196p11661Q04825
42012b977024K394080J911402n98643k496573j835494M34907K061535K014391
42004I08581Q23740n56280j436900j512152r50472k43278K61543N64011Q01083
41995a340124J084659J453989J670988J186518k15694j678327j716023R2783K055226
41986B593995J820137o64574k446399j010345J992681K360715r05481l735019
41978E710k412458J187552K377187L28298j329117l03683J438849J382083N562
$$ plain form
42039 -1739242 -2043530 -1622473 -339726 1437835 2203048 982383 -1275866 -2742703 -2445677
42030 -2445677 -743014 1059022 1521100 516282 -201727 993088 3199212 3980115 2646175
42021 2646175 929409 269280 165559 -330833 -1170706 -2049992 -3070188 -3781849 -2977024
42012 -2977024 -582944 1328458 729815 -1766758 -3602252 -3167345 -1105810 908581
42004 908581 1732321 1176041 -260859 -1773011 -2723483 -2966761 -2705218 -2141207 -1340124
41995 -1340124 -255465 1198524 2869512 4056030 3840336 2162009 445986 538769 2593995
41986 2593995 4414132 3749558 1303159 292814 2285495 4646210 3740729 5710
41978 5710 -2406748 -1219196 1157991 1486289 157172 -146511 1292338 2674421 2679983
41969B679983r39733j234697j342405o63897J203376K737420K121726j17992j854674
41960B589107k147969j678011r15412L73071J815598K188573R57149q25187j609591
41951G47328r62541J32610M84931J57902M24211J845270K903392J695798j148489
41942F280412k783837j781295R8557N42824m02684j216748j354376j242211p40904
41933b600262N91390K018561K058877N39427j051757j550748j413365j580690
41925b988567j867577j225531O18508K443611K763913J528852R0433n61957p84867
41916A6818j049699o82824R53107K608443K203961j51283j920549j541255m75496
41907c8777p44008j717314j081365J445037L157082J755206j386041k565977l58158
$$ plain form
41969 2679983 1740250 505553 -836852 -1500749 -297373 2440047 4561773 4443781 2589107
41960 2589107 441138 -1236873 -2152285 -1779214 36384 2224957 3182106 2356919 747328
41951 747328 -215213 -82603 402328 560230 984441 2829711 5733103 7428901 6280412
41942 6280412 3496575 1715280 1813837 2356661 1953977 737229 -617147 -1859358 -2600262
41933 -2600262 -2008872 9689 2068566 2607993 1556236 5488 -1407877 -2988567
41925 -2988567 -4856144 -6081675 -5463167 -3019556 -255643 1273209 1363642 801685 16818
41916 16818 -1032881 -1715705 -762598 1845845 4049806 3898523 1977974 436719 -38777
41907 -38777 -782785 -2500099 -3581464 -2136427 1020655 2775861 1389820 -1176157 -1534315
41898a534315K370512K049302p81585k136641j60351K337257K152726J95397n52974
41889C939328K01799L56216n64847r78811n03230l40470l76125O87624J955602
41880D377086Q42795k087376k709932M61783L416965K477599m33396j459597p26944
41871D158983q16419j645245j170176J09494k87004k120036k374526k82387J295822
41862c131494M95945p74164k34064J190033J213870n9688m33208R48121K282680
41853A498031J547819p92806k288899j539573J23440N88861j35068l21598N13013
41844h06780R70160L68138j83275j15392m91044j451841j079485J154701K271793
41835F36975K3530k774517j796537K125101L923749J603368j442678j992818j011670
$$ plain form
41898 -1534315 836197 2885499 2103914 -32727 -193078 2144179 4296905 4492302 3939328
41889 3939328 4141127 4497343 3932496 2953685 2450455 2109985 1733860 2421484 4377086
41880 4377086 5219881 3132505 422573 884356 4301321 6778920 6345524 4885927 4158983
41871 4158983 3342564 1697319 527143 636637 349633 -1770403 -4144929 -4427316 -3131494
41862 -3131494 -2635549 -3409713 -3643777 -2453744 -1239874 -1299562 -1732770 -784649 1498031
41853 1498031 3045850 2253044 -35855 -1575428 -1451988 -863127 -998195 -1319793 -806780
41844 -806780 163380 531518 348243 232851 -258193 -1710034 -2789519 -1634818 636975
41835 636975 660505 -2114012 -3910549 -1785448 2138301 3741669 2298991 306173 -705497
41826g05497o84295q00549k28108M99100L91055Q8688N70627J041711K24521j087810
41816f90557q66879J025918K376514J528473n79499j789083j272514o5591N51891
41807B18673M68197L02406R4615p30473j987594k259823n45681K120601L494016
41798A174937K402178k53680k444538k592478p81103J135092J262199j02143q75622
41789a075158k08113L53210m35668j352243p38520Q28978J723577J727846J299494
41780B123403p3456k235791k627960M54235L912715L142918j040741l152138j187805
41771f84620P23009n13791j927285J33673L447734L166713o35170l236870k234364
41762a760971r928Q94481J093121J916444K560768J507161p68049k153108j448890
$$ plain form
41826 -705497 -1389792 -2190341 -2418449 -1919349 -1528294 -1439606 -868979 172732 397253 -690557
41816 -690557 -1557436 -531518 1844996 3373469 2793970 1004887 -267627 -333218 218673
41807 218673 686870 989276 1083891 353418 -1634176 -3893999 -4439680 -2319079 1174937
41798 1174937 3577115 3323435 878897 -1713581 -2494684 -1359592 -97393 -199536 -1075158
41789 -1075158 -1283271 -930061 -1365729 -2717972 -3456492 -2627514 -903937 823909 2123403
41780 2123403 2049947 -185844 -2813804 -2359569 1553146 4696064 3655323 503185 -684620
41771 -684620 38389 -475402 -2402687 -2269014 1178720 4345433 3710263 473393 -1760971
41762 -1760971 -1770899 -876418 216703 2133147 4693915 6201076 5433027 3279919 1831029
41753A831029L72393J279946K10931j879377l000284k233801m76160R98305J802192
41744a094826J849098P94355q68907j356445J84097J889317J489252k27592m88835
41735B169514J085567J739796r8128k156325j524950J180221K797852J847914
41727G041461j65817j380183j617828j423098o37183R39269K214279J523921j038898
41718E455923k971476j951244J166161K999327J634417j061346j994517q31139
41710B446106P0375o39144j557987r94704N13203J235901O41862m34878j155061
41701A25673j066667M7971J512533J754565L11851r97803n07616O01833J44731
41692A927071j266689j032780R29451J685096N2730j344893m22383R59592L19981
$$ plain form
41753 1831029 2203422 3483368 3694299 1814922 -1185362 -3419163 -3895323 -2897018 -1094826
41744 -1094826 754272 1548627 679720 -676725 -492628 1396689 2885941 2658349 2169514
41735 2169514 3255081 4994877 4896749 2740424 1215474 2395695 5193547 7041461
41727 7041461 6875644 5495461 3877633 2454535 1817352 2756621 4970900 6494821 5455923
41718 5455923 2484447 533203 1699364 4698691 6333108 5271762 3277245 2446106
41710 2446106 2516481 1877337 319350 -675354 -162151 1073750 1715612 1280734 125673
41701 125673 -940994 -893023 619510 2374075 2685926 1688123 1180507 1782340 1927071
41692 1927071 660382 -372398 557053 2242149 2294879 949986 527603 1487195 1807176
41683A807176j220174j067577L17892M42246p21908p99085O53090J251987k41496
41674D22151j914241j603332L39500K039081K175041N80474j622402k274885l41415
41665b200028K079875J893021p25111k414941j282640R37236J904258J391622
41657A583292J71007j380074k437508j703221N43772K227096K241428J543239
41649B789031Q64018k72253j474326j194561L17428O39064p90543j271112O61000
41640B67746K400731J331011j114929k143002j734693j187183o0475K076422L065645
41631B901273J036166j774921j774548O32678K016200J248020K86927K95705M29765
41622E297265K25477J47355o7623j011408j945918j839730j254829r88426k14308
$$ plain form
41683 1807176 587002 -480575 -162683 279563 -442345 -1241430 -588340 663647 422151
41674 422151 -1492090 -3095422 -2755922 -716841 1458200 2038674 416272 -1858613 -2200028
41665 -2200028 -120153 1772868 1047757 -1367184 -2649824 -1712588 191670 1583292
41657 1583292 1754299 374225 -2063283 -3766504 -3222732 -995636 1245792 2789031
41649 2789031 3653049 3380796 1906470 711909 1029337 1668401 877858 -393254 267746
41640 267746 2668477 3999488 2884559 741557 -993136 -2180319 -2240794 -164372 2901273
41631 2901273 3937439 2162518 387970 1020648 3036848 4284868 4571795 4867500 5297265
41622 5297265 5522742 5670097 5602474 4591066 2645148 805418 -449411 -1437837 -1652145
41613a652145J509503K241102P92205k03360J758664M051787K622388q97658j350714
41604H871772J426362K318928m98567k883416k059612p56291j543041k267679
41596B608456m88513J729403J186663j249566k316591j193963K80826P79780N17706
41587A854201J44809J62627N42809L12396j134683k326462j413198N71324R03031
41578c83146m14189p04597O83179J420952N35050j92232k7511m04208j120363
41569f07065J47442K907600L058649o71852l954560l275064q50753m7517j08708
41560c401828Q72146J612295M76352n91633P01276K526640J920779j43014q29918
41551C143095l99170q66510j643408p93871Q93919J206341N29555O42666Q57671
$$ plain form
41613 -1652145 -142642 2098460 2890665 2687305 4445969 8497756 11120144 10222486 8871772
41604 8871772 10298134 12617062 12118495 9235079 7175467 6419176 4876135 2608456
41596 2608456 2119943 3849346 5036009 3786443 1469852 275889 556715 1336495 1854201
41587 1854201 1999010 2161637 2704446 3016842 1882159 -444303 -1857501 -1286177 -383146
41578 -383146 -797335 -1501932 -818753 602199 1137249 945017 917506 513298 -607065
41569 -607065 -459623 2447977 5506626 4834774 880214 -2394850 -3245603 -3293120 -3401828
41560 -3401828 -2529682 -917387 -441035 -1032668 -331392 2195248 4116027 3973013 3143095
41551 3143095 2743925 1877415 234007 -559864 334055 1540396 2069951 2712617 3570288
41542C570288n72187k381829j857839L04886Q44825p87107j919163j267755l29456
41533d395337m9351M76947J580346K187533J805705J034413Q8349j128227j844142
41524b43764j335612l95734k295L96530J233205J024388j168849l032052j841719
41515e365902J142806K298693Q05910q25657p20077O32771J955190K118487M45232
41506B487453j861636k119925L714J383124M25250j04418J545368J893539j821387
41497A831082n264860k925766K404209L382482k73754j802061J251631L698462
41489B301425J916432j044778j777613j370247j291819k64736J865571K293642
41481B627877J41563j423663n01345N78580p2641q15021l83698k56467p72542
$$ plain form
41542 3570288 2998101 616272 -1241567 -936681 -91856 -878963 -2798126 -4065881 -4395337
41533 -4395337 -4444688 -3967741 -2387395 -199862 1605843 2640256 2728605 1600378 -243764
41524 -243764 -1579376 -1975110 -1977405 -1580875 -347670 676718 -492131 -3524183 -5365902
41515 -5365902 -4223096 -1924403 -1118493 -1944150 -2664227 -2031456 -76266 2042221 2487453
41506 2487453 625817 -1494108 -1490394 -107270 317980 213562 1758930 3652469 1831082
41497 1831082 -3433778 -6359544 -3955335 -572853 -846607 -2648668 -1397037 2301425
41489 2301425 4217857 3173079 1395466 25219 -1266600 -1531336 334235 2627877
41481 2627877 2769440 1345777 844432 1423012 1350371 535350 151652 -104815 -877357
41472h77357L04747K826526K906406n48636l075361j776672n7688j355529l228319
41463d881883k287468k95688j71341j45857K406152M886106L296928n45117j678047
41454E83785R5994Q28737n08083j305417p55055n64305p38814K56931J445849
41445f60378L73790j896324j643104J429733L554422K797603J198253L69582o65980
41436D857597k135085k085276Q5310K029266J993307J149915J029706J254119
41428H178859J122369J006673Q98768j59332j961156k604549j367954j76816q31980
41419D104882k392166k670543j130127Q48305J715942J022982l46902q83203j07246
41410A61924O09271j30001j534624j702316n43237J93280k32507n96393Q6000
$$ plain form
41472 -877357 -572610 2253916 5160322 4611686 1536325 -240347 -298035 -1653564 -4881883
41463 -4881883 -7169351 -7465039 -7636380 -7782237 -5376085 -489979 2806949 2261832 583785
41454 583785 679779 1508516 1000433 -304984 -1060039 -1624344 -2363158 -2106227 -660378
41445 -660378 -286588 -2182912 -3826016 -2396283 1158139 3955742 5153995 5523577 4857597
41436 4857597 2722512 637236 722546 2751812 4745119 5895034 6924740 8178859
41428 8178859 9301228 10307901 11206669 11047337 9086181 6481632 5113678 4936862 4104882
41419 4104882 1712716 -957827 -2087954 -1239649 476293 1499275 1152373 269170 161924
41410 161924 771195 641194 -893430 -2595746 -3138983 -2945703 -3178210 -3774603 -3688603
41401c688603J134537J473794R24151j21690j040023q84747O22049J926697J089691
41392A435856j317069k411939o99858J880539K449292O84414j097942q93937O84110
41383G13466J243013k90494j965636j232802J229664K120260M31867q44076N00259
41374A905521K135615R71958j590808j851312J87131J082451l52314j747893j641903
41365i01554j205660r85122R3466J546008J173333n93452l24532K519368L597651
41356D919506M48505k818580j560396J983250K217154j023795k720285r86008
41348D59351N08655o67255j681851L23786L003258K289137j330992l638943k604255
41339c339109j41827J603387K451656K295463K04693l107931m451540j960821
$$ plain form
41401 -3688603 -2554066 -1080272 -156121 -277811 -1317834 -2202581 -1580532 346165 1435856
41392 1435856 118787 -2293152 -2993010 -1112471 1336821 2021235 923293 29356 713466
41383 713466 1956479 1665985 -299651 -1532453 -302789 1817471 2249338 1405262 1905521
41374 1905521 4041136 5013094 3422286 1570974 1758105 2840556 2488242 740349 -901554
41365 -901554 -2107214 -3092336 -2998870 -1452862 -279529 -872981 -1197513 1321855 4919506
41356 4919506 5368011 2549431 989035 2972285 5189439 4165644 1445359 459351
41348 459351 968006 300751 -1381100 -1057314 1945944 4235081 2904089 -734854 -3339109
41339 -3339109 -3480936 -1877549 574107 2869570 3074263 -33668 -4485208 -6446029
41331f446029J903096L423288K430009J473121J228919R3737j735749j603786
41323G66606R34246K319256J76114k620853k103245P82982J897483K50575j241159
41314A162005q60176p3774m7388K06141J095504J007123q06890k388819j862120
41305b568394j02731R88912J133287R78684M10207o50198j104788k12281P87535
41296c39767M17196n47303k60031J133154J669533O28272o01958r79028j218061
41287i7993j938470k026691l02443K056572K490709M94732j469118j219069K39743
41278a772028M46268o38125n41082J679384L465853K187817j002312k629513j428616
41269b32354N11069Q98785k40077j397103j517143p10821P6699j7356n91842j61885
$$ plain form
41331 -6446029 -4542933 -1119645 1310364 2783485 4012404 4106141 2370392 766606
41323 766606 1700852 4020108 4196222 1575369 -527876 255106 2152589 2403164 1162005
41314 1162005 301829 228055 180667 386808 1482312 2489435 1682545 -706274 -2568394
41305 -2568394 -2671125 -1682213 -548926 429758 839965 189767 -915021 -1127302 -339767
41296 -339767 77429 -469874 -729905 403249 2072782 2701054 2099096 1120068 -97993
41287 -97993 -2036463 -4063154 -4365597 -2309025 181684 676416 -792702 -2011771 -1772028
41278 -1772028 -1325760 -1963885 -2504967 -825583 2640270 4828087 3825775 1196262 -232354
41269 -232354 278715 1177500 937423 -459680 -1976823 -2687644 -2610945 -2628301 -3220143 -3382028
41259c382028J653426K961547J998922r3510p42310L45132J074836L73550n99619
41250C589946q40245q07321q27120l67794L41687K6242j346323j869350l91678
41241b491956J712090K520878J829947M93598r27133j817375j356849Q4235P47405
41232G94840j50781j110059n27883J000425J692185Q78431o30585j532974q32059
41223d18460J127407K096699J68834k958765l282289p051K828676J860160j030961
41214C84250j916037l56549J039070R23233Q2304r02435j923064j922490K0278
41205d571440K484097L038902J552364l4403p85177j234363j197873J33569J830415
41196A216091J662155n10236k097918j321619N59720J363446O74923l72248p06920
$$ plain form
41259 -3382028 -1728602 1232945 3231867 3138357 2396047 2741179 3816015 4189565 3589946
41250 3589946 2749701 1942380 1115260 747466 1089153 1115395 -230928 -2100278 -2491956
41241 -2491956 -779866 1741012 3570959 4064557 3137424 1320049 -36800 47435 794840
41232 794840 644059 -466000 -993883 6542 1698727 2577158 1946573 413599 -418460
41223 -418460 708947 2805646 2974480 15715 -3266574 -3273625 -444949 1415211 384250
41214 384250 -1531787 -1888336 -849266 73967 156271 -746164 -2669228 -4591718 -4571440
41205 -4571440 -2087343 951559 2503923 2469520 1684343 449980 -747893 -614324 1216091
41196 1216091 2878246 2368010 270092 -1051527 -491807 871639 1546562 1174314 467394
41187D67394j06716O33579K03798j478738k383687q16591J641940J802752n36656
41178e72925k120572r17430J156770J328645k77634j436808q53379J024657L064391
41169C95715M034301L038774N04603j871543k847618k622917j809982o00121N66900
41160a211888Q55733L03700J0369L57433L58169m58050r96382m46146K94983K96016
41150f36063K82244J130630J897712J125687o98053j719133j235251j29493P00339
41141G18619Q92743J60179j164453j606681k49699J413377J130674p91935j780814
41132a277990p18129O74147P20559O5537M534K41392j91508r27939q43400n3654
41122b306451K29056l28524p66187n38303l18145n54633l59962J112211K802092
$$ plain form
41187 467394 360678 994257 1198055 -280683 -2664370 -3480961 -1839021 -36269 -572925
41178 -572925 -2693497 -3610927 -2454157 -1125512 -1403146 -2839954 -3693333 -2668676 395715
41169 395715 4430016 7468790 7973393 6101850 3254232 631315 -1178667 -1778788 -1211888
41160 -1211888 -356155 -52455 -42086 315347 673516 215466 -780916 -1227062 -932079 -636063
41150 -636063 -353819 776811 2674523 3800210 3102157 1383024 147773 18280 718619
41141 718619 1611362 1771541 607088 -999593 -1249292 164085 1294759 502824 -1277990
41132 -1277990 -1996119 -1321972 -601413 -535876 -531342 -289950 -481458 -1409397 -2252797 -2306451
41122 -2306451 -2077395 -2405919 -3172106 -3710409 -4028554 -4583187 -4943149 -3830938 -1028846
41113a028846K636587M26904j412265q53287R52098J174827p75878k436393j705107
41104c021360M64765J712856J376617O06095J94036j11577m19350l68991r4653
41095C38438j93942n29827l04652L98320M49486m67922j125068o28059J39073
41086a924153l5088p36122o46570L38542R67661M73046m31371n09897N88138J913610
41076b204K004992L93353j552955j919722n79494O84343O88874J70797n1436n31074
41066f94526j479097j379873N44123J998536O31588j607654p05154K929142M235863
41057D472948Q90237l011074k966117m33821J19956j812143k702861q70240J417405
41048d895710J903171J220127R35650J105150R62409N30668M67132J045209J807035
$$ plain form
41113 -1028846 1607741 2034645 622380 -230907 721191 1896018 1120140 -1316253 -3021360
41104 -3021360 -2556595 -843739 532878 1138973 1333009 1221432 802082 433091 338438
41095 338438 144496 -385331 -689983 -291663 157823 -310099 -1435167 -2063226 -1924153
41086 -1924153 -1959241 -2695363 -3341933 -3003391 -2035730 -1562684 -1994055 -2503952 -1915814 -2204
41076 -2204 2002788 2396141 843186 -1076536 -1656030 -971687 -282813 -112016 -163452 -694526
41066 -694526 -2173623 -3553496 -3009373 -1010837 -379249 -1986903 -2692057 237085 4472948
41057 4472948 5363185 2352111 -614006 -1047827 -927871 -2740014 -5442875 -6313115 -4895710
41048 -4895710 -2992539 -1772412 -836762 268388 1230797 1761465 2228597 3273806 5080841
41039E080841J825424M70295j563472k560665j822136n59984J2306J51209P7554
41030A111372j038576k717349k097048J753812M552783K011256l075155m036699
41022c535604k02040K280906L97871j293084J015636L534250J081680m170265
41014h90650n735947k114388K251403L906956L384038J977321Q7453j207406p60197
41005H98583K93000l7758j081783o67660O77729L70525j560243k336822j204908
40996d649337l96713p15405j81756J760275K590381R88654o87919j96369J314618
40987a73571J791073J277350N01227q20644k229833j779477P33547K404860J459487
40978C164019J73497Q30634J494320o61287l963831m249833j073879K002622K747465
$$ plain form
41039 5080841 6906265 7376560 5813088 3252423 1430287 870303 882609 1033818 1111372
41030 1111372 72796 -2644553 -4741601 -2987789 1564994 3576250 501095 -3535604
41022 -3535604 -3737644 -1456738 -1058867 -2351951 -1336315 2197935 3279615 -890650
41014 -890650 -6626597 -8740985 -6489582 -2582626 801412 2778733 2866186 1658780 898583
41005 898583 1191583 1153825 72042 -595618 82111 452636 -1107607 -3444429 -4649337
40996 -4649337 -5046050 -5761455 -5943211 -4182936 -1592555 -603901 -1291820 -1488189 -173571
40987 -173571 1617502 2894852 3396079 2575435 345602 -1433875 -700328 1704532 3164019
40978 3164019 3337516 4168150 5662470 5001183 1037352 -3212481 -4286360 -2283738 463727
40969D63727K186388J398428L8143j517315j804394q79863n76693j340594j342327
40960c374500L00776J810914J511254K69478k41085o8480k13353n21391L7022
40951d89365J500395K602671K269440P24664r06380j743544j794777j467856p52968
40942e7720M25107J167371K93612j443327j555883O15109K365491J458816l45661
40933B922915j63458J222746Q36296j195142j798411l31949L90206p73612j327305
40924b17714J24442J208599K07844n96309Q71034K225786M94280k300673j972671
40915D4618Q94337J685914q82942k909199j657828N28347N71304n88893k89483
40906b603825J176122J300132k33864q51292R24931K984750K306319r12754l219325
$$ plain form
40969 463727 2650115 4048543 4086686 2569371 764977 -114886 -691579 -2032173 -3374500
40960 -3374500 -3073724 -1262810 248444 517922 276837 208357 -4996 -526387 -489365
40951 -489365 1011030 3613701 5883141 6607805 5701425 3957881 2163104 695248 -57720
40942 -57720 367387 1534758 1828370 385043 -1170840 -555731 1809760 3268576 2922915
40933 2922915 2759457 3982203 4818499 3623357 1824946 1492997 1883203 1109591 -217714
40924 -217714 -93272 1115327 1323171 726862 1597896 3823682 4317962 2017289 44618
40915 44618 938955 2624869 1741927 -1167272 -2825100 -2296753 -1725449 -2314342 -2603825
40906 -2603825 -1427703 -127571 -361435 -1212727 -287796 2696954 5003273 4090519 871194
40897H71194k093214R67327K461388J324139k06316k07306M03705J912q72929
40888B649900o53987L82524N76494k94049p94582l34015J17238o0253l53978m84278
40878G51014p80815r15924o8879J230570J270500j79007j131367k02147J360148
40869A334093J449405k93865k469192l433335k267864N65837L020166L149252
40861A054497J396568j15153o19341j108603j568755m85693J952031K944595J049035
40852D499181j400938j806406r12363o51387o67903K29183J098404M67971o53148
40843B02594n79263k87200j370068k034329M82947M192879M068836n7708k482478
40834B136210k19390K345279M80684l347694l321653Q68920L780550K095174j505526
$$ plain form
40897 871194 -1222020 -254693 2206695 3530834 3324518 3117212 3520917 3522829 2649900
40888 2649900 1995913 2378437 2954931 2660882 1866300 1532285 1649523 1589270 1235292 751014
40878 751014 -29801 -945725 -1014604 215966 1486466 1307459 176092 -26055 1334093
40869 1334093 2783498 2489633 20441 -3412894 -5680758 -5114921 -2094755 1054497
40861 1054497 2451065 2335912 1716571 607968 -960787 -1446480 505551 3450146 4499181
40852 4499181 3098243 1291837 379474 -271913 -939816 -710633 387771 855742 202594
40843 202594 -376669 -663869 -2033937 -4068266 -3585319 607560 4676396 4618688 2136210
40834 2136210 1916820 4262099 4742783 1395089 -1926564 -1057644 2722906 4818080 3312554
40825C312554k896511j603714J8430M51087J06833j80383j91989O0014P48985
40816a74694J789539K327508J392338o50603j976290j396932o1545N3901j018576
40807B84646j431010n28502J63772m22836j017170J0450J984497K684443J250709
40798B978999q14100j444637k06096J268927R87351r76989k200151r15958J301368
40789b1286J459205n91035j987840j164525J54117J41247m07893o4407O67027
40780a815390O92660M97364Q81444R91531j42923j291507o62962R46470J160349
40771A257036j87863p74969N34795J997077J650679n8230j251941j119073m73023
40762A574488k55313k79580K00241Q78390L32174j553356k200677M33729L761724
$$ plain form
40825 3312554 416043 -1187671 -1169241 -718154 -611321 -791704 -983693 -923679 -174694
40816 -174694 1614845 3942353 5334691 4684088 2707798 1310866 1249321 1303222 284646
40807 284646 -1146364 -1674866 -1511094 -1933930 -2951100 -2940650 -956153 1728290 2978999
40798 2978999 2164899 720262 514166 1783093 2770444 1793455 -406696 -1322654 -21286
40789 -21286 1437919 846884 -1140956 -2305481 -2151364 -2010117 -2418010 -2482417 -1815390
40780 -1815390 -1122730 -625366 256078 1247609 1104686 -186821 -849783 96687 1257036
40771 1257036 1069173 294204 828999 2826076 4476755 4418525 3166584 2047511 1574488
40762 1574488 1319175 1039595 1239836 2118226 2450400 897044 -1303633 -869904 2891820
40753B891820K953292j923459m915783k322554J957419K522772M94527O82851
40745B340885L073447L037764m71937k925113j564453N63203J63301j243516q33940
40736B139641N52043M83689o04448o58309K4536l60876j355394q38826R06238
40727B88294J141142q05566k039705m95233J638103J057050j549614k255430L47965
40718b672994K854717J829397j186677j953441J55026J372233m35131k330659
40710b367529r27089K229111K959661N89349j586166j373122K1224Q15306P97411
40701A158156J79805j007960j717052n35916J691039K250986M19641j363706j140030
40692f5037M8193M67562K98157M26452N63420K23381L7050N16386Q08334J10984
$$ plain form
40753 2891820 5845112 3921653 -994130 -3316684 -1359265 1163507 1658034 2340885
40745 2340885 5414332 8452096 7980159 5055046 3490593 4053796 4217097 2973581 2139641
40736 2139641 2691684 3175373 2570925 1912616 1937152 1576276 220882 -617944 288294
40727 288294 1429436 623870 -1415835 -1911068 -272965 784085 -765529 -3020959 -2672994
40718 -2672994 181723 2011120 824443 -1128998 -973972 398261 -36870 -2367529
40710 -2367529 -3294618 -1065507 1894154 2483503 897337 -475785 -454561 360745 1158156
40701 1158156 1337961 330001 -1387051 -1922967 -231928 2019058 2438699 1074993 -65037
40692 -65037 -16844 450718 748875 1175327 1738747 1962128 1999178 2515564 3323898 3434882
40682C434882q18755q58901j85145L41404M18227N4640p73209j455439j047202
40673h89498J5070k2819j592535k764749j834674N10515K533018L431018L058825
40664B444171J309505j066304k415683j989424o48861O60609J594030J477860
40656A365903l3408j154583L02714K868896K515176j123982l490269j837568Q57751
40647B70630J259743P31555J519886J887664l79101k853482k020972M61181M35074
40638A312178j637579j860862n1382J81748j770831k405278k95457J902895K486963
40629b137605K739575K927780J299779j518891k082835J02391J181760n36856
40621A975098j555035N40022K536778J020828j790190j926973r9354L21171p41578
$$ plain form
40682 3434882 2616127 1757226 1572081 1913485 2331712 2386352 1613143 157704 -889498
40673 -889498 -874428 -897247 -2489782 -5254531 -7089205 -6578690 -4045672 -614654 2444171
40664 2444171 3753676 2687372 271689 -1717735 -2366596 -1705987 -111957 1365903
40656 1365903 1332495 177912 480626 3349522 5864698 4740716 1250447 -587121 270630
40647 270630 1530373 2261928 3781814 5669478 5290377 2436895 415923 877104 1312178
40638 1312178 -325401 -2186263 -2237645 -2055897 -3826728 -6232006 -6527463 -4624568 -2137605
40629 -2137605 601970 3529750 4829529 3310638 1227803 1330194 2511954 1975098
40621 1975098 420063 960085 3496863 4517691 2727501 800528 701174 1022345 280767
40612B80767q12552J36951N8221p88410k40699J326661J136907j164817k574031
40603b641002j329295P86352J681170J600359J351883M89288j107282j833310
40595a001837m30782J730795K173125N38653j111327j067599R9569O77507J78611
40586A786715j37059P81482J940370J352846j070684k920332k325004n16704k9305
40577a137675j013654j161133N95279K195293J353584r41647j581596K92312J937251
40568E38014Q17801j707411k202518k0655J838471J134485n65435o32162O58113
40559a41297J057514J02339o12742m86950n91053j092219n86416J204699K355377
40550A209252J520923q3556p26710m90841k51389N7424O40350P17057j34303o74319
$$ plain form
40612 280767 -531785 -394834 -336613 -1125023 -1365722 -39061 1097846 -66971 -2641002
40603 -2641002 -3970297 -3183945 -1502775 97584 1449467 1938755 831473 -1001837
40595 -1001837 -1432619 298176 2471301 3009954 1898627 831028 930597 1608104 1786715
40586 1786715 1649656 2431138 4371508 5724354 4653670 1733338 -591666 -1108370 -1137675
40577 -1137675 -2151329 -3312462 -2717183 -521890 831694 -109953 -1691549 -1399237 538014
40568 538014 1355815 -351596 -2554114 -2574769 -736298 398187 -167248 -799410 -141297
40559 -141297 916217 1018556 405814 -81136 -672189 -1764408 -2350824 -1146125 1209252
40550 1209252 2730175 2646619 1919909 1429068 1177679 1235103 1875453 2592510 2458207 1783888
40540A783888K25752J460970J144820m97911j483320r01704K77705R83177J021215
40531D014592L79463q88649j920391j563561k4043J050892N38580q77540j700419
40522i91076j271824j66337N95551M89510j07769l63755P2018P01703Q13064K29389
40512D74n84155q26717N2354J463412J666295k81717k705378k874849n38301J776598
40502b851984K366127K191516K240012J476792o91575k081154o49545J635243
40494C635432J093634j987078l350497r05798K281183K463213J29776j490644
40486A869221j120240l98116q96266k143131k660191j672743M03219K339230K845446
40477a433571J643637k3394m78725N55446J587480J119436m69674j277490k00694
$$ plain form
40540 1783888 2009640 3470610 4615430 4117519 2634199 1732495 2010200 2993377 4014592
40531 4014592 4394055 3505406 1585015 21454 -2589 1048303 1586883 709343 -991076
40522 -991076 -2262900 -2429237 -1833686 -1344176 -1451945 -1815700 -1743682 -1041979 -228915 474
40512 474 -583681 -1410398 -1358044 105368 1771663 1489946 -1215432 -4090281 -4628582 -2851984
40502 -2851984 -485857 1705659 3945671 5422463 4730888 2649734 2000189 3635432
40494 3635432 4729066 2741988 -608509 -1514307 766876 3230089 3359865 1869221
40486 1869221 748981 350865 -545401 -2688532 -5348723 -7021466 -6618247 -4279017 -1433571
40477 -1433571 210066 186672 -292053 263393 1850873 2970309 2500635 1223145 1022451
40468A022451J579788J930800L59268j451232j811627r52151l05026n24177r91045
40459a142951r61837l91913L49545R10292R88199M70445k39876l96677K95670
40450a19103J168597J116629k05128j755683j971289m39100J577908K535526K068335
40441C976692O43544j430166l549027m045708j700718J903675L449079J943561
40433A190932m1374j24780P38100L93434q51999r15880N63165J735888J428646
40424D116132M68435j67660p21057j468364j562031r4656K301582L715353K732330
40415I320064j96173k942176l371393j276553J350163K268462J085760p76914
40407E461240j757052j374878k77681L66615j10852j012939r24876L57553J323721
$$ plain form
40468 1022451 2602239 4533039 4892307 3441075 1629448 677297 372271 -151906 -1142951
40459 -1142951 -2104788 -2496701 -2147156 -1236864 -248665 221780 -18096 -414773 -119103
40450 -119103 1049494 2166123 1960995 205312 -1765977 -2205077 -627169 1908357 3976692
40441 3976692 4620236 3190070 -358957 -4404665 -6105383 -4201708 -752629 1190932
40433 1190932 1149558 1024778 1762878 2156312 1304313 388433 951598 2687486 4116132
40424 4116132 4584567 4416907 3695850 2227486 665455 570799 2872381 6587734 9320064
40415 9320064 9123891 6181715 2810322 1533769 2883932 5152394 6238154 5461240
40407 5461240 3704188 2329310 2051629 2418244 2307392 1294453 369577 727130 2050851
40398B050851Q14320l23995o39689k85235m93412j374693j697055p65960O91998
40389b022870J579995J450131N15794n68052j053682q46085n80578m79738R3001
40380a912084J209862J570990L15519j328122j635136p61656n343L65678P73844
40371a406448P98853P6215j96525R41479J833638N33783j287456m10953K223116
40362C105702K208252j207589l328124j224325J752267J667656J41550P06220
40354C821609K317025J524601r16711j077932J212012J861196o07807k740034
40346E393959k092420q42222j200836j365119P60380L037602K172369o73558j348394
40337C841761J040248L047321K119687l31327j803915j965448j784503j366737
$$ plain form
40398 2050851 2865171 2541176 1901487 1616252 1122840 -251853 -1948908 -2714868 -2022870
40389 -2022870 -442875 1007256 1523050 954998 -98684 -944769 -1525347 -2005085 -1912084
40380 -1912084 -702222 868768 1184287 -143835 -1778971 -2540627 -2545970 -2180292 -1406448
40371 -1406448 -607595 -531380 -727905 213574 2047212 2580995 1293539 882586 3105702
40362 3105702 5313954 4106365 778241 -446084 1306183 2973839 3115389 3821609
40354 3821609 6138634 7663235 6746524 5668592 6880604 8741800 8133993 5393959
40346 5393959 3301539 2459317 1258481 -106638 653742 3691344 5863713 5190155 3841761
40337 3841761 4882009 7929330 10049017 9717690 7913775 5948327 4163824 2797087
40329B797087k32096J241611J958962J422390K98806k10646M35298J278642P01928
40320I691982j206909j937246L90703L875083M704192K038529j170247k454478
40312A3931609k436608k403317j952437o32100M09667M06264N75518J573415J451656
40303A0923667j041404l037017j077294L045549M065126O98177k742657k785035
40295H049112q58414M28842J269183K602312L106485J133996k160276m124332
40287I446908l819059k074811K37619K151867K271130M86692j140564j010894
40279F548888k48527n67554j353702j031040j5707J54852l39364j81726L66344
40270C332464k9744r24641m45719J374143K158868P24031j051886q73342R31001
$$ plain form
40329 2797087 2564991 3806602 5765564 7187954 7486760 7276114 7711412 8990054 9691982
40320 9691982 8485073 6547827 6938530 10813613 15517805 17556334 16386087 13931609
40312 13931609 11495001 9091684 7139247 6507147 6916814 7323078 7898596 9472011 10923667
40303 10923667 9882263 6845246 5767952 8813501 12878627 13576804 10834147 8049112
40295 8049112 7190698 7619540 8888723 11491035 14597520 15731516 13571240 9446908
40287 9446908 5627849 3553038 3790657 5942524 8213654 8700346 7559782 6548888
40279 6548888 6300361 5732807 4379105 3348065 3332358 3487210 3147846 2966120 3332464
40270 3332464 3302720 2378079 1932360 3306503 5465371 6189402 5137516 4264174 5195175
40261E195175K091981J369142n9761j96071J085623J566069l22218k692296k304845
40252E732799O24974K403750J326163j2687N37777J075475n21549k384875j879324
40243F902503k90725j44731k92423J501262L120524R28603l158961l609422o1043
40234D895587K164503Q79810k62381O29768K78603k661670l658190K21046M410066
40225F897142L544868l60900j862995n98726q1829p08811l4017J520313J089189
40216I404234j064878j695711k43240M62097n78369j163020l53499Q995p42642
40207D033967o47479R76619J790648L53591j318263j027490L99285J134163J251437
40198F946478J494613J104079p27756k509964j972677N42569K214054J327180
$$ plain form
40261 5195175 7287156 8656298 8596537 8400466 9486089 11052158 10729940 8037644 5732799
40252 5732799 6357773 8761523 10087686 10074999 10612776 11688251 11166702 8781827 6902503
40243 6902503 6611778 6467047 6174624 7675886 10796410 11725013 8566052 4956630 4895587
40234 4895587 7060090 7939900 7677519 8307287 8585890 5924220 2266030 2487076 6897142
40225 6897142 10442010 10081110 8218115 7619389 7537560 6828749 6794732 8315045 9404234
40216 9404234 8339356 6643645 6400405 6862502 6284133 5121113 4767614 4776609 4033967
40207 4033967 3386488 4363107 6153755 6507346 5189083 4161593 4560878 5695041 6946478
40198 6946478 8441091 9545170 8817414 6307450 4334773 4877342 7091396 8418576
40190H418576p36792j485954l64032Q20794L01008j388264k075484p97783R32533
40181C624602J254066M36467J58254R42029J698270J634797J254297J266189J586340
40172A3855311J745334J576333J257101J034918Q39162M6520j731820l412088
40164A5210771l198191j241611Q168o85608j283062J11831J559932L3284l243609
40155G271905l904405q89829J961214J671988n4825m38556J61320L6868m11759
40146E403921R6349P98745J97337q42880l11950J270755J465631Q2620l77598
40137G782930J005715J907700O64943q68598l84359J114587J162510j4181j20079
40128A2251168J105015J529896N65636L61833K011287L344212K319425L56981
$$ plain form
40190 8418576 7681784 6195830 5831798 6652592 6953600 5565336 3489852 2692069 3624602
40181 3624602 4878668 5315135 5473389 6415418 8113688 9748485 11002782 12268971 13855311
40172 13855311 15600645 17176978 18434079 19468997 20308159 20354679 18622859 15210771
40164 15210771 12012580 10770969 10779137 10093529 8810467 8922298 10482230 10515514 7271905
40155 7271905 3367500 2477671 4438885 6110873 6056048 5617492 5778812 5815680 5403921
40146 5403921 5500270 6299015 6496352 5653472 5341522 6612277 8077908 8160528 7782930
40137 7782930 8788645 10696345 11361288 10492690 10108331 11222918 12385428 12371247 12251168
40128 12251168 13356183 14886079 15451715 15813548 17824835 21169047 23488472 23845453
40120B3845453l2111P47693M23780j129694j776753p18588M06830J66694j121258
40111B0812046k588262l482253k709510m0500K238107J509799j123067j842246
40103A2774114L89408K478467K114744N77056n94832j947569l231472k165646
40095A0394270J097545K168918j151965m190782j869210L016942L648174m42229
40087A2671663l055121j050766J819850J866015N75676N97672J300349J139637
40079A5864975Q39947J350011J451167J03457j150269o56212M80173M31468k02083
40070A8512634K32244J269858J025188o75043j944011j317676Q17477K913059
40062B0833730L445261K012525o4371r75182n71801j50867k7687P78929K053639
$$ plain form
40120 23845453 23813342 24561035 24984815 23855121 22078368 21359780 21766610 21933304 20812046
40111 20812046 18223784 14741531 12032021 11991521 14229628 15739427 14616360 12774114
40103 12774114 13163522 15641989 17756733 18333789 17738957 15791388 12559916 10394270
40095 10394270 11491815 13660733 12508768 8317986 6448776 9465718 13113892 12671663
40087 12671663 9616542 8565776 10385626 12251641 12827317 13424989 14725338 15864975
40079 15864975 16704922 18054933 19506100 19609557 18459288 17803076 18283249 18714717 18512634
40070 18512634 18744878 20014736 21039924 20364881 18420870 17103194 17920671 20833730
40062 20833730 24278991 26291516 26227145 25251963 24680162 24529295 24501608 25280537 27334176
40053B7334176K007672M52216j50441J555322L364386K898832J310169J118458
40045C9890790K229831K997355L748150N894742Q324034Q222990N611850L858641
40037H0778383N092303P994671J0999906J4721673J9624121K4078682K7377383
40030A90667122L2600687M2489728N2289545N0581301L0174750k744404l2595006
40023C63463723m7691642m8355197m2521637l6383217l0957217k5322437j9528729
40016A12703647j4109215r356827n980923m731969m708205l784029j536341l621
40008F8492517m73981j246881r2209K477165M199876M421881M622983O053349
40000H8454700Q568978J1743342J5597069J9925893K4122642K8231157L3203485
$$ plain form
40053 27334176 29341848 29794064 29643623 31198945 34563331 37462163 38772332 39890790
40045 39890790 42120621 45117976 48866126 54760868 63084902 71307892 76919742 80778383
40037 80778383 85870686 93865357 104865263 119586936 139211057 163289739 190667122
40030 190667122 223267809 265757537 318047082 368628383 398803133 396058729 363463723
40023 363463723 315772081 267416884 224895247 188512030 157554813 132232376 112703647
40016 112703647 98594432 89237605 83256682 78524713 73816508 70032479 68496138 68492517
40008 68492517 68018536 66771655 66679446 69156611 73356487 77778368 82401351 88454700
40000 88454700 97023678 108767020 124364089 144289982 168412624 196643781 229847266
39993B29847266L8852395M1392821L4439877J4702912j2393498l4552768m2437224
39986B69851781l7543911k8836589k2522547j7810795j2135295o246213k176620
39979A42579811P19201M797646J0686081J7073034K2984883K8718633L5418316
39972B62977605M4189171N3131573N4230343L7512954K724002l5247076n7705109
39965C61813463n9179868m9809151m1450988l6262882l0079389k1820506j5158491
39958A08052188j2690992j2562727j1450543q576569n643346m015364l413592
39951D9699055l234284l655945m562796m575763k863694j175618j699568l146540
39943B4784847k054897J472630L041785O60913j762149o29704J349732j95713
$$ plain form
39993 229847266 268699661 310092482 344532359 359235271 346841773 312289005 269851781
39986 269851781 232307870 203471281 180948734 163137939 151002644 144756431 142579811
39979 142579811 143299012 148096658 158782739 175855773 198840656 227559289 262977605
39972 262977605 307166776 360298349 414528692 452041646 454765648 419518572 361813463
39965 361813463 302633595 252824444 211373456 175110574 145031185 123210679 108052188
39958 108052188 95361196 82798469 71347926 62771357 57128011 53112647 49699055
39951 49699055 46464771 42808826 38246030 33670267 30806573 29630955 27931387 24784847
39943 24784847 22729950 24202580 27244365 27905278 26143129 25513425 26863157 26667444
39935B6667444l547648l417850J97816J803939p76415l260660k093391M61714
39927A6034949R05026j38027k09895N83378O77959L10796P59039J782377K112277
39918B2817879J417758K50995p92938r15915K94231J465060P34320r90021p91323
39909B3490046J466261K487165J016207R1270J603927K646388O33890j589055
39901C1846099j15590L334133L986127J516376n422J166810K569760K258127J107912
39892D7664332J08044q15496r32491P07166K480432J610018j175002k112816k09593
39883D7324594J293701L31989j037979p82915k28857r21876j402480R8577K260166
39874D6934920K803020K117151K134725L168334M309059N498014O795318P035096
$$ plain form
39935 26667444 23119796 19701946 19899762 21703701 20927286 17666626 15573235 16034949
39927 16034949 16939975 16801948 16592053 17175431 17853390 18164186 18923225 20705602 22817879
39918 22817879 24235637 24486632 23693694 22777779 23072010 24537070 25271390 24281369 23490046
39909 23490046 24956307 27443472 28459679 28550949 30154876 32801264 33435154 31846099
39901 31846099 31730509 35064642 39050769 40567145 40561723 41728533 44298293 46556420 47664332
39892 47664332 47772376 46956880 46024389 46731555 49211987 50822005 49647003 47534187 47324594
39883 47324594 48618295 48950284 47912305 47129390 46900533 45978657 44576177 44674754 46934920
39874 46934920 49737940 51855091 53989816 57158150 61467209 66965223 73760541 80795637
39866H0795637N839078N733224R324226J5155971J9538183K2249375K6767870
39859A85403564L3560437L6237964K7354598P334300j4669989k9156371l3962280
39852B12102223l3095280l0076826k5178459j8831117j4000744j2816246j3104051
39845F4999500j1325802p643385m854404l415451j558705N3751j403515n167307
39837B9684682o330143l062491K12289l04676k105208j285564Q21776O10852j266197
39828A6975320j515715k27998j5872o19753K57071J695159P33449j524562p47247
39819A5009852L161657N099558K595590o82724j140843n5536K08546K70424J182230
39810B5648754J641854O38453l99153o04837j438419l016075k478871J008961
$$ plain form
39866 80795637 86634715 92367939 101692165 116848136 136386319 158635694 185403564
39859 185403564 218964001 255201965 282556563 289890863 275220874 246064503 212102223
39852 212102223 179006943 148930117 123751658 104920541 90919797 78103551 64999500
39845 64999500 53673698 46030313 41175909 37760458 36201753 36255504 34851989 29684682
39837 29684682 23354539 20292048 20504337 20199661 18094453 16808889 17630665 18241517 16975320
39828 16975320 15459605 15231607 15215735 14595982 14853053 16548212 17281661 15757099 15009852
39819 15009852 18171509 23271067 25866657 25183933 24043090 23987554 24196100 24466524 25648754
39810 25648754 27290608 27929061 27529908 26925071 25486652 22470577 19991706 21000667
39802B1000667L505536K139429j3186Q24254K479758O66103l139882l582869P594
39793B3887404K770841K018505M57933Q05241J746121R10216j476209l515136
39785B7604916l954169k719966j015640r56516l041544m440732k389610J286685
39777A0373424K218825k28218k279221j547084J79199O81555K87290j11731q21405
39768H752634j703677j547654m15807n0296q02776q34423M84421J230427L34564
39759E447413n48633j34287M22657L01407Q44123K406746K361550q58429m144025
39750F098522l428055N93454L599853L392340J561768J87690k81209r9247L87047
39741A2012163L40570p40333j784190j205651Q81602K700464K883886J654863
$$ plain form
39802 21000667 24506203 26645632 26632446 27456700 29936458 30602561 27462679 23879810 23887404
39793 23887404 26658245 28676750 29134683 29939924 31686045 32596261 31120052 27604916
39785 27604916 23650747 20930781 19915141 18958625 15917081 11476349 9086739 10373424
39777 10373424 12592249 12364031 10084810 8537726 8716925 9398480 9685770 9574039 8752634
39768 8752634 7048957 5501303 5085496 5035200 4232424 3398001 3882422 5112849 5447413
39759 5447413 4898780 4764493 5187150 5488557 6332680 8739426 11100976 10242547 6098522
39750 6098522 2670467 3263921 6863774 10256114 11817882 12005572 11724363 11625116 12012163
39741 12012163 12352733 11612400 9828210 8622559 9504161 12204625 15088511 16743374
39733A6743374L64029M86734K298704L954580L015495l55959l009117k472397
39725B1025443L30706K833019L673244K838511P84475j299993j979433j459767
39717B6746205j280032j365765Q7696K720526L292778Q62539q15172R87521L215134
39708C4451430J841398j542346k629944j575214j921388l782432l858970j916349
39700A9066185j437069l118552l282961l88123J960416Q77415j329086j425379
39692A0922846k78723l61349j168677o32263Q89293J385628P34730M78642P74743
39683A2744870K82708j042765j345722M59564K898381L549520J849060l15389
39675A9080227q97740j88356k29162j715683k930521k496889j373057o38702N93436
$$ plain form
39733 16743374 17107403 17594137 19892841 23847421 26862916 26506957 23497840 21025443
39725 21025443 21356149 24189168 27862412 30700923 31485398 30185405 28205972 26746205
39717 26746205 25466173 24100408 24188104 26908630 30201408 31063947 30248775 31236296 34451430
39708 34451430 36292828 34750482 32120538 30545324 28623936 24841504 20982534 19066185
39700 19066185 17629116 14510564 11227603 10839480 12799896 13677311 12348225 10922846
39692 10922846 10644123 10282774 9114097 8481834 9371127 10756755 11491485 11970127 12744870
39683 12744870 13027578 11984813 10639091 11098655 13997036 17546556 19395616 19080227
39675 19080227 18182487 17994131 17764969 16049286 13118765 10621876 9248819 8610117 9203553
39666I203553K685532L115816J39045k985385j919432J675805K202251j009940
39658A3107245k789870r03721N83976j060970k527560r53186O50609q29159k501466
39649B775898p76402J547509N7767k721752r82777M003986N058551N45169l032876
39640F475073j473821J105420k06337l370715l428047k53345K221096K211343
39632C280667J444121J392807J493801R95796K99379J34031N40370Q55595M58073
39623A0894640k37778P4082J587013K315873P13690j465577j404490K23028J79465
39614A2879946j798337k271728J5703J598158j11230k364431j451646J404645
39606G901080K383120J224243Q14110J684812J295959j122550k963989k417926
$$ plain form
39666 9203553 11889085 15004901 15143946 12158561 10239129 11914934 14117185 13107245
39658 13107245 10317375 9413654 9997630 8936660 6409100 5455914 6106523 5277364 2775898
39649 2775898 1999496 3547005 3604772 883020 -99757 3904229 8962780 9507949 6475073
39640 6475073 5001252 6106672 5900335 2529620 -898427 -1151772 1069324 3280667
39632 3280667 4724788 6117595 7611396 8607192 8906571 9040602 9580972 10436567 10894640
39623 10894640 10656862 10730944 12317957 14633830 15347520 13881943 12477453 12700481 12879946
39614 12879946 11081609 8809881 8825584 10423742 10312512 7948081 6496435 7901080
39606 7901080 10284200 11508443 12322553 14007365 15303324 14180774 11216785 8798859
39598H798859j042349q54823j453451j561136j351954j523655j532081m57634
39590i78224J230631K167211J829065P92295k57583r44239j055665o78114j87743
39581A917634K26815N29762K01716j317346l049080k654421N85320L924111L956568
39572D321079R01041j665379j439728P8229L74226n70050j073528p82142p23056
39563e79308p21758P68287L528321M471670J439589l213771m962897k578376P84829
39554a063414J955312J084529L9297m56752o87205m59181M34631J032828K28514
39545B108559j306578j799140r92806o02221j721215k961859k000056J473728
39537g801588M951074N359121K187428j698624k878328j071227R32135J263368
$$ plain form
39598 8798859 7756510 6901687 5448236 3887100 2535146 1011491 -520590 -978224
39590 -978224 252407 2419618 4248683 5040978 4783395 3839156 2783491 2105377 1917634
39581 1917634 2144449 2674211 2875927 1558581 -1490499 -4144920 -3559600 364511 4321079
39572 4321079 5222120 3556741 2117013 2195242 2569468 1999418 925890 143748 -579308
39563 -579308 -1301066 -532779 2995542 7467212 8906801 5693030 730133 -1848243 -1063414
39554 -1063414 891898 1976427 2015724 1558972 871767 412586 847217 1880045 2108559
39545 2108559 801981 -997159 -1989965 -2592186 -4313401 -7275260 -9275316 -7801588
39537 -7801588 -2850514 2508607 4696035 2997411 119083 -952144 -20009 1243359
39529A243359J154619J926565J891645r61200m422380l982913M70912L701881
39521A022488K245119j021511j692579o4664O58843m1656j77859L22152m09739
39512H40594k035165j874216N12068K243104J688469P82723J295334J881154Q40160
39503F174225q02442j241119p88558n57933j34775J080649J898257J164021M5872
39494F838197p922m3116j512081k918464j924410K85292N32253j022200j141088
39485i13539Q48690J946504P54756m05092m5209N0610j018658q84891J452143
39476A785314K594662J58274k295923n08288K987807K302671k239079m145807
39468F39631p09859L033039K203422j140837k178960m43786Q97426M30222m65411
$$ plain form
39529 1243359 2397978 4324543 6216188 5254988 832608 -3150305 -2679393 1022488
39521 1022488 3267607 2246096 553517 488853 1147696 1106040 928181 1250333 840594
39512 840594 -1194571 -3068787 -2556719 -313615 1374854 2157577 3452911 5334065 6174225
39503 6174225 5371783 4130664 3342106 2784173 2649398 3730047 5628304 6792325 6838197
39494 6838197 6830275 6787159 5275078 2356614 432204 717496 1249749 227549 -913539
39485 -913539 -64849 1881655 2636411 2231319 2186110 2236720 1218062 333171 1785314
39476 1785314 4379976 4538250 2242327 1734039 4721846 7024517 4785438 639631
39468 639631 -70228 2962811 5166233 4025396 1846436 1402650 2300076 2730298 2264887
39459B264887p01592n25097m5438Q36883J340338N83897p79009j258265n44937
39450A171667M59125J116280J275584O26430p76164j809009j412012l4908J106123
39441A723116J582926J502156O36589p97330j435352m96044O21465K74335p25118
39432B886743m49167Q14084J038355m3587n44749L26126J146788Q67364J72844
39423F214801k97523q41630j219779n78441N06429L06375j011859j233870P4980
39414A919483N14538r74792j967291o15734J117924Q77702k19317k10382j76424
39405B65707j729629k761249k28317L976796M734534J175341k090789j839989
39397A502405o6697L16981k91969k32228K76641K56384n3976k54808q48788j637118
$$ plain form
39459 2264887 1563295 1038198 992760 1829643 3169981 3753878 2974869 1716604 1171667
39450 1171667 1630792 2747072 4022656 4649086 3872922 2063913 651901 616993 1723116
39441 1723116 3306042 4808198 5444787 4647457 3212105 2716061 3337526 3611861 2886743
39432 2886743 2437576 3251660 4290015 4246428 3701679 4027805 5174593 6041957 6214801
39423 6214801 5917278 5075648 3855869 3277428 3783857 4090232 3078373 1844503 1919483
39414 1919483 2434021 1459229 -508062 -1123796 -5872 871830 652513 442131 265707
39405 265707 -1463922 -4225171 -4453488 -476692 4257842 5433183 3342394 1502405
39397 1502405 1435708 1752689 1460720 1228492 1505133 1761517 1707541 1452733 603945 -1033173
39387a033173j084710J039354K399860J350889l88586l75149Q61036J054477o6679
39378C757319p26208j80952L91434N5447n81968n04840L79668J234501J048040
39369D872441m25386k086692k336255r04776P54961J264358P94200L94086N95443
39360B922380J020079Q13818m49075j658733p39374K328287M164878K042137j630157
39351H814240k176536L46701J200885j365021l201439j001010K544644L411821
39343H574285K197488J772718K413572L364441O069240J0906512J3159554P912190
39335E6370000k087031q717111q213023l837392N06127L801272M844563J594592
39327D4261997m444385p933835o247329k736368j466273k132849k312257j541822
$$ plain form
39387 -1033173 -2117883 -1078529 1321331 2672220 2283634 1908485 2769521 3823998 3757319
39378 3757319 3031111 2850159 3241593 3297040 2715072 2210232 2589900 3824401 4872441
39369 4872441 4447055 2360363 24108 -880668 -125707 1138651 1932851 2326937 2922380
39360 2922380 3942459 4756277 4307202 2648469 1909095 4237382 8402260 10444397 8814240
39351 8814240 6637704 6984405 8185290 6820269 3618830 2617820 5162464 8574285
39343 8574285 10771773 12544491 14958063 18322504 24391744 35298256 48457810 56370000
39335 56370000 54282969 45565858 37352835 33515443 34021570 37822842 42667405 44261997
39327 44261997 39817612 31883777 25636448 22900080 21433807 19300958 16988701 15446879
39319A5446879p75259l44098n23257j795394k941306j555779J830486L158509
39311A2500781N65334k297993j454125J570781K427505M10874j391513j220075
39303A1111569l49359o6683q3664j33721o21585j282788j184476m65795m42324
39294F481174j546876k487904j954278k61611J102299J059119j17735j176564
39286A097624j194063m82877P6061L00136N39391N71454p3223p44141j67086J416832
39276A340108K180072J276203l8318m42619k07973j37907l13851o22725j164696
39267A868294j514084r69098P002J92274k06358K34954J287308Q51953j388692
39258C63553k613699p35778K481170L874327K682908M12069j310418j365149M35423
$$ plain form
39319 15446879 14671620 14327522 13804265 12008871 9067565 7511786 9342272 12500781
39311 12500781 13066115 10768122 9313997 10884778 13312283 13723157 12331644 11111569
39303 11111569 10762210 10695527 10611863 10478142 9856557 8573769 7389293 6923498 6481174
39294 6481174 4934298 2446394 492116 230505 1332804 2391923 2274188 1097624
39286 1097624 -96439 -579316 -503255 -203119 336272 907726 834503 90362 -76724 1340108
39276 1340108 3520180 4796383 4758065 4315446 4107473 3969566 3655715 3032990 1868294
39267 1868294 354210 -614888 -607886 -415612 -621970 -387016 900292 1752245 363553
39258 363553 -2250146 -2985924 -504754 3369573 6052481 6464550 5154132 3788983 4224406
39249D224406K199682J349606j533440k792169j088430M39902m58613j237939
39241A103005O93683K710915R61159k835875l657891q38268J698785K171958K592409
39232D599880L495978K412521r82188k933046j130244J539957J332526j095238
39224G240146k312488r50103J385064K584786J674958p43689k396062j137523
39216E345089J964902L045523L11048l224151l583085q89188J447070J504776
39208E921984N19996J37039J84018k95795j247028j730547j312700o39064n42650
39199I95253q63463n84808O61530J755985J415017N850q52629l80065N98911R70528
39189C722109M90343m05792j006997n47664Q71698J545463k23435l336487m294293
$$ plain form
39249 4224406 6424088 7773694 6240254 3448085 2359655 2799557 2340944 1103005
39241 1103005 1796688 4507603 5468762 2632887 -1025004 -1863272 -164487 2007471 4599880
39232 4599880 8095858 10508379 9526191 6593145 5462901 7002858 8335384 7240146
39224 7240146 4927658 3977555 5362619 7947405 9622363 8878674 6482612 5345089
39216 5345089 7309991 10355514 10666562 7442411 3859326 2970138 4417208 5921984
39208 5921984 6441980 6579019 6763037 6467242 5220214 3489667 2176967 1537903 995253
39199 995253 131790 -453018 208512 1964497 3379514 3385364 2532735 2152670 2751581 3722109
39189 3722109 4212452 3806660 2799663 2251999 3123697 4669160 4445725 1109238 -3185055
39180c185055j456428K336827K959867J57308k284931j553365Q34882J598781
39172e92114K11620q52287P2486J710643K040779J014067k7676m50400m25985
39163B701133J63869J232291J506865k0630j934969j797886J92902J154062l62135
39154B835502k361894k417804p25392R51712J663422J415105M47764m74636l99849
39145I33930K74879K5288j312979k008637j170149n5012K55672L26827M92756
39136b237425o6303j126106r42579N27582Q35787o88954j124572J100777K829314
39127h92479J097001j628366j220791J513191K469600P28151j104145j782953
39119h20791k177206j954304P2720K657069L223387J966859J127806Q12073m92922
$$ plain form
39180 -3185055 -4641483 -2304656 655211 812519 -1472412 -3025777 -2190895 -592114
39172 -592114 -380494 -1232781 -1160295 550348 2591127 3605194 3577518 3127118 2701133
39163 2701133 2865002 4097293 5604158 5583528 3648559 1850673 2043575 3197637 2835502
39154 2835502 473608 -1944196 -2669588 -1717876 -54454 1360651 1808415 1333779 933930
39145 933930 1208809 1234097 -78882 -2087519 -3257668 -3312680 -3057008 -2730181 -2237425
39136 -2237425 -2303728 -3429834 -4372413 -3844831 -3009044 -3697998 -4822570 -3721793 -892479
39127 -892479 204522 -1423844 -2644635 -1131444 1338156 2066307 962162 -820791
39119 -820791 -2997997 -4952301 -4879581 -2222512 1000875 2967734 4095540 4907613 4414691
39110D414691j951774j340073M62997N39138p26440k27968J830511J690745j378515
39101C313312l392364j962836M50995J295548J434511J971418J753266K04645
39093E068495j010690j050748j136392j303610J76834K673474K844321K68775
39085F530459j110263N68551J886601J68338k011659j732068n98799p87190n32609
39076B381361J857970L391848J007561k327762j673299K078916M053117L290782
39068A4060494K975543L671795K296580j779370m896651m615016k801171j818920
39060G093284j295157l26662J51778q12214k064942j846789k34017J146854J122178
39051B934313J9451p95289k42290J236616K012472J170688n33401j887469k318215
$$ plain form
39110 4414691 2462917 1122844 1585841 2124979 1398539 1170571 3001082 4691827 3313312
39101 3313312 -79052 -2041888 -1590893 -295345 1139166 3110584 4863850 5068495
39093 5068495 4057805 3007057 1870665 567055 743889 3417363 6261684 6530459
39085 6530459 5420196 5988747 7875348 8043686 6032027 4299959 3701160 2913970 2381361
39076 2381361 4239331 7631179 8638740 6310978 4637679 6716595 10769712 14060494
39068 14060494 17036037 20707832 23004412 21225042 16328391 11713375 8912204 7093284
39060 7093284 5798127 5471465 5623243 4811029 2746087 899298 665281 1812135 2934313
39051 2934313 2953764 2158475 1916185 3152801 5165273 6335961 5802560 3915091 1596876
39042A596876j464820O97434K601670J912477j195016l490758k813583p35676
39034b891396M50996J071625K182082K589152P15390k020131k687025r34523R12330
39025f11500J190035J93009j086525j561505l27373J844146K483508P05334j025209
39016A803920m32592J076982R06413o17900j496475j662581k091557j888766R6430
39007d306126K001269J237953p70704k89318K607108L840205J561995j468096
38999D414286k512890k062694j266262K29394K164028K488581M42089j487285
38991B409247q18296J316514J815775j19455k115031j771973M67089J910604Q64291
38982C958765j176928j415611L07054J210278j38853j472305l46925K157238L505596
$$ plain form
39042 1596876 132056 829490 3431160 5343637 4148621 657863 -2155720 -2891396
39034 -2891396 -2440400 -1368775 813307 3402459 4117849 2097718 -589307 -1523830 -611500
39025 -611500 578535 771544 -314981 -1876486 -2203859 -359713 2123795 2829129 1803920
39016 1803920 1371328 2448310 3354723 2736823 1240348 -422233 -2513790 -4402556 -4306126
39007 -4306126 -2304857 -1066904 -1837608 -2126926 480182 4320387 5882382 4414286
38999 4414286 1901396 -161298 -1427560 -1198166 965862 3454443 3896532 2409247
38991 2409247 1590951 2907465 4723240 4603785 2488754 716781 1183870 3094474 3958765
38982 3958765 2781837 1366226 1673280 2883558 2744705 1272400 925475 3082713 6588309
38973F588309L478701L230480K548257J213830J200759L650534N184319J765828
38965B8861017m546739p527098n367512k437877j974455k122035p13566Q68532
38957E040267R61528O71574J023285N59428j484776k741918j353280O55391O20161
38948C951660n07785k68529R49663R79115j21696m70866J0979m51665k066603
38939B004273k795052j503003L69860R50389K15206n45489n42836j29196q3718
38930b059566o51798j243794j094883j85641P10749Q30942O3469q98376p97274
38921e326172J046173L262105L218269L98157k256907k070618m08677l37593j592941
38912d068204j146562J459384L002037J605085m97292p29104J90777K98721l05902
$$ plain form
38973 6588309 10067010 13297490 15845747 17059577 18260336 21910870 27095189 28861017
38965 28861017 24314278 16787180 11419668 8981791 7007336 4885301 4171735 5040267
38957 5040267 6001795 6673369 7696654 8256082 6771306 4029388 2676108 3331499 3951660
38948 3951660 3443875 3175346 4125009 5104124 4982428 4511562 4522541 4070876 2004273
38939 2004273 -790779 -2293782 -1923922 -973533 -758327 -1303816 -1846652 -1975848 -2059566
38930 -2059566 -2711364 -3955158 -5050041 -5235682 -4524933 -3693991 -3630522 -4528898 -5326172
38921 -5326172 -4279999 -1017894 2200375 2598532 341625 -1728993 -2137670 -2475263 -4068204
38912 -4068204 -5214766 -3755382 -753345 851740 354448 -374656 -183879 114842 -191060
38903a91060l50418J95855O31083J035327J467022R83110p34315j997549j248579
38894b09524M21110Q15733m2639j58939J149699K167192J331860n78432j579280
38885C316780j060467l88639r42538k201534k429313j054317O53591J520024J784237
38876h02176J809112J046431m21861r25614L45980J442270M88624j057326q30428
38867A095012J73726o18839k282375j466890J549003K590312K42577j853187j012257
38858a582918N98150L90779m18301M0705N44493m11323j116400L34971K034105
38849D14261J152131j118685j500221o1743L41552p95446j109684J65714J007572
38840a504549L45638k96878K22119Q16376M17816j65447J13023P41806P37682
$$ plain form
38903 -191060 -541478 -345623 285460 1320787 2787809 3770919 3036604 1039055 -209524
38894 -209524 211586 1027319 984680 825741 1975440 4142632 5474492 4896060 3316780
38885 3316780 2256313 1867674 925136 -1276398 -3705711 -4760028 -4106437 -2586413 -802176
38876 -802176 1006936 2053367 1631506 705892 1051872 2494142 2982766 1925440 1095012
38867 1095012 1268738 649899 -1632476 -3099366 -1550363 1039949 1282526 -570661 -1582918
38858 -1582918 -984768 -593989 -1012290 -971585 -427092 -838415 -1954815 -1619844 414261
38849 414261 1566392 447707 -1052514 -1114257 -772705 -1568151 -2677835 -2512121 -1504549
38840 -1504549 -1158911 -1455789 -1233670 -417294 522 -164925 -51902 689904 1427586
38831A427586K98552J89865K84021j68754j121384j521948p42415L40650L34626
38822f79201o33998p99672P13025K229173J695955k35980j120319l28034L81687
38813A222636n9961o49429m30931J74327O93007J107301O16103j614062l890722
38804b831731l102455N81363L171284K442861Q56894J003665J524685L39549j124977
38795B861138m58206J223106J018759r31844j883826q52871N59251J059782P14177
38786C309466k29761j229228j033320M77845J281824K05683p84844J44075J180430
38777C322170m0047j744382n76851K424988L009335M42185j571913j006730m8559
38768D210196m98776q21639M91896K074796K217756J531626J135970M66455j151409
$$ plain form
38831 1427586 1726138 1916003 2200024 2031270 909886 -612062 -1354477 -1013827 -679201
38822 -679201 -1313199 -2112871 -1399846 829327 2525282 2289302 1168983 840949 1222636
38813 1222636 1162675 513246 82315 256642 949649 2056950 2673053 1058991 -2831731
38804 -2831731 -5934186 -5352823 -2181539 261322 1118216 2121881 3646566 3986115 2861138
38795 2861138 2402932 3626038 4644797 3712953 1829127 976256 1535507 2595289 3309466
38786 3309466 3079705 1850477 817157 1295002 2576826 2782509 1997665 2141740 3322170
38777 3322170 3282123 1537741 960890 3385878 6395213 6837398 5265485 4258755 4210196
38768 4210196 3711420 2889781 3381677 5456473 7674229 9205855 10341825 10808280 9656871
38759I656871k514316k038051j39368J316253J201408j12800j459222j802129
38751D108646j104573m11080m69382o90107l56755m7366n07065j030072o53592
38742a161346j6459j22277l37097J63912K31970j196693k140504j52022K980701
38733a749815L090436j1014k163243j189615N72348R14721P75706J187716J073477
38724B500717p2595o70911m4596J78171p37628j230794p80096j119877k360213
38715d337822j759293J332159L262184J680287n50187m24942J28001j548243l155820
38706e373676j107644K766757L689534J408498k15622R7783K72274O7962J273380
38697B879246K672641P40244l633924m835966q83996L093832K350684j080804
$$ plain form
38759 9656871 7142555 5104504 4965136 6281389 7482797 7369997 5910775 4108646
38751 4108646 3004073 2592993 2123611 1433504 1076749 1029383 522318 -507754 -1161346
38742 -1161346 -1177805 -1300082 -1637179 -1473267 -1241297 -2437990 -4578494 -4730516 -1749815
38733 -1749815 1340621 1329607 -833636 -2023251 -1450903 -536182 239524 1427240 2500717
38724 2500717 2428122 1757211 1712615 1890786 1153158 -77636 -857732 -1977609 -4337822
38715 -4337822 -6097115 -4764956 -1502772 177515 -372672 -797614 -669613 -2217856 -5373676
38706 -5373676 -6481320 -3714563 -25029 1383469 1167847 1265630 1537904 1605866 2879246
38697 2879246 5551887 6292131 2658207 -2177759 -3061755 32077 2382761 1301957
38689A301957k564991j449682L2694J149757K161871J923402k59996k183446j555929
38680a444363K87464O41054k17419k50892L01128j88174r72762k5077J792496
38671g6545J718230q096m28654Q01480P97154j086726j765882K2598J184616l45660
38661H12515j905076q58931Q07564L88760n25083O30421K019638N50030j837864
38652H1974r23499K015485J691688j945209k884257R36355L657362Q84785l094611
38643D20073k410575R49484R38286k418922l419534j64658K738899J666451j151499
38634b851995j968785o24362Q30242J535831J659488J019980j37039n75098J22715
38625i89023N42789l93406j581966j461282m00064J80850J94766P24867J817577
$$ plain form
38689 1301957 -1263034 -2712716 -2680022 -1530265 631606 2555008 2295012 111566 -1444363
38680 -1444363 -1156899 -515845 -733264 -984156 -683028 -871202 -1843964 -1869041 -76545
38671 -76545 1641685 1633589 1204935 2006415 2803569 1716843 -49039 -26441 1158175 812515
38661 812515 -1092561 -1951492 -1143928 -755168 -1280251 -649830 1369808 1919838 81974
38652 81974 -841525 1173960 2865648 920439 -1963818 -1027463 2629899 3514684 420073
38643 420073 -1990502 -1041018 -102732 -2521654 -5941188 -6105846 -3366947 -1700496 -2851995
38634 -2851995 -4820780 -5445142 -4614900 -3079069 -1419581 -399601 -536640 -1111738 -989023
38625 -989023 -446234 -839640 -2421606 -3882888 -4282952 -4102102 -3907336 -3182469 -1364892
38616a364892K014070M15262j771520k389315q03954J244978J529538q4791j513363
38607b723987j112470L02996Q08577Q4925l56237N28380J939056K386819J408528
38598C266587j85218j293195j517444j305236j035082j63877J889778L929620
38590C585933L495784J07971l326384l751579j573204N42569J428073J878542
38582B387705K038902R01267j341729k687747j861352J02285J456351J596260
38574B591942Q08131m95229j621992j755229r03772J1304K85595n1339p52924
38565a883513j407545j138718M85909K256249K381104R04045k53456Q6171R60171
38556B390417Q87655j75196r77710m63480J012365J670700J17305k393961k843421
$$ plain form
38616 -1364892 649178 1064440 -707080 -3096395 -3900349 -2655371 -1125833 -1210624 -2723987
38607 -2723987 -3836457 -3533461 -2724884 -2639959 -2996196 -2467816 -528760 1858059 3266587
38598 3266587 3081369 1788174 270730 -1034506 -2069588 -2233465 -343687 3585933
38590 3585933 7081717 7189688 3863304 111725 -1461479 -918910 509163 2387705
38582 2387705 4426607 5327874 3986145 1298398 -562954 -460669 995682 2591942
38574 2591942 3400073 2904844 1282852 -472377 -1376149 -1364845 -1079250 -1130589 -1883513
38565 -1883513 -3291058 -4429776 -3943867 -1687618 693486 1597531 1344075 1430246 2390417
38556 2390417 3278072 3102876 2125166 1661686 2674051 4344751 4462056 2068095 -775326
38547g75326o09744J130552Q4465j250222M34339L202439K365454j624440l099885
38538a42368O3927K911811J050599k801852l433513p36483J378207J211364K93555
38529b04753l19895q96772r68867J87504J475973J263285J77290q0661J00745
38520G33849o97290j471737k0091K543892K422500r54372l407562j992555Q30522
38511b012844J344251J73910O41569L076432M139222J749006k010103l698151
38503C403292k511109m62555M13200k3145n80360l70441L79386Q66500P22082
38494A836850K93058J5512j25820l08525l71185q2670J87733k75140j338170j715617
38484a883974n17581J300876J925101R52886l31715r12962r63047n95640N85432
$$ plain form
38547 -775326 -1385070 -254518 -170053 -1420275 -985936 2216503 4581957 2957517 -142368
38538 -142368 -78441 2833370 3883969 1082117 -2351396 -3087879 -1709672 -498308 -204753
38529 -204753 -524648 -1421420 -2390287 -2202783 -726810 536475 713765 633104 733849
38520 733849 36559 -1435178 -1455269 1088623 3511123 2556751 -850811 -2843366 -2012844
38511 -2012844 -668593 -494683 146886 3223318 7362540 9111546 7101443 3403292
38503 3403292 892183 429628 842828 819683 239323 -131118 248268 1114768 1836850
38494 1836850 2129908 2145420 2019600 1711075 1339890 1257220 1444953 1169813 -168357 -1883974
38484 -1883974 -2401555 -1100679 824422 1777308 1445593 532631 -430416 -1026056 -440624
38475d40624J855022J143904j903217m194126k765448R17990K759584J527941
38467a098974k12234m89639j64953k38021L0175J027092J417438M46430n51343
38458A65971m93958k92879o23746k31071J435141K102545k3182k554049j811363
38449b326591J470843K791097K82249k724792k456079M94460K567438J877140
38441A975765j18822j019501l70925J47829p90332k085475j583446N51732J562192
38432a730983N1734j648542q13255J557810K355655J029068j83060k12736k89554
38423A16137q81514n86980R55722J802211P80431n25121n30646k05272q42826
38414H2142j314009j67501J105487J35590j814320j100214K274594L731254Q13985
$$ plain form
38475 -440624 1414398 2558302 655085 -3539041 -6304489 -5386499 -2626915 -1098974
38467 -1098974 -1311208 -1800847 -1965800 -2203821 -2173646 -1146554 270884 717314 165971
38458 165971 -327987 -620866 -1244612 -1475683 -40542 2062003 2038821 -515228 -2326591
38449 -2326591 -855748 1935349 2217598 -507194 -2963273 -2468813 98625 1975765
38441 1975765 1856943 837442 466517 614346 -175986 -2261461 -3844907 -3293175 -1730983
38432 -1730983 -1679249 -3327791 -4141046 -2583236 -227581 801487 618427 405691 116137
38423 116137 -765377 -1352357 -396635 1405576 2186007 1660886 1130240 924968 82142
38414 82142 -1231867 -1399368 -293881 -158291 -1972611 -3072825 -798231 2933023 3747008
38405C747008k644682j926797J579608K665553K58118j429040J2423J508901r0980
38396C680112k764887k724120m17462P43995J06497L6210R87096O28721j462113
38387a185951k256821m7577K537133K402382K57497j225524j324734r59961l25609
38378b129165O19564P23813p28631k035925j209232Q30019J692206J321614J552430
38369F36693K345768J587952j046489k933033k146416N9478J539215K019606K236550
38360D299324J965703N87182j283626k218969j728828o43872K9648o236m02024
38351E98302o25684m33546m2006K46529M11475M27626J5381p15283q22151K92392
38341f46965J529625J157173o83705j790279o60072J614736K802130J998267N506
$$ plain form
38405 3747008 1102326 -824471 755137 3420690 3678808 2249768 2262191 3771092 3680112
38396 3680112 915225 -1808895 -2226357 -1482362 -1375865 -1339655 -352559 276162 -1185951
38387 -1185951 -3442772 -3490349 -953216 1449166 1706663 481139 -843595 -1803556 -2129165
38378 -2129165 -1509601 -785788 -1514419 -3550344 -4759576 -3929557 -2237351 -915737 636693
38369 636693 2982461 4570413 3523924 590891 -1555525 -1496047 43168 2062774 4299324
38360 4299324 6265027 6852209 5568583 3349614 1620786 976914 1006562 1000326 598302
38351 598302 -27382 -460928 -502934 -256405 155070 582696 598077 -117206 -939357 -646965
38341 -646965 882660 2039833 1356128 -434151 -1094223 520513 3322643 5320910 5326416
38332E326416j906975k747095j943064J38637J957579K061936P56833k45919q9744
38323C308604J37787p87840k035896j568509Q27456K710285J939577n23321j926245
38314B081898j263546j19338q6003p85306r18554j94038N22797M38864k97339
38305f20565p29580o5248J176269J369464j53644j759346j404252M98644J610481
38296g7777R48230p7867j07295M74953Q06711Q36514O48168J7171o69988n31015
38286B267805J57886J3577j116666j638776p93517J59424K83088M47583J252861
38277A033265J530116M50397p63057q69092n64718p66220q09198j54325O2427
38268h50405p66392r03035R94245L082056K857818R63597j40341P1263L76757
$$ plain form
38332 5326416 3419441 672346 -1270718 -1132081 825498 2887434 3644267 3398348 3308604
38323 3308604 3446391 2658551 622655 -945854 -118398 2591887 4531464 4008143 2081898
38314 2081898 818352 699014 613011 -172295 -1090849 -1284887 -762090 -323226 -620565
38305 -620565 -1350145 -1415393 -239124 1130340 976696 -782650 -2186902 -1688258 -77777
38296 -77777 870453 792586 685291 1160244 1966955 2803469 3451637 3468808 2798820 2267805
38286 2267805 2425691 2439268 1322602 -316174 -1109691 -950267 -667179 -219596 1033265
38277 1033265 2563381 3013778 2250721 1381629 816911 50691 -758507 -912832 -850405
38268 -850405 -1616797 -2519832 -1525587 1556469 4414287 5377884 5237543 5308806 5685563
38259E685563M08580L86102m12997k104580k474116J37040L447710M012994K355600
38250A1441896J925634L789154N838489O559376N973702L499210j213472n632559
38242C2181430o492466m521812l230958l307731k517233r60876j350023l408631
38234F391700l301093j72065J826964K13233j922219j383430K22969K46699l62490
38225A760268K31598Q54932q9403j091422l41450O28069q9486p73088Q02020K589070
38215D481108J298984j526650j546818J119216J865482r63732l558680k791954
38207a623044n74781m5270q22330o17932P43876J589403J415849J260557J478925
38198B805253J120860k04730j228893n85396J145939J950522J008363j66657J58654
$$ plain form
38259 5685563 6094143 6480245 6067248 3962668 1488552 1625592 5073302 9086296 11441896
38250 11441896 13367530 17156684 22995173 29554549 35528251 39027461 37813989 32181430
38242 32181430 25688964 21167152 17936194 14628463 12111230 11150354 9800331 6391700
38234 6391700 3090607 2918542 4745506 4958739 3036520 1653090 1876059 2122758 1760268
38225 1760268 1991866 2846798 2757395 1665973 1324523 1952592 1863106 1090018 1892038 4481108
38215 4481108 5780092 4253442 2706624 3825840 5691322 4727590 1168910 -1623044
38207 -1623044 -2197825 -2243095 -3065425 -3683357 -2939481 -1350078 65771 1326328 2805253
38198 2805253 3926113 3721383 2492490 1907094 3053033 5003555 6011918 5845261 6003915
38189F003915J616142K663234K933625K901434J909557r33647l961097m042180
38181I090983j203955Q89594L75815j17784J666450L300512J511140k054678k830324
38172A0627753J82468L752316N598965O406226O578557M698854L27387m369506
38164C3803020p034011p349563o198105m395270k826476k077359j384852L78658
38156B916042K314421K044908o87215k961599k358371p2678R93045J9907j327058
38147H81402j549144q56143j36056M32174J207808J991165J840696L83084j149764
38138C045222j179626j02932k8588j630368k757552j426100J099544J960244N94496
38129d25660r23812r79588K2775R77720J183514K49588j374163j894217k1605
$$ plain form
38189 6003915 7620057 10283291 13216916 16118350 18027907 17094260 13133163 9090983
38181 9090983 7887028 8776622 9152437 9034653 10701103 14001615 15512755 13458077 10627753
38172 10627753 10810221 14562537 20161502 26567728 33146285 37845139 38172526 33803020
38164 33803020 26769009 19419446 13221341 8826071 5999595 3922236 2537384 2916042
38156 2916042 5230463 7275371 6588156 3626557 1268186 1195508 2188553 2208460 881402
38147 881402 -667742 -1523885 -1659941 -1227767 -19959 1971206 3811902 4194986 3045222
38138 3045222 1865596 1762664 1734076 103708 -2653844 -4079944 -2980400 -1020156 -425660
38129 -425660 -1349472 -2329060 -2306285 -1328565 -145051 104537 -1269626 -3163843 -3185448
38120c185448K722552L501912K029447P67088R50194Q95373p28749k326058j829377
38111B796934r893P49407Q357m67771L01136J087724L87949j427504k540066j796053
38101i09780R3080J470001J615911J350957J631912K165280K072351J414674R99646
38092A1904032R17988N38790j2639K29793J290893J728524O23701r59904j343748
38083A4917430k98888R56773J143930k17690k480497l846785k761446j74516P56434
38074G994745j481609m207925l617133J31252K938678K034656p66158j872656
38066A153850l47328J743326K311525J134110o73911j722378j149631M54039J156216
38057D059818q9376j632595j099690R63750J503622m98228k251813j321843O51627
$$ plain form
38120 -3185448 -462896 3039016 5068463 5835551 6785745 7681118 6952369 4626311 2796934
38111 2796934 2787041 3536448 3544805 3077034 3378170 4465894 4853843 3426339 886273 -909780
38101 -909780 -816700 653301 2269212 3620169 5252081 7417361 9489712 10904386 11904032
38092 11904032 12822020 13360810 13348171 13577964 14868857 16597381 17221082 16261178 14917430
38083 14917430 14618542 15575315 16719245 16501555 14021058 10174273 7412827 7238311 7994745
38074 7994745 6513136 2305211 -1311922 -1180670 1758008 3792664 3026506 1153850
38066 1153850 806522 2549848 4861373 5995483 5321572 3599194 2449563 2903602 4059818
38057 4059818 3970442 2337847 1238157 2201907 3705529 3207301 955488 -366355 285272
38048B85272O68176q86862j166696L57357J333289P04827J31490N35423M32559
38039B394835r02915j553296k48031R68065j50363k210422k228757j70574J396347
38030b705111J336507Q11780N34205k9468o10550O4212J810793K506984R49444
38021D668796j450635k611219k064745o51759P82238J616875J384430K65874q49300
38012A090555j201691p45534J4793L21660l15745j295810j269233r1501N69790
38003b922716k26766q27111M65126K197897J789300p8556l95649R61389P51352
37994A714266j980016l648124j614497J454065J673516k36598p76801M70023Q16053
37985b128113l75383o27634J008793J946707K78679j869156j453886Q64540J718736
$$ plain form
38048 285272 953448 66586 -1100110 -742753 590536 1295363 1426853 1962276 2394835
38039 2394835 1491920 -61376 -309407 658658 508295 -1702127 -3930884 -4101458 -2705111
38030 -2705111 -1368604 -556824 -22619 -52087 -662637 -598425 1212368 3719352 4668796
38021 4668796 3218161 606942 -1457803 -2109562 -1327324 289551 1673981 1939855 1090555
38012 1090555 -111136 -856670 -841877 -520217 -835962 -2131772 -3401005 -3492506 -2922716
38003 -2922716 -3149482 -3976593 -3511467 -1313570 475730 397174 1525 962914 1714266
37994 1714266 -265750 -3913874 -5528371 -4074306 -2400790 -2637388 -3414189 -2944166 -2128113
37985 -2128113 -2503496 -3131130 -2122337 -175630 103049 -1766107 -3219993 -2355453 -636717
37976f36717j59140k435062k517164n91057J225935J512578N77685l67147k93198
37967c683287R86239K525381K773341J078207j244692j955733l54658J707290
37959A832088J810483j84834j931921j489622K14964O48777p70169j663932n4147
37950a588313K376135K223075o30261k314117l36061K578462K257359p97448k167165
37941A601666q5948K098623J026616j968122l141416j414550R18254J480858L4482
37932E50463j965515k714135j469633N51506J399934Q88409N42944P87532L49313
37923a079182p64589n14979J315574J595618j188786l406493j381334K457229
37915b966942L047143N64912m30030J050405J154374j477770k919230o40035K048013
$$ plain form
37976 -636717 -795857 -3230919 -5748083 -6339140 -5113205 -3600627 -3022942 -3390089 -3683287
37967 -3683287 -2697048 -171667 2601674 3679881 2435189 479456 124798 1832088
37959 1832088 3642571 3457737 1525816 36194 251158 899935 129766 -1534166 -1588313
37950 -1588313 787822 3010897 2380636 66519 -269542 2308920 4566279 3768831 1601666
37941 1601666 1515718 3614341 4640957 2672835 -468581 -1883131 -964877 515981 550463
37932 550463 -1415052 -4129187 -5598820 -5047314 -3647380 -2758971 -2216027 -1428495 -1079182
37923 -1079182 -1843771 -2358750 -1043176 552442 -636344 -4042837 -5424171 -2966942
37915 -2966942 80201 645113 215083 1265488 2419862 942092 -1977138 -2617173 -569160
37906e69160J379908r85426j106822J074767K395478J460895l01018j404019j427347
37897E17256l15302J236044J595743J93606j365586j628403j184495p44997N43972
37888a152162K748974L353290P34870k331483k030873P80966J790289l82774k638332
37879H72765k425605q52831J47384P47745J726956K207150Q41913j693356k941549
37870a369428j373297J707689L187250J435023j441488j754165Q99022K655084
37862C945690N87761k995456l728743j162751J355836J840854J343651P34171
37854A921013n68755k040190j700368L44723J102555p79499k451593j088498J660507
37845c600105K204897L36887j015876n08529K23264j04945n02730O3192P07164
$$ plain form
37906 -569160 810748 -174678 -1281500 -206733 2188745 3649640 3348622 1944603 517256
37897 517256 201954 1437998 3033741 3227347 1861761 233358 -951137 -1696134 -1152162
37888 -1152162 1596812 4950102 5684972 3353489 1322616 2103582 3893871 3511097 872765
37879 872765 -1552840 -2405671 -2258287 -1510542 216414 2423564 3265477 1572121 -1369428
37870 -1369428 -2742725 -1035036 2152214 3587237 2145749 391584 1290606 3945690
37862 3945690 4533451 1537995 -2190748 -3353499 -1997663 -156809 1186842 1921013
37854 1921013 1352258 -687932 -2388300 -2043577 -941022 -1720521 -4172114 -5260612 -3600105
37845 -3600105 -1395208 -1058321 -2074197 -2582726 -2359462 -2464407 -2967137 -2903945 -2196781
37836b196781K61560n26048j2799J704948K650096J576976m04178j408703j217972
37827D27099j100930j447739j027616P20759J979620P28632j945997k725891n53030
37818d945093J716637J262723p35622r69795J046962K286815P52743j526853j479537
37809b591020N06615J231641n07173k116738j072944J381511K171290P92146m87623
37800f92295l86025p6341n46779r17289m19506P8420o7755J56227J262447J542526
37790f6370k31315j978505r46041J900757L137096J907008M71112o7489j010989
37781C115264k487978k291951J84274K037594R75716j229534j701615o37703L1125
37772b004808K54017J164853K043891J150410q65574j361086K98155J692150R20031
$$ plain form
37836 -2196781 -1935221 -2461269 -2474068 -769120 1880976 3457952 3053774 1645071 427099
37827 427099 -673831 -2121570 -3149186 -2428427 -448807 279825 -1666172 -4392063 -4945093
37818 -4945093 -3228456 -1965733 -2701355 -3671150 -2624188 -337373 415370 -1111483 -2591020
37809 -2591020 -2084405 -852764 -1359937 -3476675 -4549619 -3168108 -996818 -204672 -692295
37800 -692295 -1078320 -1154661 -1701440 -2618729 -3038235 -2959815 -3027570 -2871343 -1608896 -66370
37790 -66370 -297685 -2276190 -3222231 -1321474 1815622 3722630 4193742 4126253 3115264
37781 3115264 627286 -1664665 -1480391 557203 1532919 303385 -1398230 -2035933 -2004808
37772 -2004808 -1750791 -585938 1457953 2608363 1742789 381703 679858 2372008 3292039
37763C292039q57882j361620k09820R58764O02035j066668k191768j125788J428256
37754e32452K736657J295441j054347j508707J4318J212711Q05385l35850j146013
37745A487143j403125q65815M95695J262488j83065k727847l169083n89603K145206
37736c548006K329557O77525o71549j212586j365975o66521J131308K523862K017361
37727A214976M24293m83930n37663n18543k58622M10187J52987j760848l040876
37718d398039j224833J915311K452835M06996l75442J212896J683474q13846k945982
37709b086630j673626O61421M58640j048371k93313K119555K375402P1229j105880
37700e21573L58317J554154M63353p20146J76657J291092j4340k369934k338086
$$ plain form
37763 3292039 2434157 1072537 862717 1821481 2423516 1356848 -834920 -1960708 -532452
37754 -532452 2204205 3499646 2445299 936592 950910 2163621 2969006 2633156 1487143
37745 1487143 84018 -781797 -286102 976386 793321 -1934526 -5103609 -5693212 -3548006
37736 -3548006 -1218449 -540924 -1212473 -2425059 -3791034 -4457555 -3326247 -802385 1214976
37727 1214976 1639269 1155339 617676 99133 -159489 250698 403685 -1357163 -4398039
37718 -4398039 -5622872 -3707561 -1254726 -847730 -1223172 -10276 1673198 859352 -2086630
37709 -2086630 -3760256 -3098835 -2640195 -3688566 -3981879 -1862324 513078 584307 -521573
37700 -521573 -163256 1390898 1854251 1134105 1310762 2601854 2587514 217580 -2120506
37691b120506J62058J749355O47560j106717j062210M09180J363657J126589N21454
37682A690420J61564j52899o04495r91092j253726j548009j575937o47402J073943
37673c847633K107899J371420o6013j71121J136383J684639J56246j890579k084496
37664a603255k83562J557991J805160M25829j381479j916270k55462K225299K774693
37655C348944Q20047r42808n10768L52328o40986k020101r81423J344257J294676
37646B064166j187862k373076r41596L26467j2940K10901J911241K408512M52732
37637B858545j024460k33726n3250k461247l924037j138622K569864K231236n94799
37628a770496q58169J253246J451517l89985m25604J273776O07577k251149k155804
$$ plain form
37691 -2120506 -1958448 -209093 438467 -668250 -1730460 -1321280 42377 1168966 1690420
37682 1690420 1851984 1699085 1094590 103498 -1150228 -2698237 -4274174 -4921576 -3847633
37673 -3847633 -1739734 -368314 -434327 -605448 530935 2215574 2371820 481241 -1603255
37664 -1603255 -1886817 -328826 1476334 1902163 520684 -1395586 -1651048 574251 3348944
37655 3348944 4168991 3226183 2715415 3067743 2426757 406656 -574767 769490 2064166
37646 2064166 876304 -1496772 -2438368 -2111901 -2124841 -1913940 -2699 2405813 2858545
37637 2858545 1834085 1600359 1547109 -914138 -4838175 -5976797 -3406933 -1175697 -1770496
37628 -1770496 -2628665 -1375419 76098 -313887 -739491 534285 1141862 -1109287 -3265091
37619c265091J698775L398748K17147k381169J22272L711792K744296j028525
37611E218245k429111j530969j823476k795966j128994K365529L341815Q87825
37603B104898j547871j915693j373657o14175Q87588K056597J198880k54100N22433
37594A064900K431120J772952j034631j548046J017972J972559j013786l838191
37586H24849k756199k13248J3026p71260P02000L269273L142382L33808j511399
37577C033232r44709j50142o71013j353087r58325K3862O79294O92678m8222j114480
37567h10912j159753L09611J505205P99623l44639M25390K028533J215266j907835
37558B060489l305804r12310K241137K459800K36170j366434j118865k31970J08861
$$ plain form
37619 -3265091 -1566316 1832432 2049579 -331590 -209318 3502474 6246770 5218245
37611 5218245 2789134 1258165 -565311 -3361277 -4490271 -2124742 1217073 2104898
37603 2104898 557027 -1358666 -2732323 -3346498 -2458910 -402313 796567 542467 1064900
37594 1064900 3496020 5268972 4234341 2686295 3704267 5676826 4663040 824849
37586 824849 -1931350 -2144598 -2131572 -2902832 -2200832 1068441 4210823 4544631 3033232
37577 3033232 2088523 1938381 1267368 -85719 -1044044 -1020182 -340888 351790 303568 -810912
37567 -810912 -1970665 -1661054 -155849 643774 299135 724525 2753058 3968324 2060489
37558 2060489 -1245315 -2157625 83512 2543312 2779482 1413048 294183 62213 171074
37549A71074j40490m76898k37132Q49888J717240Q56249j051122j255155R83181
37540A416835K537216P59746k192246k279432L75512J770914J20005j805263j224265
37531e20978P65240J406578J94712j210244j521701o87799P18640J641861J043884
37522A830193n64701j142125J37903J368025O57173q17876n88059J072974J382377
37513C335884o89035k806753k625851p78755N56583N82755J57051J38134O01420
37504a528567J146028J231302O90945K39785O37086J131727J13372k102553k853506
37495a294381p69390J768820J724239k35866q69331P38123K092386J348182j66488
37486D336294n19613r5735l22930r97042q26253R8518L52914k88922j46196J728092
$$ plain form
37549 171074 30584 -446314 -683446 166442 1883682 2739931 1688809 433654 1416835
37540 1416835 3954051 4713797 2521551 242119 617631 2388545 2508550 703287 -520978
37531 -520978 244262 1650840 1845552 635308 -886393 -1574192 -855552 786309 1830193
37522 1830193 1265492 123367 261270 1629295 2286468 1468592 880533 1953507 3335884
37513 3335884 2646849 -159904 -2785755 -3564510 -3007927 -2425172 -2268121 -2129987 -1528567
37504 -1528567 -382539 848763 1539708 1779493 2416579 3548306 3661678 1559125 -1294381
37495 -1294381 -2063771 -294951 1429288 1193422 324091 1062214 3154600 4502782 4336294
37486 4336294 3816681 3720946 3398016 2400974 1574721 1673239 2026153 1737231 1591035 3319127
37476C319127L394036K034165j954348m493429k613892J346015K437675j60365
37468C308984j949625J06574K676633R92620l508140m902749j551596J724491
37460c102808J209144p01857m26284J050572R28028m9088P14538K503348K223901
37451D349494l41158k258096k129310j328686o39322N96155J717331R46852r59484
37442d6224j034207Q84421J360106p94199j927434N47211L337491K057088j848300
37433B535953l221270p85750J660608J301501l89893r92174n13562k04061l68764
37424i77412p12209j205723j442517m48660J706985L100950J996673p12181k170940
37415h65034q36053J573492J994076j75633k104743j179188J244409J560508q22340
$$ plain form
37476 3319127 6713163 8747328 6792980 2299551 -314341 1031674 3469349 3308984
37468 3308984 1359359 1465933 4142566 5135186 1627046 -3275703 -4827299 -3102808
37460 -3102808 -1893664 -2595521 -3021805 -1971233 -1043205 -1092293 -377755 2125593 4349494
37451 4349494 4008336 1750240 -379070 -1707756 -2347078 -1750923 -33592 913260 -46224
37442 -46224 -1080431 -196010 1164096 369897 -1557537 -1010326 2327165 4384253 2535953
37433 2535953 -685317 -1471067 189541 1491042 1101149 108975 -404587 -608648 -977412
37424 -977412 -1689621 -2895344 -4337861 -4786521 -3079536 21414 2018087 1305906 -865034
37415 -865034 -1701087 -127595 1866481 1690848 -413895 -1593083 -348674 1211834 389494
37406C89494k492274j174287Q66012N88582r97260p87652J142650J789635K94613
37397c80487q12839Q0651J355115J225266L36874j48567o32741j449306j196119
$$ plain form
37406 389494 -2102780 -3277067 -2411055 -1822473 -2819733 -3607385 -2464735 -675100 -380487
37397 -380487 -1193326 -1112675 242440 1467706 1804580 1656013 1023272 -426034 -1622153
$$ [...]
##END NTUPLES=NMR SPECTRUM
##END=
