##TITLE=31Pdec_SR151_oil
 , 24 sc
 16.11.2022
##JCAMPDX= 6.0         $$ Bruker NMR JCAMP-DX V2.0
##DATA TYPE= NMR SPECTRUM
##DATA CLASS= NTUPLES
##ORIGIN= UXNMR, Bruker Analytische Messtechnik GmbH
##OWNER= root
$$ XWIN-NMR		Version 3.5
$$ Wed Nov 16 15:31:51 2022 Russian Standard Time (UT+4h)  she@DPX200
##.OBSERVE FREQUENCY= 81.013821
##.OBSERVE NUCLEUS= ^31P
##.ACQUISITION MODE= SIMULTANEOUS
##.ACQUISITION SCHEME= undefined
##.AVERAGES= 24
##.DIGITISER RES= 16
##SPECTROMETER/DATA SYSTEM= spect
##.PULSE SEQUENCE= zgpg30
##.SOLVENT NAME= CDCl3
##.SHIFT REFERENCE= (INTERNAL, CDCl3, 0, 248.564)
##AUDIT TRAIL= $$ (NUMBER, WHEN, WHO, WHERE, WHAT)
$$ ##TITLE= Audit trail, XWIN-NMR		Version 3.5
$$ ##JCAMPDX= 5.01
$$ ##ORIGIN= Bruker BioSpin GmbH
$$ ##OWNER= she
$$ F:/spectra/data/she/nmr/P31/1/pdata/1/auditp.txt
$$ ##AUDIT TRAIL=  $$ (NUMBER, WHEN, WHO, WHERE, WHAT)
(   1,<2022-11-16 15:30:28.46 +0400>,<she>,<DPX200>,
      <created by zg, POWCHK disabled, PULCHK disabled
       configuration hash MD5:
       00 E9 B6 7A A2 85 ED C7 34 08 36 98 17 FE 4E 26
       data hash MD5: 32K
       E7 D4 28 32 ED D4 33 30 A8 43 AB BE DB 39 12 78>)
(   2,<2022-11-16 15:30:56.23 +0400>,<she>,<DPX200>,
      <Start of raw data processing
       efp BC_mod = 2 LB = 1 FT_mod = 6 PKNL = 1 PHC0 = -10302.42 PHC1 = 176.856 SI = 64K 
       data hash MD5: 64K
       5D C2 C4 26 F9 73 93 6D 94 BE 9F 52 16 D6 4E 22>)
(   3,<2022-11-16 15:31:09.53 +0400>,<she>,<DPX200>,
      <pk PHC0 = 9.970465 PHC1 = 0 
       data hash MD5: 64K
       BD D9 4A C0 55 CD B0 00 28 F5 94 4F 4E 3B F7 65>)
(   4,<2022-11-16 15:31:12.84 +0400>,<she>,<DPX200>,
      <abs ABSG = 5 
       data hash MD5: 64K
       73 CF 8E 37 0B 6C 60 4A 4A D2 1A 0B CA 12 E6 24>)
$$ ##END=
$$ 
$$ hash MD5
$$ F8 97 C9 FD C3 0E 58 E4 32 03 43 46 87 61 78 46
##$RELAX= 
##$RELAX= 
##$RELAX= 
##$RELAX= 
##$RELAX= 
##$RELAX= 
##$RELAX= 
##$RELAX= 
##$RELAX= 
$$ Bruker specific parameters
$$ --------------------------
##$DU= <F:/spectra>
##$EXPNO= 1
##$NAME= <P31>
##$PROCNO= 1
##$TYPE= <nmr>
##$USER= <she>
##$AMP= (0..31)
100 100 100 100 100 100 100 100 100 100 100 100 100 100 100 100 100 100 
100 100 100 100 100 100 100 100 100 100 100 100 100 100 
##$AQSEQ= 0
##$AQ_mod= 1
##$AUNM= <au_zg>
##$AUTOPOS= <>
##$BF1= 81.014009
##$BF2= 200.13
##$BF3= 200.13
##$BF4= 200.13
##$BF5= 200.13
##$BF6= 200.13
##$BF7= 200.13
##$BF8= 200.13
##$BYTORDA= 1
##$CFDGTYP= 0
##$CFRGTYP= 5
##$CHEMSTR= <none>
##$CNST= (0..31)
1 1 145 1 1 1 1 1 1 1 1 1 1 1 1 1 1 1 1 1 1 1 1 1 1 1 1 1 1 1 1 1 
##$CPDPRG= <waltz16>
##$CPDPRG1= <>
##$CPDPRG2= <waltz16>
##$CPDPRG3= <>
##$CPDPRG4= <mlev>
##$CPDPRG5= <mlev>
##$CPDPRG6= <mlev>
##$CPDPRG7= <mlev>
##$CPDPRG8= <mlev>
##$CPDPRGB= <>
##$CPDPRGT= <>
##$D= (0..31)
0 1 0 0 0 0 0 0 0 0 0 0.03 2e-05 3e-06 0 0 0 0 0 0 0 0 0 0 0 0 0 0 0 0 
0 0 
##$DATE= 1668598228
##$DBL= (0..7)
120 120 120 11 120 120 24 19 
##$DBP= (0..7)
150 150 150 150 150 150 150 150 
##$DBP07= 0
##$DBPNAM0= <>
##$DBPNAM1= <>
##$DBPNAM2= <>
$$ [...]
##$SUBNAM3= <"">
##$SUBNAM4= <"">
##$SUBNAM5= <"">
##$SUBNAM6= <"">
##$SUBNAM7= <"">
##$SUBNAM8= <"">
##$SUBNAM9= <"">
##$SW= 501.771253377433
##$SWIBOX= (0..15)
0 1 3 0 0 0 0 0 0 0 0 0 0 0 0 0 
##$SW_h= 40650.406504065
##$TD= 32768
##$TD0= 1
##$TE= 0
##$TE2= 300
##$TE3= 300
##$TEG= 300
##$TL= (0..7)
0 120 53 12 22 120 120 120 
##$TP= (0..7)
150 150 150 150 150 150 150 150 
##$TP07= 0
##$TPNAME0= <>
##$TPNAME1= <>
##$TPNAME2= <>
##$TPNAME3= <>
##$TPNAME4= <>
##$TPNAME5= <>
##$TPNAME6= <>
##$TPNAME7= <>
##$TPOAL= (0..7)
0.5 0.5 0.5 0.5 0.5 0.5 0.5 0.5 
##$TPOFFS= (0..7)
0 0 0 0 0 0 0 0 
##$TUNHIN= 0
##$TUNHOUT= 0
##$TUNXOUT= 0
##$USERA1= <user>
##$USERA2= <user>
##$USERA3= <user>
##$USERA4= <user>
##$USERA5= <user>
##$V9= 5
##$VALIST= <valist>
##$VCLIST= <CCCCCCCCCCCCCCC>
##$VD= 0
##$VDLIST= <DDDDDDDDDDDDDDD>
##$VPLIST= <PPPPPPPPPPPPPPP>
##$VTLIST= <TTTTTTTTTTTTTTT>
##$WBST= 1024
##$WBSW= 4
##$XGAIN= (0..3)
0 0 0 0 
##$XL= 0
##$YL= 0
##$YMAX_a= 9926
##$YMIN_a= -11993
##$ZGOPTNS= <>
##$ZL1= 120
##$ZL2= 120
##$ZL3= 120
##$ZL4= 120
##$ABSF1= 248.5645
##$ABSF2= -253.2056
##$ABSG= 5
##$ABSL= 3
##$ALPHA= 0
##$AQORDER= 0
##$ASSFAC= 0
##$ASSFACI= 0
##$ASSFACX= 0
##$ASSWID= 0
##$AUNMP= <proc_1d>
##$AZFE= 0.1
##$AZFW= 0.5
##$BCFW= 0
##$BC_mod= 2
##$BYTORDP= 0
##$COROFFS= 0
##$CY= -3
##$DATMOD= 1
##$DC= 0
##$DFILT= <>
##$DTYPP= 0
##$F1P= 0
##$F2P= 0
##$FCOR= 1
##$FTSIZE= 65536
##$FT_mod= 6
##$GAMMA= 0
##$GB= 0
##$INTBC= 1
##$INTSCL= 6.047779e-11
##$ISEN= 30
##$LB= 1
##$LEV0= 0
##$LPBIN= 0
##$MAXI= 10000
##$MC2= 0
##$MEAN= 0
##$ME_mod= 0
##$MI= 50
##$NCOEF= 0
##$NC_proc= -6
##$NLEV= 6
##$NOISF1= 182.463
##$NOISF2= 159.3651
##$NSP= 0
##$NTH_PI= 0
##$NZP= 0
##$OFFSET= 248.5645
##$PC= 4
##$PHC0= -10292.45
##$PHC1= 176.856
##$PH_mod= 1
##$PKNL= yes
##$PPARMOD= 0
##$PSCAL= 0
##$PSIGN= 0
##$REVERSE= no
##$SF= 81.0140089999694
##$SI= 65536
##$SIGF1= 159.3651
##$SIGF2= -187.1042
##$SINO= 113.3802
##$SIOLD= 16384
##$SREGLST= <1H.CDCl3>
##$SSB= 0
##$STSI= 65536
##$STSR= 0
##$SW_p= 40650.406504065
##$SYMM= 0
##$S_DEV= 0
##$TDeff= 32768
##$TDoff= 0
##$TI= <>
##$TILT= no
##$TM1= 0
##$TM2= 0
##$TOPLEV= 0
##$USERP1= <user>
##$USERP2= <user>
##$USERP3= <user>
##$USERP4= <user>
##$USERP5= <user>
##$WDW= 1
##$XDIM= 65536
##$YMAX_p= 482546550
##$YMIN_p= -58517064
$$ End of Bruker specific parameters
$$ ---------------------------------
##NTUPLES= NMR SPECTRUM
##VAR_NAME=  FREQUENCY,     SPECTRUM/REAL,   SPECTRUM/IMAG
##SYMBOL=    X,             R,               I
##VAR_TYPE=  INDEPENDENT,   DEPENDENT,       DEPENDENT
##VAR_FORM=  AFFN,          ASDF,            ASDF
##VAR_DIM=   65536,         65536,           65536
##UNITS=     HZ,            ARBITRARY UNITS, ARBITRARY UNITS
##FACTOR=    0.620285442955139, 1,           1
##FIRST=     20137.2065510682, 0,            0
##LAST=      -20513.1999529968, 0,           0
##MIN=       -20513.1999529968, -58517064,   0
##MAX=       20137.2065510682, 482546550,    0
$$ Real data points
##PAGE= N=1
##DATA TABLE= (X++(R..R)), XYDATA
$$ [...]
42266c52186J002742N86363q7168p14595r63844p23278l07109R529L13782N52372
$$ -352186 650556 1236919 1149751 435156 -528688 -1251966 -1559075 -1549546 -1235764 -683392
42256f83392L07050l98458p21161j11495P68266R46877M47793k058o8749O3824
$$ -683392 -376342 -774800 -1495961 -1607456 -839190 107687 555480 553422 484673 548497
42246E48497K02743J64976k40867p41279o88576p6350L02812J91140L40275R77120
$$ 548497 751240 916216 675349 -65930 -754506 -830856 -528044 -336904 3371 980491
42236I80491J008408j75631j260380p87893N29836Q73028L9803n70833l12415
$$ 980491 1988899 1813268 552888 -235005 294831 1167859 1207662 636829 324414
42227C24414P2920O6922L1085J35702K0490k82747k84333m4342j40699n28733
$$ 324414 397334 464256 495341 631043 651533 368786 84453 40111 -100588 -629321
42217f29321n13122M9178N57085P16066P35745N13515k12739q92559o20740L04052
$$ -629321 -1142443 -1093265 -536180 179886 915631 1429146 1216407 323848 -296892 7160
42207G160N78841j24397p10280n11591j90977k72420j66913N47334J102286P71617
$$ 7160 586001 461604 -248676 -760267 -951244 -1223664 -1390577 -843243 259043 1030660
42197A030660J44191J41731N34134M69993q8226m76186m96018n28168o68223n64700
$$ 1030660 1174851 1316582 1850716 2320709 2232483 1756297 1260279 732111 63888 -500812
42187e00812p9907M76390P35309M77167l74867j494863k024985j263346L97908
$$ -500812 -580719 -104329 630980 1108147 733280 -761583 -2786568 -4049914 -3652006
42178c652006J589691J284724o4822r24107l68599P71017Q76978l22326j277775
$$ -3652006 -2062315 -777591 -842413 -1766520 -2135119 -1364102 -487124 -809450 -2087225
42169b087225o82435P37864J315901P32689P8467n6803k00155o19465o76511k6826
$$ -2087225 -2769660 -2031796 -715895 16794 95261 38458 -161697 -781162 -1457673 -1484499
42159a484499O21735N61935O8423k29040k13872j6310L75809O90694K95569p99991
$$ -1484499 -862764 -300829 -232406 -461446 -675318 -691628 -315819 374875 670444 -129547
42149a29547j508304r57875K76390R55549P82298M77505N14888N59857K06476
$$ -129547 -1637851 -2595726 -2319336 -1363787 -581489 -103984 410904 970761 1177237
42140A177237l08860l88924J20989O22129L83650n40291j304221j316407q38080
$$ 1177237 868377 479453 600442 1222571 1606221 1065930 -238291 -1554698 -2392778
42131b392778k54026N43145J393943J358295J27446p94768N2935J538990J265758
$$ -2392778 -2646804 -2103659 -709716 648579 776025 -18743 34192 1573182 2838940
42122B838940o62910j571348l59344Q25184J84266r31309o16504L43166J69642
$$ 2838940 2176030 604682 245338 1070522 1254788 323479 -293025 50141 219783
42113B19783o02638k31585Q54484O59356p87727j251459J01083J438665J184743
$$ 219783 -382855 -614440 240044 899400 111673 -1139786 -1038703 399962 1584705
42104A584705J2735q06404j078068q49606K29398J609993J576543l60388k130784
$$ 1584705 1597440 791036 -287032 -1136638 -907240 702753 2279296 1918908 -211876
42095b11876j646777L15260J301275N58957l65432j57304O46451Q27546J93826
$$ -211876 -1858653 -1543393 -242118 316839 -48593 -205897 440554 1268100 1461926
42086A461926m07752k73625L82745P46119L57592l55935p10411p47118j002390
$$ 1461926 1054174 780549 1163294 1909413 2267005 1911070 1200659 453541 -548849
42077e48849j309432p47623P84946J874328J324694o1675n11530K53489P66243
$$ -548849 -1858281 -2605904 -1820958 53370 1378064 1316389 804859 1058348 1824591
42068A824591O5705r61155r57634M0417Q21954O21040j69781p43605p48320l56076
$$ 1824591 1890296 929141 -28493 11924 833878 1454918 1285137 541532 -206788 -562864
42058e62864J01566L55097K62527j09670m60283m21801J37484R13481J297146
$$ -562864 -461298 -106201 156326 46656 -413627 -835428 -697944 215537 1512683
42049A512683Q51509k11363j079895j050903k71998L42552Q3825p11176r75326
$$ 1512683 2364192 2152829 1072934 22031 -249967 92585 176410 -534766 -1510092
42040a510092j26181J193367J747782J031274k13060q42079n31822J6099N0923
$$ -1510092 -1636273 -442906 1304876 2336150 2123090 1281011 749189 765288 816211
42031H16211k96229k75852L86733J025969Q62503N6353m38738q3983N35317M49214
$$ 816211 519982 244130 630863 1656832 2519335 2575688 2136950 2052967 2588284 3037498
42021C037498m25887j127498q75765j41325n9217q37814j370875p78811K68825
$$ 3037498 2611611 1484113 608348 467023 407806 -430008 -1800883 -2579694 -2310869
42012b310869N37071J31842K73848J148360J355751J22210j206819r95041K84900
$$ -2310869 -1773798 -1641956 -1368108 -219748 1136003 1258213 51394 -943647 -658747
42003f58747Q51678K49343l20252r6861L11863K65737L8727N9837K32292L41801
$$ -658747 192931 442274 122022 25161 337024 602761 641488 701325 933617 1275418
41993A275418L15617m1949p07379r17043r0318Q54656N02508p63724j127292j78336
$$ 1275418 1591035 1549086 841707 -75336 -165654 689002 1191510 427786 -699506 -877842
41983h77842N00208N6904l88228p4899q416p34841q35369N79295J785745J020356
$$ -877842 -377634 -320730 -708958 -783857 -792273 -1527114 -2362483 -1783188 2557 1022913
41973A022913n01832o07403J59293k79524j574368j311521Q33339K328199J598537
$$ 1022913 521081 -86322 72971 -206553 -1780921 -3092442 -2259103 69096 1667633
41964A667633l0977q89025j083861j194821r41014k22804K06864P0030R1362M90589
$$ 1667633 1636656 747631 -336230 -1531051 -2472065 -2694869 -2488005 -2417975 -2326613 -1836024
41954a836024N07936P0702J85377R18960R02205j63385n29862O97695J676521
$$ -1836024 -1328088 -1257386 -1072009 -153049 749156 585771 55909 753604 2430125
41945B430125O52432j086983j278971k99349j87772r79979p84146P00870J453286
$$ 2430125 3082557 1995574 716603 417254 229482 -750497 -1534643 -833773 619513
41936F19513L78594j025047j120567l56228N8169J54105N70537J029001Q38424
$$ 619513 998107 -26940 -1147507 -1503735 -1445566 -1291461 -720924 308077 1146501
41927A146501K51721J5686k2447n82915j389707j246421Q3969J223395R82572
$$ 1146501 1398222 1413908 1391461 808546 -581161 -1827582 -1743613 -520218 462354
41918D62354l6874l97640K09822Q16537O48955j23923r73679j477463j215826
$$ 462354 425480 27840 237662 1054199 1703154 1579231 605552 -871911 -2087737
41909b087737r1259J117711J358125O37653o3496l08654n64780q41315l40794
$$ -2087737 -2178996 -1061285 296840 934493 870997 562343 -2437 -843752 -1184546
41900a184546R17370J508312N91663p42870j179741r66026p73205j73418J104162
$$ -1184546 -267176 1241136 1832799 1089929 -89812 -1055838 -1829043 -2002461 -898299
41891h98299J711134N27022j071406j047263N6588K21888m15531L1461J447133
$$ -898299 812835 1339857 268451 -778812 -722224 -500336 -915867 -884406 562727
41882E62727J573468l2789j077036l83734L64407o9313l69317N29976J226906
$$ 562727 2136195 2103406 1026370 642636 1007043 937730 568413 1098389 2325295
41873B325295L83580q33942q87101l87252m31783l82009M88719R54130j52714
$$ 2325295 2708875 1874933 987832 600580 168797 -213212 275507 1229637 1076923
41864A076923j453318j021028M81506J117317Q55557Q73314Q52722k34070j509049
$$ 1076923 -376395 -1397423 -915917 201400 1056957 1930271 2782993 2548923 1039874
41855A039874j221724J43687N55217j72016m09901J40253J66130m45016l52179
$$ 1039874 -181850 -38163 517054 345038 -64863 75390 241520 -203496 -555675
41846e55675M72378M84988n02687q06902J36549Q39730N21661K56846N19076J39725
$$ -555675 -83297 401691 -100996 -907898 -771349 68381 590042 846888 1365964 1505689
41836A505689j153933j624874l72623R24426O87272j51721j11842L00305q4271
$$ 1505689 351756 -1273118 -1645741 -721315 -34043 -185764 -297606 2699 -81572
41827h1572p63036n46987K62030N51874L32055K53868P3696o46575j066720j57692
$$ -81572 -844608 -1391595 -1129565 -577691 -245636 8232 81928 -564647 -1631367 -1789059
41817a789059J227964J233720k24467j272230p52418M14606Q25702L09575l60613
$$ -1789059 -561095 672625 448158 -824072 -1576490 -1161884 -336182 -26607 -387220
41808c87220n45146j19205N99287J012977P45371Q3453l75492m09689j84767J62763
$$ -387220 -932366 -1051571 -452284 560693 1306064 1389517 1014025 604336 419569 582332
41798E82332N16695O04944L05588p9326k66426m22552p13269p72684k11559N81031
$$ 582332 1099027 1703971 2009559 1930233 1663807 1241255 527986 -244698 -456257 124774
41788A24774P64914J15665p10504r43518l97852M79941R67411O38516j46897n37758
$$ 124774 889688 1005353 294849 -648669 -1046521 -566580 400831 1039347 892450 354692
41778C54692k15930J96668O7499l08550k05040L85198P17043L65129k31638m47923
$$ 354692 138762 335430 402929 94379 -110661 274537 991580 1356709 1125071 677148
41768F77148k94814k82484o20337q63976m77448M20579J128125J145757N85126
$$ 677148 382334 99850 -520487 -1384463 -1861911 -1441332 -313207 832550 1417676
41759A417676j95698q79091j009902k33187R08723J176454K64202n35542j51804
$$ 1417676 1221978 342887 -667015 -900202 8521 1184975 1449177 913635 761831
41750G61831N92344L25149n93916p41641j26242j13043q83730r97539O8303Q95331
$$ 761831 1354175 1679324 1085408 343767 217525 104482 -779248 -1776787 -1708484 -813153
41740h13153M72911j90573Q5229P23328O23919Q3611N8694M46377M84833J57977
$$ -813153 -340242 -530815 -445586 277742 901661 985272 1043966 1490343 1975176 2133153
41730B133153p0077l06311q04478j049359m77442L29741L45564l29380o71654
$$ 2133153 2063076 1756765 952287 -97072 -574514 -244773 100791 -228589 -900243
41721i00243k65094L45991O41612O20991M72958L89283M51655K80579o33215j803769
$$ -900243 -1165337 -819346 -177734 443257 916215 1305498 1757153 2037732 1404517 -399252
41711c99252j851264m31227R47262R84951M26186O20285J281691J218302M68704
$$ -399252 -2250516 -2681743 -1734481 -749530 -323344 296941 1578632 2796934 3265638
41702C265638j3305k27042q69856j585230j331953l70087l9195n10476n69266
$$ 3265638 3252333 3025291 2155435 570205 -761748 -1131835 -1171030 -1681506 -2250772
41693b250772J66299O22540K72974K7328M95065R19254N95941J1134k00759k37958
$$ -2250772 -2084473 -1461933 -1188959 -1161631 -666566 252688 848629 859763 659004 421046
41683D21046l52388k20099J97615K31497l54965q08003o10877k38969o5857L49826
$$ 421046 68658 -151441 46174 277671 -77294 -885297 -1496174 -1735143 -1801000 -1451174
41673a451174J128702J362682M78769o63116r74184n60383p6071L94773Q56891
$$ -1451174 -322472 1040210 1518979 855863 -118321 -678704 -754775 -360002 496889
41664D96889P62976m9197o23755k07547M93479M94473J06570Q2054P6676n29718
$$ 496889 1259865 1210668 586913 379366 872845 1367318 1473888 1555942 1632618 1102900
41654A102900j033637l54903R07347J153912K53374m51827m57157n33066q10339
$$ 1102900 69263 -285640 621707 1775619 2028993 1577166 1120009 586943 -223396
41645b23396m33162M97723O16328l66643q53531J42664J336738J156354l7648
$$ -223396 -656558 -158835 457493 90850 -762681 -620017 716721 1873075 1835427
41636A835427r39105j213938j126459m58298P25273J255996L91056o69025m04940
$$ 1835427 896322 -317616 -1444075 -1902373 -1177100 78896 469952 -199073 -604013
41627f04013N98682N82413n82804j357559j014832l35134R2119M85770P37751
$$ -604013 -5331 577082 -5722 -1363281 -2378113 -2713247 -2621128 -2135358 -1397607
41618a397607L95139p1355L08987J126247R22002l26720r87938m87307j59357
$$ -1397607 -1002468 -1073823 -764836 361411 1283413 956693 -31245 -518552 -677909
41609f77909o64285p53975K51313R15987J62096o80333j47350P78609M64892m88903
$$ -677909 -1342194 -2096169 -1844856 -928869 -766773 -1447106 -1594456 -815847 -350955 -839858
41599h39858m66668K89489M43071J89238N61565R44455M1053j240499q34946P71153
$$ -839858 -1306526 -1017037 -573966 -384728 176837 1121292 1162345 -78154 -913100 -141947
41589a41947R98261m96762j200473q6720P33132p9539p46719K09415J096651K2284
$$ -141947 856314 359552 -840921 -927641 -194509 -274048 -1020767 -811352 285299 307583
41579C07583j590622j222402O57680J539172Q18382P5432M3833q9693n45479m63239
$$ 307583 -1283039 -2505441 -1847761 -308589 509793 585225 629058 539365 -6114 -469353
41569d69353K64224N97594Q8919n20346o22923l28619K90514J171505J492114
$$ -469353 -205129 392465 481384 -38962 -661885 -990504 -699990 471515 1963629
41560A963629L83940j453223k229731j368600m9567P09824J119727J431700J141276
$$ 1963629 2347569 894346 -1335385 -2703985 -2753552 -2043728 -924001 507699 1648975
41551A648975Q6862q09043p47779j89883j2300j97001j47594J62219J73452k90158
$$ 1648975 1735837 926794 179015 -10868 -23168 -220169 -367763 -205544 -32092 -322250
41541c22250p02302n50731M5182N92757Q57900R68669R26784M23115n29350j126182
$$ -322250 -1024552 -1575283 -1530101 -937344 -79444 889225 1816009 2239124 1709774 583592
41531E83592o17085M69536P80357m4285q93457q29824k54325O1251J13042J35619
$$ 583592 -33493 436043 1216400 1172115 278658 -551166 -805491 -744240 -631198 -495579
41521d95579j18618o94865q69548k14859N39919O56379N47787P32761N98108m00195
$$ -495579 -614197 -1309062 -2178610 -2393469 -1853550 -1197171 -649384 83377 681485 281290
41511B81290j174129l79757J181808J411755j2359j249475j093631l92540k58891
$$ 281290 -892839 -1272596 -90788 1320967 1308608 59133 -1034498 -1427038 -1685929
41502a685929m55462k68588K19507N10482N39249N15757M36653J59643l29643
$$ -1685929 -2141391 -2409979 -2190472 -1679990 -1140741 -624984 -188331 -28688 -358331
41493c58331p98459p41101J32739J070773P46839p77336j596896n49802Q76405
$$ -358331 -1156790 -1897891 -1765152 -694379 52460 -724876 -2321772 -2871574 -1995169
41484a995169P53082k87424k94485O38936P45527j27833l34809M17334N19677
$$ -1995169 -1242087 -1529511 -1823996 -1185060 -439533 -567366 -902175 -484841 34836
41475C4836m40293p69553K57167J009596L79724l70122o3550L40117j93328p12767
$$ 34836 -405457 -1175010 -917843 91753 471477 101355 37805 377922 184594 -528173
41465e28173j18459P51330P76119O14776J091933J139065l35094j868728j324256
$$ -528173 -646632 104698 880817 1495593 2587526 3726591 3391497 1522769 198513
41456A98513N64169J167798N991q23518k23534M24832j38608j114343j159330
$$ 198513 762682 1930480 1936471 1112953 889419 1314251 1175643 61300 -1098030
41447a098030k87238O03874R98727Q62395L05423k91257l99502O9698P00467J094610
$$ -1098030 -1385268 -781394 217333 1079728 1385151 1093894 694392 764090 1464557 2559167
41437B559167J023465L11025q02458j464254j103638k53517K26133L35708N03622
$$ 2559167 3582632 3893657 3091199 1626945 523307 269790 495923 831631 1335253
41428A335253M64665k86266j211299j163719j06269P42829O15340M9491j40730
$$ 1335253 1799918 1513652 302353 -861366 -967635 -224806 390534 440025 299295
41419B99295J18257L90929L03716k23137p81824o65280J47617N72522j45364j004454
$$ 299295 417552 808481 1112197 889060 107236 -558044 -410427 162095 16731 -987723
41409i87723m74882J066807J592083K77889j346178j635760r12444m68088n18869
$$ -987723 -1462605 -395798 1196285 1474174 127996 -1507764 -2420208 -2888296 -3407165
41400c407165k62663N43710J146862R20994K05847j79235Q4479N30465N50721
$$ -3407165 -3669828 -3126118 -1979256 -1058262 -852415 -1031650 -947171 -416706 134015
41391A34015J78540J1922L06330N12543N4493p28035r28194k68030N43323O95775
$$ 134015 312555 324477 630807 1143350 1197843 469808 -458386 -726416 -183093 512682
41381E12682J67707l67485l44862N1286J12498l94277p07989q8904Q63365Q53251
$$ 512682 680389 312904 -31958 19328 131826 -262451 -970440 -1059344 -195979 657272
41371F57272j04751n54369J20557O81917J55846m60889L2427Q05441L32676q76601
$$ 657272 552521 -1848 118709 800626 956472 495583 528010 1333451 1666127 789526
41361G89526r55769K53768R14690Q3390j050769j219779o29386J12558J003293
$$ 789526 -166243 87525 1002215 1085605 34836 -1184943 -1814329 -1701771 -698478
41352f98478J797890J569198R8722j331301j458072n76927J64282K76273P0390
$$ -698478 1099412 2668610 2767332 1436031 -22041 -598968 -434686 -158413 -88023
41343h8023n5822J20833N68214P91533K93991n36679p68247l31870j24259m47844
$$ -88023 -143845 -23012 545202 1336735 1630726 1094047 325800 -6070 -130329 -578173
41333e78173n07261O9429M49541Q2867k04416L91731J128044P54457n72458j532034
$$ -578173 -1085434 -1016005 -566464 -483597 -688013 -296282 831762 1586219 1013761 -518273
41323e18273j374525m76880M52631Q74379M90718l61523p04880m2996Q34345Q53718
$$ -518273 -1892798 -2369678 -1917047 -1042668 -551950 -913473 -1618353 -1661349 -827004 26714
41313B6714R8068m67208l47957J46314O19712Q79457P09996O0050o33512q21075
$$ 26714 124782 -342426 -690383 -544069 75643 955100 1665096 1725146 1091634 270559
41303B70559m28953K14589P06251N94193l10499j298555j228121j53159M21764
$$ 270559 -158394 56195 762446 1356639 1046140 -252415 -1480536 -1633695 -1211931
41294a211931l41013j228908p62469N65233J169172P52502K88770J62096l4125
$$ -1211931 -1552944 -2781852 -3544321 -2979088 -1809916 -1057414 -768644 -606548 -640673
41285f40673j71460K24058O12425O2479p71722k60549J338616J737921N9638j641022
$$ -640673 -812133 -588075 24350 86829 -684893 -945442 393174 2131095 2190733 549711
41275E49711j436672k05059K80019K19606P52865J339691N70973j008031j331248
$$ 549711 -886961 -1092020 -812001 -592395 160470 1500161 2071134 1063103 -268145
41266b68145j18457N26942n84375j830011j266001N07619J396316Q18166J51988
$$ -268145 -386602 140340 -444035 -2274046 -3540047 -3032428 -1636112 -817946 -665958
41257f65958M43935R96422N79313p52437j642966j085248L21681J032021M17901
$$ -665958 -222023 774399 1353712 601275 -1041691 -2126939 -1805258 -773237 -355336
41248c55336m72509l65248M73553O88761j11748p74571l45432N73380Q34777L60744
$$ -355336 -827845 -1193093 -719540 -30779 -142527 -917098 -1262530 -689150 145627 506371
41238E06371o7558j18517j17702k19386k24686j29198j11603m8643K48588M15741
$$ 506371 438813 320296 202594 -16792 -241478 -370676 -482279 -530922 -282334 133407
41228A33407k4867o21335l46356P90490J455392P90184l59220o86686j97931J00081
$$ 133407 108540 -512795 -859151 -68661 1386731 2176915 1817695 1131009 933078 1033159
41218A033159j93807n24316m70033k94607l03350l41877j72555J13429K87714
$$ 1033159 839352 315036 -154997 -449604 -752954 -1094831 -1267386 -1153957 -866243
41209h66243K97026K45455K61088L97201M89089K27465l66569p37151m60319P8038
$$ -866243 -569217 -323762 -62674 334527 823616 1051081 684512 -52639 -512958 -434920
41199d34920J98864l1336K2048L68230K47975n41140j060461n74580K45818L19806
$$ -434920 -236056 -267392 -245344 122886 370861 -170279 -1230740 -1805320 -1559502 -1239696
41189a239696j26405J09365J253751K005547J272426l31922j267854q91593J3713
$$ -1239696 -1366101 -1256736 -2985 2002562 3274988 2943066 1675212 783619 797332
41180G97332K89757m13503j380323j512005m16151J054588J616459J007193J86016
$$ 797332 1087089 673586 -706737 -2218742 -2634893 -1580305 36154 1043347 1229363
41171A229363q4754j65868n50871p23829m572R46366P68800m92482j262861p23775
$$ 1229363 1144609 978741 427870 -295959 -300531 645835 1414635 922153 -340708 -1064483
41161a064483Q5243O7828k74150L3404O81491P00150J47270j48736j01168k80422
$$ -1064483 -979240 -911412 -1185562 -1152158 -470667 229483 376753 228017 126849 -153573
41151a53573n69139k84576L95747N07926n2608l06203R5480K88143j67711m03264
$$ -153573 -722712 -1007288 -611541 -103615 -156223 -462426 -366946 -78803 -246514 -649778
41141f49778K28406R09426O25055k45835o51279m58702k70245k07839L7450L15875
$$ -649778 -421372 488054 1113109 867274 215995 -242707 -512952 -720791 -683341 -367466
41131c67466K13584p4911M884L84281M80157J85148n4148r6696k66617o20769
$$ -367466 -153882 -228793 -223909 160372 640529 825677 771529 674833 408216 -212553
41121b12553p68780n40278k40342j08247j4712J71299L18795K67489M8086j82986
$$ -212553 -981333 -1521611 -1761953 -1870200 -1884912 -1713613 -1394818 -1127329 -1079243 -1262229
41111a262229k34056M2086N63694R97684J064445P48607J81578m18886p03278
$$ -1262229 -1496285 -1454199 -890505 107179 1171624 1920231 2101809 1682923 979645
41102I79645m99708j55817m9767J17621P24802J063042O9791j577155j738470
$$ 979645 479937 324120 274353 391974 1116776 2179818 2249609 672454 -1066016
41093a066016Q6795J653766J185609j5625L3043N52252n14014k515485k603141
$$ -1066016 -979221 674545 1860154 1844529 1877572 2429824 1915810 -599675 -3202816
41084c202816k22192J793123J355110j52588m65602L57516Q44165O02768K37025
$$ -3202816 -3425008 -1631885 -276775 -429363 -894965 -537449 306716 909484 1146509
41075A146509j33339o71664q66396k00849O84706P27551J3624m44450k46409M6646
$$ 1146509 1013170 341506 -524890 -725739 -41033 686518 700142 255692 9283 55929
41065E5929k5694k49433k46291K3464L20238L96749K74059K91060N74163N58730
$$ 55929 30235 -219198 -465489 -442025 -121787 274962 549021 840081 1414244 1972974
41055A972974l04663j406113j494309n00249K86742K26909J97890P77308R95266
$$ 1972974 1668311 262198 -1232111 -1732360 -1445618 -1218709 -1020819 -243511 751755
41046G51755P3375q64104m06021P30874P23705m25382r13714m7080P64114L36275
$$ 751755 825130 -38974 -444995 285879 1009584 584202 -329512 -376592 387522 723797
41036G23797n90619p30616p1101N43578P34875O55783L73696o7709l92510m31680
$$ 723797 133178 -597438 -668539 -124961 609914 1265697 1639393 1571684 1179174 747494
41026G47494l40621j63916K63891O87569M70130k54644l47781O32151J343809
$$ 747494 406873 242957 506848 1194417 1664547 1409903 1062122 1694273 3038082
41017C038082M37959j201043j469393j08604Q77118J96752r19397p57841L16263
$$ 3038082 3476041 2274998 805605 697001 1574119 1770871 851474 93633 409896
41008D09896O25007k52052j059821p73568K41615R66286P51723l06477j264179
$$ 409896 1034903 782851 -276970 -1050538 -808923 157363 909086 602609 -661570
40999f61570q82226Q29192K042058J261518m04107p06204L31033N67086n53722
$$ -661570 -1543796 -714604 1327454 2588972 2184865 1478661 1809694 2376780 1823058
40990A823058j003534K02607J002572k84318j810756j008976J138602J611645
$$ 1823058 819524 1022131 2024703 1740385 -70371 -1079347 59255 1670900
40982A670900J49843o52256K09452Q02313j59714j282075j089201k67165q274
$$ 1670900 1820743 1168487 1377939 2180252 2020538 738463 -350738 -617903 -626177
40973f26177m7303K79501N68528K64795k00318l07048l28370l77695J37246J117791
$$ -626177 -673480 -393979 174549 439344 239026 -68022 -396392 -774087 -636841 480950
40963D80950J212504j35043j354574q44185O79333J342900P14577j74017o02278
$$ 480950 1693454 1558411 203837 -640348 38985 1381885 2096462 1922445 1320167
40954A320167n44093L1083Q39322Q72208l01767j383801r35556L57797N77977
$$ 1320167 776074 807157 1646479 2518687 2216920 833119 -102437 255360 833337
40945H33337n35841j209587k49220J401101K093803J398693J60043o26308o29895
$$ 833337 297496 -912091 -1161311 239790 2333593 3732286 3892329 3266021 2636126
40936B636126k98961k90191n93056n08164K03634P17564K76780o26144r47088
$$ 2636126 2337165 2046974 1453918 945754 1149388 1866952 2143732 1517588 570500
40927E70500n09904M2037K86463K36471o8009m06693k54194M03341O15426k96008
$$ 570500 60596 102633 389096 625567 557558 150865 -103329 300012 915438 619430
40917F19430j511768j664071o27134N32750J009462Q02053K52675r6930L08399
$$ 619430 -892338 -2556409 -3183543 -2650793 -1641331 -839278 -586603 -683533 -375134
40908c75134J145680J182228Q2666o58700J18216J120696M27611j314749j712016
$$ -375134 770546 1952774 2035440 1376740 1494956 2615652 3043263 1728514 16498
40899A6498l56460O42018J23076n14262k1724N41541k11050j476128j458019j48423
$$ 16498 -339962 302056 425132 -89130 -110854 430687 219637 -1256491 -2714510 -2862933
40889b862933P87614N40757P8632M14548J100767R86055q8383r95084p50793K14543
$$ -2862933 -2075319 -1534562 -1455930 -1041382 59385 1045440 957057 -38027 -788820 -574277
40879e74277O55053K05484k27711M7350M70265K47151l62132o16410n25640n19323
$$ -574277 80776 286260 58549 105899 576164 823315 461183 -155227 -680867 -1200190
40869a200190l98325K49146R40383Q12471O3275k92199o903K10235M6091l9955
$$ -1200190 -1598515 -1349369 -408986 403485 466760 174561 167658 377893 423984 384029
40859C84029J63078L24051L66322N11380N13593n2780p34341o06854J73828M40908
$$ 384029 547107 871158 1237480 1748860 2262453 2209673 1475332 868478 1042306 1483214
40849A483214j88980p84536o14410o2053K54348K28905r4603o20222q00873j95233
$$ 1483214 1294234 509698 -104712 -166765 87583 316488 221885 -398337 -1199210 -1394443
40839a394443N38653L81687l37842l59795L57208N27560j78276n04795J99544
$$ -1394443 -855790 -474103 -811945 -1171740 -814532 -286972 -465248 -970043 -770499
40830g70499Q98761P39182L55275L75407J99724n92418j038710l23474O36810
$$ -770499 128262 867444 1222719 1598126 1797850 1205432 166722 -156752 480058
40821D80058N07482m31201q53136l43613L50816N64090L06520j7134M3856M51290
$$ 480058 987540 556339 -296797 -640410 -289594 274496 581016 563882 607738 1059028
40811A059028L68821p10257j587695o68470J180423J204814j038032k462645r55818
$$ 1059028 1427849 717592 -870103 -1538573 -358150 846664 -191368 -2654013 -3609831
40802c609831J259856J057296p56133r88843P48964J684422M30684j195842j352559
$$ -3609831 -2349975 -1292679 -2048812 -3037655 -2288691 -604269 -173585 -1369427 -2721986
40793b721986n31993R4809N13181R51391Q45079p1733q33028m90437N08147J020506
$$ -2721986 -3253979 -3159170 -2645989 -1694598 -849519 -921252 -1754280 -2244717 -1736570 -716064
40783g16064O62741m7111m47771k06390M62557Q10526L38455l58989k54118N54614
$$ -716064 -53323 -100434 -548205 -754595 -292038 518488 856943 497954 243836 798450
40773G98450Q53245R1370q12609q57775k83276M9259j03766l63258m79473n12290
$$ 798450 1651695 1743065 930456 72681 -210595 -161336 -265102 -628360 -1107833 -1620123
40763a620123n23545m73945k63723K32499Q86524J129407N79680j51531j9360
$$ -1620123 -2143668 -2617613 -2881336 -2648837 -1762313 -632906 -53226 -204757 -224117
40754b24117R19263J350871M93725p49487j065231m81511J0864J07404L57283
$$ -224117 695146 2046017 2539742 1790255 725024 243513 254377 361781 719064
40745G19064P75589N08410o42973j371493m94576J092089J271259m55251k114376
$$ 719064 1494653 2003063 1360090 -11403 -505979 586110 1857369 1402118 -712258
40736g12258j755181R9508J304988Q06760m64718j128761p97639J6400N95074
$$ -712258 -2467439 -2367931 -1062943 -256183 -720901 -1849662 -2647301 -2630901 -2035827
40727b035827M80291j37516m82572j65206J86666q314q5730P96221J778550J169156
$$ -2035827 -1555536 -1693052 -2175624 -2340830 -2154164 -2162478 -2248208 -1451987 326563 1495719
40717A495719p80533j845752j036048R4022J57946m1834M91182Q63304O5091p56189
$$ 1495719 715186 -1130566 -2166614 -2072592 -1914646 -1956480 -1465298 -601994 -536903 -1293092
40707a293092o8379J120284O25410j214744j813365k82017J376618J437162N46415
$$ -1293092 -1361471 -241187 384223 -830521 -2643886 -2925903 -1549285 -112123 434292
40698D34292p6960m44942p34668k76137R69371J397804o9680j810476j362393
$$ 434292 357332 -87610 -822278 -1098415 -129044 1268760 1199080 -611396 -1973789
40689a973789R76928K299697J016291j075016j427779j24727P09006J60399m69066
$$ -1973789 -996861 1302836 2319127 1244111 -183668 -308395 400611 561010 91944
40680I1944k6427P43208O51367q413k86169l78157r53647j313141k38911J500439
$$ 91944 65517 808725 1460092 1451679 1165510 787353 -166294 -1479435 -1718346 -217907
40670b17907J752630L72906l74594M79360J050929K0397r91103l99421M02933
$$ -217907 1534723 1907629 1533035 2012395 3063324 3083721 2092618 1693197 2096130
40661B096130l80898j529041r82818K44854j68110j396850o95629J480224J800788
$$ 2096130 1715232 186191 -796627 -551773 -719883 -2116733 -2812362 -1332138 468650
40652D68650k35837j211565M81685J911498N75500j490306j226481O66476J452918
$$ 468650 232813 -978752 -497067 1414431 1989931 499625 -726856 -60380 1392538
40643A392538P95866L82541M84017r7856j298878j653110p43139K63783M94236
$$ 1392538 2188404 2570945 3054962 2957106 1658228 5118 -738021 -474238 19998
40634A9998J91195k08721m90233l79354N6313J55802k31057j51751Q42002J489849
$$ 19998 211193 2472 -487761 -867115 -810802 -655000 -886057 -1037808 -195806 1294043
40624A294043O49130o52563p11140J35452K45736m50736m81433M52331R63181
$$ 1294043 1943173 1290610 579470 714922 960658 509922 28489 480820 1444001
40615A444001M10106j45172P6433L70572K5561m68563m78003l18150n04897q19914
$$ 1444001 1854107 1708935 1785368 2155940 2181501 1712938 1234935 916785 411888 -408026
40605d08026q02570m62762j173N21100Q47761N28404l64623j072169r81567j92160
$$ -408026 -1210596 -1673358 -1674531 -1153431 -305670 222734 -141889 -1214058 -2195625 -2387785
40595b387785P74684J308890R21608j45413p24649m2429R87509R05278n8076l14897
$$ -2387785 -1613101 -304211 617397 471984 -252665 -295094 692415 1597693 1539617 1224720
40585A224720M73660Q15209j12387j071465q02671K5083J35892k62781j35027
$$ 1224720 1698380 2513589 2401202 1329737 527066 552149 688041 425260 290233
40576B90233M79417P05598M64390M18680N52173J83987o24471r50550m74603M0680
$$ 290233 769650 1475248 1939638 2358318 2910491 3094478 2470007 1519457 1044854 1085534
40566A085534J6814j84358j61031k19200o27286q17325r7593J138117J608194
$$ 1085534 1102348 917990 756959 537759 -89527 -906852 -1004445 133672 1741866
40557A741866O03783j126892k081741j469403P8229J221312J269849O84556K27199
$$ 1741866 2345649 1218757 -862984 -2332387 -2254158 -1032846 237003 921559 1148758
40548A148758l751l48152p19976o14460J7742N39849M90957J46733p5629k43954
$$ 1148758 1145007 796855 76879 -537581 -519839 20010 510967 657700 582071 338117
40538C38117m93788m73769J09168O76231L47552o57661j048958k20844P68318
$$ 338117 -155671 -629440 -520272 155959 503511 -154150 -1203108 -1423952 -655634
40529f55634N75403n95346j311107q15016J98372P14231N38477J16307j09853
$$ -655634 -80231 -675577 -1986684 -2801700 -2603328 -1889097 -1350620 -1234313 -1344166
40520a344166J44709Q70177J391356P77226q06502j767000r30665P34133J279259
$$ -1344166 -1199457 -329280 1062076 1839302 1032800 -734200 -1664865 -930732 348527
40511C48527M28946j97900L29281Q57002J05555j148948j157790J18676Q91167
$$ 348527 777473 579573 908854 1765856 1871411 722463 -435327 -316651 574516
40502E74516J51496r24883p47744M66331J118043M47995n72418o71940O1419M40014
$$ 574516 726012 -198871 -946615 -480284 637759 1085754 513336 -158604 -97185 342829
40492C42829j03103o80240k15999Q64240J065264L4733o97281R6995J329007J041842
$$ 342829 239726 -440514 -656513 207727 1272991 1307724 610443 707438 2036445 3078287
40482C078287o09466j446344m39955Q59626P09220m71284j131531p94247l3697
$$ 3078287 2468821 1022477 582522 1442148 2151368 1680084 548553 -245694 -279391
40473b79391P85974J424074J183247j49374j340494j130976j42144J18722l58301
$$ -279391 506583 1930657 3113904 2964530 1624036 493060 350916 469638 111337
40464A11337m38630j40994m52295r49241n1715J899546K348932L60287j605069
$$ 111337 -327293 -468287 -920582 -1869823 -1921538 -21992 2326940 2687227 1082158
40455A082158j253717K89787O70147q0391l58898m5831k57348q69280p24049Q9692
$$ 1082158 -171559 118228 788375 707984 349086 303255 45907 -823373 -1547422 -1457730
40445a457730L95410J41509L35584Q94506P00523j38183k26796O26930R30184
$$ -1457730 -1062320 -920811 -585227 309279 1009802 871619 644823 1271753 2201937
40436B201937N088r69171j037666p54393o57662k43970O33949R82180K99697m35812
$$ 2201937 2207025 1237854 200188 -554205 -1211867 -1455837 -821888 160292 459989 24177
40426B4177m02695j93090m61169o81379l12281J12332J42308L41506R16129Q21727
$$ 24177 -378518 -571608 -1032777 -1714156 -2026437 -1914105 -1771797 -1430291 -514162 307565
40416C07565l90495j233907m58170O94083L63239p88767n76658J081568J911743
$$ 307565 -82930 -1316837 -1775007 -1080924 -717685 -1506452 -2083110 -1001542 910201
40407I10201P75485p23646p37140L95438J051792N19260n34286j091948p07435
$$ 910201 1685686 962040 224900 620338 1672130 2191390 1657104 565156 -142279
40398a42279J97306O96124L42398k74472l69843o6000j3282k48967k89758j33213
$$ -142279 55027 751151 1093549 819077 449234 383234 369952 120985 -168773 -301986
40388c01986k23230n19149n28660k24177j4352J60109P35004J482199J538998
$$ -301986 -525216 -1044365 -1573025 -1797202 -1811554 -1651445 -916441 565758 2104756
40379B104756O50189m71206j151601j293773q71933J03555R47149P07576l93651
$$ 2104756 2754945 2283739 1132138 -161635 -1033568 -930013 17136 724712 331061
40370C31061r32556k11050P07641N57983l30658o34627Q0454R31340R67560J72489
$$ 331061 -601495 -812545 -104904 453079 122421 -512206 -431752 499588 1467148 1639637
40360A639637p41783j073282o68293j3850K40568P781j43275K22062P53104P55122
$$ 1639637 897854 -175428 -843721 -857571 -617003 -609222 -752497 -530435 222669 977791
40350I77791J74672k21498J90206R66716J015417L0561r29658p67068J02563L40162
$$ 977791 1152463 930965 1121171 2087887 3103304 3133865 2204207 1437139 1539702 1879864
40340A879864k78380n43352J57937P59054K84495m65290k75048L27353j02050
$$ 1879864 1601484 1058132 1216069 1975123 2259618 1794328 1519280 1846633 1744583
40331A744583j385495j766822n36311R76211J346816O30120l74609j109384j049623
$$ 1744583 359088 -1407734 -1944045 -967834 378982 1009102 634493 -474891 -1524514
40322a524514J70177J753067K038026N90452j006465j219034m31372J03138J65502
$$ -1524514 -1354337 398730 2436756 3027208 2020743 801709 370337 473475 638977
40313F38977L04417M58561J49260l51943k56288M67152J012855Q58140J71210
$$ 638977 943394 1401955 1551215 1199272 942984 1410136 2422991 3281131 3452341
40304C452341p34624j542654j687565q46386L61869R85936J009523J129109J295373
$$ 3452341 2717717 1175063 -512502 -1358888 -997019 -11083 998440 2127549 3422922
40295C422922O24357q83808j717164q14361O73325P47264o86832j703855j073512
$$ 3422922 4047279 3163471 1446307 631946 1305271 2052535 1365703 -338152 -1411664
40286a411664J92225O01393L70638O93409J464279J263609l02723j700141j554437
$$ -1411664 -1219439 -618046 -247408 446001 1910280 3173889 2871166 1171025 -383412
40277c83412n14821q1696m19101n18535m2593L05940J63237L3340K42533M01323
$$ -383412 -898233 -979929 -1399030 -1917565 -1960158 -1654218 -1490981 -1457641 -1215108 -813785
40267h13785K57708K17972N76090R21139P78574L04472p7516k83909m43104n36355
$$ -813785 -556077 -338105 237985 1159124 1937698 2242170 2164654 1880745 1437641 901286
40257I01286m93839l58908j50686J44483L49223K37148l2478n7976J60203K10691
$$ 901286 407447 48539 -102147 42336 391559 628707 596229 538253 698456 909147
40247I09147K167l1652L63252Q20415Q11858K07472o66284j181105p57947M30889
$$ 909147 911314 879662 1242914 2063329 2875187 3082659 2416375 1235270 477323 908212
40237I08212J289823R58466n5625o17664n40057m69016m99757j61101L18008J51164
$$ 908212 2198035 3156501 3100876 2483212 1943155 1474139 974382 813281 1131289 1282453
40227A282453m75614n03510J06362J81961n07495o43239L46074J122725O22114
$$ 1282453 806839 303329 409691 591652 84157 -559082 -213008 909717 1531831
40218A531831k58248l94696k50773n00361m29888N25660J123094K42617q01460
$$ 1531831 1273583 878887 628114 127753 -302135 223525 1346619 1589236 787776
40209G87776k02998J138345R69554m87796r07840K21507R94552N53894J89949
$$ 787776 584778 1723123 2692677 2204881 1297041 1518548 2513100 3066994 3256943
40200C256943M08979j00727j493516j666844K06437J649854N31973j419330j264253
$$ 3256943 3665922 3565195 2071679 404835 611272 2261126 2793099 1373769 109516
40191A09516O22310J433995L28484q71597r64126o68207n23791O7881J136274
$$ 109516 731826 2165821 2494305 1622708 658582 -9625 -533416 -465535 670739
40182F70739J508135O78955k89896n01695m14051n47152m34326J75789L71472
$$ 670739 2178874 2857829 2567933 2066238 1652187 1105035 670709 846498 1217970
40173A217970m58290j239259o49392P67293J332838O69341k2953j3702M8906m25989
$$ 1217970 759680 -479579 -1128971 -361678 971160 1640501 1617548 1603846 1652752 1226763
40163A226763q52255m51401M37841Q02721L36004k81868l96826k03293l91875
$$ 1226763 374508 -76893 360948 1163669 1499673 1217805 820979 617686 225811
40154B25811j119588j572532q51174O99242J587658R96557o6103j66413N13869
$$ 225811 -893777 -2466309 -3317483 -2618241 -1030583 -34026 -100129 -266542 247327
40145B47327O51613P244l11976M2141j8998q97338j181982J01755J547759J338252
$$ 247327 898940 906184 594208 636349 617351 -279987 -1461969 -1360214 187545 1525797
40135A525797M4505n03848l19446q70458j915084j378708J114359L039020K384024
$$ 1525797 1570302 1066454 747008 -123450 -2038534 -3417242 -2302883 736137 3120161
40126C120161K72644j084881j263518r81628k59468R13947J348493J81465j161258
$$ 3120161 3392805 2307924 1044406 62778 -196690 717257 2065750 2247215 1085957
40117A085957o40996J191057J769302K30168j474653j500020l11445O58790R89050
$$ 1085957 444961 1636018 3405320 3635488 2160835 660815 349370 1008160 1997210
40108A997210J009523P47086J36672m17438n17371l86064m59073p24297q32905
$$ 1997210 3006733 3753819 3890491 3473053 2955682 2569618 2110545 1386248 553343
40099E53343n29457K05752J027835J203033L20047q92672j173124l18506N78527
$$ 553343 23886 229638 1257473 2460506 2780553 1887881 714757 396251 974778
40090I74778P00682M42807L77707K21175m10919r28320m75648N61519P82611l27907
$$ 974778 1675460 2118267 2495974 2717149 2306230 1377910 902262 1463781 2246392 1918485
40080A918485j503774j184024M80398J702070J190587l07017j023825m18160L43055
$$ 1918485 414711 -769313 -288915 1413155 2603742 2296725 1272900 854740 1197795
40071A197795K04195l78787m06413N6894J65367k34476m54739k11345l5775k71808
$$ 1197795 1401990 1023203 616790 673684 839051 604575 149836 -61509 -97284 -369092
40061c69092m87040k15927L08574N31764L32479J31805L86237J013901J295294
$$ -369092 -856132 -1072059 -763485 -231721 100758 232563 618800 1632701 2927995
40052B927995O31725m80782q04550l2097O29092J60803p82484r93055n01479o0494
$$ 2927995 3559720 3078938 2274388 2242291 2871383 3032186 2249702 1256647 755168 694674
40042F94674L95381J239364J671027N82202j286805j937522r39663J58659L95935
$$ 694674 1090055 2329419 4000446 4582648 3295843 1358321 418658 577317 973252
40033I73252M04953N23944N1161r06743r80879M4634M41750n46307j069466L38200
$$ 973252 1378205 1902149 1953310 1046567 65688 110322 552072 5765 -1063701 -725501
40023g25501K025052J645205j39533q01979J31271P73120J01034q20757r26753
$$ -725501 1299551 2944756 2805223 2003244 2134515 2907635 3008669 2187912 1261159
40014A261159n31373k92907k44141j64021R8526O69374J187218P43759o91978
$$ 1261159 729786 436879 192738 28717 127243 796617 1983835 2727594 2035616
40005B035616j494326m20941J248099J311575j42524j063344o58687j50414k91904
$$ 2035616 541290 120349 1368448 2680023 2537499 1474155 815468 665054 373150
39996C73150l50679K4325L8458m55747l61513N87279R92559J16530o53561J4995
$$ 373150 22471 46796 85254 -370493 -732006 -144727 847832 964362 310801 325796
39986C25796J188332J116919j80577j250779j323228p33569J21792R31228J030557
$$ 325796 1514128 2631047 2450470 1199691 -123537 -857106 -735314 195914 1226471
39977A226471P3862j089448j228730k61999P97480J138849P04330j46221p68587
$$ 1226471 1300333 210885 -1017845 -1279844 -482364 656485 1360815 1214594 446007
39968D46007m54430O92475J500883J125475K30023p3622P1378k58135r60058r08635
$$ 446007 -8423 684052 2184935 3310410 3540433 3466811 3538189 3280054 2319996 1411361
39958A411361K06855J261290J213658K85395p13107j364161j530135j033955l3154
$$ 1411361 1618216 2879506 4093164 4378559 3665452 2301291 771156 -262799 -295953
39949b95953P84374Q99860N37824J80805j11009m74982o86533l82750K70486O48549
$$ -295953 488421 1388281 1926105 2106910 1995901 1520919 834386 451636 722122 1370671
39939A370671M67857J25253R6143L02994L17596l350l72952m92019l28051K0458
$$ 1370671 1838528 1963781 2059924 2362918 2680514 2677164 2304212 1812193 1484142 1504600
39929A504600M37121P03066O28573L97153M03030N43225J60669q83793j588800
$$ 1504600 1941721 2644787 3273360 3670513 4073543 4616768 4777437 3893644 2304844
39920B304844r96919K89200O80468k98800j369428j196795L3328J099697J173467
$$ 2304844 1307925 1597125 2277593 1978793 609365 -587430 -554102 545595 1719062
39911A719062L71923n69496q03530o3794Q00754N49126q01923j694105r57868
$$ 1719062 2090985 1521489 717959 654165 1454919 2004045 1202122 -491983 -1449851
39902a449851N72140J115488J96693r71299j122677j84367J022696J630864J271963
$$ -1449851 -877711 237777 434470 -536829 -1659506 -1843873 -821177 809687 2081650
39893B081650L69485q9120M18642J165184R44570l64474j571619j622691p52863
$$ 2081650 2451135 2362015 2780657 3945841 4890411 4525937 2954318 1331627 578764
39884E78764K1172J39696p6320k9597L87834O60748K99751m02278n64701J17605
$$ 578764 599936 739632 663312 633715 1021549 1682297 1982048 1579770 1015069 1132674
39874A132674P92653N29977l09330n12453K22928Q08067L29027o61795r79891
$$ 1132674 1925327 2455304 2145974 1633521 1856449 2664516 2993543 2331748 1351857
39865A351857l99765K97138N73312O43722P41288O36289J67856l21491m73790
$$ 1351857 952092 1249230 1822542 2466264 3207552 3843841 4011697 3690206 3216416
39856C216416m00319k66362J41468Q28035J004319K0435j280622j297708J4378
$$ 3216416 2816097 2549735 2691203 3519238 4523557 4543992 3263370 1965662 1980040
39847A980040Q04627l8751j117617n60814J096321J667724N25798p05665p48746
$$ 1980040 2784667 2745916 1628299 1067485 2163806 3831530 4357328 3651663 2902917
39838B902917k25918q6105o5564L37865O25681K08843l52111k30230K00068l134
$$ 2902917 2676999 2590894 2525330 2863195 3488876 3697719 3345608 3115378 3315446 3312312
39828C312312p00020q75848k57032M43952Q09778J111308J344382R83142L1185
$$ 3312312 2612292 1736444 1479412 1923364 2733142 3844450 5188832 6171974 6203159
39819F203159o06665l24583K55455J13126p99114j538237j380428o25205q8565
$$ 6203159 5596494 5271911 5527366 5640492 4841378 3303141 1922713 1297508 1208943
39810A208943r503K07308R62087J509755P39341j036759j973329r30352R26312
$$ 1208943 1199440 1406748 2368835 3878590 4617931 3581172 1607843 677491 1603803
39801A603803J604770Q17417k0760k9602J26309l74332j182059j344700n53451
$$ 1603803 3208573 4025990 4005230 3975628 4101937 3727605 2545546 1200846 647395
39792F47395O40852J460061J454459P69856O9461r0779J20057J30603j47521k56796
$$ 647395 1288247 2748308 4202767 4972623 5042084 4951305 5071362 5201965 5054444 4797648
39782D797648l7110P5985j90744m30931j50112M84040Q36256N65506m4624m12713
$$ 4797648 4760538 4836523 4645779 4214848 4064736 4548776 5385032 5950538 5905914 5493201
39772E493201k13019K98148N15757J71021l29818m55360k52815j67561l20122
$$ 5493201 5280182 5578330 6094087 6265108 5935290 5479930 5227115 5059554 4739432
39763D739432l96746j96982J34573M01298M87216K46132k98451o42676j73145
$$ 4739432 4342686 4145704 4280277 4681575 5168791 5414923 5116472 4473796 4300651
39754D300651R94022J874316J527555N3272j339576j346307M8283J251843P38035
$$ 4300651 5294673 7168989 8696544 8749816 7410240 6063933 6112216 7364059 8102094
39745H102094q75490j363496P1744J510886J057081l48598n14811M59935M61592
$$ 8102094 7226604 5863108 5934852 7445738 8502819 8154221 7639410 8099345 8560937
39736H560937r96312j837875p60302P04696O74283l28409o28435m4044M11003
$$ 8560937 7564625 5726750 4966448 5671144 6345427 6017018 5388583 5344539 5755542
39727E755542M86316O05675M77116m27727j343799r24659N33259J230999M53558
$$ 5755542 6241858 6847533 7324649 6896922 5553123 4628464 5161723 6392722 6846280
39718F846280n26339n48664q8770J1141j0106L55873O84092L93636j1812K84108
$$ 6846280 6319941 5771277 5682507 5693648 5683542 6039415 6723507 7117143 7105331 7389439
39708G389439Q73285O45948l45020q37176k69870M79317N91665L87941L61130
$$ 7389439 8262724 8908672 8563652 7726476 7456606 7935923 8527588 8915529 9276659
39699I276659K00558l88139p52756k12038O75830Q20022J90947l23851l62386
$$ 9276659 9477217 9089078 8336322 8124284 8800114 9620136 9811083 9487232 9124846
39690I124846l17493l23478j27060J16417K1512j09552L21293R82206J034630
$$ 9124846 8807353 8483875 8356815 8473232 8494744 8385192 8706485 9688691 10723321
39681A0723321O96886R36273J653147J890806J894065K838985M149157L558365
$$ 10723321 11420207 12356480 14009627 15900433 17794498 20633483 24782640 28341005
39673B8341005P84065j391891j116544l1746p2270l15601N94265J426301Q14212
$$ 28341005 29125070 27733179 26616635 26584889 26512619 26197018 26791283 28217584 29031796
39664B9031796M94648K537376N275684O076498O437726R296564J2250222R527153
$$ 29031796 29526444 32063820 37339504 43416002 49853728 59150292 71400514 80927667
39656H0927667J429657m288133k863557R30587J12497m989438q767635q698849
$$ 80927667 82357324 78069191 75205634 76136221 76248718 71259280 62491645 53792796
39648E3792796p009686n740750m566302l050172j627494l43181J026537K017282
$$ 53792796 46783110 41042360 36476058 33425886 31798392 31455211 32481748 34499030
39640C4499030K588436M109612O871220P804966L757158l424185q158163p711176
$$ 34499030 37087466 41197078 48068298 55873264 59630422 56206237 48048074 40336898
39632D0336898m833014l313640l429102k962013r04011J475187K662391K860306
$$ 40336898 35503884 32190244 28761142 25799129 24895118 26370305 29032696 31893002
39624C1893002L550834N156047N733607L138880j553821m565617m073509k460789
$$ 31893002 35443836 40599883 46333490 49472370 47918549 43352932 39279423 36818634
39616C6818634k617246l937819l991346k543783j392610j160061q31355r7401
$$ 36818634 34201388 30263569 26272223 23728440 22335830 21175769 20344414 20247013
39608B0247013J57344l48862q89147j040387q41685K4603J632633K818057K417049
$$ 20247013 20404357 20055495 19166348 18125961 17284276 17308879 18941512 21759569 24176618
39599B4176618J125781N93883J132258J834158K394238L187768M032332M383059
$$ 24176618 25302399 25896282 27028540 28862698 31256936 34444704 38477036 42860095
39591D2860095M283313L908626L005630J982237K351416M711126P625452R852332
$$ 42860095 47143408 51052034 54057664 56039901 58391317 63102443 70727895 80580227
39583H0580227J2034625J5003649J8788916K4410033L2535727L7729416K9378661
$$ 80580227 92614852 107618501 126407417 150817450 183353177 221082593 250461254
39576B50461254M352925k4612709m0178051l8579947l0182252k3764578j8641392
$$ 250461254 254814179 230201470 190023419 151443472 121261220 97496642 78855250
39569G8855250j2564197q095077p368753p420142n225851k522855j826946j993825
$$ 78855250 66291053 58195976 50827223 43407081 38181230 35658375 33831429 31837604
39561C1837604j252862o29602r85856m91194J689511K957288J802900J073038
$$ 31837604 30584742 29955140 28969284 28478090 30167601 33124889 34927789 36000827
39553C6000827L407407P017424R184386J0029410R414397M587826m556757j1885753
$$ 36000827 39408234 46425658 55610044 65639454 75053851 79641677 75084920 63199167
39545F3199167j1938217p410840m705748m880929m414271k512388j706536k385905
$$ 63199167 51260950 43850110 39144362 34263433 29849162 27336774 25630238 23244333
39537B3244333k211420o00326O49639Q25462P30233M68119J8991O01777K340225
$$ 23244333 21032913 20432587 21082226 21907688 22637921 23106040 23125031 23726808 26067033
39528B6067033K659687L93897j165049P79914L540125L426705K030474K824321
$$ 26067033 28726720 29120617 27955568 28735482 32275607 35702312 37732786 40557107
39520D0557107M754568N147607N792252R386875J2871315J1712814Q205739P676306
$$ 40557107 45311675 50459282 56251534 65638409 78509724 90222538 98428277 106104583
39512A06104583R271748R298478J0534525J7711966K6942658L2647039M1949942
$$ 106104583 115376331 124674809 135209334 152921300 179863958 212510997 254460939
39505B54460939O4005584Q3660411O8285458J2134158m4879961o0175423l8177362
$$ 254460939 318466523 402126934 470412392 482546550 437666589 377491166 339313804
39498C39313804j8620609k3930109l9565952m4211729l7145798k9368034k4524143
$$ 339313804 320693195 296763086 257197134 212985405 175839607 146471573 121947430
39491A21947430j9446022j4106162j1019006r292339o310339k617633n31941l77811
$$ 121947430 102501408 88395246 77376240 68083901 61773562 59155929 58623988 58246177
39483E8246177j364479l581046o395364p465161n814370l629871l042990l352268
$$ 58246177 56881698 53300652 46905288 39440127 33625757 29995886 26952896 23600628
39475B3600628l045869k259760j676830j128373o19970p59880j222624q55774
$$ 23600628 20554759 18294999 16618169 15489796 14869826 14109946 12887322 12031548
39467A2031548O0752j5159j006409j156155l14539l12741j405872j557731k14500
$$ 12031548 12092300 12077141 11070732 9914577 9600038 9287297 7881425 6323694 6109194
39458F109194N43721j40448l03139R90345J604014J70938j235236o49774M76055
$$ 6109194 6652915 6512467 6209328 7199673 8803687 8974625 7739389 7089615 7565670
39449G565670J25917p48908l49798N99844N04207k4206L89171J037367N54289
$$ 7565670 7691587 6942679 6592881 7192725 7696932 7672726 8061897 9099264 9653553
39440I653553l40591k89202p281p00776j231849k361J577137R49152j079390j319569
$$ 9653553 9312962 9023760 9016479 8315703 7083854 7081493 8658630 9607782 8528392 7208823
39430G208823N95242J674840N63946m96728L18772J609387J430416K35961n46118
$$ 7208823 7804065 9478905 10042851 9546123 9864895 11474282 12904698 13140659 12594541
39421A2594541q78491j324420j411373m75853Q62795J466207J168553M72705m17878
$$ 12594541 11716050 10391630 8980257 8504404 9367199 10833406 12001959 12474664 12056786
39412A2056786j273844j377394m69894M69135M12425k56240m39111k9696J23750
$$ 12056786 10782942 9405548 8935654 9404789 9817214 9560974 9121863 9092167 9215917
39403I215917k55802m25932J45836Q80409Q22615m8992o51013l8756J360091K160552
$$ 9215917 8960115 8534183 8680019 9560428 10383043 10334051 9683038 9644282 11004373 13164925
39393A3164925J811314J363306J856839K596551K233913J248359J677056M044998
$$ 13164925 14976239 16339545 18196384 20792935 23026848 24275207 25952263 29997261
39385B9997261O326913O917787P016467Q588149J1383427J3997075J6683042K0124190
$$ 29997261 36324174 43241961 50258428 58846577 70230004 84227079 100910121 121034311
39377A21034311K1536268J5620685J360333j4429769k2982121k2168803j7176482
$$ 121034311 142570579 158191264 159551597 145121828 122139707 99970904 82794422
39370H2794422j3445283j1591891r497097o610269m384426l719482l805798l401279
$$ 82794422 69349139 57757248 48260151 41649882 37265456 33545974 29740176 26338897
39362B6338897k227301r98582n63387j034511j623185j536211j005659r13060
$$ 26338897 24111596 23113014 22549627 21515116 19891931 18355720 17350061 16437001
39354A6437001j404069j691681j417574j192044j300541r77216J78758J083659
$$ 16437001 15032932 13341251 11923677 10731633 9431092 8453876 8632634 9716293
39346I716293O80443k03728N563J057826J100432m65402j959603j798619n84980
$$ 9716293 10396736 10193008 10198571 11256397 12356829 11891427 9931824 8133205 7548225
39337G548225L5901l12238o15007k53054J02103m41677j607107k109400j236568
$$ 7548225 7584126 7271888 6656881 6403827 6505930 6064253 4457146 2347746 1111178
39328A111178J27068N51198l831j45564P87661J567665R00534n18019j029806
$$ 1111178 1238246 1789444 1785613 1640049 2427710 3995375 4895909 4377890 3348084
39319C348084m61995l7547j81208j32640K16740p4596j067342j329112j35497
$$ 3348084 2886089 2848542 2667334 2534694 2751434 2676838 1609496 280384 144887
39310A44887J169820J115489K07679j36360K05453K79161j78385n53680n65523
$$ 144887 1314707 2430196 2637875 2501515 2706968 2986129 2807744 2254064 1688541
39301A688541m20523j9R07480J649147J178536l36054j399735j058039q3116J75464
$$ 1688541 1268018 1267999 2175479 3824626 5003162 4667108 3267373 2209334 2126218 2301682
39291B301682m45039q79543l34323O96269J071667M34881l65143m36165m7383
$$ 2301682 1856643 977100 642777 1339046 2410713 2845594 2480451 2044286 1996903
39282A996903j21713p03722p75714J74549J233674J271707M76028m09M20868J173685
$$ 1996903 1875190 1171468 395754 570303 1803977 3075684 3551712 3551303 3972171 5145856
39272E145856J344883N99557n43499j105633n91262K96739L47809n57842j195345
$$ 5145856 6490739 7090296 6546797 5441164 4849902 5146641 5494450 4936608 3741263
39263C741263o74571L98126R74504R82303R34461Q47038M81013J02582L0248j02968
$$ 3741263 3066692 3464818 4439322 5421625 6356086 7203124 7684137 7786719 7816967 7713999
39253G713999o54721j032399n51348K19105K31511k82508k80415R4200k94564
$$ 7713999 7059278 6026879 5475531 5694636 5926147 5643639 5363224 5457424 5162860
39244E162860j264811j125256N02494J494307J70685j950995k072601l2858J529422
$$ 5162860 3898049 2772793 3275287 4769594 4940279 2989284 916683 883825 2413247
39235B413247Q44174q49397j352019l94073N04664L77032j42811j13347L43229
$$ 2413247 3257421 2408024 1056005 661932 1166596 1543628 1400817 1287470 1630699
39226A630699N02362L06758L56395P38377P48978P2964n62007m81497j23443k11958
$$ 1630699 2133061 2439819 2796214 3534591 4283569 4356533 3794526 3313029 3189586 2977628
39216B977628m71148k07758K57955M7468n53126l28192P06696R90786p7677q91592
$$ 2977628 2506480 2298722 2556677 2604145 2051019 1722827 2429523 3420309 3342632 2451040
39206B451040m2719J332421J185848l26840j148849l67329Q45213J369505J438211
$$ 2451040 2408321 3740742 4926590 4599750 3450901 3083572 3928785 5298290 6736501
39197F736501J329428M44557j310013k488597j768188N1314R64572L36399n89096
$$ 6736501 8065929 8510486 7200473 4711876 2943688 2995002 3959574 4295973 3706877
39188C706877o48306j30336K5606m50393j047386j181993p00849K8067L94559
$$ 3706877 3058571 2928235 2953841 2503448 1456062 274069 -426780 -398713 -4154
39179d154J82889j11295L8611L63484K45763j55453r6489L74992L02343n29121
$$ -4154 178735 67440 106051 469535 715298 559845 463356 838348 1140691 611570
39169F11570r45623j63516Q10327O83234l8082P7396Q96080Q06930o40475j838920
$$ 611570 -334053 -497569 312758 995992 957910 1035306 1931386 2738316 2097841 258921
39159B58921j405574o898Q47460P40638K40569k31653m92924k37583M95988R76979
$$ 258921 -1146653 -1153551 -306091 434547 675116 443463 -49461 -287044 208944 1185923
39149A185923O83853J13310k789K13038J91123j22362m82113r75251j577910j623700
$$ 1185923 1869776 1983086 1980297 2193335 2384458 2262096 1779983 804732 -773178 -2396878
39139b396878o95483M21008P17819M59604N58817Q85409N65177k65315m96429
$$ -2396878 -3092361 -2671353 -1953534 -1493930 -935113 -49704 515473 250158 -246271
39130b46271J15533N91242M13118J66543J98361N6761k93772j41920M86643M69180
$$ -246271 -130738 460504 873622 1040165 1238526 1295287 1001515 859595 1346238 1815418
39120A815418m90625j018204j95543Q14700N71256l97299o52697j82944J4868
$$ 1815418 1324793 306589 111046 925746 1497002 1099703 447006 264062 278930
39111B78930l5515M54904J129362P72103m69795j008733k92869L82182J24986
$$ 278930 243415 698319 1827681 2599784 2129989 1121256 828387 1210569 1335555
39102A335555j57778M30427J028236M05524r02457j331160o31258l7391k38089
$$ 1335555 1177777 1608204 2636440 3041964 2139507 808347 177089 139698 -98391
39093i8391n33256k59384J12360q5138m85212k32911N90813R50380L47613l79348
$$ -98391 -631647 -891031 -778671 -863809 -1349021 -1581932 -991119 -40739 306874 -72474
39083g2474j89992O66624R77496L08020l58550o8864O76741O54611k86056j039448
$$ -72474 -262466 404158 1381654 1689674 1331124 1262260 1939001 2593612 2307556 1268108
39073A268108q57927k74121q1823j46171J44937O90294O93390j72643j209611
$$ 1268108 410181 136060 54237 -91934 53003 743297 1436687 1264044 54433
39064E4433j482041q25981J10263O24839N68076K79459J15811J14502N7945k18404
$$ 54433 -1427608 -2253589 -2143326 -1518487 -950411 -670952 -555141 -440639 -382694 -601098
39054f01098n85836o45614p5358Q75976J328592O05020p54149j279163k46447
$$ -601098 -1186934 -1832548 -1907906 -1031930 296662 901682 147533 -1131630 -1378077
39045a378077J337185J944178J349638N23325m507o23917j426134j666285r84209
$$ -1378077 -40892 1903286 3252924 3776249 3771742 3147825 1721691 55406 -928803
39036i28803k12292j82072m46601r9616O83525R74602O39752M16386M95148K01418
$$ -928803 -1141095 -1323167 -1769768 -1869384 -1185859 -211257 428495 844881 1340029 1541447
39026A541447o28255j037782l38070O99384Q33619P5094m11094K9170P34052P48850
$$ 1541447 913192 -124590 -462660 236724 1070343 1145437 734343 763513 1497565 2246415
39016B246415J01154l42820r2363L41515K02487m23868p33484l98501l1805j34886
$$ 2246415 2347569 2004749 1912386 2253901 2456388 2032520 1299036 900535 868730 733844
39006G33844k16797L24534R26187N38893n44204p98256K61878J146616M90840
$$ 733844 517047 841581 1767768 2306661 1762457 964201 1226079 2372695 2863535
38997B863535r11391j254831k76355N54201J80445q23784j278941p63704K55517
$$ 2863535 1952144 697313 420958 975159 1155604 331820 -947121 -1710825 -1455308
38988a455308J020690J029752M51636L4702K06750M48137J04173m80243m65203
$$ -1455308 -434618 595134 1046770 1081472 1288222 1736359 1840532 1360289 895086
38979H95086M8670J43761l24842m21734K81175R45013Q25386L37985O7274k70941
$$ 895086 943756 1087517 762675 340941 622116 1567129 2392515 2730500 2797774 2526833
38969B526833r48331j222999m39154N02364J69830j148341j619776m30503J078480
$$ 2526833 1578502 355503 -83651 418713 588543 -559798 -2179574 -2610077 -1531597
38960a531597J279110K90439m67875j33977P82781J146729L73129r69177j615619
$$ -1531597 -252487 37952 -429923 -563900 218881 1365610 1738739 769562 -846057
38951h46057r17961L33979Q16879L29770p9794K99152R00759Q52453J88716m10378
$$ -846057 -1764018 -1430039 -613160 -283390 -363184 -64032 836727 1689180 1877896 1467518
38941A467518n66726l60052K0396K34946j75553j090549j503890o55843P64318
$$ 1467518 900792 540740 561136 796082 620529 -470020 -1973910 -2629753 -1865435
38932a865435J353724Q24464K11889K07030K93209o7918l69555L3174O38650M39665
$$ -1865435 -511711 312753 524642 731672 1024881 956963 587408 620582 1259232 1698897
38922A698897m57307q96706l62325L76040N31208L01714J77362Q2255j36729o8612
$$ 1698897 1241590 344884 -17441 358599 889807 1191521 1368883 1451138 1314409 1245797
38912A245797N67942J089642O63415l46509q45405o41669n16616p02373n56875
$$ 1245797 1813739 2903381 3566796 3220287 2374882 1733213 1216597 514224 -42651
38903d2651j729P4526n40963o65319L63570J220984M27944j189971j535562l41506
$$ -42651 -44380 30146 -510817 -1176136 -812566 408418 836362 -353609 -1889171 -2230677
38893b230677N29922j3362q09524m62441N80028R41119L54399k80161l65227j58358
$$ -2230677 -1700755 -1714117 -2523641 -2986082 -2406054 -1464935 -1110536 -1390697 -1755924 -1914282
38883a914282j9564J43700N83432J210040J462622P35200p79764j787120j099495
$$ -1914282 -1933846 -1790146 -1206714 3326 1465948 2201148 1421384 -365736 -1465231
38874a465231O94362J563774M85048j182931j450134k16486Q45839N92053l82094
$$ -1465231 -770869 792905 1277953 95022 -1355112 -1571598 -725759 -133706 -515800
38865e15800q32073l43208N18011R63747O18560k51819r23658q42907j95382K99052
$$ -515800 -1347873 -1691081 -1173070 -209323 409237 157418 -766240 -1609147 -1804529 -1505477
38855a505477J83711l06551n99055l88667J09989L86223J28554m33797p55795
$$ -1505477 -1321766 -1628317 -2227372 -2616039 -2506050 -2119827 -1991273 -2425070 -3180865
38846c180865n54356k682O00549J012451R09530J33701p34141p15380K08470P57602
$$ -3180865 -3735221 -3737903 -3137354 -2124903 -1215373 -1081672 -1815813 -2531193 -2322723 -1565121
38836a565121Q4361p80361k65955J310608J978445Q75237n71573p91490k09842
$$ -1565121 -1480760 -2261121 -2527076 -1216468 761977 1637214 1065641 274151 64309
38827F4309k46343j009552j288585n54360L28002N69770N43401Q86502J339031
$$ 64309 -182034 -1191586 -2480171 -3034531 -2706529 -2136759 -1593358 -706856 632175
38818F32175J180981L50294n54648j077427j086453m81653N07523R65657K22229
$$ 632175 1813156 2163450 1608802 531375 -555078 -1036731 -529208 436449 658678
38809F58678q51842o18801R15890J695020M04390j442883j476843K38503J426468
$$ 658678 -193164 -811965 103925 1798945 2203335 760452 -716391 -477888 948580
38800I48580P92318o12986j297263j032452k63782P24758J383784R13930m47572
$$ 948580 1740898 1127912 -169351 -1201803 -1465585 -740827 642957 1556887 1109315
38791A109315j214568n83091M08746N22931P9955J5172J97519J5484j93134K03181
$$ 1109315 -105253 -688344 -279598 243333 323288 338460 535979 551463 358329 561510
38781E61510O51007J75172p71392q51777l9593L94411P4491j9102M82803O23005
$$ 561510 1212517 1387689 616297 -235480 -275073 119338 193829 174727 657530 1280535
38771A280535q9662p32304n61494j85535k72180l05477L35322J031457P78531
$$ 1280535 1190873 458569 -102925 -288460 -560640 -866117 -530795 500662 1279193
38762A279193k50157r71872p96851j7140P87878J122782P80211J62776o3591M7505
$$ 1279193 1029036 57164 -739687 -756827 31051 1153833 1934044 2096820 2033229 2080734
38752B080734k20916q99351j012169j73022N41883J54662p09457q61718k97408
$$ 2080734 1859818 960467 -51702 -224724 317159 471821 -237636 -1099354 -1396762
38743a396762J41619J65647M7808j29094k00150M15626J629265J981133M04810
$$ -1396762 -1255143 -1089496 -1041688 -1170782 -1370932 -955306 673959 2655092 3059902
38734C059902j858362k582854j412936P8275Q13676J044464R64373L34831l29862
$$ 3059902 1201540 -1381314 -2794250 -2715975 -1902299 -857835 106538 441369 111507
38725A11507L4739J197437J541707L82217j020011j338096p66854j42791K35106
$$ 111507 146246 1343683 2885390 3267607 2247596 909500 142646 -145 234961
38716B34961K59580k66055q77258o07109M47325R54819L95585j23095J18743K02704
$$ 234961 494541 228486 -648772 -1255881 -808556 146263 541848 418753 537496 740200
38706G40200n47217j024560j95897Q79454O52028m02343p54287l94392m11361
$$ 740200 192983 -831577 -1027474 -148020 504008 101665 -652622 -1047014 -1458375
38697a458375o96780k43893O57435P32163Q4485M8801O42057M62381n62395p28121
$$ -1458375 -2155155 -2399048 -1741613 -1009450 -924965 -876164 -234107 228274 -334121 -1062242
38687a062242M19818R73530k31918j522839r78755O17119J212373N32463j61421
$$ -1062242 -642424 331106 99188 -1423651 -2402406 -1785287 -572914 -40451 -201872
38678b01872l43443l76160j27586O91158J263881N59335p53596j027302k01890
$$ -201872 -545315 -921475 -1049061 -357903 905978 1465313 711717 -315585 -517475
38669e17475J05332p37036j358021o07821O81342J028598L50841k40777m7510
$$ -517475 -412143 -1149179 -2507200 -3115021 -2433679 -1405081 -1054240 -1295017 -1342527
38660a342527N92283R46619O55445N0197j37974L19493O52816P7225q89387r72980
$$ -1342527 -750244 196375 851820 902017 764043 1083536 1736352 1813577 924190 -48790
38650d8790p845P91596O22837K0842m06720r12939j529153j285271K75320J706335
$$ -48790 -56635 734961 1357798 1378640 971920 58981 -1470172 -2755443 -2480123 -773788
38640g73788J271065n02337j389233n11275O72009P02032O1298L6702O75776R09604
$$ -773788 497277 -5060 -1394293 -1905568 -1233559 -531527 -470229 -433527 242249 1151853
38630A151853K26181p49751j241865j106556n38380L50121J307666J701869J005152
$$ 1151853 1378034 628283 -613582 -1720138 -2258518 -1908397 -600731 1101138 2106290
38621B106290m59459j584051j491585m17253N52523O06360j7358l76112J38975
$$ 2106290 1646831 62780 -1428805 -1846058 -1293535 -687175 -704533 -1080645 -941670
38612i41670J133106J561587Q01022o26604j538167j343802n84548r4532o851
$$ -941670 191436 1753023 2554045 1927441 389274 -954528 -1539076 -1633608 -1640459
38603a640459L1702M1246k00654m08644j9P92601R02107l5302r02618n46365N85007
$$ -1640459 -1608757 -1567511 -1768165 -2176809 -2176828 -1384227 -482120 -517422 -1420040 -1966405 -1381398
38592a381398J077887M77119l22108n02914k66720j76084k81812k74086n9385
$$ -1381398 -303511 173608 -148500 -651414 -918134 -1094218 -1376030 -1650116 -1709501
38583a709501J87794L29381L49444K44359J3166k55123l66753j64724K43015M75866
$$ -1709501 -1521707 -1192326 -842882 -598523 -585357 -840480 -1207233 -1371957 -1128942 -653076
38573f53076L12950P2761K06964N33774M12418j94722n13285j57287J91497q9748
$$ -653076 -340126 -267365 -60401 473373 885791 691069 177784 20497 211994 122246
38563A22246m34932M5727J034840J330450M95566p12940j437662j414833p41289
$$ 122246 -312686 -266959 767881 2098331 2593897 1880957 443295 -971538 -1712827
38554a712827J65956N22299K0822m32691J39030J107697R98257j36632o61573
$$ -1712827 -1546871 -1024572 -1003750 -1436441 -1297411 -189714 808543 671911 10338
38545A0338N6531O85325J95288n63331n67383l71105p81013j091557l35861O60975
$$ 10338 66869 752194 947482 384151 -183232 -554337 -1335350 -2426907 -2762768 -2101793
38535b101793L89244p06842o83053Q51972K013552J372380j66383q81474m10652
$$ -2101793 -1712549 -2419391 -3102444 -2250472 -236920 1135460 969077 87603 -323049
38526c23049L60707O87481M67024o1444m78825m15104k3399J13793k17922n85763
$$ -323049 37658 725139 1192163 1130719 651894 236790 213391 327184 109262 -476501
38516d76501o04480l97683j58875J80185N44807N37049O8220k83208j4923N12817
$$ -476501 -1080981 -1478664 -1637539 -1457354 -912547 -375498 -307278 -590486 -605409 -92592
38506i2592N10249j70898q12944p05137N319M74422J70758m23066l92547L39722
$$ -92592 417657 246759 -566185 -1271322 -1266003 -791581 -620823 -1043889 -1436436 -1096714
38496a096714Q33998M64344j87717l06013q2223j41608k47798K65420J023191
$$ -1096714 -262716 201628 13911 -292102 -374325 -515933 -763731 -498311 524880
38487E24880R05753j00127o96081k87059J12536l55859r20575m34523P74145J382132
$$ 524880 1430633 1330506 634425 347366 459902 104043 -816532 -1251055 -476910 905222
38477I05222Q81060m8976o36436o55346j96459M64227Q62307P20303K27205l16477
$$ 905222 1786282 1737306 1100870 445524 249065 713292 1575599 2295902 2523107 2206630
38467B206630q10530j088913q65910k78511R0568Q8095K28318O64148P25930M3092
$$ 2206630 1396100 307187 -558723 -837234 -746666 -658571 -430253 233895 959825 1002917
38457A002917p04704q33069o22940n19922k74018K74070N33243K87298M02375
$$ 1002917 298213 -534856 -1157796 -1677718 -1951736 -1677666 -1144423 -857125 -454750
38448d54750J200108J322769j72900j735160j352639K54248Q11900J55203N841
$$ -454750 745358 2068127 1895227 160067 -1192572 -938324 -126424 28779 34620
38439C4620M73516q1414j454559j236855R40908K066913L48101j806368j606504
$$ 34620 508136 426722 -1027837 -2264692 -1323784 743129 1091230 -715138 -2321642
38430b321642n7776L45639j53921K06970R80023M57195o82146k44914J384246
$$ -2321642 -2379418 -2033779 -2187700 -1980730 -1000707 -543512 -1225658 -1470572 -86326
38421h6326J577552o075p50584L73733J009676m88453k195049j770456m4223P36980
$$ -86326 1491226 1485151 734567 1108300 2117976 1629523 -565526 -2335982 -2380205 -1643225
38411a643225L89438K69471O21997O61271M03121M09237L48035l66710j038509
$$ -1643225 -1253787 -984316 -362319 298952 702073 1111310 1459345 1092635 54126
38402E4126n57402N76922Q00862j64329j070817j080018m72012L62808J118815
$$ 54126 -503276 73646 874508 710179 -360638 -1440656 -1912668 -1549860 -431045
38393d31045R95514l74962j551479p64109J131895J374865m95220j539437K06172
$$ -431045 564469 189507 -1361972 -2126081 -994186 380679 -114541 -1653978 -1447806
38384a447806K505942K137433l27680j571912n43636M23296l61632j483896j046798
$$ -1447806 1058136 3195569 2867889 1295977 752341 1175637 814005 -669891 -1716689
38375a716689L32242P71958O7949l79920N7919N92289N81463L09764O9724l04537
$$ -1716689 -1384447 -612489 -544540 -924460 -866541 -274252 307211 616975 686699 382162
38365C82162o82080m86433K61811O80940L06229k13419k33875o8125j61262j95762
$$ 382162 -299918 -786351 -524540 156400 462629 249210 15335 -52790 -214052 -409814
38355d09814J22288K24430l07565o60298j7154P87534M08520o65874p36628K77879
$$ -409814 -287526 -63096 -370661 -1030959 -1048113 -260579 147941 -517933 -1254561 -976682
38345i76682O67480j53177o82920l033O84238L25449j36525K97431O73241j02704
$$ -976682 -309202 -462379 -1145299 -1148332 -464094 -138645 -275170 22261 695502 592798
38335E92798r53092l40158Q64457O45974p73840j355922o46146j66602m71562
$$ 592798 -360294 -700452 164005 809979 36139 -1319783 -1965929 -2132531 -2604093
38326b604093m58850R5589L329o70373j20080J859313K658884P12002j706096
$$ -2604093 -3062943 -2967354 -2964025 -3634398 -3754478 -1895165 763719 1475721 -230375
38317b30375j710574j8498N97280k21444l38978R60247J802562Q80612n39444
$$ -230375 -1940949 -1959447 -1362167 -1583611 -1922589 -962342 840220 1720832 1181388
38308A181388p35982j3250J49257n33683q77515q9283J020165J026190k09001
$$ 1181388 445406 432156 581413 47730 -829785 -919068 101097 1127287 918286
38299I18286j157028m96627J011805J381401J22036j038776o37805N03949P04695
$$ 918286 -238742 -735369 276436 1657837 1779873 741097 103292 607241 1311936
38290A311936r9597n99902k59676J80943J64732N529J3217m7305l91479q15367
$$ 1311936 1212339 612437 352761 533704 698436 703965 717182 669877 278398 -536969
38280e36969r99052p26980P6545J021916J254357M47981m79866m07456M53575
$$ -536969 -1536021 -2263001 -2186456 -1164540 89817 537798 57932 -349524 104051
38271A04051Q54561K20008p09153r37967l12516M60958N18820k83072r94293n38751
$$ 104051 958612 1178620 469467 -468500 -781016 -320058 198762 -84310 -1078603 -1617354
38261a617354P55492J419100R63931N69768R91079J194647K39163q91254r15087
$$ -1617354 -861862 557238 1521169 2090937 3082016 4276663 4515826 3624572 2709485
38252B709485m57239p23622j081717k19033J104374R72596m62916j239169q49514
$$ 2709485 2252246 1528624 446907 227874 1332248 2304844 1841928 602759 -246755
38243b46755o13853p98712j90630J109453J334571K07879l22069N42725J055090
$$ -246755 -860608 -1659320 -1849950 -740497 594074 801953 479884 1022609 2077699
38234B077699J01105q80240o09669p2051k65610k76777N63043R27634p2301r13409
$$ 2077699 2178804 1298564 688895 616844 351234 74457 637500 1565134 1492833 579424
38224E79424k84443M54467k01494j011706k97474P80338K25084j123385j067120
$$ 579424 294981 749448 547954 -463752 -761226 19112 244196 -879189 -1946309
38215a946309J03236M79519J85732P71936J724702J093199p44352j369971l29944
$$ -1946309 -1843073 -1363554 -1177822 -405886 1318816 2412015 1667663 297692 -32252
38206c2252M25335J47518M2116K46521n14073j788133j400822N90041J371193
$$ -32252 393083 540601 582717 829238 315165 -1472968 -2873790 -2283749 -912556
38197i12556p0078j228362l52613Q49889N97197J6049N32805J039305J47483j037011
$$ -912556 -982634 -2210996 -2563609 -1713720 -1116523 -1100474 -567669 471636 619119 -417892
38187d17892r12893j53829j8390J97414J402691K156593P47299j514564k000713
$$ -417892 -1330785 -1484614 -1503004 -1305590 97101 2253694 3000993 1486429 -514284
38178e14284p79999n7559l45211j39803R02709J344262O42556p2412k09887m71145
$$ -514284 -1294283 -1351842 -1697053 -1836856 -934147 410115 1052671 980259 770372 299227
38168B99227j023319r93670k56947J59160l7349J27490R79293J440959Q80479
$$ 299227 -724092 -1717762 -1974709 -1815549 -1852898 -1725408 -746115 694844 1575323
38159A575323J70819J10621J72893k63782o47361k84745K58501m9172r84871j226272
$$ 1575323 1746142 1856763 2029656 1765874 1118513 833768 1092269 1043097 58226 -1168046
38149a168046k09947R71686Q92024l53720j195130o56927K66811R4094p79446
$$ -1168046 -1377993 -406307 485717 131997 -1063133 -1720060 -1453249 -1359155 -2138601
38140b138601o17462P68027J516915P41606J5838N39963Q60644n24629k056996
$$ -2138601 -2756063 -1988036 -471121 270485 286323 826286 1686930 1162301 -894695
38131h94695j351443O71262J074655k35975m21787J317737K224530N28264j669936
$$ -894695 -2246138 -1574876 -500221 -736196 -1157983 159754 2384284 2912548 1242612
38122A242612j812735n79247p4746m02257l41076O0842q8473m70419q2890P65892
$$ 1242612 -570123 -1149370 -1224116 -1626373 -1967449 -1906607 -1995080 -2465499 -2548389 -1782497
38112a782497Q97420L11057Q8663N11649Q23778P22424O77832Q22924P68877M98859
$$ -1782497 -885077 -574020 -485357 26292 850070 1572494 2250326 3073250 3842127 4340986
38102D340986L53735K08326l03710q73223q73150n08894n34456r02289q17191
$$ 4340986 4694721 4903047 4599337 3726114 2852964 2344070 1809614 907325 90134
38093I0134j51888L27082K86323K63716N11613M84498o6148m47793r1171N07650
$$ 90134 -61754 265328 551651 815367 1326980 1811478 1745330 1297537 1206366 1714016
38083A714016O17160M84983R26812J939793K470081J682524J6062j274661j475486
$$ 1714016 2331176 2816159 3742971 5682764 8152845 9835369 9851431 8576770 7101284
38074G101284j074405j014130j501413j872698j592274r03381k82953K54943Q62082
$$ 7101284 6026879 5012749 3511336 1638638 46364 -857017 -1139970 -885027 -22945
38065b2945J235975R16196Q3024n04832m14147K7823K38849n411m82401p82096
$$ -22945 1213030 2129226 2212250 1707418 1293271 1321094 1559943 1554532 1072131 290035
38055B90035o63265l22176j80543k68115j32361L81594P12115M19780j1165Q1002
$$ 290035 -373230 -695406 -875949 -1144064 -1276425 -894831 -182716 237064 225899 306901
38045C06901L58351j38p62720p64578K32365R55006M91318k55088O0677J073234
$$ 306901 665252 665114 -97606 -862184 -629819 325187 816505 561417 622094 1695328
38035A695328J144095k16337j540767j309113K33402J645007J998285J410331
$$ 1695328 2839423 2623086 1082319 -226794 6608 1651615 3649900 5060231
38027E060231L59451p43698j465597j562187j341401j248292j073497k44741R84307
$$ 5060231 5419682 4675984 3210387 1648200 306799 -941493 -2014990 -2259731 -1275424
38018a275424J476837P76926n2104J40956R45197J060328J95268p15014r77746
$$ -1275424 201413 978339 926235 1067191 2012388 3072716 3267984 2552970 1575224
38009A575224p76190l78111K05418O35198L94243j88678j07360P49291J271985
$$ 1575224 799034 420923 626341 1261539 1655782 1467104 1359744 2109035 3381020
38000C381020Q99104N46511R49568J193764J11229j645443k319050j453287k60105
$$ 3381020 4280124 4826635 5776203 6969967 7081196 5435753 3116703 1663416 1403311
37991A403311K65447L26592L58191K84309O3340j3554Q910l98514j250186j602609
$$ 1403311 1668758 1995350 2353541 2637850 2701190 2687636 2696546 2298032 1047846 -554763
37981e54763p25919P39845J430257Q51985j98250p49128o97949n70713n93131
$$ -554763 -1280682 -540837 889420 1741405 1543155 794027 96078 -474635 -1067766
37972a067766m35015R7679N67546M77808O8890j3762K48207K26463k45561m94438
$$ -1067766 -1502781 -1405102 -837556 -359748 -290858 -304620 -56413 170050 -75511 -569949
37962e69949o3467N42556O45912L44198J38101J23682J14641J21352J64101K7687
$$ -569949 -633416 -90860 555052 899250 1037351 1161033 1275674 1397026 1561127 1588814
37952A588814l06176m45425k63177k11644m73685n14544q6855J43119k32252m44326
$$ 1588814 1282638 837213 574036 362392 -111293 -625837 -712692 -569573 -801825 -1246151
37942a246151J71316Q26336M70070m02662n64032p4899Q3287o0639L38660J026655
$$ -1246151 -1074835 -248499 221571 -181091 -745123 -820022 -736735 -797374 -458714 567941
37932E67941P77487m45327j213046q32844j98721l8321J10491O19584R29354O49236
$$ 567941 1345428 900101 -312945 -1145789 -1344510 -1382831 -1272340 -652756 276598 925834
37922I25834K43877L0502l25831q09420p61248r9660L55087K29378O0468P1852
$$ 925834 1169711 1200213 874382 64962 -696286 -795946 -440859 -211481 -151013 -79161
37912g9161j42379l83893J12619R96669R40848Q148j35057Q45472J070999k82914
$$ -79161 -221540 -605433 -492814 503855 1444703 1452851 1317794 2163266 3234265 2951351
37902B951351j233482l07531O66055m84013k358590j955859N63238K100454J222171
$$ 2951351 1717869 1410338 2076393 1592380 -766210 -2722069 -2158831 -58377 1163794
37893A163794k53165m24782L18375O42116K03615l90544m75961Q2863N48968m4812
$$ 1163794 910629 485847 804222 1446338 1649953 1259409 783448 866311 1415279 1370467
37883A370467j247558j221524N03987J726664O98835r23752n67940J103970J385234
$$ 1370467 122909 -1098615 -594628 1132036 1830871 907119 339179 1443149 2828383
37874B828383L5575n96979K97006R98964O37449M23513R56420J257639J185346
$$ 2828383 2863958 2266979 2563985 3562949 4200398 4623911 5580331 6837970 8023316
37865H023316J895973L162330L362231L087418N182014R400110J0574453M985760
$$ 8023316 9919289 13081619 16443850 19531268 24713282 34113392 44687845 49673605
37857D9673605m009200r747987r819836p031645m492079k909741j954812j367659
$$ 49673605 45664405 35916418 26096582 19064937 14572858 11663117 9708305 8340646
37849H340646p27949q524m3721j073707j767542j209533n77631j036690j428085
$$ 8340646 7612697 7604173 7560452 6486745 4719203 3509670 2932039 1895349 467264
37840D67264l11482J097576P23000p55663j035934j21710O7021m71899J53357
$$ 467264 155782 1253358 1976358 1220695 184761 63051 130072 -341827 -188470
37831a88470J789357J869679k52598j897715j232706R5854Q7220m92188q0787
$$ -188470 1600887 3470566 3217968 1320253 87547 183401 270621 -221567 -302354
37822c02354P24590M09725p16236j122476m81119K70332O19242P49527O48351
$$ -302354 422236 831961 115725 -1006751 -1487870 -1217538 -598296 151231 799582
37813G99582J85771l00902m18210k91863j16287K33203O24831N43486N6248o5472
$$ 799582 985353 684451 266241 -25622 -141909 91294 716125 1259611 1315859 1250387
37803A250387L02518L24926j69628j34023Q04429J373786P04902o6456L95158
$$ 1250387 1552905 1877831 1708203 1574180 2378609 3752395 4457297 4390841 4785999
37794D785999J498931J910323J709979J819327K414624L541232N922270Q950221
$$ 4785999 6284930 8195253 9905232 11724559 14139183 17680415 23602685 32552906
37786C2552906R145099L673754m848042j0093183r103079n106224k609017k320283
$$ 32552906 41698005 45371759 40523717 30430534 21327455 16221231 13612214 11291931
37778A1291931k298480j743677j414404j537028j458359r91426n66597k55733
$$ 11291931 8993451 7249774 5835370 4298342 2839983 1848557 1281960 1026227
37770A026227J72377M44260R8177n33979o35270j57264J00764k73415p44917o70902
$$ 1026227 1198604 1642864 1741041 1207062 571792 414528 515292 241877 -503040 -1173942
37760a173942j01180M84112Q00297Q66358P43446M10531j22429o53020q32541
$$ -1173942 -1275122 -791010 9287 875645 1619091 2029622 1907193 1254173 421632
37751D21632n36606j55207j99582n33595l97572N23357J410403J160558j94063
$$ 421632 -114974 -270181 -469763 -1003358 -1400930 -877573 532830 1693388 1499325
37742A499325j369794j225618Q406J044574R41683K6377o17954m38446O8229J82082
$$ 1499325 129531 -1096087 -1087681 -43107 898576 924953 306999 -131447 -63218 118864
37732A18864p7113j92159p3246j22776m19705n20116k29542Q3956K14357M61736
$$ 118864 41751 -150408 -223654 -346430 -766135 -1286251 -1515793 -1431837 -1217480 -755744
37722g55744Q39037O87407k28024r17056m35136N15955M63434n40269q88330O6064
$$ -755744 83293 770700 542676 -374380 -809516 -293561 169873 -370396 -1258726 -1192662
37712a192662Q98101K87597q95651q83341L80091J299148R72132R1785n02478
$$ -1192662 -294561 -6964 -902615 -1785956 -1405865 -106717 865415 957200 454722
37703D54722q11272q84345l34765O68878R96484P8690r57447p27110M05800R10506
$$ 454722 -356550 -1240895 -1575660 -906782 89702 168392 -789055 -1516165 -1110365 -199859
37693a99859L30209l09572k73915k7401j06837k41693j09595J804q0486J22780
$$ -199859 130350 -179222 -453137 -480538 -587375 -829068 -938663 -936859 -1017345 -894565
37683h94565Q00972J114258L29602q29928j008405j15640O41731N55816J82826
$$ -894565 -93593 1020665 1350267 520339 -488066 -603706 38025 593841 776667
37674G76667J36661J47753j77977m88181k99200M5242j43974o82771o24429K93749
$$ 776667 913328 1061081 883104 394923 95723 140965 -3009 -685780 -1310209 -1016460
37664a016460J053564O46952n01257j021333l71660N30366O20790L8925l01584
$$ -1016460 37104 684056 182799 -838534 -1210194 -679828 -59038 -20113 -321697
37655c21697p8416K00781K08418K57548N30263N47898q5109q76910j003346m38339
$$ -321697 -400113 -199332 9086 266634 796897 1344795 1259686 382776 -620570 -1058909
37645a058909O9002Q4000p473L13163R41087J289214R47315O1650p82942j009115
$$ -1058909 -989907 -905907 -913380 -600217 340870 1630084 2577399 2639049 1856107 846992
37635H46992n62306k5771k3312m57925n88915m376P23815O60003k80322j087145
$$ 846992 284686 258915 235603 -222322 -811237 -815613 -91798 568205 287883 -799262
37625g99262q00700L47530J249409J237238O47515O8453l87125p75355q58623
$$ -799262 -1599962 -1252432 -3023 1234215 1881730 1950183 1563058 787703 -70920
37616g0920m80744J1037K99903O30638J111417J013478j69790j370416j089380
$$ -70920 -551664 -540627 -240724 389914 1501331 2514809 2345019 974603 -114777
37607a14777J91362M41510p42001j301373J983J360856O23622j258654j645665
$$ -114777 76585 518095 -223906 -1525279 -1523296 -162440 461182 -797472 -2443137
37598b443137k09423Q55257M08037k30020J28164O83896L70294k64548j67956
$$ -2443137 -2652560 -1797303 -1389266 -1619286 -1491122 -807226 -436932 -701480 -869436
37589h69436L78245L64685j79893k70727M49820J188386J065363J07094q57599
$$ -869436 -491191 -126506 -306399 -577126 -127306 1061080 2126443 2233537 1375938
37580A375938j007755l22666L46259K45794k80790k74899L72550P10630K10272
$$ 1375938 368183 45517 391776 637570 356780 81881 454431 1165061 1375333
37571A375333l90143k35290L63831M82549o8067o43976p36189m33422q2504M7130
$$ 1375333 985190 749900 1113731 1596280 1528213 884237 148048 -285374 -367878 -320748
37561c20748j18682l60151l47762j18643p1102l00286l58805N1150N83854P61648
$$ -320748 -439430 -799581 -1147343 -1265986 -1337088 -1637374 -1996179 -1945029 -1361175 -599527
37551e99527N48754J14005m66385q96424o29319L16948J022998P70329O1874j11157
$$ -599527 -50773 63232 -403153 -1299577 -1928896 -1611948 -588950 181379 243253 132096
37541A32096L48534P05306N41333R0475l88559p99156q50230k91083M44973N49674
$$ 132096 480630 1185936 1727269 1817744 1429185 630029 -220201 -511284 -66311 483363
37531D83363n6983n64651m02489P0663K69082J95837J49413Q1284k05516m66059
$$ 483363 426380 -138271 -540760 -470097 -201015 -5178 144235 225519 20003 -446056
37521d46056k20099M43919Q01764M52395o1352L135M51004L33005o51537j516095
$$ -446056 -666155 -222236 579528 1031923 970571 973706 1424710 1757715 1106178 -409917
37511d09917j160328J85492J215250J071891R8624q37971j202468r23007k27640
$$ -409917 -1570245 -1384753 -169503 902388 1001012 163041 -1039427 -1962434 -2190074
37502b190074M40888P17330O72018N91295M16431j47318r13791j156056n08748
$$ -2190074 -1749186 -1031856 -359838 231457 647888 500570 -413221 -1569277 -2078025
37493b078025M74670R41227O56952J13361j02038P5576J46867k72977p45473m70999
$$ -2078025 -1603355 -662128 -5176 108185 6147 81723 228590 -44387 -789860 -1260859
37483a260859L40103L91267p41043j510358m82358J249217J415414n3233r77684
$$ -1260859 -920756 -529489 -1270532 -2780890 -3263248 -2014031 -598617 -651850 -1629534
37474a629534k82494P29966R11809Q71802J106836O75873q05054j696075o72082
$$ -1629534 -1912028 -1182062 -270253 601549 1708385 2384258 1579204 -116871 -788953
37465g88953R21128R78323k49972r43061o62298l98686l39020J98844Q91223O13789
$$ -788953 132175 1110498 860526 -82535 -744833 -1143519 -1482539 -1283695 -392472 221317
37455B21317m45302q08377l5847O99483N96555J61751r6305l36608m50204K960
$$ 221317 -223985 -1032362 -1068209 -368726 227829 389580 293275 -43333 -493537 -490577
37445d90577N65385J36665j077434j409497j67279J213131J251196L79673j03088
$$ -490577 74808 211473 -865961 -2275458 -2442737 -1229606 21590 401263 298175
37436B98175L4835R7584k04076m90094l82558J40392P22305P36028n7810q95351
$$ 298175 333010 430594 226518 -263576 -646134 -505742 216563 952591 894781 -570
37426e70q01817k8205K61418j92178m17868M7647M15007J57357k8255M38937Q58560
$$ -570 -802387 -830592 -569174 -761352 -1179220 -1131573 -716566 -559209 -587464 -148527 710033
37415G10033L87244n34276q63233m16530J97318N53994N85728L05126R113K27691
$$ 710033 1097277 563001 -300232 -716762 -519444 34550 620278 925404 934517 1162208
37405A162208Q81710J070652K87848p58279j148935r67818q47206q80082p18133
$$ 1162208 2043918 3114570 3402418 2644139 1495204 527386 -319820 -1199902 -1918035
37396a918035l22367N5697L18390M39559L01262K5886L0951L65279M86252Q4335
$$ -1918035 -2240402 -2184705 -1866315 -1426756 -1125494 -1099608 -1068657 -703378 -217126 -132791
37386a32791l92659m14153l7826M08871P36091P24484K43078k18582N4318Q08189
$$ -132791 -525450 -939603 -977429 -568558 167533 892017 1135095 916513 970831 1779020
37376A779020R62872K61832l26626l03651m51026j210164j556962n94215P88134
$$ 1779020 2741892 3003724 2677098 2373447 1922421 712257 -844705 -1438920 -650786
37367f50786J075842J79805q05571j185671r27517o1638J021528J305050L36216
$$ -650786 425056 604861 -200710 -1386381 -2313898 -2375536 -1354008 -48958 287258
37358B87258q43043j010590m09099j6046R7943L98013N41282r0744r21089p62420
$$ 287258 -555785 -1566375 -1975474 -1991520 -1893577 -1495564 -954282 -1045026 -1966115 -2728535
37348b728535K87367R26599N66704r8108l80548k39743L03565J137116J444494
$$ -2728535 -2441168 -1514569 -947865 -1045973 -1426521 -1666264 -1362699 -225583 1218911
37339A218911M26849j192592j636324m01742R62008Q82324l12097j067656o23798
$$ 1218911 1645760 453168 -1183156 -1584898 -622890 259434 -52663 -1120319 -1744117
37330a744117K42671L52522l52243o93590J33906J229816J111793J861l92153
$$ -1744117 -1501446 -1148924 -1501167 -2194757 -2060851 -831035 280758 282619 -109534
37321a09534L64246O55609l56531j066730j23377J019612M09669j005228r00651
$$ -109534 254712 910321 553790 -512940 -636317 383295 792964 -212264 -1112915
37312a112915M88149Q56353j96515o87254J77725Q73677N16235K09720O03395
$$ -1112915 -624766 231587 35072 -652182 -474457 399220 915455 1125175 1728570
37303A728570O20839k88841q88923l59212K35320q7755o07519m54796q9633n6916
$$ 1728570 2349409 2060568 1171645 812433 1047753 959998 352479 -102317 -191950 -248866
37293b48866J01953N86918O31099J05647Q9069P79273P70660l88676j034532k35285
$$ -248866 -146913 440005 1071104 1176751 1265820 2045093 2815753 2427077 1392545 1157260
37283A157260M35553k37929p97582J06901R05404j35570j385221m07245J538539
$$ 1157260 1592813 1354884 557302 664203 1569607 1434037 48816 -358429 1180110
37274A180110J314453p43003j317887K89959J175792l8386j044780j04225J094244
$$ 1180110 2494563 1751560 433673 723632 1899424 1861038 816258 712033 1806277
37265A806277O93193k21867r874M86086k05775j165144n89318Q87700J023332
$$ 1806277 2499470 2277603 2267729 2753815 2548040 1382896 793578 1681278 2704610
37256B704610m62337j540358j017232L9666L15850L931n4708K10393K75304j6972
$$ 2704610 2242273 701915 -315317 -275651 40199 44130 -10578 199815 475119 458147
37246D58147k90593k40747n6580j52524n02824m91355K30697R77215P87641j44749
$$ 458147 167554 -73193 -129773 -282297 -785121 -1276476 -1045779 -68564 719077 574328
37236E74328o80000l98419N142J72885O10244J253098R80363m51277j350700l88946
$$ 574328 -105672 -504091 -498949 -326064 284180 1537278 2517641 2066364 715664 326718
37226C26718J119228R36680p87267j790620j018641J83410L55657k66861p01246
$$ 326718 1445946 2382626 1595359 -195261 -1213902 -1030492 -674835 -941696 -1642942
37217a642942o15801j88709L97464Q06132P20571M61650N73603O88358n9289j287376
$$ -1642942 -2258743 -2447452 -2049988 -1243856 -523285 -61635 511968 1200326 1141037 -146339
37207a46339j430881p3672J187189J016968J65609j3208L59981L69178L1462r5016
$$ -146339 -1577220 -1650892 -463703 553265 718874 705666 1065647 1434825 1466287 1371271
37197A371271k29911p86678j112866m03458O28873O76287M0517P2122O37932K67026
$$ 1371271 1141360 354682 -758184 -1161642 -532769 143518 184035 256157 894089 1161115
37187A161115j022315j325444L2172J177040O39680l63693j50622O35460L69829
$$ 1161115 138800 -1186644 -1154472 22568 662248 298555 147933 783393 1153222
37178A153222o88280r75507k55773M05672P57717J337841J628109M88792j433878
$$ 1153222 464942 -510565 -766338 -360666 397051 1734892 3363001 3851793 2417915
37169B417915j954373n55951O90430K60625o83235m83126L85050M58102k02340
$$ 2417915 463542 -92409 598021 858646 175411 -307715 77335 535437 333097
37160C33097m30867j25561k18241q13499r84103m05152K01184L68774M03216M24085
$$ 333097 -97770 -223331 -441572 -1255071 -2239174 -2644326 -2443142 -2074368 -1671152 -1247067
37150a247067Q2258m66099m42217K41743O05888J39721k73538K10986Q85618M91829
$$ -1247067 -1164809 -1630908 -2073125 -1831382 -1225494 -1085773 -1359311 -1148325 -262707 229122
37140B29122p51238j291254l55988J056605J470023N04029r86443j753733j075690
$$ 229122 -522116 -1813370 -2169358 -1112753 357270 861299 -125144 -1878877 -2954567
37131b954567N35733J501977P87420o05183o96629P07016J549048M70672j095070
$$ -2954567 -2418834 -916857 -129437 -734620 -1431249 -724233 824815 1295487 200417
37122B00417j041274K54743O59978l67738j194605q24143k26932k38864o2404
$$ 200417 -840857 -586114 73864 -293874 -1488479 -2312622 -2539554 -2778418 -2840822
37113b840822R86903J825617J189854k49970r19191o54403m16281l40485K20933
$$ -2840822 -1853919 -28302 1161552 911582 -7609 -662012 -1078293 -1418778 -1197845
37104a197845J050971J162624M99503n384j06523m37521q96638n10157O51278
$$ -1197845 -146874 1015750 1515253 1509869 1403346 965825 69187 -440970 210308
37095B10308J056011j3104j203786j110638l13240j90821o65873n55012L31347
$$ 210308 1266319 1253215 49429 -1061209 -1374449 -1565270 -2231143 -2786155 -2454808
37086b454808Q59786L43253m79994n42188J79732P59805M80185l72988q37621
$$ -2454808 -1595022 -1251769 -1731763 -2273951 -2094219 -1334414 -854229 -1227217 -2064838
37077b064838l44376O36642J159067Q78681K76996n6229N3015M37828O86528K94016
$$ -2064838 -2409214 -1772572 -613505 265176 542172 485943 538958 976786 1663314 1957330
37067A957330o71388j208805n05711O56515O43842p24182j721615j018540N91748
$$ 1957330 1285942 77137 -428574 227941 871783 147601 -1574014 -2592554 -2000806
37058b000806J422822R77568K3028p08671j017143q68321l32546K97559Q10478
$$ -2000806 -577984 399584 422612 -286059 -1303202 -2171523 -2504069 -2206510 -1396032
37049a396032J240719J446462J026857M4369p38181q27803o63647p72426q02314
$$ -1396032 -155313 1291149 2318006 2362375 1624194 796391 132744 -639682 -1441996
37040a441996q4734J169265J896885J363589o218r44312n36054O21275P64073
$$ -1441996 -1526730 -357465 1539420 2903009 2896791 1952479 1416425 2037700 2801773
37031B801773q50296k486480j884143M63343J640547L14598j397331j071015O47573
$$ 2801773 1951477 -535003 -2419146 -1955803 -315256 -658 -1397989 -2469004 -1821431
37022a821431J350292M03741o15046n00712K08291M23282j21562q51206j032622
$$ -1821431 -471139 -67398 -682444 -1183156 -974865 -551583 -673145 -1524351 -2556973
37013b556973m59834K60313M12793K04585L33183N46933n4814j072089r19274
$$ -2556973 -3016807 -2756494 -2343701 -2139116 -1805933 -1259000 -1313814 -2385903 -3305177
37004c305177M56798R98504j54499r16980M26075K192030J901298J87061n74744
$$ -3305177 -2848379 -1849875 -2004374 -2921354 -2495279 -303249 1598049 1785110 1210366
36995A210366j72006j61165o15068m08776l3494q03409j670011l99869K051560
$$ 1210366 1038360 877195 262127 -146649 -180143 -983552 -2653563 -3053432 -1001872
36986a001872K145375o09330k419863r19383J435928J549571R7147n69620k91217
$$ -1001872 1143503 534173 -1885690 -2805073 -1369145 180426 277573 -292047 -583264
36977e83264k73685m00254O4808N60772K88646q6354K21909M30891j89768m75426
$$ -583264 -856949 -1257203 -1192395 -631623 -342977 -429331 -207422 223469 33701 -441725
36967d41725O60538J793309R86138q78693j355578k25000N93024L75087J69266
$$ -441725 218813 2012122 2998260 2119567 763989 538989 1132013 1507100 1676366
36958A676366K53043k99453j313735j283885J8761Q87247L01210o99586r53342
$$ 1676366 1929409 1629956 316221 -967664 -948903 -61656 239554 -460032 -1413374
36949a413374p18269n15713p2109P01854J085926P75321M91896O03696M03472
$$ -1413374 -2131643 -2647356 -2719465 -2017611 -931685 -156364 335532 939228 1342700
36940A342700m04708q03625j05698O64357K88866o49914o80941K53438Q41522
$$ 1342700 937992 134367 28669 693026 981892 331978 -348963 -95525 745997
36931G45997M94873L791r239l0563n43983r35161l58295P33440Q78722m01535
$$ 745997 1240870 1244661 1235422 1204859 660876 -274285 -632580 100860 979582 578047
36921E78047j650988j150359P87390K049945J365505j83451q01647l10204J09661
$$ 578047 -1072941 -2223300 -1435910 614035 1979540 1796089 994442 684238 793899
36912G93899m9296j25320K14397K82530l66339j001179p46904J16714O06225L49852
$$ 793899 744603 619283 833680 1116210 749871 -251308 -998212 -881498 -275273 74579
36902G4579k08824o09004p22902m89463O4688N61831N86400L32596M38283J001362
$$ 74579 -134245 -743249 -1466151 -1955614 -1890926 -1329095 -742695 -410099 28184 1029546
36892A029546J230936M44474q78742j520998r67447J5395L82948K3019l26490
$$ 1029546 2260482 2704956 1826214 305216 -662231 -646836 -263888 -240869 -567359
36883e67359j14262M58378Q20413O38372P4321k89902Q6689R57565J193363K3074
$$ -567359 -681621 -223243 597170 1235542 1309863 1019961 1106650 2064215 3257578 3280652
36873C280652j694418k198106j001565M43782O65217j4958k61363K72986O77659
$$ 3280652 1586234 -611872 -1613437 -1169655 -504438 -519396 -780759 -507773 169886
36864A69886L34567k01493j16473M85761P43846J61668p65493j115372n97285
$$ 169886 504453 302960 186487 672248 1416094 1577762 812269 -303103 -900388
36855i00388J56941M20571J98504m7210j62754k56788j53544L36245O92599J55228
$$ -900388 -743447 -322876 -124372 -171582 -334336 -591124 -744668 -408423 284176 439404
36845D39404r71903j443303p60497K23360O99269Q19579P81002K48377n62911
$$ 439404 -532499 -1975802 -2736299 -2512939 -1813670 -994091 -213089 35288 -527623
36836e27623n16762O56823J384118M01887j119150j168364J75657J128678R63969
$$ -527623 -1044385 -387562 996556 1398443 279293 -889071 -713414 415264 1379233
36827A379233N61675M64839K42802j71718k28889j0526j52359l99863R8767R10966
$$ 1379233 1940908 2405747 2648549 2476831 2247942 2237416 2085057 1685194 1783961 2694927
36817B694927O02355p12593j095600K10169J477832J262246N66727Q14483J360191
$$ 2694927 3297282 2584689 1489089 1699258 3177090 4439336 5006063 5820546 7180737
36808G180737Q27787l80569q85035p20114r35052j421744j156341l00996p4712
$$ 7180737 8008524 7627955 6742920 6022806 5087754 3666010 2509669 2208673 2133961
36799B133961n32773l88992O67439J275207N87793m11426n35068k2555K76930
$$ 2133961 1601188 1212196 1879635 3154842 3742635 3331209 2796141 2773586 3050516
36790C050516K37906J21874j32356m32558k29501M47725N39700m66771j374525
$$ 3050516 3288422 3410296 3277940 2845382 2615881 3063606 3603306 3136535 1762010
36781A762010r12524J97815L01092n41233o94138L03145R78474L98940l37819
$$ 1762010 849486 1047301 1348393 807160 113022 416167 1394641 1793581 1455762
36772A455762n8506N12180J22006p25470n36142O40895J166562L09965p42369
$$ 1455762 1397256 1909436 2031442 1305972 769830 1410725 2577287 2887252 2144883
36763B144883p46405o043M52606L29052K4898j10156O0289M79134O58497M5524
$$ 2144883 1398478 1392435 1845041 2174093 2198991 2088835 2149124 2628258 3286755 3332279
36753C332279j001211j349689o76849o6605l58094p71490j72624R72207J155013
$$ 3332279 2331068 981379 304530 237925 -120169 -891659 -1064283 -92076 1062937
36744A062937O9572r24658o71612M28181J167221Q88525j46851j144608j286317
$$ 1062937 1132509 207851 -463761 -35580 1131641 2020166 1873315 728707 -557610
36735e57610l48427R11275J306683M09726r31411j364227l54377J165558J588512
$$ -557610 -906037 5238 1311921 1721647 790236 -573991 -928368 237190 1825702
36726A825702M10235r50943p65566O80759J412692N76747m44675l69069M2727
$$ 1825702 2235937 1284994 519428 1200187 2612879 3189626 2744951 2375882 2418609
36717B418609l79250r55110k81564J229062J850806J170039L78719J62365Q3270
$$ 2418609 2039359 1084249 802685 2031747 3882553 5052592 5431311 5593676 5676946
36708E676946k0720K22566O43075R73653K165744N018232P428214N759418j02087
$$ 5676946 5656226 5878792 6521867 7495520 9661264 14679496 22107710 27867128 27765041
$$ [...]
##END NTUPLES=NMR SPECTRUM
##END=
