##TITLE=31Pdec_SR1516_rm
 CDcl3, 24 sc
 7.8.2020
##JCAMPDX= 6.0         $$ Bruker NMR JCAMP-DX V2.0
##DATA TYPE= NMR SPECTRUM
##DATA CLASS= NTUPLES
##ORIGIN= UXNMR, Bruker Analytische Messtechnik GmbH
##OWNER= root
$$ XWIN-NMR		Version 3.5
$$ Fri Aug  7 10:38:33 2020 Russian Standard Time (UT+4h)  she@DPX200
##.OBSERVE FREQUENCY= 81.013821
##.OBSERVE NUCLEUS= ^31P
##.ACQUISITION MODE= SIMULTANEOUS
##.ACQUISITION SCHEME= undefined
##.AVERAGES= 24
##.DIGITISER RES= 17
##SPECTROMETER/DATA SYSTEM= spect
##.PULSE SEQUENCE= zgpg30
##.SOLVENT NAME= CDCl3
##.SHIFT REFERENCE= (INTERNAL, CDCl3, 0, 182.463)
##AUDIT TRAIL= $$ (NUMBER, WHEN, WHO, WHERE, WHAT)
$$ ##TITLE= Audit trail, XWIN-NMR		Version 3.5
$$ ##JCAMPDX= 5.01
$$ ##ORIGIN= Bruker BioSpin GmbH
$$ ##OWNER= she
$$ F:/spectra/data/she/nmr/P31/1/pdata/1/auditp.txt
$$ ##AUDIT TRAIL=  $$ (NUMBER, WHEN, WHO, WHERE, WHAT)
(   1,<2020-08-07 10:37:44.07 +0400>,<she>,<DPX200>,
      <created by zg, POWCHK disabled, PULCHK disabled
       configuration hash MD5:
       00 E9 B6 7A A2 85 ED C7 34 08 36 98 17 FE 4E 26
       data hash MD5: 32K
       F2 B3 D6 F7 74 AA 0E 1B B1 ED 3E 75 0B 7D 02 A5>)
(   2,<2020-08-07 10:37:46.70 +0400>,<she>,<DPX200>,
      <Start of raw data processing
       efp BC_mod = 2 LB = 1 FT_mod = 6 PKNL = 1 PHC0 = -3537.906 PHC1 = 1953.002 SI = 64K 
       data hash MD5: 64K
       76 A1 52 DB 6F C7 2E 45 02 AC 47 DA ED 6B DC 08>)
(   3,<2020-08-07 10:38:05.43 +0400>,<she>,<DPX200>,
      <pk PHC0 = 10.92909 PHC1 = 0 
       data hash MD5: 64K
       67 78 79 CB A8 DC EC 72 E3 21 81 38 97 08 EA DB>)
(   4,<2020-08-07 10:38:08.00 +0400>,<she>,<DPX200>,
      <abs ABSG = 5 
       data hash MD5: 64K
       1D DF DA 35 08 94 25 2E 52 93 84 3B 65 E0 58 6E>)
$$ ##END=
$$ 
$$ hash MD5
$$ 9B CD 47 EB F5 9E 4F EB 11 4B AB 7A 69 83 AF 0F
##$RELAX= 
##$RELAX= 
##$RELAX= 
##$RELAX= 
##$RELAX= 
##$RELAX= 
##$RELAX= 
##$RELAX= 
$$ Bruker specific parameters
$$ --------------------------
##$DU= <F:/spectra>
##$EXPNO= 1
##$NAME= <P31>
##$PROCNO= 1
##$TYPE= <nmr>
##$USER= <she>
##$AMP= (0..31)
100 100 100 100 100 100 100 100 100 100 100 100 100 100 100 100 100 100 
100 100 100 100 100 100 100 100 100 100 100 100 100 100 
##$AQSEQ= 0
##$AQ_mod= 1
##$AUNM= <au_zg>
##$AUTOPOS= <>
##$BF1= 81.014009
##$BF2= 200.13
##$BF3= 200.13
##$BF4= 200.13
##$BF5= 200.13
##$BF6= 200.13
##$BF7= 200.13
##$BF8= 200.13
##$BYTORDA= 1
##$CFDGTYP= 0
##$CFRGTYP= 5
##$CHEMSTR= <none>
##$CNST= (0..31)
1 1 145 1 1 1 1 1 1 1 1 1 1 1 1 1 1 1 1 1 1 1 1 1 1 1 1 1 1 1 1 1 
##$CPDPRG= <waltz16>
##$CPDPRG1= <>
##$CPDPRG2= <waltz16>
##$CPDPRG3= <>
##$CPDPRG4= <mlev>
##$CPDPRG5= <mlev>
##$CPDPRG6= <mlev>
##$CPDPRG7= <mlev>
##$CPDPRG8= <mlev>
##$CPDPRGB= <>
##$CPDPRGT= <>
##$D= (0..31)
0 1 0 0 0 0 0 0 0 0 0 0.03 2e-05 3e-06 0 0 0 0 0 0 0 0 0 0 0 0 0 0 0 0 
0 0 
##$DATE= 1596782263
##$DBL= (0..7)
120 120 120 11 120 120 24 19 
##$DBP= (0..7)
150 150 150 150 150 150 150 150 
##$DBP07= 0
##$DBPNAM0= <>
##$DBPNAM1= <>
##$DBPNAM2= <>
$$ [...]
##$SUBNAM3= <"">
##$SUBNAM4= <"">
##$SUBNAM5= <"">
##$SUBNAM6= <"">
##$SUBNAM7= <"">
##$SUBNAM8= <"">
##$SUBNAM9= <"">
##$SW= 369.568048894756
##$SWIBOX= (0..15)
0 1 3 0 0 0 0 0 0 0 0 0 0 0 0 0 
##$SW_h= 29940.119760479
##$TD= 32768
##$TD0= 1
##$TE= 0
##$TE2= 300
##$TE3= 300
##$TEG= 300
##$TL= (0..7)
0 120 53 12 22 120 120 120 
##$TP= (0..7)
150 150 150 150 150 150 150 150 
##$TP07= 0
##$TPNAME0= <>
##$TPNAME1= <>
##$TPNAME2= <>
##$TPNAME3= <>
##$TPNAME4= <>
##$TPNAME5= <>
##$TPNAME6= <>
##$TPNAME7= <>
##$TPOAL= (0..7)
0.5 0.5 0.5 0.5 0.5 0.5 0.5 0.5 
##$TPOFFS= (0..7)
0 0 0 0 0 0 0 0 
##$TUNHIN= 0
##$TUNHOUT= 0
##$TUNXOUT= 0
##$USERA1= <user>
##$USERA2= <user>
##$USERA3= <user>
##$USERA4= <user>
##$USERA5= <user>
##$V9= 5
##$VALIST= <valist>
##$VCLIST= <CCCCCCCCCCCCCCC>
##$VD= 0
##$VDLIST= <DDDDDDDDDDDDDDD>
##$VPLIST= <PPPPPPPPPPPPPPP>
##$VTLIST= <TTTTTTTTTTTTTTT>
##$WBST= 1024
##$WBSW= 4
##$XGAIN= (0..3)
0 0 0 0 
##$XL= 0
##$YL= 0
##$YMAX_a= 12343
##$YMIN_a= -8245
##$ZGOPTNS= <>
##$ZL1= 120
##$ZL2= 120
##$ZL3= 120
##$ZL4= 120
##$ABSF1= 182.463
##$ABSF2= -187.1042
##$ABSG= 5
##$ABSL= 3
##$ALPHA= 0
##$AQORDER= 0
##$ASSFAC= 0
##$ASSFACI= 0
##$ASSFACX= 0
##$ASSWID= 0
##$AUNMP= <proc_1d>
##$AZFE= 0.1
##$AZFW= 0.5
##$BCFW= 0
##$BC_mod= 2
##$BYTORDP= 0
##$COROFFS= 0
##$CY= -3
##$DATMOD= 1
##$DC= 0
##$DFILT= <>
##$DTYPP= 0
##$F1P= 0
##$F2P= 0
##$FCOR= 1
##$FTSIZE= 65536
##$FT_mod= 6
##$GAMMA= 0
##$GB= 0
##$INTBC= 1
##$INTSCL= 5.30512e-09
##$ISEN= 30
##$LB= 1
##$LEV0= 0
##$LPBIN= 0
##$MAXI= 10000
##$MC2= 0
##$MEAN= 0
##$ME_mod= 0
##$MI= 50
##$NCOEF= 0
##$NC_proc= -10
##$NLEV= 6
##$NOISF1= 182.463
##$NOISF2= 159.3651
##$NSP= 0
##$NTH_PI= 0
##$NZP= 0
##$OFFSET= 182.463
##$PC= 4
##$PHC0= -3526.977
##$PHC1= 1953.002
##$PH_mod= 1
##$PKNL= yes
##$PPARMOD= 0
##$PSCAL= 0
##$PSIGN= 0
##$REVERSE= no
##$SF= 81.0140089999434
##$SI= 65536
##$SIGF1= 159.3651
##$SIGF2= -187.1042
##$SINO= 113.3802
##$SIOLD= 16384
##$SREGLST= <1H.CDCl3>
##$SSB= 0
##$STSI= 65536
##$STSR= 0
##$SW_p= 29940.119760479
##$SYMM= 0
##$S_DEV= 0
##$TDeff= 32768
##$TDoff= 0
##$TI= <>
##$TILT= no
##$TM1= 0
##$TM2= 0
##$TOPLEV= 0
##$USERP1= <user>
##$USERP2= <user>
##$USERP3= <user>
##$USERP4= <user>
##$USERP5= <user>
##$WDW= 1
##$XDIM= 65536
##$YMAX_p= 427533693
##$YMIN_p= -247385750
$$ End of Bruker specific parameters
$$ ---------------------------------
##NTUPLES= NMR SPECTRUM
##VAR_NAME=  FREQUENCY,     SPECTRUM/REAL,   SPECTRUM/IMAG
##SYMBOL=    X,             R,               I
##VAR_TYPE=  INDEPENDENT,   DEPENDENT,       DEPENDENT
##VAR_FORM=  AFFN,          ASDF,            ASDF
##VAR_DIM=   65536,         65536,           65536
##UNITS=     HZ,            ARBITRARY UNITS, ARBITRARY UNITS
##FACTOR=    0.456856943014862, 1,           1
##FIRST=     14782.0589164792, 0,            0
##LAST=      -15158.0608439998, 0,           0
##MIN=       -15158.0608439998, -247385750,  0
##MAX=       14782.0589164792, 427533693,    0
$$ Real data points
##PAGE= N=1
##DATA TABLE= (X++(R..R)), XYDATA
$$ [...]
41068C2873932J8705696O738931j0303971j7648054j8589697k4568228k9034901
41061d1826292j6809467L223357M916304j0946903j1559403J5136164L4385272
41054b3480968J5319687j8965643k4605647k185815Q919220o438534k0981228
41047g2418928j2511424O648026J8367908K5201076L1920953K7496990O765311
41040C1469912j0218438m046179J2613874J2871502m166845j4521164o694517
41033A7308145M723752M416864l912004q475341n527158J584338Q385368Q793958
41025B7297922j638656j6491927k1357051j1902995n82055J480946j2055M556644
41017a8649227R023449J140979j1143306m084978K4360030M1250808J9457206
$$ y = [32873932, 51579628, 58318559, 48014588, 30366534, 11776837, -12791391, -41826292, -58635759, -55412402, -50496098, -61443001, -73002404, -57866240, -23480968, -8161281, -27126924, -51732571, -53918386, -44999166, -51437700, -72418928, -84930352, -78282326, -59914418, -34713342, -2792389, 24704601, 31469912, 21251474, 17205295, 29819169, 42690671, 38523826, 24002662, 17308145, 22031897, 26448761, 22536757, 14061416, 8534258, 10118596, 18503964, 27297922, 25659266, 9167339, -12189712, -24092707, -24674762, -23193816, -23205871, -18649227, -9625778, -8484799, -19628105, -23713083, 646947, 41897755, 61354961]
41010F1354961k1540401l7649533j7094394Q955589J3231768L604755r39392J63078
41002A0086431K99770N002572J7615188K1749296L689377j8870064j8224388J6159
40994B1364341M892230j0210827j7487451k25218K1272288K1721099M613042j0730880
40986C5208624j6034335j2955146k262156J0115583J0452446l602092j2662876
40979H260048N18757K5532415L5871883J9650273j0519210l1275717k5918627
40972B2119822K363883K9291502L2082883J5744133K798085j998166j2956656
40965H9445486k7410794k1489917N466354J7981004r95797j6968145K316985L1094454
40957G9439630K5395642n625234j7487765m854890m316629k5770614l5309713
$$ y = [61354961, 39814560, 2165027, -14929367, -5973778, 7257990, 10862745, 9923353, 10086431, 10386201, 15388773, 33003961, 54753257, 58442634, 39572570, 21348182, 21364341, 26256571, 16045744, -1441707, -1666925, 19605363, 41326462, 45939504, 35208624, 19174289, 6219143, 3956987, 14072570, 24525016, 20922924, 8260048, 8778805, 34311220, 70183103, 89833376, 79314166, 48038449, 22119822, 24483705, 53775207, 85858090, 101602223, 104400308, 102402142, 89445486, 62034692, 40544775, 46011129, 63992133, 62996336, 46028191, 48345176, 79439630, 104835272, 99210038, 81722273, 76867383, 72550754, 46780140, 11470427]
40950A1470427j5593290N867955N302390l411605l756431o577234k0407101k5934392
40942e3039281q750997J0157882O751620n471197K009853K6294441L9495585L0670857
40934D8118763J3679497L18339r791249j6819320j8677461j7806516j4685888
40927a5663835k219844J8382013K7853103J3929284n806523q414060j395165p282769
40919A9382204k1807338k0003365j462244N938537o610470j2739201L535800J8387471
40911a5378606P635569j0107070o10688L0701091M4061014K1998754j0306929
40904F7993135k4951996k3228923j7523943p497683P196219J0813318o746230
40897F053897k4263889j3629907J4476838J9962329p521939l0149587j6583695
$$ y = [11470427, -4122863, 1745092, 7047482, 3635877, -120554, -6697788, -27104889, -53039281, -61790278, -51632396, -44880776, -50351973, -48342120, -22047679, 17447906, 48118763, 61798260, 62116599, 52325350, 35506030, 16828569, -977947, -15663835, -17883679, 498334, 28351437, 42280721, 36474198, 28060138, 26664973, 19382204, -2425134, -22428499, -23890743, -17952206, -24562676, -37301877, -33766077, -15378606, -7743037, -17850107, -18460795, 12240296, 56301310, 78300064, 67993135, 43041139, 19812216, 2288273, -5209410, 1986809, 12800127, 6053897, -18209992, -31839899, -17363061, 2599268, -4922671, -35072258, -51655953]
40890e1655953J3706924K3956400J4590228J2911860K2588309J9546719l701042
40883E1943445k3018876j8644102j83036J2501993J1927123j00143j7428961k5176025
40875h178582j1158481J2351465J9612018Q612914K259244P572411N285275r293791
40867B7062473j1053723R685717K2730331O902136j0720552j045392J2363091
40860E5924081q064222m2795199l8630572M649245K9046286O774436k0130354
40853a3226299q312688K4834006L6950372K3970498J3183985J4425560J1840919
40846A03666353m629885k5834157l8255760l4439082j2896338J7080225L4674301
40839C9365657K6303818L777165p913622n91786Q857840J573085j9021860l0450523
$$ y = [-51655953, -37949029, -13992629, 597599, 13509459, 36097768, 55644487, 51943445, 28924569, 10280467, 10097431, 22599424, 34526547, 34426404, 16997443, -8178582, -19337063, -6985598, 12626420, 21239334, 23498578, 31070989, 36356264, 27062473, 16008750, 25694467, 48424798, 55326934, 44606382, 43560990, 55924081, 47859859, 5064660, -33565912, -28916667, 129619, 6904055, -13226299, -21538987, 3295019, 40245391, 64215889, 77399874, 91825434, 103666353, 99036468, 73202311, 34946551, 507469, -12388869, 4691356, 39365657, 65669475, 69446640, 61533018, 60941232, 69799072, 71372157, 52350297, 21899774]
40831B1899774j8021914N474471J3457070O6289j0208281L462336K5884772K4888382
40823F6902899l140555k8135371k7809936j3316669o673087j0114052q822542
40816c1109313O239090K6965793L4510608J5940898j8316235l7485179k3419622
40809b6673960M079781J2020929l29331l907224J3191931K9187029K5353600J1630252
40801F4553007L583144j094983p898074r751929k973380O64503n289603q218441
40793C3574244p61015J486064j2419609k2815795o906852K2029365L0080926Q962408
40785E3229736j7530854k7103061j7176918L984924K2599364K1388179j966916
40778C7424454k2475646j4721545J1540428K3306029Q954823j0132923j2116842
$$ y = [21899774, 3877860, 9352331, 22809401, 22875690, 12667409, 16129745, 42014517, 66902899, 63762344, 35626973, 7817037, -5499632, -12172719, -22286771, -31109313, -24870223, 2095570, 36606178, 52547076, 34230841, -3254338, -26673960, -22594179, -10573250, -10902581, -14809805, -1617874, 27569155, 52922755, 64553007, 68136151, 67041168, 59143094, 49391165, 46417785, 47082288, 41792685, 33574244, 32813229, 34299293, 21879684, -936111, -7842963, 14186402, 44267328, 53229736, 35698882, 8595821, -8581097, -4596173, 18003191, 39391370, 37424454, 14948808, 227263, 11767691, 35073720, 44028543, 33895620, 21778778]
40771B1778778Q20286J2303347J0376289m446588j7604839j0856603J3085684
40764B5456354K4565192K791043l1321055l9884923j8636083K475759N799507
40757b8754206N026814J4555324K5967841K4412574R888896o161885j2668685
40750C2266673m400785J1917565J8204784N681270r741310r539816j923994o026147
40742C6438240j5137649o851451J3163061J3639336j1027591k8171733j7233705
40735a5181492R86004J675776q257605j1308487q478327n645071M313231K2740535
40727a9155436L0787155J7423995J329110P35409K420134j1369265k4564859r727235
40719a2120992K3444648L7491146K0872728l05662m994091j721810m685649j0922499
$$ y = [21778778, 22599064, 34902411, 45278700, 40832112, 23227273, 12370670, 25456354, 50021546, 52812589, 21491534, -18393389, -37029472, -34553713, -28754206, -23727392, -9172068, 16795773, 41208347, 51097243, 44935358, 32266673, 27865888, 39783453, 57988237, 63669507, 53928197, 44388381, 42464387, 36438240, 21300591, 14449140, 27612201, 41251537, 30223946, 2052213, -15181492, -14195488, -12519712, -20777317, -32085804, -40564131, -46209202, -41895971, -19155436, 11631719, 29055714, 30384824, 31120233, 33540367, 22171102, -2393757, -12120992, 11323656, 48814802, 69687530, 69381868, 64387777, 62665967, 57980318, 47057819]
40711D7057819j1588062p866571n273862l675637m88717L612708O015786M195747
40703C1989211k961036j0834731j0148409R78772J1399373J0658626J858331o410019
40695B6530118j1922173j3862748p353279N252035R415344q27789r032536k81558
40687b082586J2883192R199928o658684j2429280n004857k494716j0642654j3104677
40679c0334334M21936J8094543K4121893J6209014J024914j2180365j2015069
40672E342532M209703J9124618J2591866q914519j9445362j0699168J96349K502517
40664D908536N829370J4512583J4311886q50465j1660932k040167J2226270M735551
40656D1972632k2315057m0365335l1122316m885612J5523943J7170459M766530
$$ y = [47057819, 35469757, 27603186, 22329324, 18653687, 18164970, 21777678, 27793464, 31989211, 29028175, 18193444, 8045035, 9023807, 20423180, 31081806, 32940137, 26530118, 14607945, 745197, -6608082, -1356047, 8059297, 7231508, -1801028, -2082586, 10800606, 20000534, 13341850, 912570, -4092287, -6587003, -17229657, -30334334, -29912398, -11817855, 12304038, 28513052, 29537966, 17357601, 5342532, 9552235, 28676853, 41268719, 32354200, 12908838, 2209670, 2406019, 4908536, 10737906, 25250489, 39562375, 38711910, 27050978, 25010811, 37237081, 41972632, 19657575, -20707760, -51830076, -56715688, -41191745, -24021286, -19254756]
40649a9254756n698382k763460P230339Q182718j938612n963671P593732K6343597
40641A3731505L0948056K0267764P200288k641925j3169637k2322550k0038931
40634A3974570m914694Q143158L759102j4442472k5863186j5288901R637062K6929219
40626A933858K5550207J5237812Q136350R17346j4369862l0022875k9753215j3682567
40618c6052946N73095L014729J335666L125197M692285L281712M795249J1456180
40610c778833J4840086Q749277k444309j3590762k3598501k5675199r620264J7368717
40602c7749788K8958913J1370596j6343077k5837312j1634579J0877087K6498992
40595a3859168K7393453J2504989o525736j0625353K305085J0365236j499247
$$ y = [-19254756, -24953138, -27716598, -20486259, -12303541, -14242153, -20205824, -12612092, 13731505, 44679561, 64947325, 72147613, 69505688, 56336051, 34013501, 13974570, 9059876, 17203034, 20962136, 6519664, -19343522, -34632423, -24995361, 1933858, 27484065, 42721877, 50858227, 51775573, 37405711, 7382836, -22370379, -36052946, -35479851, -32465122, -31129456, -28004259, -23311974, -20030262, -15235013, -3778833, 11061253, 19810530, 17366221, 3775459, -19823042, -45498241, -55118505, -37749788, -8790875, 2579721, -13763356, -39600668, -51235247, -40358160, -13859168, 13534285, 26039274, 19513538, 8888185, 11193270, 21558506, 20059259]
40588B0059259j7484003j4520550L002012J2100547N457889l869525o345002n209187
40580f808560m603453m386975m625680l621211L032457J1613806R175595n039221
40572e263242j1945009k025003N573437n022335j4837716m21915K1224425J6552226
40564C834868o082347o465833J9939632L1921065R795561j3502857q701116M431595
40556C5170568k831352j7453121j0361234J1305211J6392547N20122j1773230
40549B0969511r138123m155525l317149K572252J3715208J4188687j696412j7236035
40541A5902414j7546852q637170j843917N307330J9024420L0946419K6134691
40534F9287335O085890j0222139j0267616k458720j492935p122957p086094J269952
$$ y = [20059259, 2575256, -11945294, -8943282, 3157265, 8615154, 4745629, -1599373, -6808560, -11412013, -15798988, -20424668, -24045879, -21013422, -9399616, -224021, -5263242, -17208251, -19233254, -13659817, -18682152, -33519868, -33941783, -12717358, 3834868, -2247479, -8713312, 11226320, 43147385, 52942946, 39440089, 30738973, 35170568, 32339216, 14886095, 4524861, 15830072, 32222619, 32742741, 20969511, 11831388, 7675863, 4358714, 6930966, 20646174, 34834861, 33138449, 15902414, -1644438, -10281608, -12125525, -6818195, 12206225, 43152644, 69287335, 75373225, 65151086, 54883470, 52424750, 50931815, 43808858, 36722764, 37992716]
40526C7992716M462289o744964k0355140j7517339J284235J7550318K0675069
40519C7347184J7521014J3718421K502995j8066412l1114564k0001833N849616
40512G756421K0261133J3016445j626066r117464j1216342j3097771r180495N495764
40504B291625J8843074J3175140p888631j9835565j0009530L864284r90314j8882132
40496a9432049k3644300n669586J7237282K6851840K3629029J3854689k280404
40489C0546501j8845367j9435991r56622J3496965N286950r878471o238872R472352
40481C447445R321648p636406j2464327M572945J5829743N85326k1348858k0554951
40473b8247435j340036R003472J335210p301233j472895J4370523K4382848J7390363
$$ y = [37992716, 42455005, 35710041, 15354901, -2162438, -878203, 16672115, 37347184, 54868198, 68586619, 71089614, 53023202, 21908638, 1906805, 7756421, 28017554, 41033999, 39407933, 30290469, 19074127, 5976356, -3204139, 2291625, 21134699, 34309839, 26421208, 6585643, -3423887, 440397, -549917, -19432049, -43076349, -48745935, -31508653, -4656813, 18972216, 32826905, 30546501, 11701134, -7734857, -8691479, 4805486, 10092436, 213965, -6024907, 3447445, 12769093, 5132687, -7331640, -2758695, 13071048, 13656374, -7692484, -28247435, -29587471, -20583999, -19248789, -26550022, -28022917, -13652394, 10730454, 28120817]
40465B8120817l606675k1668412k0230636j799618J4218657J5360317Q037370
40458A8431820K678664M52376P71634P286355J7025634J7075948L087506j0677200
40450E6132737j0637288k086329K284512M78003k793771o205979p106406M83709
40442C0549188J1810583R766592r187105k2662478j2398417P706135J2616322
40435B8200820K274441m674996k715273j790798m537910m003215q48179k567262
40427I337628p521473p107242r62906N270954J1649710J7832997J4225247k021425
40419D0703490j2076988O13675J9996873J7210813n304561j8303954j1837207
40412C1002141o097660j3452185j9767029j1762299L020534J3575121K0525381
$$ y = [28120817, 24514142, 2845730, -17384906, -19184524, -4965867, 10394450, 18431820, 21110484, 21562860, 22334494, 29620849, 46646483, 63722431, 66809937, 56132737, 45495449, 43409120, 45693632, 46171635, 43377864, 37171885, 30065479, 30549188, 42359771, 52126363, 42939258, 20276780, 7878363, 15584498, 28200820, 30475261, 25800265, 23084992, 21294194, 16756284, 12753069, 11904890, 9337628, 1816155, -5291087, -6253993, -983039, 10666671, 28499668, 42724915, 40703490, 28626502, 29240177, 49237050, 66447863, 61143302, 42839348, 31002141, 24904481, 11452296, -8314733, -20077032, -17056498, -3481377, 17044004]
40405A7044004K4018306J6311457l461147k2813881l0934835k6531846j0271506
40398c6639448J2547124K3497411R024883j2701556j0001702J4699740K5696564
40391B6123016Q303348j0797978q752044J629554K082753r86374K258329K787776
40383B2648380m851580m870175R574515J4764465o122283k8348270k1462819Q39565
40375a7828202L210088j4343521k0318730l683504J5298080K2295886K2420472
40368G050569J8097092O378152j802967P444087J9179951L350292l3336824m4678247
40360a8317895q891585L5526610L9473062O563098j7740429p935682J4654955
40353D3332134J5876969p488282k5648789j3727448J5659482K6195219M337325
$$ y = [17044004, 41062310, 57373767, 53912620, 31098739, 163904, -26367942, -36639448, -24092324, -594913, 8429970, -4271586, -14273288, 426452, 26123016, 34426364, 23628386, 14876342, 16505896, 18588649, 17602275, 19860604, 22648380, 17796800, 12926625, 22501140, 37265605, 31143322, 2795052, -18667767, -17828202, -14618114, -28961635, -49280365, -52963869, -37665789, -15369903, 7050569, 25147661, 31525813, 29722846, 37166933, 56346884, 59697176, 26360352, -18317895, -27209480, 8317130, 47790192, 54353290, 36612861, 28677179, 43332134, 59209103, 51720821, 26072032, 12344584, 28004066, 54199285, 58536610]
40346E8536610k2624429k4115737n633694P158733Q665813J1217600J2210292
40339D5415188l569857k8641784l3288635r736898J3847104J5721458R137861
40332H884437J2226127J5089672m41113k6725990l9966836l2707792j6074418
40325g9715913J595969J8938172L0503812K9486088J8959504P445591k792207
40318B4421016j2147657j4800777n725245Q966747J9920439K6156240K7716853
40311G4507616J6533792r045786k8389094j8166243J3190814L0466924J5090094
40304I4188117j2874794k2464875p985339J0775653J4456291J110780j6836140
40297F0369693k4486927j5683776K094993J4380341J3253561L261216n773419
$$ y = [58536610, 35912181, 11796444, 6162750, 13321483, 21987296, 33204896, 45415188, 41845331, 13203547, -20085088, -29821986, -15974882, -253424, 8884437, 21110564, 36200236, 35759123, 9033133, -30933703, -63641495, -79715913, -78119944, -59181772, -28677960, 808128, 19767632, 27213223, 24421016, 12273359, -2527418, -8252663, 714084, 20634523, 46790763, 74507616, 91041408, 81995622, 53606528, 35440285, 48631099, 79098023, 94188117, 81313323, 58848448, 50863109, 61638762, 76095053, 77205833, 60369693, 35882766, 20198990, 22293983, 36674324, 49927885, 53189101, 47415682]
40290D7415682q210321m392085K223645O811271N156793k143704p882706l905138
40282C5073437R488152K1096394J8962598L955774j0061772j1995903n394405
40275F1124275k74845J550734M376876O097670J154401m173932M015962K1544118
40267I5415259K1630200r637874m5152494m3470417p43460M1548719M3652076
40260A03242009R177684k4957474k9843861r189060J1080132J0730547o418645
40253F3821332j9035318j2195740P046525J9038397J2525846p077215k5654714
40246C8469113l0722810j7879214N081786K1899312K2306383J1546577R84601
40239E1685748n256683o516110L322298K5383295M0370921K4344070j5698168
$$ y = [47415682, 39205361, 34813276, 37036921, 43848192, 49004985, 46861281, 38978575, 35073437, 44561589, 65657983, 84620581, 88576355, 78514583, 66518680, 61124275, 60849430, 62400164, 66777040, 72874710, 74029111, 69855179, 73871141, 95415259, 117045459, 107407585, 62255091, 18784674, 18041214, 59589933, 103242009, 112419693, 87462219, 57618358, 48429298, 59509430, 70239977, 63821332, 44786014, 32590274, 39636799, 58675196, 71201042, 64123827, 38469113, 7746303, -10132911, -5051125, 16848187, 39154570, 50701147, 51685748, 46429065, 39912955, 43235253, 68618548, 108989469, 133333539, 117635371]
40232A17635371m2031753l2572980r128215l420228j0652489j190986K8540405
40225D7179125M5681471K7404333o808855k3969056k0662046j7188794j9626838
40218C2009340j3004211P200364K0753522J0728445j0869368k0230046j3414146
40211A3173900m592443j63281O056769J3718643J2419264J515223n118731k056537
40203C4952807k708103j5445327k5799699j8145323j105026P735201J0679026
40196i836444K0515523L0856371K3321973J821296r452844n054313n228894j6456506
40188C0486162j7599195m42614R067395n596921j7458333N63671K3629407J0354019
40180C3003591k4894712k6137305J8076663N3599078L9027593l43217j9411936
$$ y = [117635371, 75603618, 43030638, 33902423, 30482195, 19829706, 18638720, 47179125, 92860596, 120264929, 113456074, 89487018, 68824972, 51636178, 32009340, 19005129, 26205493, 46959015, 57687460, 46818092, 26588046, 13173900, 8581457, 8418176, 14474945, 28193588, 40612852, 42128075, 37009344, 34952807, 32244704, 16799377, -9000322, -27145645, -28250671, -20515470, -9836444, 10679079, 41535450, 64857423, 66678719, 57225875, 52171562, 46942668, 30486162, 12886967, 12444353, 21511748, 15914827, -1543506, -979835, 22649572, 33003591, 8108879, -18028426, 48237, 53647315, 92674908, 92331691, 72919755]
40173G2919755j4967401j0599344j0987776n996536L90163j581335m831559k76304
40165B4069663P60455j1687065j8293494J820973K9393197K9031144M571330j0460683
40157D9205520r699186j4680742k2021418m050239K9966662L0816701j0881375
40150D8655923l6939605p575795L3727335K5834367j8602152l8630164j4979777
40143h509868J7533332L0102383K2709289q20909l2088545m1180628q543255L2193760
40135A1395559L1800143R49757n140044K2934831L4047442L605568k5927760j6768718
40127E6896778O786804P101472o882816p893853p19053k879907n508123M922149
40119E1823451J1296027o021598k7105986k0390216M875697J5834676J0625538
$$ y = [72919755, 57952354, 47353010, 36365234, 30368698, 30758861, 29177526, 24345967, 24069663, 24830118, 13143053, -5150441, -3329468, 26063729, 55094873, 59666203, 49205520, 39506334, 24825592, 2804174, -1246065, 28720597, 59537298, 48655923, 11716318, 4140523, 37867858, 63702225, 45100073, 6469909, -8509868, 9023464, 39125847, 61835136, 61014227, 28925682, -12254946, -20798201, 11395559, 43195702, 44145459, 39005415, 61940246, 95987688, 99593256, 73665496, 56896778, 63683582, 70785054, 63902238, 56008385, 55289332, 52409425, 46901302, 51823451, 63119478, 57097880, 29991894, 9601678, 14477375, 30312051, 40937589]
40112D0937589J2384520K0028673J0790749j2531259k1191200q604923J565634
40105D3379783j226959j338596P498417J0431873K958676j66678M640512L747320
40097F9924348k109198M449476J9101718J3456343j4818369k8563012q525946
40090E2915360J3189717M395259j6109359j2786682P860199J1590271o764660
40083E4290105j9421314j2181262q24015m09891n463328n308228J21929M646597
40075A5450593M549462J503677K118966R325474J1764838l917266k5252095k0996653
40067e453004J1365458L1824340J3888830j2266993n468979K0323503J8890825
40060G3103980j1915509k6686903o749372J1717920j001310k2037133j6682762
$$ y = [40937589, 53322109, 73350782, 84141531, 71610272, 50419072, 41814149, 43379783, 42152824, 40814228, 48312645, 58744518, 61703194, 61536516, 66177028, 69924348, 67815150, 72264626, 91366344, 104822687, 90004318, 61441306, 52915360, 66105077, 70500336, 54390977, 41604295, 49464494, 61054765, 54290105, 34868791, 22687529, 21863514, 21453623, 15990295, 10682067, 10803996, 15450593, 20000055, 21503732, 23622698, 32948172, 44713010, 40795744, 15543649, -5453004, 5912454, 37736794, 51625624, 39358631, 33889652, 54213155, 73103980, 61188471, 34501568, 27752196, 39470116, 38468806, 16431673, -251089]
40053b51089P448157J7519614N654781p791338r404292n242852l428630m190509
40045C13842m985195j975950R655320K6212204L2642445K0017659p10081j2793268
40037F8376976j4255210j3589712j2725016p214296J652346P023264N864668l66942
40029C4766078r453974j5230726q558152Q940281K0773535J6424674O922016O245083
40021F0828815P754043k385614j6528877j3834075M338244J1466600o107867k8384910
40013A7146359k8410804n403162J7719403J9592684k274382k9058482l2401361
40006d3089745j426126L8579273M8952432K3162443p112172j6228346j3129780
39999B9707979j4428133j2983109M403087K4960234K3196174r42915k2069702
$$ y = [-251089, 7197068, 24716682, 30371463, 22580125, 13175833, 7932981, 4504351, 313842, -4671353, -6647303, 3008017, 29220221, 61862666, 81880325, 81170244, 68376976, 54121766, 40532054, 27807038, 20592742, 22245088, 29268352, 35133020, 34766078, 25312104, 10081378, 1523226, 10463507, 31237042, 47661716, 54583732, 60828815, 68582858, 66197244, 49668367, 35834292, 40172536, 51639136, 45531269, 17146359, -11264445, -16667607, 1051796, 20644480, 18370098, -10688384, -43089745, -44515871, -5936598, 43015834, 66178277, 59066105, 42837759, 29707979, 15279846, 2296737, 6699824, 31660058, 54856232, 53913317, 31843615]
39992C1843615k4683578j6208141o495744K905059P844516K359197n223337K531427
39984e126986K4762656L8833783L0876415J1877347l188161j2949154j8172642
39977F6913258j3381941j624000K355574k615777L427966K6416542L7420822J2023653
39969A30936097k7331541l9040155k0918535p309374j2623254j4523526J714195
39962A0903907J7346801J3425459J715792K352149J0753334Q643107m267674j0341756
39954E0531119p51161J3387862J5321520m77733k2905103l1650299j7125602M084736
39946A0415339N349866j3874445k4106065p789239J2772594P353176j6166670
39939b6045444k1715887L948827L3729269L6514931J2743525j1930226j5361808
$$ y = [31843615, 7160037, -9048104, -15543848, -12638789, -4794273, -2435076, -7658413, -5126986, 19635670, 58469453, 89345868, 101223215, 98035054, 85085900, 66913258, 53531317, 51907317, 54262891, 51647114, 55075080, 81491622, 118912444, 130936097, 103604556, 64564401, 43645866, 36336492, 23713238, 9189712, 10903907, 28250708, 41676167, 43391959, 45744108, 56497442, 65140549, 60872875, 50531119, 49779958, 63167820, 78489340, 78011607, 55106504, 23456205, 6330603, 10415339, 15765205, 1890760, -22215305, -30004544, -17231950, -9878774, -26045444, -47761331, -43812504, -10083235, 26431696, 39175221, 27244995, 11883187]
39932A1883187L574819K5740425K6428583j030165l3356940l8435082j1474613
39925a6669786J8917399K3994622N030083j3952509j4624655R01338J7553945
39918B1150437K2569568J5362394N633879P81846l191119j3291262k4721412k4480564
39910a86233j0968193J308883J779462j775419L024379J3597976J7585036J2378605
39902C6744496P222274P132950O703418K149336j151744J372877M095218n52283
39894F3716542r136639j0936471l180255N052794M912034k687338j1072069j4761231
39886B1907367r718625N653172K3391457K6305160N891350k1819946k9447581
39879B2162354j0172961J2621331J3187298n921867j8895758r248516J1573754
$$ y = [11883187, 15458006, 41198431, 67627014, 66596849, 33239909, -5195173, -16669786, 2247613, 26242235, 31272318, 17319809, 2695154, 3596492, 21150437, 43720005, 59082399, 64716278, 65498124, 62307005, 49015743, 24294331, -186233, -11154426, -9845543, -8066081, -9841500, -6817121, 6780855, 24365891, 36744496, 43966770, 51099720, 57803138, 59952474, 58800730, 60173607, 64268825, 63716542, 54579903, 43643432, 40463177, 45515971, 50428005, 47740667, 36668598, 21907367, 12188742, 17841914, 41233371, 67538531, 73429881, 51609935, 22162354, 11989393, 24610724, 37798022, 31876155, 12980397, 3731881, 15305635]
39872A5305635K0488128J1273065k51673O87726P806952M478802r816393j7062461
39864C2909781p963159K666529j809743j4070256j4861441k572718P862145J1052788
39856A3213926J5318250K1601586K0276910J1794023Q252931R389072N84489j7570089
39848H2861098k3662697j1529750m636620j6640125k5238838j0146282Q816268
39841a76946M036076j0686651k474395K2358076K5561773q90173k2412527j6498384
39833a183151p20724M233697L626612N698774J558473j2698312j9611310o212214
39825b5308155J4226807K4117449K5988516K7593784K1702817R83623k1856692
39818F7448149k8821667k0856959j0882227l036054N929536J4138957J7159608
$$ y = [15305635, 35793763, 47066828, 46815155, 47502881, 55309833, 59788635, 49972242, 32909781, 24946622, 27613151, 25803408, 11733152, -3128289, -5701007, 2161138, 13213926, 28532176, 50133762, 70410672, 82204695, 90457626, 99846698, 100431187, 82861098, 59198401, 47668651, 43032031, 26391906, 1153068, -8993214, -176946, 3859130, -6827521, -9301916, 13056160, 38617933, 37727760, 15315233, -1183151, -1903875, 2329822, 5956434, 11655208, 13213681, 515369, -19095941, -25308155, -11081348, 13036101, 39024617, 66618401, 88321218, 89304841, 67448149, 38626482, 17769523, 6887296, 3851242, 9780778, 23919735, 41079343]
39811D1079343J4784332O079377j0512407k4528456j8228790N214350J7906121
39804C1793870N933984q956215m465692P449034N150019l119140M897946K2759142
39796F1442948K1613685m746972l0378623l3660733j9936417o133148j309250
39789a3108510k972049N63487J9123462M0596789L5532127j587521l4008850k9654249
39781A4484686o646829l07120n017591Q034352K9954553K4487743l765873r560161
39773E1663760J4865103K0780828j4834004m4037885k1905974K0984720K7186329
39766E4702877n49188j3010281N072391K1108968J4576380L137744M244503Q627346
39758I7910740K141637j3029841k7791674l6766331l4645774j9320592j077748
$$ y = [41079343, 55863675, 61943052, 51430645, 26902189, 8673399, 13887749, 31793870, 37727854, 28771639, 24305947, 31754981, 36905000, 33785860, 38683806, 61442948, 83056633, 78309661, 47931038, 14270305, -5666112, -11799260, -13108510, -16080559, -15517072, 3606390, 44203179, 79735306, 78147785, 44138935, 14484686, 7837857, 7530737, 2513146, 10547498, 40502051, 64989794, 61223921, 51663760, 66528863, 87309691, 72475687, 28437802, 6531828, 27516548, 54702877, 54153689, 41143408, 46215799, 67324767, 81901147, 85038891, 89283394, 97910740, 100052377, 87022536, 59230862, 22464531, -12181243, -31501835, -32579583]
39751c2579583P035651P820157J3334037K2270475K1457919Q010956p348182j6562890
39743B3438540j6928584l431426K0377954L0154365O752284k7551787k9817368
39736B993978K892626K6415999J2997765j2110607j6016467p542470j1897215
39729b266391k1015792p240113K4962912M0141805K5600449Q600412R943900J1769861
39721I0497043q420689l4973181l3724929m536801J5809896O362975r285503j685140
39713B0043671J7407962J1965472k1588290m3681693k5318529J1764270K6552786
39706b854351J4181564N826221J9098289L4072009K4506854n996415l0119800
39699E8714371k8972326r089273P180583L200642j5608671k5856148j2806439
$$ y = [-32579583, -25543932, -17723775, -4389738, 17880737, 39338656, 47349612, 40001430, 23438540, 6509956, 3078530, 23456484, 53610849, 60363133, 32811346, 2993978, 5886604, 32302603, 45300368, 33189761, 17173294, 9630824, -2266391, -23282183, -30522296, -5559384, 34582421, 60182870, 68783282, 78727182, 90497043, 82076354, 47103173, 13378244, 8841443, 24651339, 31014314, 21728811, 20043671, 37451633, 49417105, 27828815, -15852878, -41171407, -29407137, -2854351, 11327213, 17153434, 36251723, 70323732, 94830586, 88834171, 58714371, 29742045, 20652772, 27833355, 31033997, 15425326, -10430822, -23237261]
39692b3237261R243626J4682561L070050Q5725J7593161L3390978K4027638P9221
39684G8935699j1320116p266108p990286j8941799j9980726J139798K5627576
39677D0204038K7390515P237648j1300821j4238207j0761610j4025443k0289045
39670D217075j4930757M611321K0895524J6034426m901690j7933089q726783J0803444
39662A0069471J9149115J1256119j44126m040975j018069N098223J3770358K2424121
39654G6564237K3435676J2310345n588944k0659119k8312592k9871428k7359486
39647E18689k0688384r417809L608651J1159763P974344L50377L016146J9882690
39639A6404467L4149375K7855030O225235j0662248j5986768j7934135j5383574
$$ y = [-23237261, -13993635, 688926, 3758976, 3844701, 21437862, 54828840, 78856478, 78935699, 67615583, 60349475, 52359189, 33417390, 13436664, 14576462, 40204038, 67594553, 74832201, 63531380, 49293173, 38531563, 24506120, 4217075, -10713682, -6102361, 14793163, 30827589, 25925899, 7992810, -733973, 10069471, 29218586, 40474705, 40330579, 36289604, 35271535, 40369758, 54140116, 76564237, 99999913, 112310258, 106721314, 86062195, 57749603, 27878175, 518689, -20169695, -29587504, -25978853, -14819090, -6844746, -6494369, -3478223, 16404467, 50553842, 78408872, 84634107, 73971859, 57985091, 40050956, 24667382]
39632B4667382L386874L1033235L6706146Q108043k4029754k5683739n584846
39625D8603341M599282K17291Q75980P859513L318305q661411j615017K3320190
39617G8517474K7942181l237346l1618524k1266829N666915O898345j2025022
39610E0877194j1940078J1744694K2532806L776682j7804718j8242686q181886
39603C2762008m838101m280601J458052O309244O181870R477987J5723499P989587
39595G0783545j5339980k6156999o624252J9350445K1244841Q010475P781274
39588G9049349J8042753J2553949j0444752k4343584j7645056o701043k157642
39581D8353974L653690R622635P15913j7700819j3877805K1848003N0920756L4832771
$$ y = [24667382, 28054256, 59087491, 95793637, 103901680, 79871926, 54188187, 48603341, 53202623, 53419914, 54295894, 62155407, 65473712, 56812301, 55197284, 78517474, 106459655, 103222309, 71603785, 50336956, 56003871, 62902216, 50877194, 38937116, 50681810, 73214616, 76991298, 59186580, 40943894, 32762008, 27923907, 23643306, 25101358, 31410602, 37592472, 47070459, 62793958, 70783545, 55443565, 29286566, 22662314, 42012759, 63257600, 71268075, 79049349, 97092102, 109646051, 99201299, 74857715, 57212659, 50511616, 48353974, 52007664, 61630299, 62346212, 44645393, 30767588, 52615591, 103536347, 138369118]
39573A38369118j0916078l8614903l0324380j0569843m916681j2676800k0140205
39566A0210228j8844698p406671R226507J9927844J8144368J1653583J1113084
39559E4024245J3002145O826593n404884j2254305j1603626r556041m351160Q506005
39551C9188972J7144705M054861k0917907k5469958k656671J3728719j000005
39544B4072716k3295480j8206252N902867J4027088L535460N489102K6216466
39537C7741967L0019886l361694l9376466l4393263K527794K4938756J2919097
39530C1016077j0005078j8530051j2600071k36645J6870564L0361851K3111268
39523E9987915m050970k2968035j3754252N439197M742026j3056321j8906428
$$ y = [138369118, 127453040, 88838137, 58513757, 47943914, 43027233, 30350433, 10210228, -8634470, -16041141, -6814634, 13113210, 31257578, 42911161, 54024245, 67026390, 73852983, 68448099, 56193794, 44590168, 35034127, 30682967, 39188972, 56333677, 60388538, 39470631, 14000673, 11344002, 25072721, 24072716, 777236, -17429016, -11526149, 2500939, 6036399, 11525501, 37741967, 67761853, 64400159, 25023693, -9369570, -6841776, 18096980, 31016077, 21010999, 2480948, -10119123, -10355768, 6514796, 36876647, 59987915, 55936945, 32968910, 19214658, 24653855, 29395881, 16339560, -2566868]
39516b566868l143820J2025457R624756K579456Q429195J8192402J0114508j4012541
39508D1242545k6787832j1378623J5394952K3887254P412891j2239579j3374916
39501B4156692M29713Q652462K812869k540078P847093K3999755J9109748j4003908
39493G0464346m6057556m1751591l604351K7635248K0975397p449712j6693261
39486C518520N224241K7600979K0967218l900691j5602763p332967J10520m354113
39478B6230944q152192l199160j916633j1665289j5944366j143803J6209924J3815332
39470A4234757J571313N677370K2207046K0062068p953471l0283141k3196818
39463B319124k589310O955226Q679404J6878094K4182502J3508803q153950j5735590
$$ y = [-2566868, -5710688, 6314769, 15939525, 18518981, 26948176, 45140578, 55255086, 41242545, 14454713, 3076090, 18471042, 42358296, 49771187, 37531608, 24156692, 24586405, 33238867, 36051736, 33511658, 41358751, 65358506, 84468254, 70464346, 24406790, -17344801, -20949152, 6686096, 27661493, 20211781, 3518520, 8742761, 36343740, 57310958, 53410267, 37807504, 30474537, 30585057, 26230944, 18078752, 14879592, 12962959, 1297670, -14646696, -15790499, 419425, 14234757, 15806070, 21483440, 43690486, 63752554, 55799083, 25515942, 2319124, -270186, 6685040, 15364444, 32242538, 56425040, 69933843, 61779893, 46044303]
39455D6044303l550911P084694K59082j4410601j9980648j4576049o879768m00939
39447f410837P122885J3401484J0561997l482783j7539570j6632565l21023J3965697
39439F65285J1559688m63557m678152P57955L275680K261598J2560429L3669759
39431E9608685L8250535R628185k6322610l0669428l416467J8860999J4015666
39424G9955565j923327n333004K823709N371644m821138j8043652k1265138j2251853
39416B4512806k067299l003496j1857473j1863084K679171J4225675O710105q178404
39408A1158001p770607O076660J0720253p99167j1062281q132993p96352J773579
39400A167093M087423J0187528J4562876J5107403J6914767J6370279K047158
$$ y = [46044303, 42493392, 49578086, 49837168, 35426567, 15445919, 869870, -6009898, -6410837, 712048, 14113532, 24675529, 21192746, 3653176, -12979389, -13300412, 665285, 12224973, 11761416, 7083264, 7841219, 11116899, 13378497, 25938926, 59608685, 97859220, 107487405, 81164795, 50495367, 47078900, 65939899, 79955565, 78032238, 72699234, 75522943, 80894587, 76073449, 58029797, 36764659, 24512806, 22445507, 19442011, 7584538, -4278546, -1599375, 12626300, 19336405, 11158001, 3387394, 9464054, 20184307, 19385140, 8322859, 189866, -606486, 1167093, 5254516, 15442044, 30004920, 45112323, 62027090, 78397369, 80444527]
39393H0444527k0185051k6183773j0372578J75833j3507693k9622531j7570637
39386c6821903J4351960L0482282J7332901m329505j2126941l739684J1337583
39379A6486693K0687018J1368887j6144804l6428289k1520753K1602460N2668728
39372D8719940M2279349K227658l1448801l4861076j3281623Q851734J2338168
39365C4825349K334770N49636J4774149K6118569J5529731r403778k8253643l5184707
39357B1290076l3305832j5205264K2942031N5370555M7960025P526118k1210030
39350H5367679j4760885K785793L198693o165162m354226O187206P931923k079727
39342G8111294j2187836j5730565j4243069r936152p604367j3657691k2727511
$$ y = [80444527, 60259476, 34075703, 23703125, 23878958, 10371265, -19251266, -36821903, -22469943, 8012339, 25345240, 21015735, 8888794, 5149110, 16486693, 37173711, 48542598, 32397794, -4030495, -25551248, -3948788, 48719940, 90999289, 93226947, 61778146, 26917070, 13635447, 22487181, 34825349, 37160119, 37709755, 52483904, 78602473, 94132204, 84728426, 56474783, 21290076, -12015756, -27221020, -4278989, 51091566, 99051591, 106577709, 85367679, 70606794, 73392587, 76591280, 70426118, 66071892, 72259098, 80191021, 78111294, 65923458, 50192893, 35949824, 26013672, 18409305, 4751614, -17975897]
39335a7975897j8601081R12812J6715193J8225491J9727079K9635764K6992564
39328G5631925m577671l9071581l8064109o540459J6363033J5042521Q497458
39321B7281117O680061k626675j7014802j1183307J8186245L5827094J8640496
39314G5790229p954726j0427734L404868N954096j789163L04451Q265813n29004
39306G3018830k2985341k8781867p518512J4667218J4040385k408615j7001053
39299B3031045k4041653k0912555j465472K6272342L8030698K6249097J4036402
39292H1199904J7074409J4996264j1829978l8438971k6705913J0706827K2189900
39285F9192442o239398l1867647k4673069r570301j3986196j6758558R109763
$$ y = [-17975897, -36576978, -35664166, -18948973, -723482, 19003597, 48639361, 75631925, 71054254, 31982673, -6081436, -12621895, 3741138, 18783659, 27281117, 33961178, 31334503, 14319701, 3136394, 21322639, 57149733, 75790229, 67835503, 57407769, 60812637, 66766733, 64977570, 65282021, 73547834, 73018830, 50033489, 21251622, 13733110, 28400328, 42440713, 40032098, 23031045, -1010608, -21923163, -23388635, 2883707, 40914405, 67163502, 81199904, 98274313, 113270577, 101440599, 63001628, 36295715, 47002542, 69192442, 62953044, 31085397, 6412328, -3157973, -17144169, -33902727, -24792964]
39278b4792964L5847740J8107573k5243141k7932171K1779018N6638365K9479795
39271H3884215j7799147k2240558P035462J5595549m190303q974454J4392575
39264F7703339K5013412o02537k5947218j2749690J7533370J8551704r615477
39257G9886903k5544098j1642203O600750P545205K672897P632830J4351131J1061102
39249I2564517Q049396J9301867L1338255J7044363k1587723m8939493m0297126
39242E7474056j1842691M724030K554176r40700M261948R220203N863314O51723
39234G1966059J538415L640893k634876j6434965k7966892l0302259k2711713
39227b2905338p374668R608804J8477616J5309468P801685M229626J661644n593097
$$ y = [-24792964, 11054776, 29162349, 3919208, -24012963, -2233945, 54404420, 83884215, 66085068, 43844510, 50879972, 66475521, 62285218, 53310764, 67703339, 92716751, 92114214, 66166996, 53417306, 70950676, 89502380, 79886903, 54342805, 42700602, 49301352, 56846557, 59519454, 67152284, 81503415, 92564517, 100613913, 119915780, 151254035, 168298398, 146710675, 97771182, 57474056, 45631365, 50355395, 52909571, 51968871, 56230819, 65451022, 71314336, 71966059, 73504474, 77145367, 74510491, 58075526, 30108634, -193625, -22905338, -30280006, -20671202, -2193586, 13115882, 20917567, 25147193, 26808837, 21215740]
39219B1215740j1507123n528307Q344653J4217307O783598k438467l237607K471657
39211C0321451J0478252J9971791K4678683J4232773p223983j8525085q529557
39204F5404325P010683P682793m199817j1993836r840237l847469L182853J1287324
39196F4686619J3730656N126973m818402k628755O721079O121191o776784j6873304
39188F5289273j5943929j1308265q032926j195602Q920369J1618148L740094k215513
39180E0871649L220545J2413420J3876945Q373438L628417L086561O905080J3831843
39172A16207898J5896282K901553k0584385l4473399k7199851r251157M000370
39165D7497311R412264Q404557j232975j3855409j2463021P545902K4789800J9009716
$$ y = [21215740, 9708617, 4180310, 12524963, 26742270, 33525868, 31087401, 27849794, 30321451, 40799703, 60771494, 85450177, 99682950, 92458967, 73933882, 65404325, 72415008, 80097801, 75897984, 63904148, 54063911, 50216442, 53399295, 64686619, 78417275, 83544248, 78725846, 76097091, 82818170, 88939361, 82162577, 65289273, 49345344, 38037079, 30004153, 28808551, 37728920, 49347068, 53087162, 50871649, 54092194, 66505614, 80382559, 88755997, 92384414, 95470975, 102376055, 116207898, 132104180, 135005733, 114421348, 79947949, 52748098, 43496941, 47497311, 56909575, 65314132, 64081157, 50225748, 37762727, 45308629, 70098429, 89108145]
39157H9108145o18466j1933001j1768699j1017092r858857k442384K668761o139659
39149C7998748j6835040o871396J8392868K9647270J8023314N370029M342612
39142I0068405R7327j5746127k3948822j0551459N279726J542579q784435P68831
39134C8726025K4060569K9079778O961250j5013575j3841908m20863J197210j2335272
39126E8413214k2883808j5716868M880019K2218069K3647815J1052850k396003
39119G9215288n517758J033840P659807N915858m778766j6848651j9590272q359475
39111C8729871R416241K0479635J8553762P908339l600528r248659m627088O557533
39103H4169106J0707479L31064j0807751m184327J3380929J6751670J898128o748305
$$ y = [89108145, 88489679, 76556678, 64787979, 53770887, 43912030, 41469646, 44138407, 37998748, 21163708, 14292312, 32685180, 62332450, 80355764, 85725793, 90068405, 90165732, 74419605, 50470783, 39919324, 45199050, 46741629, 37957194, 38726025, 62786594, 91866372, 98827622, 83814047, 69972139, 69551276, 70748486, 58413214, 35529406, 19812538, 24692557, 46910626, 70558441, 81611291, 79215288, 73697530, 74731370, 82391177, 88307035, 83528269, 66679618, 47089346, 38729871, 48146112, 68625747, 87179509, 95087848, 91487320, 82238661, 77611573, 84169106, 94876585, 95207649, 84399898, 80215571, 93596500, 110348170, 112246298, 105497993]
39095A05497993K804059R064250n817255k3452319j8783652j393760L163272k215638
39087F8866950M530596J9710775J6976144m035311j0950768Q820783K3715439
39080A27634608N512542k6112588l1572456o664043J6072858J3636693l024276
39073I5483338j1237284n578049J689681K06300n880754m859023O082865J5761257
39065I1668331J2707498o83520j2669380j5927508j0507335K63071P564979j091644
39057G1324492k3827134l5322184j4584531K1748503L5364481J6205375o166841
39050F4742161n839089Q205032J4405751J0693511Q247758Q722944N461370j221956
39042A13417482m758772l249125P75308O252356J0844257Q052886m721971j9252052
$$ y = [105497993, 108302052, 117366302, 111549047, 88096728, 69313076, 67919316, 71082588, 68866950, 73397546, 93108321, 110084465, 106049154, 95098386, 103919169, 127634608, 133147150, 107034562, 75462106, 68798063, 84870921, 98507614, 95483338, 84246054, 78668005, 80357686, 80563986, 74683232, 69824209, 75907074, 91668331, 104375829, 103692309, 91022929, 75095421, 64588086, 64851157, 72416136, 71324492, 47497358, 12175174, -2409357, 19339146, 54703627, 70909002, 64742161, 58903072, 67108104, 81513855, 92207366, 100455124, 109178068, 114639438, 113417482, 108658710, 105409585, 106184893, 112437249, 123281506, 131334392, 126612421, 107360369]
39034A07360369k3692441j4318574J664725J1538197P316867l784467m795209
39027H1289467O589872R754981p283227k2025822r178301J3951821J0580583j2685186
39019G0994188j2310607J7695977L0018723K089666k2848644o760809J8969978
39012I7848472P354766k4475651k5716264L371910J7317373L449498n106936P455322
39004H1498490J8475282J4077948P876324L944735j1767967l1416512k3003824
38997E9684476J4560110L7164534J8488689j0875935j2623667M707240R288655
38990A20394102l000921j1719810p820010Q2186L116825k991108j7587692k6446214
38982E4027358j1369799J8687446K8416826M322539k1696419j7066439O741640
$$ y = [107360369, 83667928, 69349354, 71014079, 82552276, 89869143, 86084676, 81289467, 87879339, 97634320, 90351093, 68325271, 59146970, 73098791, 83679374, 70994188, 58683581, 76379558, 106398281, 108487947, 85639303, 78878494, 97848472, 105203238, 80727587, 55011323, 58383233, 75700606, 79150104, 74043168, 81498490, 99973772, 114051720, 121928044, 125872779, 114104812, 82688300, 59684476, 74244586, 111409120, 129897809, 119021874, 106398207, 111105447, 120394102, 117393181, 105673371, 97853361, 97935547, 101052372, 98061264, 80473572, 54027358, 42657559, 61345005, 89761831, 94084370, 72387951, 55321512, 62063152]
38975F2063152J8388217J3389857P774927L241719q457079j7572667o245087J7394480
38967H9977519K4944943Q809737p557980m375529R961329J4989701M376026r792557
38959A31333189j1630476J125115J2132903M829774j2942333j6565241j463812
38952A06819119P818339l539605j5773662p542740Q376079Q727633Q97423Q490895
38944A14273481K7578677L1611935J5232459N0652l060707n604183j1843301q340224
38936A59898789Q059316J8352957R526292o199957j1795884q051546n305301o795437
38928A57689229r649452j1433027r445383l255723k73344p169652j5132004p983032
38920I3347612J3318209K9186089K6966283J3693280J288659o109646p641143
$$ y = [62063152, 80451369, 93841226, 101616153, 104857872, 96400793, 78828126, 72583039, 89977519, 114922462, 123732199, 116174219, 111798690, 121760019, 136749720, 141125746, 131333189, 119702713, 120827828, 132960731, 137790505, 124848172, 108282931, 106819119, 114637458, 111097853, 95324191, 87781451, 96157530, 104885163, 105782586, 114273481, 141852158, 173464093, 188696552, 188747204, 185686497, 180082314, 168239013, 159898789, 167958105, 186311062, 195837354, 189637397, 177841513, 169789967, 164484666, 157689229, 148039777, 136606750, 127161367, 123905644, 123632300, 116462648, 101330644, 93347612, 106665821, 135851910, 162818193, 176511473, 177800132, 171690486, 164049343]
38913A64049343l444214J74735l393770r246077q611688n687173r141190j0529325
38905A14170641M586478K3964825J6776966j7021817l4860342o770844M0706982
38898A41552889N7843670L3049497k078187j9391507k1874453k4413303k6260725
38891A38427881j3267692J7508531M5468771M6338588K2669442J996207J8406
38884B59160134K652692l570461n544713P631302J1623057j8726079n5158864
38877A98067068m4866531O902345L5653416J1076076k1028555j4040578J2607887
38870A84371128J7945093P480437J0244129J9321901O642105k0746919k8145196
38863A97112678r032349Q970687R816473L339724k671109r547005r436873O584692
$$ y = [164049343, 160605129, 160779864, 157386094, 148140017, 139528329, 133841156, 124699966, 114170641, 118757119, 142721944, 159498910, 142477093, 107616751, 100845907, 141552889, 199396559, 232446056, 230367869, 210976362, 189101909, 164688606, 138427881, 125160189, 142668720, 188137491, 234476079, 257145521, 259141728, 259160134, 261812826, 258242365, 252697652, 260328954, 271952011, 253225932, 198067068, 153200537, 160102882, 195756298, 206832374, 185803819, 171763241, 184371128, 202316221, 209796658, 220040787, 239362688, 246004793, 225257874, 197112678, 188080329, 197051016, 206867489, 210207213, 207536104, 197989099, 188552226, 195136918]
38855A95136918K4093495K0859902L595792l415927j444594j1271329k6133802
38848B01420455j4416999K3099602M1731426J6095919k0873883k4078671N837597
38841B28815446L2366417L0216449L679802k5653561l4775049j7115949N941421
38834B23474976O838355j0363312j5208311K039957J6676670J2352002O378991
38827B42189328J5535432K5964887J9157077K698828q165474j6142670k4529630
38820B56707778j8100332R421587K9991018J7025920r645790j0538913J3372754
38813B88234022K5469361J2791579J075876Q109213J8916525J6616642O693962
38806C77907180j437644j0183751j7899014j1339473J0534495K4989074J4100680
$$ y = [195136918, 219230413, 240090315, 243686107, 240270180, 238825586, 227554257, 201420455, 187003456, 210103058, 251834484, 267930403, 247056520, 222977849, 228815446, 261181863, 291398312, 295078114, 269424553, 234649504, 217533555, 223474976, 230313331, 219950019, 204741708, 206781665, 223458335, 235810337, 242189328, 257724760, 283689647, 302846724, 305545552, 297380078, 281237408, 256707778, 238607446, 248029033, 278020051, 295045971, 285400181, 274861268, 288234022, 313703383, 326494962, 327570838, 335680051, 354596576, 371213218, 377907180, 376469536, 366285785, 348386771, 337047298, 347581793, 372570867, 386671547]
38799C86671547j0044215k3029848j7905875m467686Q310723J5384271J2138104
38792C67057021J482088l984555J942366R949393J1766516J2984469J6501724
38785D17699022Q361746j9475342m3497243l2107703P929906L4782209K5466384
38778C99158979K388664l203387P911601J4018873P258963k567345r361515j5725778
38770C99879055j9664517j3797287J019770J4295225J8948550J4834330R12091
38763D16427217k1935223l9710670l3191980k885945K6595507L3163743J7402793
38756C95865442p101014k8078826l3001324j2412170K0990645L3002787O944751
38749C76210291k9164883l4597311o418991K2934153L0538324K0753891L475269
$$ y = [386671547, 376627332, 353597484, 335691609, 331223923, 339534646, 354918917, 367057021, 368539109, 364554554, 366496920, 376446313, 388212829, 401197298, 417699022, 426060768, 406585426, 363088183, 330980480, 338910386, 373692595, 399158979, 401547643, 398344256, 406255857, 420274730, 427533693, 424966348, 415604833, 399879055, 380214538, 366417251, 367437021, 381732246, 400680796, 415515126, 416427217, 394491994, 354781324, 321589344, 318703399, 345298906, 378462649, 395865442, 388764428, 360685602, 327684278, 315272108, 336262753, 369265540, 376210291, 347045408, 312448097, 306029106, 328963259, 359501583, 380255474, 383730743]
38742C83730743j5850289k3038850l392056K7241975K8863936q990559m5130660
38735C43434240l8977394l890793J6420038Q446209l117261M39990R464744Q713498
38727C40933271k214388j6603944k9540840l3125841j9552344L631482J5513968
38720B59041364P583196m016058r06814J2712834J8377704R787116j219764l701155
38712B97658423j784570o063247j7293814k4961244k1040601r690179o65342L179672
38704B19339098O875963J3250725J7844429J5287525O333254l072539o729516
38697B69128939k722181K769383j593709j8313930l2037136k5165256k672629
38690A89393481J1423866N427308o078429n964992J637668J668897q484153j7589958
$$ y = [383730743, 367880454, 344841604, 341449548, 368691523, 397555459, 388564900, 343434240, 304456846, 300566053, 316986091, 325432300, 322315039, 322755029, 332219773, 340933271, 338718883, 322114939, 292574099, 259448258, 239895914, 243527396, 259041364, 266624560, 262608502, 261701688, 274414522, 292792226, 302579342, 301359578, 297658423, 295873853, 289810606, 272516792, 247555548, 226514947, 216824768, 216159426, 219339098, 226215061, 239465786, 257310215, 272597740, 278930994, 275858455, 269128939, 266406758, 269176141, 267582432, 249268502, 217231366, 192066110, 189393481, 200817347, 206244655, 200166226, 194201234, 195838902, 197507799, 189023646, 171433688]
38682A71433688j5827838k967176J2046726J4845082k78497j5918221p716557
38675A55617207J8099004K5708342J963103j8544466m882664J9302064J2651659
38668B09914249j4806754j6302526J3621888K7154086p87719l3124085l0270898
38661A55398241q331635n075869j8507397j7943020K082539J7967277J9027128
38654A44617264J7382972J6913547N780276j4126322k0281515n044012O069253
38647A51311463r853584l5750219l5231053l049456K7787345L0457391J4792009
38640A40463896M387097J859647m776001j2692213o667631R978476J3690966j954716
38632A44289521j3065019m676189K428905j2317865k9854484k0896014K547219
$$ y = [171433688, 155605850, 152638674, 164685400, 179530482, 179251985, 163333764, 155617207, 173716211, 199424553, 201387656, 182843190, 177960526, 197262590, 209914249, 195107495, 178804969, 192426857, 219580943, 218793224, 185669139, 155398241, 147066606, 141990737, 123483340, 105540320, 107622859, 125590136, 144617264, 162000236, 178913783, 184694059, 170567737, 150286222, 145242210, 151311463, 141457879, 105707660, 70476607, 67427151, 95214496, 125671887, 140463896, 144850993, 146710640, 141934639, 129242426, 122574795, 132553271, 146244237, 144289521, 131224502, 126548313, 128977218, 116659353, 86804869, 65908855, 68456074]
38625F8456074N100905j1978190j3851309N569000J3156789j736138m944644K1573151
38617H1345638M2939791K7265302j686441o584701J998394q696338l0934554k8757070
38609G6890021Q4147K1461657J9150174R634321M577540j900882p724334k053821
38601A20118823P298376N57906j7341057k1336372r697390o340352j6085688j7005141
38593D0169105m661972k236259j3760201r709492K1201930M5812897L6549204
38586A13365212J1356793k926631j1535169k5449643k8928391j0660624L301067
38579D8522614r824907k2418471J654789L8530235L3556279r790187k9225539
38572E1004813K474150L8789773L2950289J334589j5191305j4397011k0235597
$$ y = [68456074, 73556979, 61578789, 47727480, 53296480, 66453269, 64717131, 59772487, 81345638, 124285429, 151550731, 149864290, 143279589, 145277983, 136581645, 105647091, 76890021, 76974168, 98435825, 117585999, 127220320, 131797860, 129896978, 122172644, 120118823, 127417199, 127975105, 110634048, 89297676, 79600286, 73259934, 57174246, 40169105, 35507133, 33270874, 19510673, 9801181, 31003111, 76816008, 113365212, 124722005, 121795374, 110260205, 84810562, 55882171, 45221547, 48522614, 38697707, 16279236, 17934025, 56464260, 90020539, 80230352, 51004813, 53478963, 92268736, 125219025, 126553614, 111362309, 96965298, 76729701]
38565G6729701l1873065k4598346O217192L3873334L4685687J2502274j3563030
38558I3973747k9741302l1808230k0664697r68701J9326456L1787038L0887519
38551I2791830J7044394k008853j4974420j4657214k956163J0014630J1872873
38544I7127077j683983j9438906k3753555j2019253j493096n445474j3705920
38537A9586890q992171N347185J0292311L40105r228793m687817J1073979K6702061
38529E0433750L2496117K2601074P03672j6661307j5743889k989749O223117J0140117
38521H7202902J3689593P571786j7697938m0555091k6602953J6183073L7625258
38514G7416630J5057997j3593446q398056J5874172K2074336R081076l36058o539313
$$ y = [76729701, 44856636, 20258290, 26475482, 60348816, 95034503, 107536777, 93973747, 64232445, 32424215, 11759518, 10790817, 30117273, 61904311, 92791830, 109836224, 107827371, 92852951, 78195737, 75239574, 85254204, 97127077, 95443094, 76004188, 52250633, 40231380, 38738284, 33292810, 19586890, 10594719, 15941904, 26234215, 26574320, 17345527, 12657710, 23731689, 50433750, 82929867, 105530941, 106234613, 89573306, 73829417, 70839668, 77062785, 87202902, 100892495, 108464281, 90766343, 50211252, 23608299, 39791372, 77416630, 92474627, 78881181, 70483125, 86357297, 108431633, 117512709, 117176651, 110637338]
38506A10637338k3861812l8581604k2661661J4294279L1103383J5834166j183860
38499H5580229j995437n881605k4431630l2485573r589131K0955801K4264799
38492E6417453L177697j3309574j4060762r566539m295809M914732R578906j683806
38484C1172298j5616768m065950L1722349N1147594K3713862k6709993m5601387
38477D5762005j2436995L3426038L7328512p582383n2165240m7925194j468144
38470e061401L7739423L7056495J0951274q539456j0687247n063122N72095L703656
38462F0671717j286381j6169147k8282863k3678961q031398J631235L611155J1488269
38454d6374K6506330L0601925J4891247k769863k054537J0410355J1532812n391465
$$ y = [110637338, 86775526, 48193922, 25532261, 39826540, 70929923, 86764089, 85580229, 83584792, 77703187, 53271557, 20785984, 11196853, 32152654, 56417453, 59595150, 46285576, 32224814, 22658275, 18362466, 23277198, 32856104, 31172298, 15555530, 11489580, 43211929, 94359523, 118073385, 91363392, 45762005, 33325010, 66751048, 104079560, 96497177, 44331937, -3593257, -5061401, 32678022, 69734517, 80685791, 72146335, 61459088, 56395966, 56968061, 60671717, 59385336, 43216189, 14933326, -8745635, -16777033, -15145798, -11534643, -46374, 26459956, 57061881, 71953128, 69183265, 67128728, 77539083, 89071895, 83680430]
38446H3680430k4498834l1538455k7869408j8148612p93702K0000398K6432947
38439B7264764P458402j9445147k5346663q294081N159843J513144l8404J5823314
38431D095172K7652529Q859965k2727131k3846638Q066184K7420634Q765820j6356921
38423B1929614j2019524P341632O597339j1737940j7235979l959005O798627Q846449
38415F561213J6304798K6618974J7505022j1470162k9272125j7972154K690377
38408A0965943Q685589K323673m544638j1096304j4975968m910466J5806208K3299386
38400B5553423J0343867L506736J9185950K9733579N549376l2190356l9749722
38393B1932853j5746811M250473Q018548J5340364K7801431J8957357j4160483
$$ y = [83680430, 59181596, 27643141, -226267, -18374879, -19168581, 831817, 27264764, 34723166, 15278019, -10068644, -18362725, -13202882, -11689738, -11728142, 4095172, 31747701, 40607666, 17880535, -5966103, 2100081, 29520715, 38286535, 21929614, 9910090, 17251722, 23849061, 12111121, -5124858, -9083863, -2285236, 6561213, 22866011, 49484985, 66990007, 55519845, 26247720, 8275566, 10965943, 19651532, 21975205, 17430567, 6334263, -8641705, -13552171, 2254037, 25553423, 35897290, 39404026, 58589976, 88323555, 93872931, 61682575, 21932853, 6186042, 10436515, 18455063, 33795427, 61596858, 80554215, 66393732]
38386F6393732l4360716j9090987N750381J0410759N295930J1088786J5123304
38379F0611189m961587l3806850l4708455n027759K1219863K3993416J7107041
38372D4426858J5225709J2332043J399753j0116220j4768219j5033047j0988998
38365B2477879K058436J6434919J4224914l855534j3881278n105414K561151o148603
38357B8766470j3939722k563803J0399684k06299j7752891l725500L6834317N3289062
38349I1101318K2447581j6131935j8330411M038027R887734p330408j6952093
38342F8729813k209951J7924576J8332097m013043l2924935m6502923k9412078
38335a0076444R864019L6085923K2031296j4428369l0285658j4931342l89199
$$ y = [66393732, 32033016, 12942029, 18692410, 29103169, 34399099, 45487885, 60611189, 55649602, 21842752, -12865703, -17893462, 3326401, 27319817, 44426858, 59652567, 71984610, 73384363, 63268143, 48499924, 33466877, 22477879, 24536315, 40971234, 55196148, 51340614, 37459336, 32353922, 34915073, 28766470, 14826748, 12262945, 22662629, 22456330, 4703439, 977939, 37812256, 91101318, 113548899, 97416964, 79086553, 83124580, 93012314, 85681906, 68729813, 66519862, 84444438, 102776535, 98763492, 65838557, 19335634, -10076444, -212425, 35873498, 57904794, 43476425, 13190767, -1740575, -2129774]
38328b129774p290574j2162035J1195477M3601735M4849429J3437900j1272327
38321H0229831o321153N860353l709844k6235249k9259328m477508J9657062J5799100
38313E1543264o846716j6534581l193268P298396r383083l7035234l6431408K71711
38305e0310919L5198705L3936764Q661508n602546j693280j266094j2294921j6294177
38297i664960l090250R697527O414902L37583J0039848K4164821J5593278j4717082
38289C8775667l4014111k1741775M126828J3691167J428501j5228643j9872122
38282c2834488o573593K2421972N1505065N3444839J7959126k4402936l0309298
38275E1210687J209451K5348508J2033995j4947058j6898983L770019J3536380
$$ y = [-2129774, -9420348, -21582383, -10386906, 33214829, 78064258, 91502158, 80229831, 73908678, 79769031, 76059187, 49823938, 20564610, 16087102, 35744164, 51543264, 44696548, 28161967, 24968699, 32267095, 22884012, -14151222, -50582630, -50310919, -15112214, 18824550, 27486058, 21883512, 20190232, 18924138, 6629217, -9664960, -12755210, -3057683, 3357219, 3694802, 13734650, 37899471, 53492749, 38775667, 4761556, -16980219, -12853391, 837776, 2266277, -12962366, -32834488, -39408081, -16986109, 34518956, 87963795, 105922921, 81519985, 51210687, 52420138, 77768646, 89802641, 74855583, 57956600, 61726619, 75262999]
38268G5262999K03922j6202694k0687006j9258437j4423224L228263K7552958
38261C5676781L0782213M471839j7849513m674667K4201243K2692989j5427052
38254G9873833m7443518m1610872j6960677r629581k0604521j9100544Q962042
38247f6513838L8185814L7008962J0332286o838874L576025J9857008J3918341
38240D9525724p841187j6612132n757690K494908l898468q413406K935508J6493873
38232B8927130J3804795M31690o951159o911932p392832o951693j831600Q4383
38224A3208782p552254j3731265p483370J346686K47792j621308P021991J1670443
38216C107497l240028j5668396N878776M2027947L9272878p186339l7214862j1297765
$$ y = [75262999, 75466921, 59264227, 38577221, 19318784, 4895560, 8123823, 35676781, 66458994, 70930833, 53081320, 48406653, 72607896, 95300885, 79873833, 32430315, -9180557, -26141234, -35770815, -56375336, -75475880, -66513838, -28328024, 8680938, 19013224, 12174350, 15750375, 35607383, 49525724, 41684537, 25072405, 19314715, 21809623, 17911155, 9497749, 12433257, 28927130, 42731925, 43163615, 36212456, 29300524, 21907692, 14955999, 13124399, 13208782, 5656528, -8074737, -15558107, -14211421, -13963629, -15584937, -8562946, 3107497, -132531, -15800927, -9922151, 32105796, 71378674, 64192335, 26977473, 15679708]
38208A5679708L2266815L4794999l619404l6736762l8056297j8036143O967157
38201f739927K6550216K5817354k670007l6076928l7448097q1437M1900055N1573256
38193F2824485K6080978o155152j6533779l828758O441411n946659k6509292k2962717
38185A3410517P100375K7794036J4675095j0755499j5413603k762227k80105j2785852
38177B0982737j8267062n593771J1073132J7008552J3789039P934162Q74692n238436
38169D2563045n862865k361340j619428n299416p793257n188711M21589M306696
38161A9166313K421916m307519o639145K743299J3178754N601988j5928619k2460658
38153f223671j855027J9720632J6236666R7882k198989O895655P061778j127655
$$ y = [15679708, 47946523, 82741522, 79122118, 42385356, 4329059, -13707084, -6739927, 19810289, 45627643, 42957636, 6880708, -30567389, -30648826, 11251229, 62824485, 88905463, 82750311, 66216532, 62387774, 68829185, 62882526, 36373234, 13410517, 20510892, 48304928, 62980023, 52224524, 36810921, 34048694, 33768589, 20982737, 2715675, -2878096, 8195036, 25203588, 38992627, 46926789, 47801481, 42563045, 36700180, 34338840, 32719412, 27419996, 19626739, 14438028, 14859617, 19166313, 21588229, 17280710, 10641565, 13384864, 26563618, 32165606, 16236987, -6223671, -8078698, 11641934, 27878600, 27976482, 25777493, 32673148, 39734926, 38607271]
38145C8607271j934201J369028o857788j9334857j2844409J0235545K1689937
38138C0930526J1390890q74232j768076j243531o867977j0914747r806325q474277
38130B372251q50849K2906348M4506826K8976350k0033201n2234066l6204782
38123a0561123p08875J0890312j750118r278743j27784J2157792J3978448L235826
38115A7835735j1795244j2617053J2483231M1519498L4776692p876056l5965196
38108C8361607j6198146J9687229K3756213r4184j3213136m822051L565777K899747
38100E3943056M879904J1043709J0238797N233421R439729J8140035J3429856
38093A26348507k773158j0563448p351758j1465312k7491965l6797400k8521324
$$ y = [38607271, 36673070, 38042098, 31184310, 11849453, -994956, 9240589, 30930526, 42321416, 41447184, 39679108, 38435577, 31567600, 20652853, 10846528, 2372251, 1521402, 24427750, 68934576, 97910926, 77877725, 25643659, -10561123, -11269998, -379686, -2129804, -11408547, -11536331, 621461, 14599909, 17835735, 6040491, -6576562, 5906669, 47426167, 82202859, 74326803, 38361607, 22163461, 41850690, 65606903, 65512719, 52299583, 47477532, 51043309, 53943056, 58822960, 69866669, 80105466, 85338887, 94778616, 112918651, 126348507, 123575349, 113011901, 105660143, 94194831, 66702866, 29905466, 1384142]
38086A384142j4349962n686106O61285P119256P024542q78977p337642p250356
38078a9313818m021847J604022J0156048J2967452L228700n806034K281809J5438707
38070A6535039Q052075j3021514j2755425J4763371L0751385R694397k1233855
38063C2785473k3996658k762245J1931899J0089102M241307k11847p902208j5206096
38055H968727j3729473o931023l644727j437377N171933P725924m448570k1204605
38047b9529191k1367998l212080J4181503J9027817J7882844J8010897J6473197
38040C1466989J0340324L184271k972896j0677523j8556222j9908077j3167148
38033b0290282n696766m456071q534082j1147962m570374J3141923K9983809K5611106
$$ y = [1384142, -12965820, -18651926, -17990641, -10871385, -3846843, -4725820, -12063462, -19313818, -23335665, -21731643, -11575595, 1391857, 4620557, -1185477, 1096332, 16535039, 24587114, 11565600, -1189825, 13573546, 44324931, 54019328, 32785473, 8788815, 6026570, 17958469, 28047571, 32288878, 32077031, 24174823, 8968727, -4760746, -11691769, -15336496, -16773873, -11601940, -3876016, -8324586, -29529191, -50897189, -54109269, -39927766, -20899949, -3017105, 14993792, 31466989, 41807313, 44991584, 42018688, 31341165, 12784943, -7123134, -20290282, -25987048, -30443119, -38977201, -50125163, -54695537, -41553614, -11569805, 14041301]
38025A4041301l382673k9818451k3337801J0572141L5764901L0631535J0337686
38018D4808639r47117j710555n573680j5839000k2749390j9809505r695718L320640
38010b8195686J5785573K0850617J2108194n430912j5132361m963104J7057224
38003A2079545K7569149J2149508j4430269j9174309R991701M1448644L1612569
37996A01246538j8873417n9075192m8369148o067429J8001981R232688k658688
37989f562667L583420J1433302J156282j4047710q685104J4639803K9357267K1527290
37981E2401883J351219j6666019k5155557j9640788l704478M108466r245857k5013245
37973d1564376j1996486K5591521M7928426L4745970J0640263J839732m63903
$$ y = [14041301, 10658628, -19159823, -42497624, -31925483, 3839418, 34470953, 44808639, 43861522, 42150967, 36577287, 20738287, -2011103, -21820608, -31516326, -28195686, -12410113, 8440504, 20548698, 15117786, -14575, -4977679, 12079545, 39648694, 51798202, 37367933, 18193624, 28185325, 69633969, 101246538, 82373121, 23297929, -25071219, -31138648, -13136667, -3903979, -6562667, -2979247, 8454055, 9610337, -4437373, -13122477, 1517326, 30874593, 52401883, 53753102, 37087083, 11931526, -7709262, -11413740, -7305274, -16551131, -41564376, -53560862, -27969341, 19959085, 54705055, 65345318, 67185050, 66721147]
37966F6721147j1327605j7190668k479249J2438029q08754k7496328k8801526
37959h944954m448299Q045709l205931q289539P905150J9259690Q135778j589523
37951A6868081R974426J8115142l851897l1327076k3141419R353396J7453672
37944A3444325o984022j9255736N029307L0966988J9500490j4468386k7862913
37937C70053r974551J2820539J9705227J4249189N808903k513979o541986k264417
37929C1658978K727179l207795j3916292j0474793N914852Q117501j5405499l3791536
37921b8377405j3191078K9592311M4229629J6086347j4920824j3946062K778451
37914B2251369K389118j1589873j2238232J515614N260421o145145j0128377K627445
$$ y = [66721147, 55393542, 38202874, 35723625, 48161654, 47352900, 19856572, -8944954, -13393253, -5347544, -8553475, -16843014, -8937864, 10321826, 18457604, 16868081, 26842507, 44957649, 41105752, 9778676, -13362743, -4009347, 13444325, 6460303, -12795433, -7766126, 23200862, 42701352, 28232966, 370053, -9604498, 3216041, 22921268, 37170457, 42979360, 40465381, 33923395, 31658978, 34386157, 31178362, 17262070, 6787277, 12702129, 20819630, 5414131, -28377405, -41568483, -11976172, 32253457, 48339804, 33418980, 19472918, 22251369, 24640487, 13050614, 812382, 2327996, 7588417, 1443272, -8685105, -6057660]
37906f057660J1182329J18006j4459820j0425161R266221K6440264L1800303K4949094
37898G2813576O473991j5063472k2812152j3190102m296217r160814j6091378
37891a326568j1032902j976800r85059J148846J6492758K9503226J5805257j4375195
37883C3253563k3542893m569K5151615K1870238k237473j9892096j9255976q165594
37875G176815K804709Q519948Q017275M127902Q37644j412901l049485l66975
37867B6654932P689261J1104719M23843j4803958j4945090J002160J1831467L436555
37859C2393889j3393336k0301030j2969978R57367J3209323J7403319J1239967
37852B8539521K520164L042125J1600278J3800361L454478p792002q046413n58253
$$ y = [-6057660, 5124669, 5242675, -9217145, -19642306, -10376085, 16064179, 47864482, 72813576, 79287567, 64224095, 41411943, 28221841, 23925624, 14764810, -1326568, -12359470, -14336270, -15321329, -14172483, 2320275, 31823501, 47628758, 33253563, 9710670, 9706101, 34857716, 56727954, 54490481, 34598385, 15342409, 7176815, 9981524, 18501472, 26518747, 30646649, 31484293, 30071392, 27021907, 26654932, 34344193, 45448912, 45872755, 31068797, 16123707, 17125867, 28957334, 32393889, 19000553, -1300477, -14270455, -13313088, -103765, 17299554, 28539521, 31059685, 34101810, 45702088, 59502449, 62956927, 55164925, 47118512, 46560259]
37844D6560259N104404N895636K344265n983454j4444406j3425496k519784N109694
37836B8641118m2697j1568486j8064559j5521464l655750J5907728L0338292K1343396
37828D7377578p244891k3404318n142034K7703636L8129559J8275587q611891
37821H7083226k4179714k9909103k8878624j6487141N156181K1174265K0472319
37814C4431409Q366528j973365l261266K150047N304065j593309j3712275j4497659
37806A5214175K576349J9943340J7513563J761090n390936k302768p897124k4198317
37798A7219372k6015099k52493K7925897K7604124N036422p109788N615049K5629336
37790G5652820K9930497J3360120j2518866k9300253k3222052p55432J1235403
$$ y = [46560259, 51664663, 57560299, 59904564, 53921110, 39476704, 26051208, 23531424, 28641118, 28598421, 17029935, -1034624, -16556088, -20211838, -4304110, 26034182, 47377578, 40132687, 16728369, 11586335, 39289971, 77419530, 95695117, 87083226, 62903512, 32994409, 4115785, -12371356, -7215175, 13959090, 34431409, 42797937, 40824572, 37563306, 39713353, 45017418, 43424109, 29711834, 15214175, 17790524, 37733864, 55247427, 57008517, 51617581, 49314813, 41417689, 17219372, -8795727, -9048220, 18877677, 46481801, 51518223, 44408435, 50023484, 75652820, 105583317, 118943437, 106424571, 77124318, 53902266, 53146834, 64382237]
37783F4382237l348246k3461823j6489303J2443557K4106480L381768j7165177
37776D3849493q763572Q060031p99587k3195121j6862954K1224686M4254021K2657450
37768I0424447j5561966k9253216j7756636o295558k925945O68612K691754l303692
37760A8687800o792158N683898K1438744J6823446k540430q649284K329271M977816
37752E1959103q707450j3600827M645158K3676438K1386919R045924N252722L996563
37744I7654550n549099j1964112l462793M857503k685325r264929M768235J7640616
37736I1994646l877178m1674690m4421801q007813J5304692j015472j9525701
37729a1223317n855504J5688074J0273503m225228R982712M0461579L9896168
$$ y = [64382237, 61033991, 37572168, 21082865, 33526422, 57632902, 61014670, 43849493, 35085921, 43145952, 42346365, 19151244, 2288290, 23512976, 67766997, 90424447, 74862481, 45609265, 27852629, 21557071, 18631126, 19299738, 21991492, 18687800, 11895642, 17579540, 39018284, 55841730, 53301300, 44652016, 46981287, 51959103, 43251653, 29650826, 34295984, 57972422, 79359341, 88405265, 93657987, 97654550, 92105451, 80141339, 76678546, 81536049, 78850724, 69585795, 74354030, 91994646, 88117468, 46442778, 2020977, -5986836, 9317856, 8302384, -11223317, -17078821, -1390747, 8882756, 4657528, 14640240, 55101819, 94997987]
37722I4997987K053261k7716340k1223210k374911p42671q213243l591351P857033
37714D1046555O942032l255818j373345J6422401K7808824J5527596q966796k1628522
37706G2522927j6391413q675928j0289291j2600449k091462J4552291J5394264
37699E2420939m481344k0565153r730975J6571290K5283124M232836k3962241
37692C9768476l1910456j7481760J487467J1765977J5288120J9127573K2069374
37685F0114771J4341750p375376k7022432k1852512O236709K4957875J1518381
37678F0919166j2568658q488459K3384589M1885849K3802675n109378j1550029
37671A12275755p23403J213810r130072j4034116r291448q635722j5856536j7646237
$$ y = [94997987, 97051248, 69334908, 48111698, 45736787, 44994116, 36780873, 33189522, 41046555, 47988587, 44732769, 43359424, 59781825, 87590649, 103118245, 94151449, 72522927, 56131514, 47455586, 37166295, 24565846, 22474384, 37026675, 52420939, 47939595, 27374442, 17643467, 34214757, 59497881, 63730717, 39768476, 7858020, -9623740, -8136273, 3629704, 18917824, 38045397, 60114771, 74456521, 67081145, 40058713, 18206201, 24442910, 49400785, 60919166, 48350508, 39862049, 63246638, 105132487, 128935162, 123825784, 112275755, 111552352, 112766162, 103636090, 89601974, 80310526, 71674804, 55818268, 38172031]
37663C8172031p220596M978022Q304170L489304n390449j5103566j7761673p283210
37655B184033O938605R986244O355253J4026292K9531868K4453278j0249027l9954397
37647D3272149k7676841J5661268M4852395L5409008L788364k1830108k9611708
37640F3864527k2889276r221845M435943J5546771K6177048L3082852K3871914
37633A34867934m924328l2181837l1697883o230470J4418889J0339946r411966
37626G5180285k6362899l3008270k7548950o863299K1894814L5562986J7878394
37619E6733061j6229094l3667630k0882736K671934J1722013O102129O116346
37612A2566023K0878387L3182043K2140622o874205k7005910k3057113o288488
$$ y = [38172031, 30951435, 35929457, 44233627, 47722931, 42332482, 27228916, 9467243, 2184033, 9122638, 19108882, 25464135, 39490427, 69022295, 93475573, 83226546, 43272149, 15595308, 31256576, 76108971, 111517979, 115306343, 93476235, 63864527, 40975251, 31753406, 36189349, 51736120, 77913168, 110996020, 134867934, 129943606, 97761769, 66063886, 59833416, 74252305, 84592251, 75180285, 48817386, 15809116, -11739834, -18603133, 3291681, 38854667, 56733061, 40503967, 6836337, -14046399, -11374465, 347548, 6449677, 12566023, 33444410, 66626453, 88767075, 81892870, 54886960, 31829847, 25541359]
37605B5541359O371146J2391844J5195872J1422306K60735p065805l036333J779111
37597F2860235k767644n334662P357629K0409604Q696289j9759154l0105752j2350619
37589B9005926N469120L489014k597231N579785J8005192J7197131O035570n076539
37581G7107968j6721394k5853012j5869952J3724662K9457438O533080k7428637
37574D0950153k6305132P185056K5691186O585327k0620790k3044187o547844
37567C893769N448770P839764Q922312Q712515L370674L22589Q841302J9775663
37559F7127358J2908302j2773939l0533714j7206663J3777298K4367086m07750
37552E7257978l0452531k8464614O74992J8997516J0023295k970215O80779P888929
$$ y = [25541359, 31912505, 44304349, 59500221, 70922527, 71183262, 64117457, 61081124, 62860235, 60092591, 54757929, 62115558, 82525162, 91221451, 71462297, 41356545, 29005926, 34475046, 37964060, 35366829, 40946614, 58951806, 76148937, 82184507, 77107968, 60386574, 34533562, 18663610, 32388272, 61845710, 68378790, 40950153, 14645021, 21830077, 47521263, 54106590, 33485800, 10441613, 3893769, 9342539, 17182303, 26104615, 34817130, 38187804, 38510393, 47351695, 67127358, 80035660, 67261721, 36728007, 19521344, 33298642, 57665728, 57257978, 26805447, -1659167, -984175, 18013341, 28036636, 25066421, 25747200, 33636129]
37544C3636129O69314r433490k033129J4553477J5681972J86431j0224667n629609
37536C7406428L726693R416198J0964661M373114j1224394k0168860r151003N462871
37528C0805708k278838k4060305k5733489k52715K1501940J8286304M093989k491468
37520A9871126k872744j260310O361300J3124578J628031k1506917k2543921Q688594
37512A489737L5251641K4303895n166426j3668531K352861J5929250J4336360
37505G4828787O909612j314741j4013106k6095365k6130991j4388329r79281R327387
37497H143973J5797109J3490029J709147q058151p089427k149709j90686N181611
37489B6833896J6260648J7503606k30836j8172740j6068775m645522n008491j0211352
$$ y = [33636129, 34305443, 24871953, 22838824, 37392301, 53074273, 53260704, 43036037, 37406428, 41133121, 50549319, 61513980, 65887094, 54662700, 34493840, 25342837, 30805708, 28526870, 4466565, -21266924, -21519639, -17699, 18268605, 22362594, 19871126, 16998382, 15738072, 22099372, 35223950, 36851981, 15345064, -7198857, 1489737, 36741378, 61045273, 55878847, 42210316, 44563177, 60492427, 74828787, 81738399, 80423658, 66410552, 40315187, 14184196, -204133, -1183414, 8143973, 23941082, 37431111, 39140258, 31082107, 23992680, 21842971, 21652285, 26833896, 43094544, 60598150, 60367314, 42194574, 26125799, 21480277, 16471786, 6260434]
37481F260434J299775K4422239L3493771K4018093J4195819P337246j1156948
37474I9870429l6138196l8462375r646617J9949317K2156992N067891q563203
37467E4234238j3985402j8028608j8301942q452065O002270J2987272R471393
37460B3927156J529015n524976r094239o538578K584079J3665678J9334035J3849497
37452E3731667j912564j6990592j8471370q629348m412800j1543505j2262063
37445b0490575P212868L0736935L2915458J3774231q751596k7920121m2691787
37438a5214587l5826030O198332N5299296O2485842K1540115k2103357l2441096
37431C9938515j8936692l960863Q720527J8551602J5788580K910750j448262L324465
$$ y = [6260434, 7560209, 31982448, 65476219, 89494312, 103690131, 111027377, 99870429, 63732233, 25269858, 15623241, 35572558, 57729550, 62797441, 54234238, 40248836, 22220228, 3918286, -4533779, 1468491, 14455763, 23927156, 25456171, 19931195, 10836956, 4298378, 6882457, 20548135, 39882170, 53731667, 51819103, 34828511, 16357141, 7727793, 3314993, -8228512, -20490575, -13277707, 17459228, 50374686, 64148917, 55397321, 27477200, -15214587, -51040617, -44842285, 10457011, 72942853, 94482968, 72379611, 39938515, 21001823, 17040960, 25761487, 44313089, 60101669, 63012419, 61564157, 64888622]
37423F4888622o870175l5355787m7191240k1414576J2787173K1175009J3718768
37416A737794J5275305J8173175M912256q324702K008098J6603637P46603l0181690
37408B0950476k7711464R740050L0295960J0104861j3478353q609515K676290
37401B3968305p649893k1628518j0539145J0718501Q927164q764886p775235J2301388
37393d42319J6004996n925197j7596319M039337L0252862K4750314j684675j2847239
37385C6551760m892750m580069j5961287j0228665K1173999M0714982J6646268
37378G9424238k5534865l5359605o521483K0099151J7389635J989749r22132P509527
37370E8074215J1355809L210700j5283754l6913978m4318413k2972480J1934219
$$ y = [64888622, 58018447, 22662660, -24528580, -45943156, -33155983, -11980974, 1737794, 17013099, 35186274, 40098530, 31773828, 33781926, 50385563, 51132166, 20950476, -6760988, 2979062, 33275022, 43379883, 29901530, 21292015, 23968305, 16318412, -5310106, -15849251, -5130750, 3796414, -4968472, -12743707, -442319, 15562677, 9637480, -7958839, -3919502, 26333360, 51083674, 49398999, 36551760, 31659010, 27078941, 11117654, 888989, 22062988, 62777970, 79424238, 53889373, 18529768, 12008285, 32107436, 49497071, 51486820, 50564688, 58074215, 69430024, 72640724, 57356970, 20442992, -23875421, -46847901, -34913682]
37363c4913682K4612929O324269j0739502j867287J5167534J4610096N028758
37356A8223115Q025414J7072525J1823107k670965p024513n755585j6250112k7474305
37348d031319j1626586K3598915L7499824J8656013L076889J4818236K7363660
37341A09355632Q514943k7656115m3796639l2570967j5804860l820180J2620248
37334F842062L3189551L9310986K1355439l995455j3567567n742868J50077j0122506
37326F7419719k7490180l1374073j6571865P02118O671442Q086238J5828993K1625913
37318D4898305R838983j2828543k1778685j0078362K449073J772827k01477J0154401
37310B4226522K1932988J4858214q977895k4994888j5902639Q518310K2404015
$$ y = [-34913682, -10300753, -3976484, -14715986, -16583273, -1415739, 13194357, 18223115, 26248529, 43321054, 55144161, 52473196, 45448683, 39693098, 23442986, -4031319, -15657905, 7941010, 45440834, 64096847, 67173736, 81991972, 109355632, 117870575, 90214460, 46417821, 13846854, -1958006, -5778186, 6842062, 40031613, 79342599, 100698038, 96702583, 83135016, 77392148, 77542225, 67419719, 39929539, 8555466, -8016399, -7314281, -642839, 7443399, 23272392, 44898305, 54737288, 41908745, 20130060, 10051698, 12500771, 14273598, 14072121, 24226522, 46159510, 61017724, 52039829, 27044941, 11142302, 19660612, 42064627]
37303D2064627J1556183r750571j3122138Q310945K6482505J2825614k1194146
37296E7173019l7138888k0406764M724712J3222998Q272835L981345J996351j288620
37288C0536988k279019R46450J524818k640763k422520M635907N799238m972011
37280C1129088j2689441m007083R931146R770201m265000j6571616j8463389j1774864
37272a6940958O97698J4379261K0181638J4483621N049591n68722k595992k50816
37264C4435321Q648404J3496125j831021k7350592k8555509L601973L1218978
37257C3663679K1262870o970932j5478310m703427j147140p014416l860399M797649
37249B0549574k084340j9798433k1126757m300494L023968o425404n869695J7259037
$$ y = [42064627, 53620810, 43870239, 30748101, 39059046, 65541551, 78367165, 57173019, 20034131, -372633, 4352079, 17575077, 25847912, 29829257, 31825608, 30536988, 28257969, 29204419, 30729237, 28088474, 25665954, 30301861, 36101099, 31129088, 18439647, 14432564, 24363710, 34133911, 29868911, 13297295, -5166094, -16940958, -16243260, -1863999, 18317639, 32801260, 37850851, 37282129, 34686137, 34435321, 43083725, 56579850, 54748829, 27398237, -1157272, 2444701, 33663679, 54926549, 47955617, 32477307, 27773880, 26626740, 19612324, 15751925, 20549574, 18465234, -1333199, -22459956, -26760450, -23736482, -30161886, -36031581, -18772544]
37241a8772544L6070587K5260730j933391j6986916j3591415m888219j806836
37234C351996q089843k0684431k5289963q533509J8385118K7700632J2955378
37227b04622l327702o407571p645498j5442206j5510986K728056K3385185K6819691
37219D394347J6437748N609395m270433j5444017k0153363j2735055j674331M443678
37211b3392031Q744187J2576258P973084m163050p534759M662417J7739275K0225195
37203C6830576J7921761J1825301q780614l4863647l3387808O12675K2400722
37196A2558966J323175k6751402j3009904K6425127L6662810Q714102j6923108
37189B8999766k1338382k4944778l4086789k5808864L678363K4839973K3808323
$$ y = [-18772544, 17298043, 42558773, 40625382, 23638466, 10047051, 5158832, 3351996, -4737847, -25422278, -50712241, -59245750, -40860632, -13160000, -204622, -3532324, -9939895, -17585393, -33027599, -48538585, -45810529, -22425344, 4394347, 20832095, 26441490, 22171057, 6727040, -13426323, -26161378, -27835709, -23392031, -14647844, -2071586, 5901498, 1738448, -5796311, -1133894, 16605381, 36830576, 54752337, 66577638, 57797024, 22933377, -10454431, -9841756, 12558966, 13882141, -12869261, -25879165, 545962, 37208772, 45922874, 28999766, 7661384, -17283394, -51370183, -77179047, -73500684, -48660711, -24852388]
37182b4852388K1023758K5346617J4557860j6772410l2885080r494326K4588206
37175A512237L0164989J2446283L87411k921016j2715374k4069386j8969395k312416
37167a6476667L850425j959488k61101J1684961J1656482j0164684k9290587j6769631
37159d7730290K1155465M7041650L4278815k975117k6330567j7577276K717363
37152A0580043O944269j555642o3172J2004328J0715451j0599194k6376966j7293801
37144a5644684K431517J2045704J3817586J5584135P647006j6317141l4116921
37137a4552798k1501308Q058973K0342071R274413j638219k147810o783608k0957248
37129b9905534k6757133j2765740O725054J5120312J6640029K1982181K6081749
$$ y = [-24852388, -3828630, 21517987, 36075847, 19303437, -13581643, -23075969, 1512237, 31677226, 44123509, 44510920, 41589904, 28874530, 4805144, -14164251, -16476667, -12626242, -14585730, -14846831, -3161870, 8494612, -1670072, -30960659, -47730290, -26574825, 20466825, 54745640, 51770523, 25439956, 7862680, 10580043, 17524312, 15968670, 15905498, 27909826, 38625277, 28026083, 1649117, -15644684, -13213167, -1167463, 12650123, 28234258, 35881264, 19564123, -14552798, -36054106, -27995133, -7653062, 1621351, -16868, -2164678, -8948286, -29905534, -56662667, -69428407, -62703353, -47583041, -30943012, -8960831, 17120918]
37122A7120918J6511414l680254j6281213j0396082M617295J1438075O232424
37115B5562577K895933J2953215K5844795J9694870p771038l2774759l5438558
37108A0967035k1688114o632273P075595J9798145K0473480K917704j5021853
37101A7889719j2102574M149534R583106J295449k911436Q46079j818844j1343115
37093E587918q601010R315899J6787975n82773j8082972o061724K3914866L2467370
37085E4745549O910968k1012346j7639724Q515263J9374480o646j9111671m130184
37077B7645689L0112097L5910606Q18495l1671089k4818829o45005k3860j6606609
37069B0721495j2389247J4144961K2827272l914970l5014890l9142857k2206410
$$ y = [17120918, 33632332, 29952078, 13670865, 3274783, 7892078, 19330153, 25562577, 28458510, 41411725, 67256520, 86951390, 79180352, 46405593, 10967035, -10721079, -17353352, -10277757, 9520388, 29993868, 32911572, 17889719, 5787145, 9936679, 19519785, 20815234, 17903798, 18749877, 16931033, 5587918, -3013092, 6302807, 23090782, 22508009, 4425037, -1636687, 22278179, 54745549, 61656517, 40644171, 23004447, 31519710, 50894190, 50887544, 31775873, 27645689, 57757786, 93668392, 94486887, 62815798, 37996969, 37351964, 37328104, 20721495, 8332248, 22477209, 45304481, 41389511, 6374621, -32768236, -54974646]
37062e4974646l628531J1407425K0540915J4897018j556073q103549K221557J1089262
37054h106622N610209l990194q356106j3610663k0023677j4526867K536240J2635311
37046d7832369J3099552K2034125L5719836K2140298k1334316m7227278k5951634
37039d9351786O321886N185550j4812298j4093762M920057J3668792J2290797
37032c5870764J7594472J9836635L489845j0301999L810806K1004510L307374
37025B2870879k7538023k0578872J3820591J7712697j3366882k1931762R645531
37018a9365841K9198758R306539o189779J4016330L0319077N285763k6680727
37011C5890120j8279202J2141119J9343787P638620Q087967J2051447r078441
$$ y = [-54974646, -58603177, -47195752, -26654837, -11757819, -13313892, -21417441, -19195884, -8106622, -2496413, -6486607, -14842713, -28453376, -48477053, -63003920, -60467680, -47832369, -34732817, -12698692, 23021144, 45161442, 23827126, -23400152, -49351786, -43029900, -37844350, -52656648, -66750410, -61830353, -48161561, -35870764, -18276292, 1560343, 5050188, -5251811, -1441005, 19563505, 22870879, -4667144, -25246016, -11425425, 6287272, -7079610, -29011372, -19365841, 9832917, 19139456, 12949677, 26966007, 57285084, 62570847, 35890120, 17610918, 29752037, 49095824, 56734444, 64822411, 76873858, 67795417]
37004F7795417l9668813l8065218p253022J0914939N856464O376618J9385668
36997B5342053J6770140p393453j8469852J252183K0271756Q166384j5687498
36990C0251713j3486429J2428563K2966499k919835m0616342m9882607j9819280
36983f1077718K1628667L8937632K4187491j297207j4809548j1848785m3878J1238317
36975F914971J1991038j159470j2673384j276026K6159968L5056102J0603074
36968G5616273j7436381j6012797O013558J7077775R183054j554474o761400j0631419
36960E5494189j2207485q099270n325762r567964j0539550m85144O121507m252274
36952A1138247j6259181r340489N235370L535854p590960k616810J6128371K2111522
$$ y = [67795417, 28126604, -9938614, -17191636, -6276697, -420233, 5956385, 25342053, 42112193, 34718740, 16248888, 17501071, 37772827, 45939211, 30251713, 16765284, 29193847, 52160346, 49240511, 8624169, -41258438, -61077718, -39449051, -511419, 23676072, 22378865, 7569317, -4279468, -4323346, 6914971, 18906009, 17746539, 5073155, 3797129, 29957097, 65013199, 75616273, 58179892, 42167095, 48180653, 65258428, 74441482, 72887008, 66125608, 55494189, 43286704, 35187434, 29861672, 20293708, 9754158, 9269014, 15390521, 11138247, -5120934, -14461423, -9226053, -5690199, -13281159, -15897969, 230402, 22341924]
36944B2341924R601212k352956o733471j1607670j0984560O674980K4184438J3615669
36936D4739566j3193258j9084484n322342o833302k1185799o463020L5547389
36929H204750M3988797k252104l8348343j2742713K8608066J7805002k5249524
36922B0013931l1314481L371763J9463248k161697j6228985L727624K5686444
36915B2557847J8790065k725905j6089034k4580526l2547252k4633911M248937
36908e4979779K8385418K6002410J1631749J1074881K2830862K5959877J2258884
36901H3164302q509430k5093088l0745582k1548261k446839J1566691J0998443
36894A7386236L168441N83321M303980N502705j673175j3375542j8222758o553592
$$ y = [22341924, 31943136, 29590180, 22856709, 11249039, 264479, 6939459, 31123897, 44739566, 31546308, 12461824, 7139482, 306180, -20879619, -27342639, 8204750, 52193547, 49941443, 11593100, -1149613, 27458453, 45263455, 20013931, -11300550, -7928787, 11534461, 9372764, -6856221, -3128597, 22557847, 41347912, 38622007, 22532973, -2047553, -34594805, -59228716, -54979779, -26594361, -591951, 11039798, 22114679, 44945541, 70905418, 83164302, 74654872, 49561784, 18816202, -2732059, -5178898, 6387793, 17386236, 20554677, 21137998, 25441978, 30944683, 29271508, 15895966, -2326792, -8880384]
36886h880384J5548609K4867352O205871k3052875k9978569q872743J1799744
36879a2362995J0519019K24357K488391J2137998P328975j3664022k6248944j1841824
36871c1419045J7429371L2788607K1707208j41202j0684286r000467j1437751
36864I242435k0400449j4155274J8803454M9682083L8709387q812278m2733140
36857C0336218k9959913Q321119L1561692K8399628J3973112p52238j3972985
36850F7906633j9482151j1657835M04066K365525m942224j0373346j2683201j7889906
36842f352439k0324142p684322J3584424J9411300J773929j7065431j4858067
36835c1514748P63964O369230l557641j2491019p117125P664392J9409370K2252490
$$ y = [-8880384, 6668225, 31535577, 37741448, 14688573, -15289996, -24162739, -12362995, -1843976, -1619619, 868772, 13006770, 20335745, 6671723, -19577221, -31419045, -13989674, 18798933, 40506141, 40364939, 29680653, 20680186, 9242435, -11158014, -25313288, -6509834, 43172249, 81881636, 73069358, 30336218, 376305, 8697424, 40259116, 68658744, 82631856, 81879618, 67906633, 48424482, 36766647, 37170713, 39536238, 34594014, 24220668, 11537467, -6352439, -26676581, -34360903, -20776479, -1365179, 408750, -16656681, -31514748, -30750784, -24381554, -27939195, -40430214, -47547339, -39882947, -20473577, 1778913]
36827A778913J7061562O183557o158816j2673699q363393K927924J0794591Q586531
36819B0137170M07305l525397J376040Q374794P106863l518893j2863329j0538112
36811F956441J243634J0251676Q590838Q87295l256629j558405K56183j112931
36803B2258102j097927M885504J2391926J2644563N449794P36148M337463P796325
36795F9401898j458747k1918858l7049221l3857518j6675301K75554Q481398Q346165
36787b4454630J787213r473782j8491028j5241500J031501J7272646K0418307
36780b7151273J2986333R004815J5072350K1238792J3475498p178069k1869416
36773A5579030j3315109J2352036K8692970J8956226k280487p873691M247087
$$ y = [1778913, 18840475, 25024032, 18865216, 6191517, -2171876, 756048, 11550639, 20137170, 20544475, 17019078, 18395118, 26769912, 33876775, 30357882, 17494553, 6956441, 8200075, 18451751, 27042589, 27929884, 24673255, 23114850, 23371033, 22258102, 21160175, 26045679, 38437605, 51082168, 56531962, 57268110, 61605573, 69401898, 67943151, 46024293, 8975072, -24882446, -41557747, -41282193, -32800795, -24454630, -22667417, -32141199, -50632227, -65873727, -64842226, -47569580, -27151273, -14164940, -5160125, 9912225, 31151017, 44626515, 37448446, 15579030, 2263921, 14615957, 43308927, 62265153, 59984666, 52110975, 56358062]
36766E6358062Q496193r207339k8457923k3641875m81099J5702216J6624712J2718282
36758D8111229N758804j2187415l2906674l4596380j6985195n966981j2193302
36751f0965914j3207593O363125K4727410J7995629J795089N970321K3991894
36744F669961K3834768J742678j2510783n481819P55802j1154260k5783893k2609896
36736d4537442o853388N225311J2121857J9119069J9922975O670965j1146809
36729E22538j6300505p076520L828590Q624826R025369O304875O66187k536341
36721C059019Q47339L301080n362803j9476792k1520875o279697J1486596J7032710
36713a6913423J2076927O361781L211029P59394o64069r36850l785032q997775
$$ y = [56358062, 64854255, 55646916, 27188993, 3547118, 3066019, 18768235, 35392947, 48111229, 53870033, 41682618, 8775944, -25820436, -42805631, -48772612, -60965914, -74173507, -67810382, -43082972, -25087343, -23292254, -17321933, 6669961, 30504729, 32247407, 19736624, 14254805, 15010607, 3856347, -21927546, -44537442, -51390830, -46165519, -34043662, -14924593, 4998382, 11669347, 522538, -15777967, -22854487, -19025897, -10401071, -1375702, 4929173, 5595360, 3059019, 3906358, 7207438, 1844635, -17632157, -39153032, -45432729, -33946133, -16913423, -4836496, 1525285, 4736314, 5495708, 4831639, 3894789, 109757, -8888018]
36705h888018o512470J0078803K7277303K3741242P16835j5015087o207764J1283611
36697C6474455J2979150J477492j501980Q114505J1310062j841566j7739197k3633440
36689B5639481k4547441k4903431j4464448J0802011L1657109K9660630J4746713
36682D8590624P668344P131397j379758j3642826j1724648K783532R082104J872114
36674E0380883j703996N646302R049616o8951q390863n552769k186232q796229
36666C8377761j5897724j0895063J090506Q406839J0907924J2514108R421108
36659E3925459P01610k196490P332563J5510020O580568j2446243k2300533j9325960
36651B7780994j5810439j7221098j5768941o133037N064647P093383l423650j6962783
$$ y = [-8888018, -15400488, -5321685, 21955618, 45696860, 46413695, 31398608, 25190844, 36474455, 49453605, 50931097, 49429117, 57543622, 68853684, 67012118, 49272921, 25639481, 1092040, -23811391, -38275839, -27473828, 4183281, 33843911, 48590624, 56258968, 63390365, 62010607, 48367781, 36643133, 39426665, 48508769, 50380883, 48676887, 54323189, 63372805, 63303854, 54912991, 49360222, 47173990, 38377761, 22480037, 11584974, 12675480, 21082319, 31990243, 44504351, 53925459, 54627069, 52430579, 59763142, 75273162, 81853730, 69407487, 47106954, 27780994, 11970555, -5250543, -21019484, -27152521, -22087874, -14994491, -18418141, -35380924]
36643c5380924j5384775R454832L8355599L9629990Q413671k3643179k7620018
36636f174804j0142438N565487J3393251K0200454K2963328J3509918j925153
36629E7390043r084088o652976l610034k312692p71943l272808j1276974j3402220
36621G006308k740178P656769O815943P889605K1862142K6388180k495146l9445868
36613C2937755l5558456O488297L0446540Q204518k3233986k4106553o778499
36606a1600384r04381k226217P901046J9890930J1958396q296303j4888367n693449
36598c858729m67721l389773K86969J1954374J3918997l42457j4598541j4518077
36590a1014958n079882K199150M311270M074364L716338M207873L555917k125835
$$ y = [-35380924, -50765699, -41310867, -2955268, 36674722, 45088393, 21445214, -6174804, -16317242, -10751755, 2641496, 22841950, 45805278, 59315196, 57390043, 48305955, 41652979, 38042945, 35730253, 34958310, 31685502, 20408528, 7006308, 4266130, 11922899, 18738842, 26628447, 48490589, 74878769, 72383623, 32937755, -2620701, 3867596, 34314136, 42518654, 19284668, -4821885, -11600384, -12504765, -14730982, -6829936, 13060994, 25019390, 16723087, 1834720, -3858729, -4326450, -7716223, -7429254, 4525120, 18444117, 18101660, 3503119, -11014958, -16094840, -13895690, -9584420, -5510056, -1793718, 2414155, 5970072, 3844237]
36582C844237q737060l627774J3340425J9438290j295330k7715981k6273702j233734
36574c2260629J0236026l896545j0701746J5036046M7843594M6143301J0415166
36567H2815213k1870404k9568013k6395115k6662220k1540801j125399K0638152
36560b3708587K1788558M116061q789415m074550N313190K717896p725838q955885
36552a9318570L577735J6844426J9392888J3745833P244055J361491m616960q575096
36544B9655802j0868903j6051264k1734372j5585587N174660K0723366J1841845
36537C155547r367002j2696679N968828J7075249K628468j3912934k088894K7123720
36529A7886303L3991157P091232k0055334j7312658Q44267Q20590j8368178k4666078
$$ y = [3844237, -4892823, -8520597, 4819828, 24258118, 22962788, -4753193, -31026895, -32260629, -22024603, -25921148, -36622894, -21586848, 26256746, 72400047, 82815213, 60944809, 31376796, 4981681, -21680539, -43221340, -44346739, -23708587, -1920029, 2196032, -6593383, -10667933, -5354743, -2636847, -10362685, -19318570, -15740835, 1103591, 20496479, 34242312, 41486367, 42847858, 38230898, 29655802, 18786899, 2735635, -18998737, -34584324, -29409664, -8686298, 3155547, -6211455, -18908134, -12939306, 4135943, 6764411, -7148523, -9237417, 17886303, 51877460, 58968692, 38913358, 21600700, 22444967, 23265557, 4897379, -19768699]
36521a9768699k906895K0553185J5119472j0413704k1351891n541374J4480297
36514i829609J8178487J2707353J2202182J1544880q03429j6401717j5846085
36507A1752062J75318J1412812J0792910J3372454K4854706K4558019k457705
36500I4460576l3487194l3360592m568519J4301784K630795j5574450j1497502
36493A2904898L778801k178938k9856050m1355313j3070813K8046678L7538549
$$ y = [-19768699, -22675594, -2122409, 12997063, 2583359, -18768532, -24309906, -9829609, 8348878, 21056231, 33258413, 44803293, 43999864, 27598147, 11752062, 11927380, 23340192, 34133102, 47505556, 72360262, 96918281, 94460576, 60973382, 27612790, 23044271, 37346055, 39976850, 24402400, 12904898, 16683699, 14504761, -15351289, -56706602, -69777415, -41730737, -4192188]
$$ [...]
##END NTUPLES=NMR SPECTRUM
##END=
