##TITLE=31Pdec_SR1516_k
 D2O, 24 sc
 31.7.2020
##JCAMPDX= 6.0         $$ Bruker NMR JCAMP-DX V2.0
##DATA TYPE= NMR SPECTRUM
##DATA CLASS= NTUPLES
##ORIGIN= UXNMR, Bruker Analytische Messtechnik GmbH
##OWNER= root
$$ XWIN-NMR		Version 3.5
$$ Fri Jul 31 12:36:51 2020 Russian Standard Time (UT+4h)  she@DPX200
##.OBSERVE FREQUENCY= 81.013821
##.OBSERVE NUCLEUS= ^31P
##.ACQUISITION MODE= SIMULTANEOUS
##.ACQUISITION SCHEME= undefined
##.AVERAGES= 24
##.DIGITISER RES= 17
##SPECTROMETER/DATA SYSTEM= spect
##.PULSE SEQUENCE= zgpg30
##.SOLVENT NAME= CDCl3
##.SHIFT REFERENCE= (INTERNAL, CDCl3, 0, 182.463)
##AUDIT TRAIL= $$ (NUMBER, WHEN, WHO, WHERE, WHAT)
$$ ##TITLE= Audit trail, XWIN-NMR		Version 3.5
$$ ##JCAMPDX= 5.01
$$ ##ORIGIN= Bruker BioSpin GmbH
$$ ##OWNER= she
$$ F:/spectra/data/she/nmr/P31/1/pdata/1/auditp.txt
$$ ##AUDIT TRAIL=  $$ (NUMBER, WHEN, WHO, WHERE, WHAT)
(   1,<2020-07-31 12:35:40.84 +0400>,<she>,<DPX200>,
      <created by zg, POWCHK disabled, PULCHK disabled
       configuration hash MD5:
       00 E9 B6 7A A2 85 ED C7 34 08 36 98 17 FE 4E 26
       data hash MD5: 32K
       9C E1 FD 86 22 4D 6A BD 7B 5F D4 61 B5 F4 8C 61>)
(   2,<2020-07-31 12:35:43.89 +0400>,<she>,<DPX200>,
      <Start of raw data processing
       efp BC_mod = 2 LB = 1 FT_mod = 6 PKNL = 1 PHC0 = -3345.492 PHC1 = 1272.402 SI = 64K 
       data hash MD5: 64K
       E9 B5 F8 8A F5 9F 7B 7B C0 2D B9 A1 66 5A F4 11>)
(   3,<2020-07-31 12:36:15.57 +0400>,<she>,<DPX200>,
      <pk PHC0 = 45.69729 PHC1 = 178.8 
       data hash MD5: 64K
       34 B8 AA C5 0A 0C FA 3B AE 7C 1E 18 C2 6C B3 4D>)
$$ ##END=
$$ 
$$ hash MD5
$$ BB 70 EB 1F F9 41 13 D0 EA 8C 7F AF 77 64 E9 9D
##$RELAX= 
##$RELAX= 
##$RELAX= 
##$RELAX= 
##$RELAX= 
##$RELAX= 
##$RELAX= 
##$RELAX= 
$$ Bruker specific parameters
$$ --------------------------
##$DU= <F:/spectra>
##$EXPNO= 1
##$NAME= <P31>
##$PROCNO= 1
##$TYPE= <nmr>
##$USER= <she>
##$AMP= (0..31)
100 100 100 100 100 100 100 100 100 100 100 100 100 100 100 100 100 100 
100 100 100 100 100 100 100 100 100 100 100 100 100 100 
##$AQSEQ= 0
##$AQ_mod= 1
##$AUNM= <au_zg>
##$AUTOPOS= <>
##$BF1= 81.014009
##$BF2= 200.13
##$BF3= 200.13
##$BF4= 200.13
##$BF5= 200.13
##$BF6= 200.13
##$BF7= 200.13
##$BF8= 200.13
##$BYTORDA= 1
##$CFDGTYP= 0
##$CFRGTYP= 5
##$CHEMSTR= <none>
##$CNST= (0..31)
1 1 145 1 1 1 1 1 1 1 1 1 1 1 1 1 1 1 1 1 1 1 1 1 1 1 1 1 1 1 1 1 
##$CPDPRG= <waltz16>
##$CPDPRG1= <>
##$CPDPRG2= <waltz16>
##$CPDPRG3= <>
##$CPDPRG4= <mlev>
##$CPDPRG5= <mlev>
##$CPDPRG6= <mlev>
##$CPDPRG7= <mlev>
##$CPDPRG8= <mlev>
##$CPDPRGB= <>
##$CPDPRGT= <>
##$D= (0..31)
0 1 0 0 0 0 0 0 0 0 0 0.03 2e-05 3e-06 0 0 0 0 0 0 0 0 0 0 0 0 0 0 0 0 
0 0 
##$DATE= 1596184540
##$DBL= (0..7)
120 120 120 11 120 120 24 19 
##$DBP= (0..7)
150 150 150 150 150 150 150 150 
##$DBP07= 0
##$DBPNAM0= <>
##$DBPNAM1= <>
##$DBPNAM2= <>
##$DBPNAM3= <>
##$DBPNAM4= <>
##$DBPNAM5= <>
##$DBPNAM6= <>
##$DBPNAM7= <>
##$DBPOAL= (0..7)
0.5 0.5 0.5 0.5 0.5 0.5 0.5 0.5 
##$DBPOFFS= (0..7)
0 0 0 0 0 0 0 0 
$$ [...]
##$SUBNAM2= <"">
##$SUBNAM3= <"">
##$SUBNAM4= <"">
##$SUBNAM5= <"">
##$SUBNAM6= <"">
##$SUBNAM7= <"">
##$SUBNAM8= <"">
##$SUBNAM9= <"">
##$SW= 369.568048894756
##$SWIBOX= (0..15)
0 1 3 0 0 0 0 0 0 0 0 0 0 0 0 0 
##$SW_h= 29940.119760479
##$TD= 32768
##$TD0= 1
##$TE= 0
##$TE2= 300
##$TE3= 300
##$TEG= 300
##$TL= (0..7)
0 120 53 12 22 120 120 120 
##$TP= (0..7)
150 150 150 150 150 150 150 150 
##$TP07= 0
##$TPNAME0= <>
##$TPNAME1= <>
##$TPNAME2= <>
##$TPNAME3= <>
##$TPNAME4= <>
##$TPNAME5= <>
##$TPNAME6= <>
##$TPNAME7= <>
##$TPOAL= (0..7)
0.5 0.5 0.5 0.5 0.5 0.5 0.5 0.5 
##$TPOFFS= (0..7)
0 0 0 0 0 0 0 0 
##$TUNHIN= 0
##$TUNHOUT= 0
##$TUNXOUT= 0
##$USERA1= <user>
##$USERA2= <user>
##$USERA3= <user>
##$USERA4= <user>
##$USERA5= <user>
##$V9= 5
##$VALIST= <valist>
##$VCLIST= <CCCCCCCCCCCCCCC>
##$VD= 0
##$VDLIST= <DDDDDDDDDDDDDDD>
##$VPLIST= <PPPPPPPPPPPPPPP>
##$VTLIST= <TTTTTTTTTTTTTTT>
##$WBST= 1024
##$WBSW= 4
##$XGAIN= (0..3)
0 0 0 0 
##$XL= 0
##$YL= 0
##$YMAX_a= 5866
##$YMIN_a= -10724
##$ZGOPTNS= <>
##$ZL1= 120
##$ZL2= 120
##$ZL3= 120
##$ZL4= 120
##$ABSF1= 0
##$ABSF2= 0
##$ABSG= 0
##$ABSL= 0
##$ALPHA= 0
##$AQORDER= 0
##$ASSFAC= 0
##$ASSFACI= 0
##$ASSFACX= 0
##$ASSWID= 0
##$AUNMP= <proc_1d>
##$AZFE= 0.1
##$AZFW= 0.5
##$BCFW= 0
##$BC_mod= 2
##$BYTORDP= 0
##$COROFFS= 0
##$CY= -3
##$DATMOD= 1
##$DC= 0
##$DFILT= <>
##$DTYPP= 0
##$F1P= 0
##$F2P= 0
##$FCOR= 1
##$FTSIZE= 65536
##$FT_mod= 6
##$GAMMA= 0
##$GB= 0
##$INTBC= 1
##$INTSCL= 5.30512e-09
##$ISEN= 30
##$LB= 1
##$LEV0= 0
##$LPBIN= 0
##$MAXI= 10000
##$MC2= 0
##$MEAN= 0
##$ME_mod= 0
##$MI= 50
##$NCOEF= 0
##$NC_proc= -8
##$NLEV= 6
##$NOISF1= 182.463
##$NOISF2= 159.3651
##$NSP= 0
##$NTH_PI= 0
##$NZP= 0
##$OFFSET= 182.463
##$PC= 4
##$PHC0= -3299.795
##$PHC1= 1451.202
##$PH_mod= 1
##$PKNL= yes
##$PPARMOD= 0
##$PSCAL= 0
##$PSIGN= 0
##$REVERSE= no
##$SF= 81.0140089999434
##$SI= 65536
##$SIGF1= 159.3651
##$SIGF2= -187.1042
##$SINO= 113.3802
##$SIOLD= 16384
##$SREGLST= <1H.CDCl3>
##$SSB= 0
##$STSI= 65536
##$STSR= 0
##$SW_p= 29940.119760479
##$SYMM= 0
##$S_DEV= 0
##$TDeff= 32768
##$TDoff= 0
##$TI= <>
##$TILT= no
##$TM1= 0
##$TM2= 0
##$TOPLEV= 0
##$USERP1= <user>
##$USERP2= <user>
##$USERP3= <user>
##$USERP4= <user>
##$USERP5= <user>
##$WDW= 1
##$XDIM= 65536
##$YMAX_p= 410909526
##$YMIN_p= -33894325
$$ End of Bruker specific parameters
$$ ---------------------------------
##NTUPLES= NMR SPECTRUM
##VAR_NAME=  FREQUENCY,     SPECTRUM/REAL,   SPECTRUM/IMAG
##SYMBOL=    X,             R,               I
##VAR_TYPE=  INDEPENDENT,   DEPENDENT,       DEPENDENT
##VAR_FORM=  AFFN,          ASDF,            ASDF
##VAR_DIM=   65536,         65536,           65536
##UNITS=     HZ,            ARBITRARY UNITS, ARBITRARY UNITS
##FACTOR=    0.456856943014862, 1,           1
##FIRST=     14782.0589164792, 0,            0
##LAST=      -15158.0608439998, 0,           0
##MIN=       -15158.0608439998, -33894325,   0
##MAX=       14782.0589164792, 410909526,    0
$$ Real data points
##PAGE= N=1
##DATA TABLE= (X++(R..R)), XYDATA
$$ [...]
42842d903373L574125L284133J142900j00775j215843k579633k084180M68139
42834b414507J904335J008982O17035K173588L000167J454029L0708M65038M06873
42825H646248j702426k924379q95477J469698Q05505o86349R07385L958953L369240
42816A2948398j414686n601206n971307m101282k462747j327778l19411L06029
42808g943990R50061K586386M461908M220353J314517j662231k063733j14588
42800A748683J947836K230098K18225k833746l855134k53227O255706R627887
42792A5086328N502925l166658q587415o655982j223082J224685n92383k574331
42784i85913k110766j483340k914707l650239J48288O143437P326208J524900
$$ y = [-4903373, -1329248, 1954885, 3097785, 2997010, 1781167, -798466, -2882646, -2414507, -510172, 498810, 1115845, 3289433, 6289600, 7743629, 7774337, 8239375, 8646248, 6943822, 4019443, 3123966, 4593664, 5399169, 4712820, 5620205, 9579158, 12948398, 11533712, 5932506, -38801, -4140083, -6602830, -7930608, -8250019, -7943990, -6993929, -4407543, 54365, 4274718, 5589235, 3927004, 1863271, 1748683, 3696519, 5926617, 6144842, 3311096, -544038, -797265, 5458441, 15086328, 20589253, 17422595, 8835180, 2179198, 956116, 2180801, 1588418, -985913, -3096679, -4580019, -7494726, -11144965, -10996677, -4853240, 2472968, 3997868]
42776C997868m951292n327800m85647L787175M555692K932459q2771m006927n973239
42767e554482k751598L430268N856495K146006k046858j091086K472374K010008
42759D471127l294684p557924o699807l063598o01079L73405J480351K523451
42751a2368758K335310J460337J141531P36216j199438l850795m619344k392755
42743a8757696J703496O160132R196103P889005J018718o849887q372655k365822
42735a0378606M005175M537674J760894J578547L492730J884130m185490q547837
42727e852783o293497L04817N830219P515414N264248J78170m244013l284151
42719e81576K939658P298107L405982o114111j2561082j0992596l946153L180832
$$ y = [3997868, -953424, -6281224, -6766871, -2979696, 1575996, 4508455, 4425684, 418757, -5554482, -8306080, -4875812, 980683, 3126689, 1079831, -11255, 2461119, 4471127, 1176443, -6381481, -13081288, -16144886, -16745965, -16372560, -14892209, -12368758, -10033448, -8573111, -7431580, -6695364, -7894802, -11745597, -16364941, -18757696, -17054200, -10894068, -1697965, 6191040, 7209758, 359871, -8012784, -10378606, -6373431, -1835757, -74863, 1503684, 4996414, 6880544, 2695054, -5852783, -12146280, -11841463, -6011244, 1504170, 6768418, 6946588, 2702575, -581576, 2358082, 9656189, 13062171, 6948060, -5613022, -16605618, -20551771, -17370939]
42711a7370939O727559N588432J390415j855959j216958J867304L972560M541153
42703C643567N348541O029350M090800n34523m743409o550907o637022n356340
42695d709943k190566J189844J652167l73373q67370J332653K656810J278086
42687c1692M06342K237259L676637J954643k33547K54942J330939J81636r56338
42678H820821L67861N46632l929314p667216l042894O173376Q210274P56762n368928
42669D867374k538110L592689M665431J373455j175122k188013k581753j68205
42661E847746N131759O682012j70235q883728r578313l156301J031724j90194
42653c285530o34331L630518P988586O840934J136098m069279n112954j558385
$$ y = [-17370939, -10643380, -5054948, -3664533, -5520492, -6737450, -4870146, -897586, 3643567, 8992108, 15021458, 19112258, 18577735, 13834326, 7283419, 646397, -4709943, -6900509, -5710665, -4058498, -4431871, -5299241, -3966588, -1309778, -31692, 374650, 2611909, 6288546, 8243189, 8009642, 8264584, 9595523, 9777159, 8820821, 9188682, 9735314, 5806000, -1861216, -4904110, 1269266, 9479540, 10236302, 4867374, 2329264, 5921953, 10587384, 11960839, 10785717, 8597704, 6015951, 5847746, 10979505, 17661517, 17491282, 8607554, -970759, -4127060, -3095336, -3285530, -3919861, -289343, 7699243, 14540177, 15676275, 11606996, 6494042, 4935657]
42645D935657L467141M605295J73888m109782k542889J058350j268124p595699
42637a276163p250127K095321Q880162M243719n144827p927203l815227J46080
42629a0048265K554692O407773Q952210M304651m622758p597892j878641L897472
42621A969242L074360o90192k197077l219538o339835p400561j923499N497432
42613a1229668O607957K050027J90919L756535N951075J880376l781578m816949
42605F08694l060547l843039n822734k927870M532156Q361874M152817j807158
42597A94193j386387M023065O253918K144608l112422m181074j913484K3986O70702
42588B717105J191853J417773J40505k026487k658718o39498K177852K982342
$$ y = [4935657, 8402798, 13008093, 13181981, 9072199, 6529310, 7587660, 6319536, -1276163, -8526290, -6430969, 2449193, 6692912, 1548085, -6379118, -10194345, -10048265, -7493573, -1085800, 7866410, 12171061, 7548303, -49589, -1928230, 1969242, 5043602, 4353410, 2156333, -1063205, -7403040, -14803601, -16727100, -11229668, -4621711, -2571684, -2380765, 1375770, 7326845, 9207221, 5425643, 608694, -2451853, -6294892, -12117626, -15045496, -10513340, -2151466, 2001351, 194193, -1192194, 2830871, 9084789, 11229397, 8116975, 3935901, 2022417, 2046403, 2717105, 3908958, 5326731, 5467236, 3440749, 782031, 142533, 2320385, 5302727]
42580E302727J214148o68316M6553K784353L754867K46727n932515j0188084r429225
42571a2868765l834075L941456R625666R411697M007441q67010j113177L32943
42563H636176j348576m353132k892681K344775L762880j479389o672636n893260
42555g895843k410515j798925k547205J2201M686752O424689M820609L883505
42547E175268M632172L980840M10402m241493p758062q035710k862268N537329
42539c161522Q619695J295403q497345q365569J306906Q057555N690019J343967
42531F289109J404839J467818l307514p461092m049526K391544K019500m632249
42523e877571p253092j241351O453768Q161903M704601J415005O97275J444888
$$ y = [5302727, 6516875, 5848559, 5895112, 8679465, 12434332, 12681059, 6748544, -3439540, -12868765, -16702840, -12761384, -3135718, 6275979, 10283420, 9416410, 8303233, 8636176, 7287600, 2934468, 41787, 2386562, 6149442, 4670053, -2002583, -7895843, -10306358, -12105283, -14652488, -14640287, -9953535, -3528846, 1291763, 5175268, 9807440, 13788280, 14198682, 9957189, 2199127, -5836583, -8698851, -3161522, 5458173, 6753576, -1743769, -10109338, -8802432, -744877, 4945142, 6289109, 7693948, 9161766, 5854252, -1606840, -5656366, -3264822, -1245322, -5877571, -13130663, -14372014, -7918246, 243657, 4948258, 6363263, 7060538, 8505426]
42515H505426J871173L68649l569942p402640p025227j854574L657541M971778
42507d77816K253033o92042o75841K291470N196397M589507N03935k620418j192414
42498I175811K013378J095328m112249o887692l142669K276933K393732k035314
42490G77258m240815j507013J700115J103317j583130k269033m47575J349147
42482e117729J938382K227380K515793J944828N30135o67137j558546k931130
42474a118024l973754k467445J418031L927326K244961j561016l287949j844863
42466f662733O62771K728244M166071L850408O85399k781864j952538K834363
42458C530121M876996j44166p205108q145748k858633J160831K09264p67947K958520
$$ y = [8505426, 10376599, 10745248, 7175306, -227334, -7252561, -9107135, -5449594, -477816, 1775217, 1083175, 407334, 2698804, 7895201, 12484708, 12988643, 10368225, 9175811, 11189189, 12284517, 8172268, 1284576, -1858093, 418840, 2812572, 777258, -3463557, -4970570, -3270455, -2167138, -3750268, -6019301, -6466876, -5117729, -3179347, -951967, 1563826, 3508654, 4038789, 3371652, 1813106, -1118024, -5091778, -7559223, -6141192, -2213866, 31095, -1529921, -4817870, -6662733, -5999962, -3271718, 894353, 4744761, 5430160, 2648296, 695758, 3530121, 8407117, 8262951, 1057843, -7087905, -9946538, -8785707, -8576443, -9344390, -6385870]
42449f385870P612198O374238P606l896558j647537K179933K153587j228601m350802
42440H18194n674347m988994j340530M203234O802403L589862j178936j718624
42432E12262Q31604J471468O21049K476330N040562J522408o724311r133750k123337
42423e505715M015094J276082l077571M11778O225986L066194n708598o439646
42415e736396J984096N910709m31111n765258r17683O767471O648836J109462
42407I570126j387718o98247j506962k070933J934856O456744L592773m571571
42399A1319068p601104k613622J385614k486858q920572q526836m47803P737138
42391a0154975R852812P003730M179251L413981J884141k626558o333697l494333
$$ y = [-6385870, 1226328, 7600566, 7608172, 3711614, 2064077, 4244010, 6397597, 5168996, 818194, -4856153, -9845147, -11185677, -6982443, -180040, 3409822, 2230886, 512262, 1343866, 2815334, 3436383, 5912713, 10953275, 12475683, 5751372, -3382378, -5505715, -1490621, -214539, -3292110, -2880332, 3345654, 6411848, 703250, -5736396, -3752300, 2158409, 1727298, -4037960, -4955643, 1811828, 8460664, 9570126, 8182408, 7484161, 5977199, 3906266, 5841122, 12297866, 15890639, 11319068, 3717964, 1104342, 2489956, 3098, -8917474, -17444310, -17892113, -10154975, -302163, 6701567, 10880818, 14294799, 16178940, 13552382, 7218685, 3724352]
42383C724352M149306P613029K831338l235588l006446P94044Q20750k902439
42375A0788346m384118k193324n22432j017331j164512m11876q35199j791893
42367a532339n88283J659831J499652J10252J557493M335908K890144j839717
42359H092941k535000J756152K551556m217117j0278459p178795R10246L920764
42351f977712J97260l586584l535092k093156j643134p31891K703081P892417
42343g774811J1377296R299082J172783p531739r657076m977122q33226j775761
42335a0700574l051162J553198R282931J1342551M490607n194864r719600o822089
42327h819002m97492L538412L032416R87959J364398L161908J943841k318862
$$ y = [3724352, 7873658, 15486687, 18318025, 15082437, 12075991, 12870035, 13690785, 10788346, 6404228, 4210904, 3688472, 2671141, 1506629, 1094753, 259554, -1532339, -2120622, -460791, 1038861, 1149113, 2706606, 7042514, 9932658, 8092941, 5557941, 7314093, 9865649, 5648532, -4629927, -11808722, -10898476, -6977712, -6780452, -10367036, -13902128, -15995284, -17638418, -18370309, -15667228, -7774811, 3602485, 12901567, 14074350, 6542611, -3114465, -8091587, -8924813, -10700574, -13751736, -12198538, -2915607, 8426944, 12917551, 7722687, -1996913, -8819002, -9316494, -5778082, -2745666, -1757707, -393309, 2768599, 4712440, 2393578]
42319B393578l723681R84188P021255Q188858M834297J436259l2672l61721k00403
42310B0539958q38136m321185q873473q379631j091144N606331M781003l2156
42302G391567j079170J419436J382902j761847k823115o71103O11701J75318J136048
42293E781737K379111j018678p240626p157820J608559Q634122M670649m971818
42285B685236p995577j719111M942042M118415k413573p120576n136257J615696
42277a1023705O619704N202759m68026l999220k469405J043940K931796L255849
42269A093692L042379J451783j639274l569691k508048m84183N3884j8343O91245
42260a886556M57514k321460m518601j782804M286426P363408N072050J847509
$$ y = [2393578, -1330103, -345915, 6675340, 14864198, 19698495, 21134754, 21102082, 20740361, 20539958, 19701822, 15380637, 6507164, -1872467, -2963611, 2642720, 7423723, 7391567, 6312397, 7731833, 9114735, 7352888, 4529773, 3858670, 4470371, 4645689, 5781737, 8160848, 7142170, -98456, -7256276, -5647717, 2986405, 7657054, 2685236, -5310341, -7029452, -2087410, 2031005, -382568, -7503144, -12639401, -11023705, -4404001, 798758, 330732, -3668488, -6137893, -5093953, -2162157, 1093692, 4136071, 5587854, 3948580, 378889, -2129159, -2613342, -2559458, -2577801, -1886556, -1429042, -3750502, -8269103, -10051907, -5765481, 1597927, 6669977, 8517486]
42252H517486J724519K475559k1383m350369m805676J18519M465900K200139m536542
42243E788152p947105m804828k70401j44369k954376l000483J075130M987315
42235g270965N340451L310260J370439P0011o33225J36487K437073M136712L022939
42226A1920182m73566l346042k324798L244927R516026J0250210L242655n950006
42218B6079588r330631n178595J077378L966789K691341q43953m780456p326467
42210F354994p189348m942592j915393J853055N944699P159708K888914l729678
42202F424359o473139l642405J236903N389278Q161181P451361J618739n003246
42194A5163031n938013k612524k425609n629960m058264L871800P913763K102862
$$ y = [8517486, 10242005, 12717564, 12696181, 8345812, 3540136, 3658655, 8124555, 10324694, 5788152, -2158953, -6963781, -7234182, -7378551, -10332927, -13333410, -12258280, -7270965, -1930514, 1379746, 2750185, 2820196, 2186971, 2323458, 4760531, 8897243, 11920182, 11446616, 8100574, 5775776, 9020703, 18536729, 28786939, 32029594, 26079588, 16748957, 11570362, 12647740, 16614529, 19305870, 18461917, 13681461, 6354994, -834354, -5776946, -7692339, -5839284, 105415, 7265123, 10154037, 6424359, -48780, -3691185, -2454282, 2934996, 11096177, 18547538, 20166277, 15163031, 9225018, 6612494, 4186885, -1443075, -5501339, -1629539, 6284224, 8387086]
42186H387086m329349j379884N199148L531528m313852n342669L371238R831800
42178A4955046N055200m763473q034898k440730M520260N398571n0571n604369
42170I035036n338631n45219J712165j537447m576655j822581L226268L587298
42162C740234l22179k298453m01118J713146J962146J594237R77306j74201K0010
42153F811128K217653K303714k089269n205190j689209K632908o13674o299887
42145a931826k117071R732789J2634967N97882j1700497j0384865q69600L626394
42137d11827J113665j517978j541765q88146O82978L786092M935978J432493k976623
42128D614867l496683j224932P27833L014406O293846P153619L882913Q72940
$$ y = [8387086, 4057737, 2677853, 7877001, 11408529, 7094677, 1752008, 5123246, 14955046, 20010246, 15246773, 7211875, 4771145, 9291405, 14689976, 14639405, 9035036, 3696405, 3151186, 4863351, 3325904, -1250751, -3073332, 152936, 3740234, 3418055, 1119602, 718484, 2431630, 4393776, 5988013, 6965319, 6791118, 6811128, 9028781, 11332495, 9243226, 4038036, 2348827, 4981735, 4368061, -1931826, -4048897, 5683892, 18318859, 18916741, 7216244, -3168621, -4038221, -411827, 701838, -816140, -2357905, -3246051, -2563073, 1223019, 6158997, 7591490, 4614867, 1118184, -106748, 621085, 3635491, 9929337, 17082956, 20965869, 21838809]
42120B1838809J142881N08446m072636p005753l138360J929780J29161n739280
42112E593048p135644l872954k243649k459046M85579N259105N184760N20945
42104A332144j338529J321024K167174j063009k382901J471471N101248L520031
42096A0128653l98342j701826m00617J086425K274973K859495Q71015m233077
42088A0486699r482682j1169634p673300K2836P707626R509516M241347j724550
42080A917858k414469j74115k04981j335716J14108J447964j535736m129585J024498
42071e290174R223457Q633643j62169m034069J271040M860412M26390l241205
42063A1687325Q89382N145373J358018m324496k776709J994779Q86643l925238
$$ y = [21838809, 22981690, 23490136, 19417500, 12411747, 9273387, 11203167, 11332328, 5593048, -1542596, -5415550, -7659199, -10118245, -9632666, -4373561, 811199, 1332144, -6385, 1314639, 3481813, 2418804, 35903, 1507374, 6608622, 10128653, 9730311, 8028485, 7627868, 8714293, 10989266, 13848761, 14719776, 10486699, 1004017, -10165617, -17838917, -17816081, -10108455, -598939, 3642408, 1917858, -496611, -670726, -875707, -2211423, -2097315, -649351, -2185087, -6314672, -5290174, 3933283, 12566926, 12404757, 8370688, 9641728, 14502140, 14928530, 11687325, 12576707, 17722080, 19080098, 14755602, 11978893, 13973672, 14860315, 10935077]
42055A0935077l719056J149125K885938j01189k517210k445321k193670j329099
42047B664595J846411M310214K426865q00639q10701l8210k605196m969515k086970
42038f3146J506303j371410o132628k512790O730362Q066621r23183o893030j844487
42029c437388N013705L023665m064140o286817k672185N06482O95640K27649J71617
42020f821772m31835j224623q33256J012173L799641O316161N740503N72629n037252
42011C092369m890575N56763M596508M048096K229910J263608r64697m117260
42003E814722l791211J74437J805286o95255j103749L462109O195941K270166
41995A4132446j882000L07098L102826j655954q330184m743171O754707J0013161
$$ y = [10935077, 7216021, 8365146, 11251084, 11149895, 8632685, 6187364, 3993694, 2664595, 4511006, 8821220, 11248085, 10447446, 9636745, 9598535, 6993339, 2023824, -63146, 1443157, 71747, -6060881, -8573671, -1843309, 6223312, 5300129, -1592901, -3437388, 1576317, 4599982, 535842, -5750975, -8423160, -7916678, -7221038, -6993389, -6821772, -7253607, -8478230, -9311486, -8299313, -4499672, 1816489, 7556992, 8129621, 3092369, -1798206, -1241443, 3355065, 7403161, 9633071, 10896679, 9931982, 5814722, 2023511, 2197948, 4003234, 3307979, 2204230, 5666339, 11862280, 14132446, 12250446, 12557544, 15660370, 14004416, 5674232, 931061, 7685768, 17698929]
41987A7698929j007252j2268890r603846J821592O793637J945227k326469M09525
41979C462453L947256J488152k467900L42491P069727O074958n215243j4029991
41971F71903q851741M666619J1807799Q098433J550370j741864l751874n814892
41963F634753m261704J650830N854109M018689o35307l902158o291810q289237
41955e221835p014791k346086M87220n01047R0499N058095Q188981M804597Q03679
41946D349312K393730M268675j057600q223516o195298L043483O505550J03538
41938E187874o464994n907251k115031J38581K852544P351038Q766948L886794
41930A3696503k570771m818547l394455j375233J100277M069126M675231J526418
$$ y = [17698929, 16691677, 4422787, -5181059, -3359467, 3434170, 5379397, 3052928, 3462453, 7409709, 8897861, 6429961, 6772452, 13842179, 19917137, 14701894, 671903, -8179838, -3513219, 8294580, 16393013, 17943383, 16201519, 12449645, 6634753, 2373049, 4023879, 9877988, 13896677, 13261370, 9359212, 3067402, -5221835, -12236626, -14582712, -14095492, -14596539, -14506040, -9447945, -1258964, 3545633, 4349312, 6743042, 11011717, 9954117, 1730601, -4464697, -1421214, 5084336, 5187874, -1277120, -7184371, -9299402, -9160821, -6308277, 1042761, 9809709, 13696503, 11125732, 6307185, 2912730, 1537497, 2637774, 6706900, 11382131, 12908549]
41922A2908549j928507k317806r79286m95059n83477n80375j833349m152684l875641
41913c837635O92798N313590N112004J085359k090645k299915r85685j05297o49369
41904B235205k260256k717533k26418K964010K858626M26781R95932N234952O740347
41895A6251646J933622l704422m179753k234770l680812o800534m994760K082500
41887e327283P303371N659098o84442o656908q505122m373768L851417R447545
41879G13908P146424P50411j216861K117951K764555k923663p295095k838520
41871g80890N244067N525114l142123r761077o556732J065255L328721n97660
41863e675325l436460j107500K784791L584573J450750r27777k350024k472655
$$ y = [12908549, 10980042, 8662236, 7682950, 7187891, 6604414, 6024039, 4190690, 38006, -3837635, -3144837, 2168753, 7280757, 8366116, 6275471, 3975556, 2989871, 2884574, 2235205, -25051, -2742584, -2969002, -4992, 2853634, 3280415, 4276347, 9511299, 16251646, 18185268, 14480846, 10301093, 8066323, 4385511, -2415023, -7409783, -5327283, 1976088, 7635186, 6950744, 293836, -8211286, -12585054, -8733637, 713908, 7860332, 8610743, 7393882, 9511833, 12276388, 9352725, 2057630, -780890, 4463177, 9988291, 6846168, -2914909, -9471641, -8406386, -5077665, -5675325, -9111785, -10219285, -7434494, -3849921, -2399171, -3326948, -5676972, -8149627]
41855h149627l77070L305288N093767K580471j732368l315954j352709R59335
41847b988867J089430k25220p24208P83739L340431M676918M061311L863165N531599
41838A9408298M892338k839512j2653915j2554345q10181Q429452M172838n115445
41830B929528m839932L218150N664497L92558j728873K415740L127025k956970
41822H221723n548203N49964N102990N89744l622877K075402Q778256K446469
41814A8593468j2062678j6762069o406098O482433J0890281P874251J967528m911417
41806E665699r040338n763694J939631M815998L51008l393048J29916P052830
41798A758002R462860M970832k786148q491677q124603j964775L993092L585243
$$ y = [-8149627, -8526697, -5221409, -127642, 2452829, 720461, -2595493, -3948202, -2988867, -1899437, -2124657, -2848865, -2065126, 1275305, 5952223, 10013534, 13876699, 19408298, 24300636, 21461124, 8807209, -3747136, -4557317, 3872135, 8044973, 2929528, -1910404, 1307746, 6972243, 7364801, 5635928, 8051668, 11178693, 8221723, 2673520, 3223484, 8326474, 8916218, 5293341, 7368743, 16146999, 18593468, 6530790, -10231279, -16637377, -10154944, 735337, 8609588, 10577116, 5665699, -3374639, -9138333, -7198702, -2382704, -2031696, -5424744, -5294828, 1758002, 11220862, 16191694, 13405546, 4913869, -3210734, -5175509, -1182417, 2402826]
41790B402826j864540n194504k620844K687872N733778M266116q50607n710348
41782a150251n336885K02850M132659K026561j328683j21963K442576P69823j434513
41773B02174K643623Q578259N981366l110661n781795O07539M085546j262247
41765A1943804n701743j835080K285369k063420q499310o373060J661748N135350
41757c446342K511892Q64271K988932N121638M699768K030026k888189q156150
41749C725846q418182k251176L494325L413807J744255L315065L564054k299250
41741F288744p079076j379545R155851J0460693J394347n886273o002547n750708
41733A201486q070418o008145K711675Q861325O080404N69771n59753j69203k712594
$$ y = [2402826, 538286, -4656218, -7277062, -4589190, 1144588, 5410704, 4560097, -1150251, -6487136, -6284286, -2151627, -125066, -1453749, -1575712, 866864, 1636687, 202174, 2845797, 11424056, 17405422, 14294761, 8512966, 9120505, 13206051, 11943804, 6242061, 4406981, 6692350, 4628930, -3870380, -10243440, -8581692, -3446342, -934450, -70179, 2918753, 8040391, 12740159, 14770185, 11881996, 3725846, -4692336, -6943512, -3449187, -35380, 1708875, 5023940, 8587994, 6288744, -790332, -2169877, 6985974, 17446667, 18841014, 12954741, 6952194, 1201486, -6868932, -12877077, -10165402, -1304077, 4776327, 5346098, 4786345, 4617142, 1904548]
41724A904548m669246k100398M92986j777559m180601r7307O933880Q799713N778612
41715A1084628L858673L053219p62082n038174l206626K602565L139273k642252
41707A2089224n271460n12961L774203J354100k230819k54661L248040R67980
41699A3163646m710440n870412k053526N66891O73237K861198P605376R106429
41691B1342399M515275j935910n485278n265178j503396M744675Q117058L018329
41683B7547974o728613j0259757m623397R32496n43224l976087k698620O12525
41675B63297J264755K088170N710104N229169m944563j5004940j1065346K717300
41667a3742054Q839868K556212k965706L05848L876104L62753l232772M31667
$$ y = [1904548, -2764698, -4865096, -4372110, -6149669, -10330270, -10427577, -3493697, 5306016, 11084628, 14943301, 17996520, 17234438, 12196264, 8989638, 11592203, 14731476, 12089224, 6817764, 6304803, 10079006, 11433106, 9202287, 8947626, 12195666, 13163646, 8453206, 2582794, 529268, 1096159, 1769396, 4630594, 12235970, 21342399, 25857674, 23921764, 18436486, 13171308, 11667912, 16412587, 24529645, 27547974, 20819361, 10559604, 5936207, 6868703, 6325479, 2349392, -349228, 263297, 1528052, 3616222, 9326326, 14555495, 9610932, -5394008, -16459354, -13742054, -4902186, -2345974, -5311680, -5005832, -1129728, -766975, -3999747, -3568080]
41659c568080M778665J105909n193609l356156M325679O012823j051151p448145
41651d394065o211281m81944L734277M335749K020539j122253j539505K116122
41643a542361N636254M082151j210833m746202m196402j396539J594313L086538
41635A306919J361035j838590j111247M400459P320819K657609l243575k285694
41627H567735K068376J059494l931542m020769J191760K992082q08494k296624
41619D822018K016719N092002K060759j816549j437701m10581k652643l836240
41611C837784R25787P151355O869403L54973n238901o129988m386197k238436
41603A145780J18975J920108J880866P32001K96683L76209p04357k824998l775291
$$ y = [-3568080, 1210585, 2316494, -2877115, -6233271, -1907592, 4105231, 3054080, -4394065, -10605346, -11087290, -7353013, -3017264, -996725, -2118978, -3658483, -1542361, 4093893, 8176044, 6965211, 2219009, -1977393, -3373932, -1779619, 1306919, 2667954, 829364, -281883, 4118576, 11439395, 14097004, 10853429, 8567735, 10636111, 11695605, 7764063, 3743294, 4935054, 7927136, 7118642, 4822018, 6838737, 11930739, 13991498, 12174949, 10737248, 10326667, 7674024, 3837784, 4763571, 11914926, 18784329, 19139302, 13900401, 7770413, 3384216, 1145780, 1264755, 3184863, 5065729, 5797730, 6094413, 6470622, 5766265, 2941267, -834024]
41594h34024k377699k60049J62427r99885q65753J983953M104685J474350k858294
41585d70289j248010O023133Q099936o33532r480814n823679N091697P402849
41577H961291j099526o449021j200089N141330L175707k162429k072461J970759
41569F265561L337122J643852M97779j56878j699979j842492J083754L299315
41561A2428034J263825k075412k326774n18056L69391R59679K153984J115402
41553A3370073l636567p511119n814564n05801L645158N150647M048039j23443
41545H622423m132349j682985O331310R542406K523306o159741o876629k993293
41537E174448k765500m655806j898582L880789N285428J677604j605043l169467
$$ y = [-834024, -3211723, -3471772, -3309345, -4309230, -5174983, -3191030, 913655, 2388005, -470289, -1718299, 4304834, 12404770, 11771238, 2290424, -3533255, 1558442, 8961291, 7861765, 1412744, 212655, 5353985, 8529692, 6367263, 4294802, 6265561, 9602683, 11246535, 11744314, 11587436, 9887457, 8044965, 9128719, 12428034, 13691859, 11616447, 9289673, 8771617, 9141008, 10100687, 12254671, 13370073, 9733506, 2222387, -3592177, -4097978, -452820, 4697827, 8745866, 8622423, 4490074, 2807089, 9138399, 18680805, 21204111, 15044370, 8167741, 5174448, 2408948, -2246858, -4145440, -264651, 5020777, 6698381, 5093338, 1923871]
41529A923871m549954l147437L100191P797473M160471k612791k957455Q16169
41521D530538p19215o223655n617821J315116M442259K003079L079242Q547222
41513A1356765O850056n098440j2968453o027981O436333R955556M828521M18149
41505A5750506r64753k858268m389636k607117k72409j207259j847497K854959
41497D458526Q314799N191875n663692j2378980p273646M148121J1262242J0062694
41489A8121939M451927m87124l117818l852039k113685K552320O623635M254732
41481B6433887m276760r962630o048160J975811M135416N31752o46443K337333
41473A4480206K830975j301188l851672j737950j8981k120560m623785n179963
$$ y = [1923871, -2626083, -5773520, -2673329, 5124144, 9284615, 6671824, 3714369, 4530538, 3811323, -2412332, -8030153, -6715037, -2272778, -269699, 2809543, 11356765, 18206821, 13108381, 139928, -5888053, 548280, 10503836, 15332357, 15750506, 14785753, 11927485, 7537849, 4930732, 4658323, 3451064, 1603567, 4458526, 12773325, 17965200, 12301508, -77472, -7351118, -3202997, 8059245, 18121939, 22573866, 22086742, 18968924, 15116885, 13003200, 15555520, 22179155, 26433887, 22157127, 12194497, 6146337, 8122148, 12257564, 12789316, 12142873, 14480206, 17311181, 16009993, 12158321, 10420371, 10401390, 8280830, 3657045, -1522918]
41465a522918n933024n705061N07817R951127J1527931K569671n341999m054294
41457A999250k76118j179888j469379M141412P739015J375873o622064l971523
41449A736578M717031N680921j151435l982391k54812J246585j781214k020914
41441D190349J790222J875272l179989m641006P73080M791221J971206j852640
41433E717715j046179O77796j347368m489092m913436l849010k419412J954327
41425i714659Q610415J0622393M584860k996095m638583j450254J256892K121043
41417H396012K216863O92315k512332l764746n69118M052512N823362M411460
41409A8746328J541751j799492l615282j470011K117913N44105o690159j0478478
$$ y = [-1522918, -7455942, -13161003, -12653186, -2702059, 8825872, 11395543, 6053544, 1999250, 1723132, 543244, -926135, 3215277, 10954292, 12330165, 5708101, 1736578, 6453609, 12134530, 10983095, 7000704, 6745892, 7992477, 6211263, 4190349, 5980571, 7855843, 4675854, 34848, 807928, 5599149, 7570355, 5717715, 4671536, 5349332, 4001964, -487128, -5400564, -9249574, -11668986, -9714659, -1104244, 9518149, 14103009, 11106914, 6468331, 5018077, 6274969, 8396012, 10612875, 11305190, 8792858, 5028112, 4458994, 8511506, 14334868, 18746328, 20288079, 18488587, 14873305, 13403294, 15521207, 16065312, 9375153, -1103325]
41401a103325m011536O709780J0142489L564897n282958q421873m698098J517252
41393a583372M716566K590149j667045l094315j704870j771029l803055l095324
41385i412295J678147N138942M089278K887161M977051N813862Q58900n249253
41377A0781793n438626j675261j140276l887660l229031K540265P050584N216293
41369A0218081p34002n510453o054430k255371L181544N623462L126485o03701
41361F991615j414667p33600j827004k840772N2457M503944M383747l41305l687602
41352E086813l679238m171367n454536j905588P370520J3646002J0035361J719132
41344B2647099j853447m32687j187782n891064p914132k866899M287692N921402
$$ y = [-1103325, -5114861, 1594919, 11737408, 15302305, 10019347, 1597474, -3100624, -1583372, 3133194, 5723343, 4056298, 961983, -742887, -2513916, -6316971, -9412295, -7734148, -2595206, 1494072, 4381233, 9358284, 15172146, 16031046, 10781793, 5343167, 3667906, 2527630, -1360030, -4589061, -2048796, 5001788, 10218081, 9484079, 3973626, -2080804, -4336175, -1154631, 4468831, 7595316, 6991615, 5576948, 4843348, 3016344, 175572, 228029, 4731973, 9115720, 8774415, 5086813, 1407575, -2763792, -8218328, -10123916, -2753396, 10892606, 20927967, 22647099, 20793652, 20360965, 19173183, 13282119, 5367987, 2501088, 6788780, 12710182]
41336A2710182J674756k129473j478012P44124o2028l346262m507631j932709
41328A672947N83179m02225k968337l226164j324196l62876o74696M06416L081978
41319c213974L903824J396396j106165n71746J002137J03782k228755j610616
41311b325117K972776P124936O649712K738810k57826q87137j873611n007728
41303I134815p260570m361924K632348P273994M956431j976095p364599p466707
41295d432307k932740L094703O917297O227826K396699m31380k26259N60090q84318
41286A0289611l549561m720495l718210r28912L792174Q193924O694910k209918
41278A3843523j0341158q347999J482466Q013561O360144K341724J161813N00423
$$ y = [12710182, 14384938, 12255465, 10777453, 11521577, 11459549, 8113287, 3605656, 1672947, 2256126, 1853901, -1114436, -4340600, -5664796, -6027672, -6702368, -6295952, -3213974, 689850, 2086246, 980081, 408335, 1410472, 1514254, -714501, -2325117, 647659, 7772595, 14422307, 17161117, 16903291, 16016154, 14142543, 9134815, 1874245, -2487679, 144669, 7418663, 12375094, 10398999, 3034400, -4432307, -7365047, -4270344, 2646953, 8874779, 11271478, 10840098, 10613839, 11173929, 10289611, 6740050, 2019555, -1698655, -2627567, 1164607, 9358531, 16053441, 13843523, 3502365, -4845634, -3363168, 4650393, 11010537, 13352261, 14514074, 15014497]
41270A5014497k045605l179879p83848O62695k075192l919144K50846N376541
41262I300911L138687m162323o317182q43863L699228J278921l603185m633743
41254b142549k922126k902184m465759m137572o86921M290122Q622616R750118
41246E405745O167158J207547Q94605M731210M093759n004736j3145560r384798
41238e035070K068394O985010J561475l306030J5745M790923K250187m274119
41230E056515n753497j782641N38810j417536l613368l550361k770648j588809
41222a4881535J480590M738763M284576O32459j598617j053377o79816j174023
41214h250980j29795J670360O08844j909882k96293M416261M081481k396454m786587
$$ y = [15014497, 12968892, 9789013, 9005165, 9667860, 7592668, 3673524, 3924370, 9300911, 12439598, 8277275, 1960093, 1116230, 4815458, 6094379, 2491194, -2142549, -5064675, -7966859, -12432618, -16570190, -17257111, -12966989, -4344373, 5405745, 11572903, 12780450, 13675055, 18406265, 22500024, 17495288, 4349728, -5035070, -2966676, 4018334, 5579809, 2273779, 2289524, 7080447, 9330634, 5056515, -696982, -2479623, -1940813, -3358349, -6971717, -10522078, -13292726, -14881535, -13400945, -8662182, -4377606, -3745147, -5343764, -6397141, -7076957, -8250980, -8380775, -6710415, -6101571, -8011453, -8307746, -3891485, 189996, -2206458, -6993045]
41205f993045K080463P979342K950471n711263m635693L864322N755223j907715
41197C382105p281430l506695K177001K543603O66805O33892n75107m796107n993872
41188a2749805k53655N327837K843389l282201k908538M101278Q476045N875616
41180G429966J391443k15151m55171j647737k281055o76068J348195J357759K812
41171F254993l80255Q79789K300451K155159K91555j498264j375393p6977r2378
41162H458680j501192j274375J451442K585877r55330n096138l299918L496377
41154C865423O865359J850244o286477q588627l080982L764286N311398K018859
41146E719483n62012K65582J085157j649481n161094l944632J307865L912972
$$ y = [-6993045, -4912582, 3066760, 6017231, 305968, -4329725, -465403, 5289820, 3382105, -3899325, -7406020, -5229019, -2685416, -2018611, -1384719, -1959826, -6755933, -12749805, -13003460, -7675623, -4832234, -8114435, -11022973, -6921695, 1554350, 7429966, 8821409, 8606258, 8151087, 6503350, 4222295, 3546227, 4894422, 6252181, 6254993, 5874738, 6754527, 9054978, 11210137, 11501692, 10003428, 8628035, 8551058, 8458680, 6957488, 5683113, 7134555, 9720432, 8765102, 3668964, 369046, 3865423, 10730782, 12581026, 6294549, -2294078, -5375060, -1610774, 3700624, 5719483, 5157471, 5423053, 6508210, 4858729, -302365, -4246997, -2939132, 973840]
41138I73840J234583j479621l2403J998402J23367k870583j919820J267056J507598
41129H02419l45521P34223M028545L602256j042975l404435q58747J038959j642727
41120B911997m576414k961281L68268L36012j633506o10190L029302M110008R81463
41111A955659k079698j217478K181359M087247K889217P44098O50344K604534
41103A1815282L175691j07932m871941o839550n929065n547047n778963k594119
41095a6677644M265361Q272891N039899m60797r69216K336368K679077p49191
41087C736748j431280L679184Q674242O796388o10246o707779p805402n844866
41079D86989l706096j567841J518811M657167N425267L006571k76861j505189
$$ y = [973840, 2208423, 728802, 696399, 2694801, 2818168, -52415, -1972235, -705179, 802419, 456898, 1191121, 5219666, 8821922, 7778947, 4374512, 3515765, 4554724, 2911997, -1664417, -4625698, -4257430, -3921418, -5554924, -6165114, -3135812, 974196, 1955659, -124039, -1341517, 839842, 4927089, 7816306, 8560404, 9210748, 11815282, 14990973, 14883041, 10011100, 3171550, -2757515, -8304562, -14083525, -16677644, -12412283, -4139392, 900507, 439710, -529506, 1806862, 4485939, 3736748, 2305468, 5984652, 14658894, 21455282, 20845036, 14137257, 6331855, 486989, -3219107, -4786948, -3268137, 1389030, 6814297, 9820868, 9544007, 8038818]
41071H038818o27903K2162n55336p99324M30385J777743J489907j94361k073754
41062G508337l703958m673998l868345j082016K025094L860724M190913K705139
41054F961890r88983m500692l278759L088038Q350335P021533J675958j280020
41046A7049300p26273p09986k674944l403779r70364J960978J916372j440955
41038A1000349n664437p483733m984474j97154K047345N59103K41078M099123
41030c82800O674446J992761n245082n310098J263207M353816P19792j560626
41022B505416J842958L747939j058121n358014j530339M673949L283158l139616
41014D967330l893173K063849M964887N21977l996626k218561K165312K475129
$$ y = [8038818, 7410915, 7433077, 6877741, 6078417, 6508802, 8286545, 9776452, 9582091, 7508337, 3804379, -869619, -4737964, -5819980, -3794886, 65838, 4256751, 6961890, 5972907, 1472215, -1806544, 1281494, 9631829, 16653362, 18329320, 17049300, 16323027, 15613041, 12938097, 9534318, 8563954, 10524932, 12441304, 11000349, 5335912, -2147821, -7132295, -7329449, -5282104, -4723001, -4481923, -382800, 6291646, 8284407, 3039325, -2270773, -1007566, 3346250, 4066042, 2505416, 4348374, 8096313, 7038192, 1680178, 149839, 4823788, 8106946, 4967330, 1074157, 3138006, 8102893, 8624870, 4628244, 2409683, 4574995, 7050124]
41006G050124j575814n529511o426778m125254J29777L944172M994420L303665
40998A764801N24054k524678n046404m537532K92001O185739Q992287Q861531
40990A4511799P301237K095925p996973j5954797j2916527j667434N531820L698823
40982e396127L26038J676486L910360K172214q71031j534111k062614m421723
40974f200508m326163J148491O130142M025403j786971l072524J320006N865978
40966C103854P202350N700877J676865l262913m601039j156534J106844j782182
40958G988122m025284M06762O061664M277226j551256j405638L634446L028998
40950A8415040m376468p624438j980649L841174L002124J77746J86323q77725
$$ y = [7050124, 5474310, -55201, -6481979, -10607233, -10477456, -6533284, -1538864, 1764801, 2288855, -235823, -5282227, -9819759, -9527758, -3342019, 5650268, 14511799, 21813036, 23908961, 15911988, -42809, -12959336, -14626770, -9094950, -5396127, -5070089, -3393603, 516757, 2688971, 1817940, 283829, -1778785, -6200508, -10526671, -9378180, -3248038, 777365, -1009606, -4082130, -2762124, 3103854, 10306204, 16007081, 17683946, 14421033, 9819994, 8663460, 9770304, 7988122, 3962838, 4369600, 10431264, 14708490, 13157234, 11751596, 15386042, 18415040, 14038572, 6414134, 4433485, 8274659, 11276783, 11454529, 11640852, 10763127]
40942A0763127n755488q043795k815297L603977L387804p21986j857966o84352
40934b123976j475649k585775l86477K269249J096839m64693K957795P357003
40926F644316M370293m528974r383564o582746k385850j393812j062671R07625
40918a3415383K414884K335069K566014K701986k19183m674562m651157O13605
40910a2328727L992447J268510j967992Q30759O613157P001036L40559o200919
40902d51170o180091j329962J767839L34526j603765L83858L886397K770683k553478
40893b975163m052949J784300P264750M800806j102961j555753J845195N32665
40885F540890n315730o703494j409196K658327J707067J436038M329882L690969
$$ y = [10763127, 5007639, -3036156, -5851453, -2247476, 1140328, 418342, -1439624, -2123976, -3599625, -6185400, -6571877, -4302628, -3205789, -3670482, -712687, 6644316, 11014609, 6485635, -2897929, -9480675, -11866525, -13260337, -14323008, -13415383, -11000499, -8665430, -6099416, -3397430, -3616613, -8291175, -12942332, -12328727, -8336280, -7067770, -9035762, -8205003, -1591846, 5409190, 5749749, -451170, -6631261, -7961223, -6193384, -5858858, -7462623, -7078765, -3192368, -421685, -2975163, -7028112, -5243812, 2020938, 6821744, 5718783, 4163030, 6008225, 6540890, 1225160, -5478334, -6887530, -4229203, -2522136, -1086098, 3243784, 6934753]
40877F934753l543297q955418n238280K620614O509605O809112O679003L622206
40869A5438298l572382p566614l017170K725832J051873k644466J416530Q342080
40861A2173981N123337o558696j1157736l534743M243645L594827P02052J307638
40853E894305j10663o868472r571350j092674Q634710O436317l007438m420516
40845d105781L976322Q625568K491179n304030m971307M42216K725269J007381
40837D886817k86349k79226j379173l176914k841077l81327J581679K746843N031683
40828E902956P314511N337218j113051n425039k524658L014477K636449l519636
40820A1623227o169466p81148M791012J620695o319516p190537J359822Q250475
$$ y = [6934753, 3391456, -5563962, -10802242, -8181628, -1672023, 5137089, 11816092, 15438298, 11865916, 4299302, 1282132, 4007964, 5059837, 2415371, 3831901, 12173981, 17297318, 10738622, -419114, -3953857, 289788, 3884615, 4586667, 5894305, 5783642, -1084830, -10656180, -11748854, -3114144, 3322173, 314735, -4105781, -129459, 8496109, 10987288, 5683258, 711951, 1154167, 3879436, 4886817, 4600468, 4321242, 2942069, -234845, -3075922, -3457249, -1875570, 871273, 5902956, 13217467, 18554685, 17441634, 12016595, 9491937, 12506414, 15142863, 11623227, 5453761, 4672613, 9463625, 11084320, 4764804, -2425733, -1065911, 7184564]
40812G184564M301121n452318r095708l024357N263230P550494L534105r21394
40804I339737j161183J679632K714296n78004n151969o327912l574792L5760K802200
40795b22235M977330N190131J585370k825459j959374L869872O314525P77391
40787A7707551n789952m525424K393556N466210J828640k264066k397939j759666
40779A0658910l987357o508100m788464M32113M066916L395872Q08019j72326
40771C905583M72042k3334k295953l071273l13583J945709j563724q178026r027577
40762a8150136j671759N534848N413992J690842J105601K226460J45170k870657
40754f575639j365755J985573J56938m543467k622546N830710R033913J931706
$$ y = [7184564, 11485685, 6033367, -3062341, -6086698, -823468, 6727026, 10261131, 9339737, 8178554, 9858186, 12572482, 11994478, 6842509, 514597, -3060195, -3024435, -222235, 4755095, 9945226, 11530596, 8705137, 6745763, 10615635, 16930160, 17707551, 11917599, 7392175, 9785731, 15251941, 17080581, 14816515, 12418576, 10658910, 6671553, 163453, -4625011, -4192898, -125982, 3269890, 4077909, 3905583, 4377625, 4354291, 2058338, -1012935, -1326518, 619191, -944533, -9122559, -18150136, -19821895, -14287047, -8873055, -7182213, -6076612, -3850152, -3704982, -6575639, -7941394, -5955821, -5798883, -10342350, -12964896, -7134186, 1899727, 3831433]
40746C831433n083996k165610N520083P421608L418929O79996O55621j009047
40738A3269017m861749o689336m660195o95746L608802O700201N185137j633666
40730A0222465p569545o084799P79861N614125N493585K889744m10601l595840
40722G338995l657593O18967L595333l44183o607584n847429J430040N386018
40714A912564K312684o18363J766688M928369L735283N43710q87535k156668n313000
40705F223732p197628m322362J097499M670424N456356M476342J894405j075997
40697A1222771j923526j193519k057782l481477n17630N842822P249536Q14091
40689A5955286n188467m267396j493894k830418l818760J030782N720254K013158
$$ y = [3831433, -1252563, -3418173, 2101910, 9523518, 12942447, 13622443, 14278064, 13269017, 8407268, 1717932, -2942263, -3638009, -29207, 6670994, 11856131, 10222465, 2652920, -3431879, -2652018, 2962107, 8455692, 11345436, 10934835, 7338995, 3681402, 4300369, 7895702, 7551519, 943935, -4903494, -3473454, 1912564, 4225248, 3606885, 5373573, 10301942, 14037225, 14580935, 13693400, 11536732, 6223732, -973896, -5296258, -4198759, 471665, 5928021, 10404363, 12298768, 11222771, 9299245, 8105726, 6047944, 2566467, 2048837, 7891659, 15141195, 15955286, 10766819, 6499423, 5005529, 2175111, -1643649, -612867, 5107387, 7120545]
40681G120545m961885m136925K500763L060745l849242p141244k512825J387276
40673h532792n83293j720674K724328O240246L104505j097488M03971L806621
40665D345424K229470k048415k108489J919943M306159L113602N48404k775894
40657I530204o776656q010684l765282K187001M162136K745739K474347L547110
40649F093915K147888k183675n204703l602650J974609Q217303J0406464N338215
40641B3187366l371647o903059k660514P93669l777484j0269579q112064J161090
40633i952222O503223M264363J449443K204228K251515r76363k922375n65351
40625B256461K074055J528839O91377K572898M748968M396042K930753J576437
$$ y = [7120545, 2158660, -1978265, 522498, 3583243, -265999, -7407243, -9920068, -8532792, -9116085, -10836759, -8112431, -1872185, 1232320, 134832, 538803, 4345424, 6574894, 4526479, 2417990, 4337933, 8644092, 11757694, 12306098, 9530204, 2753548, -5257136, -9022418, -6835417, -2673281, 72458, 2546805, 6093915, 8241803, 6058128, 853425, -2749225, -774616, 7442687, 17849151, 23187366, 19815719, 12912660, 10252146, 11045815, 7268331, -3001248, -11113312, -9952222, -3448999, 815364, 2264807, 4469035, 6720550, 5744187, 2821812, 2256461, 4330516, 5859355, 6550732, 9123630, 13872598, 18268640, 21199393, 22775830]
40617B2775830j655043o371797p483463l267463M46912n38725j804916J163700
40609C265035L879547M07176n229381m731228P28557K534155j039585k731902
40601b917626Q72189M097116K281062j249276j991225j092642j125748q69883
40593a996033R77703J560770j696973n861796o449334l980178k064213j109081
40585b0619135J294064M888897O319422M195233Q79827j140985j659398j204425
40577g046500L1806J123085Q47274M1396J178713M447631O369027M044768o00918
40568A0436282k783475o35732K614186K569957j183522m570358l612187R94126
40560C829277M553716L707760R4080k182641j838698j438422l179081n594908
$$ y = [22775830, 21120787, 14748990, 7265527, 3998064, 4444976, 3906251, 2101335, 3265035, 7144582, 7551758, 2322377, -2408851, -1680294, 853861, -185724, -2917626, -2045437, 2051679, 4332741, 3083465, 1092240, -402, -1126150, -1996033, -1018330, 542440, -1154533, -7016329, -13465663, -17445841, -19510054, -20619135, -19325071, -14436174, -8116752, -3921519, -3041692, -4182677, -5842075, -7046500, -7014694, -5891609, -5044335, -5002939, -3824226, 623405, 6992432, 11037200, 10436282, 7652807, 7017075, 9631261, 12201218, 11017696, 6447338, 2835151, 3829277, 8382993, 12090753, 12184833, 10002192, 8163494, 6725072, 3545991, -2048917]
40552b048917n539648k344040J307769K398942O49116j502635j658587K9639J509478
40543g198883J863612K226504K796493J191028l443871o576935l193665L975738
40535h359979P014266M626353M194585Q527428Q705867k121420j4343849j2690048
40527d446797J237856R887245M289587m919091n351937K05090K488812J435978
40519D826743K684040N098330L243492j266019j893296Q75090N2945n451274q711248
40510e41197o260849k709943j724202o85381K544917M900342L918367K095268
40502A537322J698541P02532k440776m984181m429607k306891k07153L083739
40494g346474P035950P148367J733766l558608k954892J272031K712502n2144
$$ y = [-2048917, -7588565, -9932605, -8624836, -6225894, -5576778, -7079413, -8738000, -8708361, -7198883, -5335271, -3108767, -312274, 878754, -2565117, -9142052, -12335717, -8359979, -1345713, 3280640, 7475225, 16002653, 24708520, 22587100, 8243251, -4446797, -3208941, 6678304, 10967891, 6048800, 696863, 901953, 3390765, 4826743, 7510783, 12609113, 15852605, 14586586, 12693290, 13568380, 13621325, 8170051, -541197, -6802046, -9511989, -11236191, -11921572, -9376655, -4476313, -557946, 1537322, 3235863, 3938395, 1497619, -3486562, -7916169, -10223060, -10430213, -7346474, -310524, 6837843, 8571609, 5013001, 2058109, 3330140, 6042642, 5990498]
40486E990498l029397l265784j268250J400104L226607K799410N16508j317826
40478E051870j774525j990625j414413K151194O740600O241289j19651m371428
40470A0514311j102889L713769J979023l675364m632490j62653K739217J567658
40462A0940582R81497L221735M538807K700225O75464O42585M20334j727337l533722
40453A8860170k167544J979079N678058M660064l207420j2919958j3952852k914597
40445c985000Q925576Q878820M29207k921707P64599K03002p756750j0499035
40437e961288n26J2842548J4385507P797095M356445L874930j756113j0434368
40429B5104230j0780601r19938P501410O618875J878195K80990j73457l171638
$$ y = [5990498, 2961101, -304683, -1572933, -172829, 3053778, 5853188, 6369696, 5051870, 3277345, 1286720, -127693, 2023501, 8764101, 15005390, 14885739, 10514311, 9411422, 13125191, 15104214, 11428850, 6796360, 6633707, 9372924, 10940582, 11922079, 15143814, 19682621, 22382846, 23058310, 23700895, 24121229, 22393892, 18860170, 16692626, 18671705, 24349763, 29009827, 25802407, 12882449, -1070403, -3985000, 4940576, 13819396, 14248603, 11326896, 12091495, 12294497, 4537747, -5961288, -5961814, 6880734, 21266241, 29063336, 33419781, 37294711, 35538598, 25104230, 14323629, 13403691, 20905101, 27523976, 29402171, 29683161, 29509704, 26338066]
40421B6338066n040882j070153M897552N509034J242816j142807K34325N98477
40413C1566428k041710l272443k76639L134058L286539L077223O532022J0915494
40405E2920972J0410841N313848R98725r74058l312710m629977N46545J0642749
40397G1916935J4735088P087242l306380n047864j43548J414012j795893k250712
40389H2608880K232440N105528L058560J259552L730116P001843O998192N134494
40381A17129605M050426L617886M252742P755333J1860879J0830918M910489J967305
40373A66375583N564582Q978046O458251L005733O100542J4139350K0658993K4451086
40365B55732166K7310495K6713951K0095465J3083941J3683002J9544509K0194793
$$ y = [26338066, 21297184, 20227031, 25124583, 30633617, 31876433, 30733626, 30967951, 31566428, 29524718, 26252275, 25975636, 29109694, 32396233, 35473456, 42005478, 52920972, 63331813, 68645661, 69644386, 68670328, 65357618, 60727641, 61274186, 71916935, 86652023, 93739265, 90432885, 85385021, 85241473, 86655485, 84859592, 82608880, 84841320, 89946848, 93005408, 94264960, 97995076, 104996919, 111995111, 117129605, 121180031, 124797917, 129050659, 136805992, 148666871, 159497789, 164408278, 166375583, 171940165, 180918211, 187376462, 190382195, 196482737, 210622087, 231281080, 255732166, 283042661, 309756612, 329852077, 342936018, 356619020, 376163529, 396358322]
40358C96358322J2003063K548141j158822j348886l928530r994259j6116137j9850419
40350C58512473k2424810k6697029l2515249l4272400k6314399j2226331l697315
40343B00364940o246901j1188767p579758K373918P185210K168018o245780j0395206
40335A70435674p986805k76076Q551115J1043365L366282p663399j1736494q712928
40327A57020734p337892j0970618j3928568j3078300j3212286j7332237j9943426
40320F1217407j5033138m928760L178147N358923K671635j409526l371432k930215
40312D4753041m210182r582305j3727501j0092235j811511J990136J08005k26686
40304G200762K848992K694329k653906n716375k492684R62757N77702J735853
$$ y = [396358322, 408361385, 410909526, 409750704, 408401818, 404473288, 394479029, 378362892, 358512473, 336087663, 309390634, 276875385, 242602985, 216288586, 204062255, 200364940, 194118039, 182929272, 175349514, 177723432, 184908642, 187076660, 180830880, 170435674, 162448869, 162172793, 170723908, 181767273, 185133555, 177470156, 165733662, 157020734, 149682842, 138712224, 124783656, 111705356, 98493070, 81160833, 61217407, 46184269, 41255509, 44433656, 49792579, 52464214, 51054688, 47683256, 44753041, 40542859, 30960554, 17233053, 7140818, 5329307, 7319443, 7427448, 7200762, 10049754, 12744083, 10090177, 4373802, 1881118, 2843875, 3421577, 5157430]
40296E157430P436275R933997L545684l979621l601765J60246j521491n325820
40288A1804935k430962L835993K297586o282245q892101p57657P662385P401283
40280A4639217K702843J189430K295668J520421j106719k706664k774190k261755
40272A3498251j346039j070736l116206n634445m012994J608350M494530M60783
40264D881494n383075n197932J141362O215417M215643l183134r393628r260311
40256a5964164l204215L744716O990716O219134L934558J919856J007056K395452
40248G043109N819110P447472L455237m319006r553463q470419l084422K127893
40240D65511M082235K404629k21947r0401K461862K351349k239817m793100L38523
$$ y = [5157430, 12593705, 22527702, 26073386, 22093765, 18492000, 18652246, 17130755, 11804935, 9373973, 13209966, 15507552, 9225307, 333206, -424451, 7237934, 14639217, 17342060, 18531490, 20827158, 22347579, 21240860, 18534196, 15760006, 13498251, 12152212, 11081476, 7965270, 2330825, -1682169, -73819, 4420711, 4881494, -501581, -5699513, -4558151, 1657266, 5872909, 2689775, -6703853, -15964164, -19168379, -15423663, -8432947, -2213813, 1720745, 3640601, 4647657, 7043109, 12862219, 20309691, 23764928, 19445922, 9892459, 1422040, -1662382, 465511, 4547746, 6952375, 6730428, 6640027, 9101889, 11453238, 9213421, 4420321, 4758844]
40231D758844O904276M142759n633109p867771K843501J2961982Q442166n431924
40223B1120724j2058560o427493N37758l21790m394160k492172M838410Q394849
40215I197566L575217l291674l712118J550982M083774J5834m746610l739586
40207B933385O23177J677291j119996k914274k342177k175949j906116J799838
40199c424821O315572M067223m333745p239707J651867J1930875R777943k779852
40191A5965355j1148187p892780p2211K722497m82063m390955m755186j034724
40183a1088254M199754O796231M664624M62883j674087j438213j478056k448572
40175b003690k812289k628594l030328k425009J715590P057909P865598L504365
$$ y = [4758844, 11663120, 15805879, 10172770, 2304999, 5148500, 18110482, 26552648, 21120724, 9062164, 2634671, 3172429, 2850639, -1543521, -4035693, 802717, 9197566, 12772783, 9481109, 5768991, 7319973, 11403747, 11419581, 6672971, 2933385, 3556562, 5233853, 4113857, 1199583, -1142594, -3318543, -5224659, -3424821, 2890751, 6957974, 2624229, -4615478, -2963611, 8967264, 18745207, 15965355, 4817168, -3075612, -3147823, -425326, -907389, -5298344, -10053530, -11088254, -6888500, -92269, 4572355, 5035238, 3361151, 1922938, 444882, -2003690, -4815979, -7444573, -10474901, -12899910, -11184320, -4126411, 3739187, 7243552]
40167G243552K3617R99109K261073n09205l793075j419178N080264P587006K612749
40158B0085912m058844n381002j543591J897507J528866j160944l018900k395642
40150E953362M34088L508306L796676P1486m238378l724568J936744O207994L683831
40141A7629541k320421m257698j365496p83359o402798j2066784r802878j112589
40133b0482482N166237M608580J347430L07652O47884o37755k472295j042897
40125a2557646L855054P453531N773342N86777k893421k394360q54702j911496
40117b942921m715685n051064j255017L178460L885135R52736j563712o15036
40109h127104K862435N573750N138765J801086k077658m100925l967132l338491
$$ y = [7243552, 7267169, 8266278, 10527351, 10018146, 6225071, 4805893, 9886157, 17473163, 20085912, 16027068, 10646066, 9102475, 10999982, 12528848, 11367904, 8349004, 5953362, 6387450, 9895756, 13692432, 13763918, 9525540, 5800972, 7737716, 13945710, 17629541, 15309120, 11051422, 9685926, 8902567, 2499769, -9567015, -19369893, -20482482, -15316245, -10707665, -9360235, -9052583, -8404699, -9042454, -11514749, -12557646, -8702592, -1249061, 4524281, 5111058, 2217637, -176723, -1031425, -2942921, -7658606, -12709670, -13964687, -10786227, -6901092, -5948356, -7512068, -8127104, -5264669, 309081, 5447846, 7248932, 5171274, 1070349, -2896783, -6235274]
40101f235274l254214k537373J86220L583608M374606J230908l284735n271388
40093a1207642l376620K98798K739017K947640K424987L108923N099790O401633
40085H436526M760838q6422n536735p612385m341365J853603N988306N313362
40077H775728J429339k604459n342081o109670l799165P10944K995546j10626
40069d054444n026913n007214P61122N972185N840377K438862j62212j498232
40061g36469k549179j834095K295045P507735R266462N963213J36472m280157
40053A5769027m424395k28262M425251M347671j054068o455140p016099l740571
40045A623414n27170J078547J411222M153k968724m829078l531057o58270J873492
$$ y = [-6235274, -9489488, -12026861, -11840641, -8257033, -3882427, -2651519, -5936254, -11207642, -14584262, -14285464, -11546447, -8598807, -6173820, -3064897, 2034893, 8436526, 13197364, 13110942, 7574207, -38178, -4379543, -2525940, 3462366, 8775728, 10205067, 7600608, 2258527, -3851143, -7650308, -6939364, -3943818, -4054444, -9081357, -14088571, -13327449, -7355264, -1514887, 923975, 761763, -736469, -3285648, -5119743, -2824698, 4683037, 13949499, 19912712, 20049184, 15769027, 11344632, 11116370, 15541621, 19889292, 18835224, 12380084, 5363985, 1623414, 1096244, 2174791, 3586013, 3590166, 621442, -4207636, -7738693, -8396963, -6523471]
40036f523471N256499R844063J0876323L997643o506925j1124939o718056N16799
40028c82064L754673K113089j737334n166523n644357k029518K645278L711178
40020b735578J282834M9829J881163L465383K618757J560187J520899m70512n631035
40011C541927q865653n029441L249282Q667074Q040338L744103j490981o157173
40003E699476p512910l318929L048075M263040j593009o921163l365744P142058
39995b559106J3866535R684932j295341r552996j0499688o612391j844190J726083
39987g086162K308360j291909n923852n179659K299004Q995330P313330j84579
39979A249863m284168j566883K139792J122592k568895k951120J809336P558780
$$ y = [-6523471, -1266972, 8577091, 19453414, 23451057, 16944132, 5819193, -898863, -382064, 3372609, 5485698, 3748364, -1418159, -7062516, -9092034, -6446756, -2735578, -1452744, -1402915, 478248, 3943631, 6562388, 8122575, 9643474, 9172962, 3541927, -5323726, -10353167, -7103885, 1563189, 9603527, 13347630, 11856649, 5699476, -1813434, -5132363, -2084288, 2178752, 585743, -6335420, -9701164, -2559106, 11307429, 20992361, 19697020, 10144024, -355664, -6968055, -8812245, -7086162, -4777802, -6069711, -11993563, -17173222, -14874218, -5878888, 1434442, 1249863, -3034305, -4601188, -2461396, -1338804, -3907699, -6858819, -5049483, 2509297]
39971B509297Q843380M123929k796853o375116n106928k739360k675409l501482
39963g718542k459396n48836k32201m30198J271772L230979K182979j88289O00999
39954d290733L677317L631224k28776k624565j447715p37894k462805k839461
39946g323408N402J968855N64486l08585K131595L890092J539533r01647J239137
39937B805460M909421M516531J025533j001146j414982k319270j606155L258735
39929A0174127P596406M307989m585270r370943n953178l62811J106670n04277
39921B408713j132488K7564J260783J450666J66038k694112n778215o641568m039818
39912a4972437J000255N700028O503730K019158l625810l971001J008858L964624
$$ y = [2509297, 11352677, 15476606, 12679753, 6304637, 1197709, -1541651, -4217060, -7718542, -10177938, -10726774, -10958975, -11389173, -10117401, -6886422, -4703443, -4891732, -4290733, -613416, 3017808, 2789032, 164467, -1283248, -2021142, -4483947, -7323408, -7318006, -5349151, -4784665, -5093250, -2961655, 928437, 2467970, 1566323, 2805460, 7714881, 12231412, 13256945, 12255799, 10840817, 8521547, 6915392, 10174127, 17770533, 22078522, 17493252, 8122309, 2169131, 1806320, 2912990, 2408713, 1276225, 1303789, 2564572, 4015238, 4181276, 1487164, -4291051, -10932619, -14972437, -13972182, -8272154, -1768424, 250734, -3375076, -7346077, -6337219, -2372595]
39904b372595J228947j207068J791067M569390k45770q023112q256947j414061
39896a3930149K253366k8273p1798N579731Q857381L868670l190275m271954j136831
39887b070132K37027M6371J965867M880629M454143J70394m569192p038375o041203
39878g964471j275343M526831O091359J761115l849134o020343n085509l164714
39870a4980209n33581J934001J937387N58247K175679O128165N392939j554151
39862A058477n277783R64934R156768P508921j764108o327262k247055K492486
39854E565378K108113j33408m61139n48575k210746l531313k924780j280940J290843
39845b126567M980714O080772M25435p859467r014338j502583M781857K815047
$$ y = [-2372595, -1143648, -2350716, -559649, 4009741, 3763971, -4259141, -12516088, -13930149, -11676783, -11705056, -11776854, -6197123, 2660258, 6528928, 3338653, -933301, -2070132, -1833105, -1786734, 179133, 5059762, 9513905, 9684299, 5115107, -1923268, -7964471, -9239814, -4712983, 1378376, 3139491, -709643, -6729986, -11815495, -14980209, -15513790, -13579789, -11642402, -11084155, -8908476, -2780311, 2612628, 1058477, -4219306, -3254372, 5902396, 13411317, 11647209, 5319947, 3072892, 5565378, 7673491, 7540083, 7078944, 6530369, 4319623, 788310, -2136470, -3417410, -2126567, 2854147, 8934919, 9360354, 1500887, -7513451, -9016034, -4234177, -1419130]
39837a419130k006218j917405R97010J24911l369083k307732M428032R550332
39829D080717P618682J767094j358594M35182L556243L197554j593511o631593
39821A1071774o968296l067108n45557k502673n098951l447307J022437L086551
39813f449130J556375j88410n46016j342845k678291j337005L465155O946205
39805e73962M703234q52617l551072j500672J431597J692885R4643r32900j087549
39796e76413j326136j254153J99467K301462K867844R26429k534480n838961o691327
39787a1926268k175183P531033J5420159J2702963O0855j0652062r953681k166466
39779a158650J882513J13890l20156L651877O259654L336840q92984j776671j803129
$$ y = [-1419130, -3425348, -5342753, -4345743, -4220832, -7589915, -9897647, -5469615, 4080717, 11699399, 13466493, 12107899, 12543081, 16099324, 19296878, 17703367, 11071774, 4103478, 1036370, 490813, -2011860, -7110811, -10558118, -9535681, -6449130, -4892755, -5081165, -5627181, -6970026, -9648317, -10985322, -7520167, -573962, 4129272, 3276655, -274417, -1775089, -343492, 1349393, 1444036, 511136, -576413, -1902549, -3156702, -2957235, -655773, 2212071, 3138500, 604020, -5234941, -11926268, -14101451, -6570418, 8849741, 21552704, 21613559, 10961497, 1007816, -1158650, 723863, 837753, 517597, 4169474, 10429128, 13765968, 12872984, 11096313, 9293184]
39770I293184m267089n349670l20646O165498M831762m137403j0114669o284680
39762a0183713K217917O671729N125880J232835k047447l362492j227845M011983
39754B438847Q140789O675977L931p165357j0533413q942801m028785R42542L161239
39745i307031K835706K589526L471133L524281J274878k005196m841230p129947
39737i587880p376900k580274N754244R789123M734132l230187m513435R17533
39729f093644N196030N327085N497690O494979K924561n557294r794559m347614
39721c52766K531494N24482o647903o590615K895842J0511158P597174j322148
39713I146718o780655o020439k645464L6574J025337K76069j018979p72937J139436
$$ y = [9293184, 5026095, -323575, -644221, 5521277, 10353039, 6215636, -3899033, -10183713, -7965796, -1294067, 3831813, 5064648, 3017201, -345291, -1573136, 2438847, 10579636, 17255613, 17259544, 10094187, -439226, -9382027, -13410812, -12468270, -9307031, -6471325, -3881799, -410666, 3113615, 4388493, 2383297, -2457933, -9587880, -16964780, -19545054, -13790810, -4001687, 732445, -2497742, -7011177, -6093644, -897614, 4429471, 9927161, 16422140, 19346701, 13789407, 3994848, -352766, 2178728, 2703210, -3944693, -10535308, -7639466, 2871692, 10468866, 9146718, 2366063, -3654376, -6299840, -6263266, -5237929, -4961860, -5980839, -6753776, -5614340]
39704e614340K498137K655030L745481O013949N516235j39970o448662o551402
39696A674458q2631O098557N879598j4645n825126o526022j802016M053549O175711
39687I631433L978052J254462P04319L61485k418427n518113m476705K39095K907724
39678F663325Q31843j254120J713168O603671N584208k440847r145907p529755
39670A025586r60349K385088R17659j75262J151256P71667k965791m460546O10678
39661a700014P158176P262476J547208k761576k961970k579569k786266m00296
39653B778169M257956N524480J481977k138739j099665P83588r08652l256713
39645G422401j766344Q53235r27097n440383n884649j018406L442285L904782
$$ y = [-5614340, -3116203, -461173, 3284308, 9298257, 14814492, 14674522, 8225860, 1674458, 1591827, 7690384, 13569982, 13555337, 7730211, 1204189, -597827, 3455722, 9631433, 13609485, 14863947, 15568266, 15929751, 13511324, 7993211, 3516506, 3755601, 6663325, 7495168, 6241048, 7954216, 14557887, 20142095, 17701248, 8555341, 1025586, 65237, 2450325, 3367984, 3192722, 4343978, 5115645, 2149854, -2310692, -1700014, 5458162, 12720638, 14267846, 11506270, 8544300, 5964731, 3178465, 2778169, 7036125, 12560605, 14042582, 11903843, 10804178, 11587766, 10679114, 7422401, 5656057, 6509292, 5582195, 141812, -5742837, -6761243, -3318958, 585824]
39637E85824K586439J371279j449913n947868p461870k470045N476188R147963
39629A837997N816976k28227k976845j081133J489506Q07644k267191m166529
39621g67802m192063m525560m862711k146156K737978L924072j55855k532508
39613a2520605J672482O268791L542789k147323o73998O631854Q115563O98907
39605A1588460m776470j024710M347492J933157m475668n238323o91662Q84104
39597B546380k027985k102618L754477Q365521M808230l118300n870847q92863
39589E461995M423626K858478l104559m861502K24351M809640K012853m273698
39581G551184n014572J84706K407747k687643q144117o507164o34321J889164
$$ y = [585824, 3172263, 4543542, 3093629, -2854239, -10316109, -12786154, -7309966, 1837997, 7654973, 7426746, 4449901, 3368768, 4858274, 5665918, 3398727, -767802, -4959865, -9485425, -14348136, -16494292, -13756314, -9832242, -9988097, -12520605, -10848123, -4579332, -1036543, -3183866, -3857864, 2773990, 10889553, 11588460, 6811990, 5787280, 10134772, 12067929, 7592261, 2353938, 1662276, 2546380, 518395, -1584223, 2170254, 10535775, 15344005, 12225705, 6354858, 5461995, 9885621, 12744099, 9639540, 4778038, 5002389, 9812029, 11824882, 7551184, 2536612, 2721318, 5129065, 2441422, -5702695, -12209859, -12844180, -10955016]
39573a0955016J34747r97104K25988J215517J436816L085756N329926M187520
39565C664150m68757l257246r99209K415901K027152q07692r99199K221237M173604
39556G969941J608851l060814n692565n499270l905425q90432L721794O584634
39548H36714L451572l690812p132995l511954J355903J296343j329069q19821
39540i544119K003823K189871N5687O5809J653146n6957m125387l437491L627647
39531g567971R584346Q668404L547742j425229n456344o872355k703400L183290
39523I58483J624697o436518p074266N633524J6662776J0094453o720519j3562701
39515A179929o048036J954636J889728j38772J282862J953588q38135j485530
$$ y = [-10955016, -10820269, -11817373, -11591385, -10375868, -8939052, -5853296, -523370, 3664150, 3195393, -61853, -1061062, 1354839, 3381991, 2574299, 1575100, 3796337, 7969941, 9578792, 6517978, 825413, -4673857, -8579282, -9469714, -5747920, 836714, 4288286, 597474, -6535521, -10047475, -8691572, -7395229, -8724298, -9544119, -7540296, -5350425, -5294738, -5228929, -3575783, -3632740, -7758127, -11195618, -7567971, 2016375, 10684779, 14232521, 12807292, 7350948, 478593, -2224807, 958483, 2583180, -3853338, -10927604, -5294080, 11368696, 21463149, 14742630, 1179929, -4868107, -2913471, -1023743, -1162515, 120347, 2073935, 1235800, -249730]
39507b49730L143115O510810K941332k970740m167446j388135P35848J649976
39499F205030K522647J342915k971213n898251l282829J472568K501548Q01359
39491B693774J736492N048699M515219k054630q619918q763984l538309J069793
39483g912864J771936L06281m96958k2280J021204K252961K798600P94096l544964
39474c031988n776226k242564L234864L119347k362371m081890K439542R210532
39466E09246P076738j235705o552850o520297n038715k875972J363225L996577
39458i277753N79633m406936l070736K109176K013866k247992j12642R075863
39450e337521J2359857L718817n833925n911941j496493j091525k071020J320962
$$ y = [-249730, 2893385, 9404195, 12345527, 9374787, 5207341, 3819206, 4555054, 6205030, 8727677, 10070592, 7099379, 1201128, -2081701, -609133, 1892415, 2693774, 4430266, 9478965, 13994184, 11939554, 3319636, -5444348, -8982657, -7912864, -6140928, -5834647, -6331605, -6353885, -5332681, -3079720, -281120, 512976, -3031988, -8808214, -11050778, -7815914, -4696567, -7058938, -11140828, -8701286, 509246, 7585984, 6350279, -202571, -6722868, -11761583, -14637555, -13274330, -9277753, -8698120, -13105056, -16175792, -14066616, -12052750, -14300742, -14413384, -5337521, 7022336, 10741153, 4907228, -1004713, -2501206, -3592731, -5663751, -4342789]
39442d342789N279136L521751p16282j193717k57109k525934l692607J850812
39434b076739P823467M112583n698432q679006k449162K857980J888166k19091
39426b440234l57639k402569o669441o511894Q6991N789041N500306L449157L663124
39417A06842K274053m170622r964626p461447J231332O591254L687007l139330
39409a0845537o507090l480057K690762O455453N701917L339306K391620J758297
39401A504671m19577j976224N7737L550629L905852R56860k104258m426043o011725
39392d962078l648320L596057P803760J531654q130767p344875K508857N176800
39384c468912m721177j1813591l778378R201060J0702675K645557q64263L066155
$$ y = [-4342789, 936347, 4458098, 3741816, 2548099, 2290990, -234944, -3927551, -2076739, 5746728, 9859311, 4160879, -4518127, -6967289, -4109309, -2221143, -2440234, -2797873, -5200442, -11869883, -18381777, -18294786, -12505745, -7005439, -3556282, 106842, 2380895, -1789727, -11754353, -19215800, -17984468, -11393214, -7706207, -10845537, -17352627, -20832684, -18141922, -11686469, -5984552, -2645246, -253626, 1504671, 1085094, -891130, -833393, 2717236, 6623088, 7579948, 5475690, 1049647, -4962078, -8610398, -5014341, 2789419, 4321073, -3809694, -11154569, -8645712, -3468912, -8190089, -20003680, -23782058, -14580998, -3878323, -1232766, -2097029, 969126]
39376I69126M585381n4036l388114j474217m54627m504074p780688m180905K246871
39367a4035283L123174k089003n643706k074151N124082Q299632N045741O37048
39359a612466N01398K680029J421592k783625k879028L217546P507278L251670
39351A1304394m276915n443541o74420J339709j748073k470431L659130J0035556
39343A1725409Q027239j021717p811226o691503j091053K109072O06991j978466
39335C874746j747371L32143M87556j553848j784494J516888M390946L185728
39327H702294K74118l78335j84172k862063o366740m658102K271188O716650L736905
39318G251743k075986l472786q2622K734808J842706r67601l063354l915564l602727
$$ y = [969126, 5554507, 5500471, 2112357, 638140, 183513, -4320561, -12101249, -16282154, -14035283, -10912109, -13001112, -18644818, -20718969, -15594887, -7295255, -2249514, -1612466, -1111068, 1568961, 2990553, 206928, -2672100, 545446, 8052724, 11304394, 7027479, 1583938, 909518, 2249227, 501154, -1969277, 1689853, 11725409, 19752648, 18730931, 10919705, 4228202, 3137149, 5246221, 5853212, 3874746, 2127375, 2459518, 2947074, 1393226, -391268, 1125620, 5516566, 8702294, 8976412, 8598077, 8413905, 5551842, -814898, -5473000, -3201812, 3514838, 7251743, 5175757, 1702971, 1620349, 4355157, 6197863, 5230262, 2166908, -1748656, -5351383]
39309e351383j442372K201248M465178K755357j251753k935459j037031K07516
39301b388699k170721l867272R05343Q974819J0427500K658791m852062l724255
39293E963444J582717J181285n584232j0126225p228350p73887L021336K572397
39285i391515L78108o45233L23449J114523p72621l233460q15223O343499R863932
39276C165459M474090l064145l404840J502823K745231q71158k880598k024178
39268c57316l485975p020908n732828J012681M995982L139205K676132P143830
39260B370803Q630437J513376o351472n573668P0808J242726j485023j002777
39252e84790K436124K477308q94197j601595P92308L44619l898834n847608l227527
$$ y = [-5351383, -6793755, -4592507, -127329, 2628028, 1376275, -1559184, -2596215, -2388699, -4559420, -8426692, -7521349, 1453470, 11880970, 14539761, 9687699, 5963444, 7546161, 8727446, 3143214, -6983011, -14211361, -14985248, -11963912, -9391515, -9013407, -9658640, -9335191, -8220668, -8993289, -12226749, -13041972, -6698473, 3165459, 7639549, 4575404, 1170564, 2673387, 5418618, 4547460, 1666862, -357316, -3843291, -10864199, -16597027, -15584346, -10588364, -7449159, -4773027, 2370803, 11001240, 12514616, 6163144, 589476, 660284, 1903010, 417987, -584790, 1851334, 4328642, 3434445, 1832850, 2625158, 2969777, -929057, -6776665, -10004192]
39243a0004192j153281k140135j124604N303309J1568960J0241944K232140m630504
39235A0293637m754949L83270M658383K939429l749246q255032n009142K558399
39227i35251N881558K272388k527227l270490j465691r40113j940903k393923
39219e319652j437681P88275L836288N556005L380922j099800k608647L97381
39211C493091K637392n03608n901678p004398k609769K699700N038883M114286
39203A963899Q40736l828350p660535p934840m203984J284991N710890P048438
39195f778755M581607O3331k590109r79175K807298M510919K309499k227212o417591
39186d720188p873499n227922m0513L200209J818659j167172q60070K703362N140215
$$ y = [-10004192, -11157473, -13297608, -14422212, -9118903, 2450057, 12692001, 14924141, 10293637, 5538688, 5921958, 10580341, 13519770, 9770524, 1515492, -3493650, -935251, 4946307, 7218695, 4691468, 1420978, -44713, -984826, -2925729, -5319652, -6757333, -5969058, -2132770, 3423235, 6804157, 5704357, 3095710, 3493091, 6130483, 5626875, -274803, -7279201, -9888970, -7189270, -2150387, 1963899, 2804635, -1023715, -8684250, -16619090, -20823074, -19538083, -13827193, -6778755, -2197148, -2133817, -4723926, -5703101, -2895803, 1615116, 3924615, 1697403, -4720188, -12593687, -17821609, -17862122, -14661913, -12843254, -14010426, -14870496, -12167134, -7026919]
39177g026919M598374L568358L237565J098624l431778n765003k701880J376269
39169e046390M59983l088316j441990N545171P859914k04998r645399p749463
39161a3311488M027369J1507628O820206k349326n168591j817537J68962j661444
39153a784221l042146j420863Q33430J383267N17098j366647l878737m150231
39145a2909050M18137O290456O416214L07787m209919j796052L400682M784224
39137B702479J978064j575859m337704m914123P4764R504114J3574736M937260
39129B1943731q324389j0596363K10489R415559O042827l035125n127410p2831
39121A0456488J976044k947583p580359n056816J687193M819266J642214l361295
$$ y = [-7026919, -2428545, 1139813, 4377378, 5476002, 2044224, -3720779, -6422659, -5046390, -4586407, -7674723, -9116713, -3571542, 4288372, 4083374, -5562025, -13311488, -9284119, 2223509, 9043715, 6694389, 1525798, -291739, -122777, -1784221, -4826367, -6247230, -5413800, -4030533, -3513435, -4880082, -8758819, -12909050, -12490913, -6200457, 215757, 523544, -3686375, -5482427, -2081745, 2702479, 4680543, 3104684, -1233020, -6147143, -6072379, 3431735, 17006471, 21943731, 13619342, 3022979, 3233468, 12649027, 18691854, 15656729, 10529319, 10456488, 12432532, 9484949, 1904590, -3152226, -1465033, 3354233, 4996447, 1635152]
39113A635152m659937j505176K062496J987853j291191l415897j343243K986628
39105c543315N183198L705896J050276j04549j85360j396831m059464n579405
39097d929554l552984P39711L229421J869205p92439j041245J241275L088618
39089a47992K677930O09165k260638n172989n964309k856622J884311M000150
39081g230994L676565N261470Q983891Q615924J048066p160440q334792m540728
39073C18962l079646m247015j959265M217038O627249J235126n826649p081951
39065i796151l121813R09599L168240M725040N269297M222761L452170M228356
39057A3057499L656102j299932p927803j0472751p603562k868562J242542M926757
$$ y = [1635152, -3024785, -4529961, -2467465, -479612, -1770803, -5186700, -6529943, -3543315, 1639883, 5345779, 6396055, 6291506, 6106146, 4709315, 649851, -4929554, -8482538, -7742827, -4513406, -2644201, -3436640, -4477885, -3236610, -147992, 2529938, 3139103, 878465, -4294524, -10258833, -13115455, -11231144, -7230994, -3554429, 1707041, 10690932, 19306856, 20354922, 13194482, 4859690, 318962, -2760684, -7007699, -8966964, -4749926, 1877323, 3112449, -2714200, -9796151, -12917964, -12008365, -8840125, -4115085, 1154212, 5376973, 8829143, 13057499, 16713601, 15413669, 7485866, -2986885, -10590447, -13459009, -12216467, -7289710]
39049g289710P178224N526644P85941k447355k010123j237132l382385n988787
39041h864683m119542K258112P438418O729982J658144k751778m367264n252969
39033g271580o398041m400606L184055J0905634R575540j086453r622952o750424
39025a1864827K502795O360750K517349q16513J266608M171995L081323M74635
39017G694115L32736R26860j403294n259678o084080k726548J938483N085829
39009E04423N392587K550293j559390l343765j980815q49751j712116j109360
39001b107894L358508O973845L963251k959439n748978k539839P82256M57857
38993B179567n83497N74299J858915N75423k107696l737630l860765k708527k57934
$$ y = [-7289710, -111486, 5415158, 6201099, 3753744, 1743621, 506489, -2875896, -8864683, -12984225, -10726113, -3287695, 3442287, 5100431, 2348653, -2018611, -7271580, -13669621, -18070227, -14886172, -3980538, 5595002, 4508549, -5114403, -11864827, -9362032, -3001282, -483933, -1300446, -33838, 4138157, 7219480, 7694115, 8026851, 8953711, 7550417, 2290739, -3793341, -6519889, -4581406, 504423, 5897010, 8447303, 6887913, 3544148, 1563333, 713582, -998534, -2107894, 1250614, 8224459, 12187710, 9228271, 3479293, 939454, 1721710, 2179567, 1596070, 2170369, 4029284, 4604707, 2497011, -1240619, -5101384, -7809911, -8067845]
38984h067845J833230J312314l01497R55874M307496L993773j269114m810880
38976b046649k002874K468953K811452J565579L406077M707653q57849r077048
38968I75294q842236L64178N791586M110p807394n695618L587821P767186L172862
38959f82211j858569p14127L219321M004312J876516N32115K74820j260263l625382
38950A766532l494205r3892K956573K466494j98953j546551o95006N52614J194294
38941B907900J699406J448761j061396m388047m077668Q95343M589601J148807
38933C162707o171837p984069j005550P444208Q887119L632988j324225j274369
38925E366972K488448N861095N617940R94172n539282r486704q456467m733769
$$ y = [-8067845, -6234615, -4922301, -5223798, -4267924, 39572, 4033345, 2764231, -2046649, -4049523, -1580570, 1230882, 2796461, 6202538, 10910191, 10052342, 975294, -7866942, -7502764, -1711178, -1707068, -9514462, -15210080, -11622259, -3855073, -682211, -2540780, -3254907, -35586, 3968726, 5845242, 6377357, 6652177, 5391914, 1766532, -1727673, -1821565, 1135008, 3601502, 3402549, 1855998, 1160992, 1713606, 2907900, 4607306, 6056067, 4994671, 606624, -3471044, -2575701, 2013900, 3162707, -3009130, -10993199, -11998749, -4554541, 4332578, 7965566, 6641341, 5366972, 7855420, 13716515, 19334455, 20328627, 14789345, 5302641, -3153826, -7887595]
38917g887595k239869j909156j824069o78977J215700L443696N454485N619618
38909A193833K916746p02320k099252r64099L10495M20717O5168o64052k375381
38900a898145l429051p33424M890837P664896L880708k534907m590204q78625
38892B372085L343954L039285j344072n465939n948221l375875j512495l148391
38884a2039669o012778m378038L473448J1121920J0581731K418052m455898l813105
38876c104337Q38362K436656L11789j47691L375012O097268L036256l298913n611104
38867C933298j403129L696651L410206j165386l751510j683699J212668J007291
38859E256390q43196p63960J003530J418803J69229j34321P37424k04894l119467
$$ y = [-7887595, -10127464, -12036620, -13860689, -14539666, -13323966, -9880270, -4425785, 1193833, 4110579, 3408259, 1309007, 344908, 655403, 1076120, 1141288, 477236, -1898145, -5327196, -6060620, -1169783, 6495113, 10375821, 7840914, 3250710, 2372085, 5716039, 8755324, 7411252, 1945313, -4002908, -7378783, -8891278, -12039669, -18052447, -22430485, -18957037, -7835117, 2746614, 5164666, 708768, -3104337, -2265975, 170681, 482470, 334779, 3709791, 9807059, 12843315, 9544402, 3933298, 2530169, 6226820, 9637026, 8471640, 4720130, 3036431, 4249099, 5256390, 4413194, 3649234, 4652764, 6071567, 6240796, 6106475, 6843899, 6639005, 3519538]
38850C519538l105420K352017P376029M627045l385255o366751m93888N799992
38842A0323307L742546l407725n686467j016247K679524j35709n054301n213374
38834c768446j002275J930148J032676j380543k959692l362977j882184K666349
38826h726944Q501142J0412763M962912m690486j0560511p059041K999830J0007895
38818E847560O928726k705160q622937o169815r57328N78496j21077R18206J433021
38809b870308k656022p157236l711909O154451J1142634O586595R01614J353044
38801I742863L037240j004008o923959o484115p25422K416553P33764j211674
38793d18758j330522j299435k14705L910541P118434L436632l973962n406304
$$ y = [3519538, 414118, 2766135, 10142164, 14769209, 11383954, 5017203, 4523315, 10323307, 14065853, 10658128, 4971661, 3955414, 6634938, 6499229, 1444928, -3768446, -4770721, -2840573, -1807897, -3188440, -6148132, -9511109, -11393293, -8726944, -225802, 10186961, 15149873, 10459387, -101124, -7160165, -4160335, 5847560, 12776286, 10071126, 1448189, -4721626, -5678954, -5100458, -5221535, -4303329, -2870308, -5526330, -12683566, -16395475, -10241024, 901610, 7488205, 8389819, 9742863, 12780103, 11776095, 4852136, -1631979, -2357401, 59152, 792916, -418758, -1749280, -3048715, -3263420, 647121, 7765555, 11202187, 7228225, 1821921]
38785A821921K14272K908595k296504o932847k526466N964879P806774J802094
38777H762718m079790n099371m238570n165514o525469m160055L520645J2452913
38769d532493J5031056P785874k876450o775644k491505J624405K59178k184809
38761E839612r81226P34373r61161k555481L11000L602067J035344m549768n274786
38752b800026j015056J404588K78880M49109K824168K456808j381391k706752
38744d89672N92538K347045j472156n518293l648837J244075J986960k257864
38736g216204n707432m013790J647367O891767P612751L085482k219633k396985
38728b316677K375361N226474J833299l325034l352301J417956M280503J068854
$$ y = [1821921, 2036193, 4944788, 2648284, -4284563, -6811029, -846150, 6960624, 8762718, 4682928, -416443, -4655013, -9820527, -16345996, -20506051, -16985406, -4532493, 10498563, 18284437, 15407987, 8632343, 6140838, 7765243, 8024421, 5839612, 4858386, 5592759, 4631598, 2076117, 2387117, 5989184, 7024528, 2474760, -2800026, -3815082, -2410494, -2131614, -1682505, 1141663, 3598471, 2217080, -489672, 102866, 2449911, 977755, -4540538, -8189375, -6945300, -4958340, -7216204, -12923636, -16937426, -15290059, -8398292, -785541, 2299941, 80308, -2316677, 58684, 5285158, 7118457, 3793423, 441122, 1859078, 6139581, 7208435]
38720G208435n405907r117984o526709O39050O423383N710431j16064m197635
38712e383000k416227J707463K510962L7610j089660Q52330K513319J242972m03540
38703d27771J829823P186989R391477M150197m359496p598209l641205K7962k607164
38694C952603o758893m034314L846533O456329o1492p303365o954186j607940
38686a2464725J195534j65332j995171k360560j685346P94662N427224Q668153
38678b585561O359370k23040n588459o556041m216547m99667L617275O909205
38670b783465P900077O190228K425069k163796n444931n717132m227945l595664
38662g417559l082664M54056N806189P126329K871159j013579n15840L56657k012564
$$ y = [7208435, 1802528, -7315456, -13842165, -13203115, -6779732, -1069301, -1185365, -5383000, -7799227, -6091764, -3580802, -3543192, -4632852, -3780522, -1267203, -24231, -427771, 1402052, 8589041, 17980518, 22130715, 17771219, 10173010, 6531805, 6559767, 3952603, -2806290, -6840604, -2994071, 3462258, 3400766, -3902599, -10856785, -12464725, -11269191, -11434523, -13429694, -15790254, -17475600, -16680938, -11253714, -2585561, 3773809, 3550769, -2037690, -8593731, -12810278, -13309945, -9692670, -2783465, 5116612, 11306840, 13731909, 11568113, 6123182, 406050, -3821895, -7417559, -10500223, -10046167, -4239978, 2886351, 5757510, 4743931, 4228091, 4584748, 2572184]
38653B572184l283753P55717M759542J581730n183484o405531j832297J225863
38645e810029J211569K781518M965840J511115n583284n714862L156043Q982453
38637E500363L462797n196935n417348N33946K099628k618883n585340k067172
38629i288944L473529M683108O82713m169117m488352J322687Q230171Q798822
38621I244617K380825l403635l003396l07232j747523o489951q767797o528535
38613a8622627k130009K749984O988240P171750J497826m554462l108043N178960
38605d828381J0947859Q146821J114251k289062m10405K114601J380741j689766
38597A4486659l703951l271520k109771j746166p39142K534294N217003K338456
$$ y = [2572184, -711569, 44148, 4803690, 6385420, 1201936, -5203595, -7035892, -5810029, -4598460, -1816942, 3148898, 4660013, -923271, -6638133, -3482090, 5500363, 8963160, 3766225, -1651123, -1117177, 982451, -1636432, -7221772, -9288944, -5815415, -1132307, -449594, -4618711, -9107063, -7784376, 445795, 9244617, 11625442, 8221807, 5218411, 4911179, 3163656, -3326295, -12094092, -18622627, -20752636, -18002652, -11014412, -3842662, -2344836, -6899298, -10007341, -4828381, 6119478, 14266299, 15380550, 13091488, 12681083, 14795684, 16176425, 14486659, 10782708, 7511188, 5401417, 3655251, 2916109, 5450403, 10667406, 13005862]
38589A3005862n118565r354062n895352r3213Q46188j757019j544949J898032
38581h013078K840785l94584k335250P56421M869705M382497K06815j905629P35670
38572A143352M652451M684670j19919n541456o945986m538987k555125l027074
38564a2248074k942481O06471N091447N717719K427470j07690O89035J950188
38556A184085j95376m986945p162158k547497O459232J1823651Q326194N08421
38548A3409607k491057Q99847L104739m86055m721855m134102k111093l871367
38540d01336o276994l389123K148485L015052m01374j834233j350366m200768
38532a2690657p923988l478716Q307303J4106341P004383l229775n295947j524050
$$ y = [13005862, 7887297, -1466765, -7362117, -7455330, -6609142, -8366161, -9911110, -8013078, -5172293, -5566877, -7902127, -7145706, -2276001, 2106496, 2313311, 407682, 1143352, 5795803, 10480473, 10360554, 4819098, -2126888, -6665875, -9221000, -12248074, -15190555, -14584084, -9492637, -3774918, -1347448, -1455138, -766103, 1184085, 988709, -3998236, -11160394, -13707891, -7248659, 4574992, 12901186, 13409607, 10918550, 11818397, 14923136, 14437081, 9715226, 5581124, 3470031, -401336, -6678330, -10067453, -7918968, -4903916, -5305290, -7139523, -8489889, -12690657, -20614645, -24093361, -15786058, -1679717, 5324666, 2094891, -3201056, -4725106]
38524d725106k3501r07788R4028J445170n36594k828340l46988M202338M348056
38515G21275P09740j121076q62647k422583m486771j953543L920569O283582L858356
38506D646902K327984L863017M374205K598751K499784M031043J085578p066654
38498A8360610j1383799o161586J293800J498400l123198l685079J25606L84673
38490b690573n058952q543721m430894K614475M894401K065443j95119J016157
38482a0328783K984838K681868R52306R8936j59489j772208m214860m245060p30809
38473a4733261K892287L150737J515836J837452M120799M599812J666257k200870
38465B849049m789589o392416o693582l700549K088819O173448N461757K321674
$$ y = [-4725106, -4748607, -5656395, -5562367, -4117197, -4653791, -7482131, -7829119, -3626781, 721275, 1431015, 309939, -552708, -2975291, -7462062, -9415605, -5495036, 788546, 4646902, 6974886, 10837903, 15212108, 17810859, 20310643, 24341686, 25427264, 18360610, 6976811, 815225, 2109025, 3607425, 484227, -3200852, -3075246, -2690573, -7749525, -16293246, -20724140, -18109665, -13215264, -11149821, -11344940, -10328783, -7343945, -4662077, -3709771, -3610835, -3770324, -5542532, -9757392, -14002452, -14733261, -11840974, -8690237, -7174401, -5336949, -1216150, 3383662, 5049919, 2849049, -1940540, -8332956, -15026538, -18727087, -16638268, -10464820, -5003063, -2681389]
38457b681389O74194Q35012Q52638R4709j413611m272395p004677n237510K083931
38448a6069098Q381098O615066q94539n378320l456458j33285J94449n30287Q21704
38439a0449670L031836L190547J137764j558584m053547n198351k983061K238164
38431a4644902O277530N587511J581441j596807j936542l80916J333750J753820
38423b025115L44981j306346p65124J505611K173331K18508j189201q8208Q16872
38414c14691p58338k101323m12623J372449o79801l901037k931443P23322Q93297
38405h110188k026437q75544N547752Q555311K700923m945028m916914J192920
38397b877205M630406K574431n10473k060699l747191n252178l624653J03359
$$ y = [-2681389, -2007195, -1172183, -319545, -224836, -1638447, -5910842, -12915519, -18153029, -16069098, -7688000, -1072934, -1967473, -7345793, -10802251, -10935536, -10741087, -11271374, -10449670, -7417834, -4227287, -3089523, -4648107, -8701654, -13900005, -16883066, -14644902, -8367372, -2779861, -1198420, -2795227, -4731769, -5112685, -3778935, -2025115, -1680134, -2986480, -3751604, -2245993, -72662, 145846, -1043355, -1131563, -314691, -1073029, -3174352, -3586975, -2214526, -2894327, -6795364, -9726807, -9003485, -8110188, -10136625, -11012169, -5464417, 3090894, 5791817, 846789, -4070125, -2877205, 1753201, 4327632, 3817159, 1756460, -1990731, -7242909, -10867562, -10764203]
38389a0764203Q84371j519212m78194O864018J2738522Q301711l453604j0673114
38381A900295p480124p7864K689840j36001l024106k419831j01748R34742O63094
38372g051703J194714L397213N476052M615932p6954n712258p128268j965426
38364g250698N405602P219935J169090n978063o114056K12694M872232K710147
38356B246883k856587n403653k693693L299777R699317J3310059J1090299L623937
38348C2316339l730945o212727m565219k164327M6068K241823K333239q72743
38340A9391508l050838P74769P149490O888212j647962q730593o204946J474466
38332A6044106M216061J49919l718254k784433k21088l54491k100857j734185
$$ y = [-10764203, -9879832, -11399044, -11877238, -5013220, 7725302, 16027013, 12573409, 1900295, -5579829, -5657693, -2967853, -3103854, -6127960, -8547791, -8649539, -7714797, -7051703, -5856989, -2459776, 3016276, 7632208, 7555254, 1842996, -5285272, -7250698, -1845096, 5374839, 6543929, 565866, -5548190, -5335496, -463264, 2246883, -609704, -6013357, -8707050, -5407273, 4292044, 17602103, 28692402, 32316339, 28585394, 22372667, 17807448, 15643121, 15689189, 17931012, 20264251, 19391508, 16340670, 17115439, 24264929, 31153141, 29505179, 20774586, 14569640, 16044106, 20260167, 20410086, 16691832, 13907399, 13686311, 13331820, 11230963, 9496778]
38324I496778J112988L562813M175124M251189M359356K508135k514409p818609
38316A9133365r018463n646531j390310J068690K420329L280094K152492r90539
38308A1009127k707376j117910J05691k837056o961682o462895k077187j18832
38300a1168120k145589k321147K917912Q519215P655463P66757n784163p294279
38292h853951m126405J45825J722407l45735k694429j426544K273473L671411
38284i633948J876353Q83945K060089J328406l366241p336162n854144q32078
38276b0873780L395598O335450Q694443Q156005L604524l11116P61711L312593
38268A3075428J199616l919539m698935L73054M731469L375068j372611m617853
$$ y = [9496778, 10609766, 14172579, 18347703, 22598892, 26958248, 29466383, 26951974, 19133365, 10114902, 4468371, 3078061, 4146751, 6567080, 9847174, 11999666, 11009127, 8301751, 7183841, 7289532, 4452476, -2509206, -8972101, -11049288, -11168120, -13313709, -15634856, -12716944, -4197729, 3457734, 4224491, -1559672, -8853951, -12980356, -12834531, -11112124, -11457859, -14152288, -15578832, -13305359, -9633948, -7757595, -6873650, -4813561, -3485155, -6851396, -14187558, -20041702, -20873780, -17478182, -11142732, -2448289, 5707716, 9312240, 9001124, 9762835, 13075428, 14275044, 10355505, 5656570, 6029624, 10761093, 14136161, 12763550, 8145697]
38260H145697m380354j583005J271803J335686r77579q37767M108678P900212
38252A4983371L735350m323175n361738K251164P543176K569118o603024r209677
38244E584565l834468K395723M230748K277576p95785l044458l372006k246707
38236A195188j340044n49486K444558P424588R149774L167424p197393j3106910
38228A187699r631165p80290N349162N160178K246178J534196K468255P36936
38220H271149l634684m852864m47121L457010R26971m336897n198636k787493
38212h602565l134937m817266r66302O641722P707167L10810m413531K55953O036219
38203i82730M129545k78787J768972O741694M717059l530267p923592n076854
$$ y = [8145697, 3765343, 2182338, 3454141, 4789827, 3812248, 2974481, 7083159, 14983371, 18718721, 14395546, 9033808, 11284972, 18828148, 21397266, 14794242, 5584565, 1750097, 4145820, 8376568, 10654144, 9858359, 6813901, 3441895, 1195188, -144856, -694342, 1750216, 9174804, 18324578, 21492002, 14294609, 1187699, -8443466, -9223756, -3874594, 1285584, 3531762, 5065958, 7534213, 8271149, 4636465, -216399, -663520, 2793490, 3720461, -616436, -5815072, -8602565, -11737502, -16554768, -17521070, -10879348, -3172181, -2861371, -7274902, -7018949, -982730, 3146815, 2868028, 4637000, 11378694, 16095753, 12565486, 4641894, -434960]
38195d34960j363965p25020j02136K118044K640499K65432j465978p21403J34325
38186C44838L3391Q27278K129934J079184j255018m4986M542074N695163L85439
38177A3737297m965813l701515J452638L130976j70767l736353m439520l681829
38169b374886l157145k014746Q40288M066478M882218K384338p06100n27279L118467
38160F511633N906397M526046J266584K96673J136814m270l303248m786190l095480
38151H454959j612844k307463k438105L341J934646j60191m372963n940968l642722
38142a0082310j66324K553489N027897P584357Q684322O492990J211123m290263
38134A7015281o364323m163795j086255r18593k776130k430878J144706L921847
$$ y = [-434960, -1798925, -2523945, -2626081, -508037, 2132462, 2397894, 931916, 210513, 344838, 378229, 1205507, 3335441, 4414625, 3159607, 3114621, 7656695, 13351858, 13737297, 8771484, 5069969, 6522607, 9653583, 9482816, 5746463, 1306943, -2374886, -5532031, -7546777, -6706489, -2640011, 2242207, 4626545, 3920445, 3393166, 6511633, 12418030, 16944076, 18210660, 18507333, 19644147, 19639877, 16336629, 11550439, 8454959, 6842115, 4534652, 2096547, 2099888, 4034534, 3874343, -498620, -6439588, -10082310, -10248634, -7695145, -2667248, 4917109, 13601431, 20094421, 21305544, 17015281, 10650958, 6487163, 5400908, 4482315, 1706185, -724693, 420013, 4341860]
38126D341860K854798M47748O29826K427442J264877l949601q145013n801793
38118e929856J838301P082638M366615k462533m303481J041810N014185J60217
38110F807896p985228p535569K516855R753542N056088n411051r447363m566871
38102a0811701J394332K230760k88613j348907O65783L801616N422396M296178
38094E361844R62369l398468p972195j1037712q819360O38023J1856722J4852909
38086B444132O509611m535952p764603k626381L094760M006783J608905m26707
38078B310548p00854L42115J801797K595757K245464J346731K82382j134069j723039
38069G366832N34665L995124L051963l859660r376374n807242L506626P790094
$$ y = [4341860, 7196658, 7644406, 8274232, 10701674, 11966551, 8016950, -128063, -5929856, -4091555, 2991083, 7357698, 4895165, 591684, 1633494, 6647679, 6807896, -1177332, -8712901, -6196046, 3557496, 8613584, 3202533, -6244830, -10811701, -9417369, -7186609, -7475222, -8824129, -8158346, -4356730, 1065666, 5361844, 6324213, 2925745, -5046450, -16084162, -24903522, -24265499, -12408777, 2444132, 8953743, 4417791, -3346812, -5973193, -2878433, 1128350, 2737255, 2310548, 1609694, 1951809, 3753606, 6349363, 8594827, 9941558, 10223940, 9089871, 7366832, 7901497, 11896621, 14948584, 11088924, 1712550, -4094692, -588066, 7202028]
38061G202028L192147l120614m255430k375874l012106n761359n453329k12485
38053a3797022N917287Q049687N554049J912697P84214K353348L343956R31359
38045A5049575l788360p118652o876142l867349j77873K095874J326690j866982
38037e223219l808311j443390L411622O203493N563160L925150K750759J177689
38029A2556953n19521p68509p23471l272883o531612m350745L515619Q027168
38021G932999K954694n128688o123022j388264l74140m481343n010799J651051
38013i967512P577109O316858K623287K371999J407512n766170j2462817p444467
38005a5344201O145266J2482465N325520l540150k577659L873274N495814K191971
$$ y = [7202028, 10394175, 7273561, 3018131, 642257, -2369849, -8131208, -13584537, -13797022, -7879735, 169952, 5724001, 7636698, 8420912, 10774260, 14118216, 15049575, 11261215, 4142563, -2733579, -6600928, -6778801, -4682927, -3356237, -5223219, -9031530, -10474920, -7063298, -859805, 4703355, 8628505, 11379264, 12556953, 12037432, 11268923, 10545452, 7272569, 740957, -3609788, -94169, 7932999, 10887693, 5759005, -364017, -1752281, -2126421, -6607764, -11618563, -9967512, -2390403, 3926455, 6549742, 8921741, 10329253, 4563083, -7899734, -15344201, -9198935, 3283530, 8609050, 5068900, 2491241, 6364515, 11860329, 14052300]
37997A4052300O71371J433577R5219k095925l02303K813168q15351j0573439j5429295
37988a0150678q968710K507413R963125J1607312R445661L959802k976893o732645
37980H654387o338753o156533p136097l963419L957888P449530J394123m511827
37972f650701N72325J0431547R916409j963434j0481713o804142J544241M467622
37964A032154K155963n47576k951088n297373m002388K753173R160585P998780
37956A0302230L05662o172635o606772l145456l46612J00647r7439J085545L076223
37947a498607L480549K078311J877915M306010O070677M011167Q5513k656373
37939A7755162n369743q826004p811261J146447R650107O340883m928205q605265
$$ y = [14052300, 14723671, 16157248, 16252467, 14156542, 13854239, 16667407, 15852056, 5278617, -10150678, -19119388, -16611975, -6648850, 4958462, 14404123, 18363925, 15387032, 8654387, 2315634, -3840899, -10976996, -14940415, -10982527, -3532997, -2138874, -6650701, -6078376, 4353171, 14269580, 12306146, 1824433, -4979709, -3435468, 1032154, 3188117, 2640541, -310547, -5607920, -9610308, -6857135, 2303450, 10302230, 10607892, 4435257, -2171515, -5316971, -5663583, -5562936, -5660375, -4574830, -1498607, 1981942, 4060253, 5938168, 10244178, 16314855, 20326022, 20411535, 17755162, 12385419, 3559415, -4251846, -3105399, 6544708, 12885591, 7957386, -647879]
37931f47879q00929M730248j068689q191259m471508N042227P361165J586570
37923C539946k939643k791066k379822l141354k198674P4648J005227K182403
37915f648335N892259P594499J878972o380577p487090j903499J394522L79392
37907e279857J347938M571063K262039n944956q779884n75049Q640842P722263
37899C964399j69517m572886k540778J469857M297282N003856K222594k428228
37891G246579l014018K136322N553532J159417n533561n592203l28187K150727
37883C778608N05704M22589K979222K784471j674309m683460k276379K572243
37875D408689N743893O724633N623732J454238m076001o231054l439147L87010
$$ y = [-647879, -1448808, 3281440, 2212751, -5978508, -10450016, -5407789, 1953376, 3539946, 600303, -2190763, -4570585, -7711939, -9910613, -9835965, -8830738, -6648335, -756076, 6838423, 8717395, 2336818, -5150272, -7053771, -5659249, -5279857, -3931919, 639144, 2901183, -3043773, -11823657, -12398706, -3757864, 3964399, 3794882, -778004, -3318782, -1848925, 2448357, 7452213, 9674807, 7246579, 4232561, 6368883, 11922415, 13081832, 7548271, 1956068, 1627881, 3778608, 4284312, 4706901, 7686123, 10470594, 8796285, 4112825, 1836446, 4408689, 10152582, 16877215, 22500947, 23955185, 19879184, 13648130, 10208983, 10595993]
37867A0595993J879656K282513L197367K687628j064085n523066o749438m605927
37859B700641k250037j800041k557384k525844m65846K633496L928239K079951
$$ y = [10595993, 12475649, 14758162, 17955529, 20643157, 19579072, 14056006, 7306568, 2700641, 450604, -1349437, -3906821, -6432665, -6898511, -4265015, -336776, 1743175]
$$ [...]
##END NTUPLES=NMR SPECTRUM
##END=
