##TITLE=31Pdec_SR1516_TFA
 CDCl3, 124 sc
 28.7.2020
##JCAMPDX= 6.0         $$ Bruker NMR JCAMP-DX V2.0
##DATA TYPE= NMR SPECTRUM
##DATA CLASS= NTUPLES
##ORIGIN= UXNMR, Bruker Analytische Messtechnik GmbH
##OWNER= root
$$ XWIN-NMR		Version 3.5
$$ Tue Jul 28 10:08:09 2020 Russian Standard Time (UT+4h)  she@DPX200
##.OBSERVE FREQUENCY= 81.013821
##.OBSERVE NUCLEUS= ^31P
##.ACQUISITION MODE= SIMULTANEOUS
##.ACQUISITION SCHEME= undefined
##.AVERAGES= 124
##.DIGITISER RES= 17
##SPECTROMETER/DATA SYSTEM= spect
##.PULSE SEQUENCE= zgpg30
##.SOLVENT NAME= CDCl3
##.SHIFT REFERENCE= (INTERNAL, CDCl3, 0, 182.463)
##AUDIT TRAIL= $$ (NUMBER, WHEN, WHO, WHERE, WHAT)
$$ ##TITLE= Audit trail, XWIN-NMR		Version 3.5
$$ ##JCAMPDX= 5.01
$$ ##ORIGIN= Bruker BioSpin GmbH
$$ ##OWNER= she
$$ F:/spectra/data/she/nmr/P31/1/pdata/1/auditp.txt
$$ ##AUDIT TRAIL=  $$ (NUMBER, WHEN, WHO, WHERE, WHAT)
(   1,<2020-07-28 10:07:09.78 +0400>,<she>,<DPX200>,
      <continue with go, POWCHK disabled, PULCHK disabled
       configuration hash MD5:
       00 E9 B6 7A A2 85 ED C7 34 08 36 98 17 FE 4E 26
       data hash MD5: 32K
       25 07 AA 65 83 C7 03 9F C1 94 F2 AF F5 5D E9 38>)
(   2,<2020-07-28 10:07:12.09 +0400>,<she>,<DPX200>,
      <Start of raw data processing
       efp BC_mod = 2 LB = 1 FT_mod = 6 PKNL = 1 PHC0 = -3084.32 PHC1 = 1006.602 SI = 64K 
       data hash MD5: 64K
       31 85 A0 04 19 36 89 8A EF 7B EE C8 27 57 E5 C4>)
(   3,<2020-07-28 10:07:38.14 +0400>,<she>,<DPX200>,
      <pk PHC0 = -61.94192 PHC1 = 114 
       data hash MD5: 64K
       67 4B 17 B9 86 AF E1 C2 D1 2E B3 81 28 71 94 E3>)
(   4,<2020-07-28 10:07:42.18 +0400>,<she>,<DPX200>,
      <abs ABSG = 5 
       data hash MD5: 64K
       8E FF 8F 32 D1 10 D5 C8 EA F4 AA 11 BF 42 D8 97>)
$$ ##END=
$$ 
$$ hash MD5
$$ 1E CF 02 4E 2A 77 A9 7A 6E E7 D5 5C 32 A9 89 CA
##$RELAX= 
##$RELAX= 
##$RELAX= 
##$RELAX= 
##$RELAX= 
##$RELAX= 
##$RELAX= 
##$RELAX= 
$$ Bruker specific parameters
$$ --------------------------
##$DU= <F:/spectra>
##$EXPNO= 1
##$NAME= <P31>
##$PROCNO= 1
##$TYPE= <nmr>
##$USER= <she>
##$AMP= (0..31)
100 100 100 100 100 100 100 100 100 100 100 100 100 100 100 100 100 100 
100 100 100 100 100 100 100 100 100 100 100 100 100 100 
##$AQSEQ= 0
##$AQ_mod= 1
##$AUNM= <au_zg>
##$AUTOPOS= <>
##$BF1= 81.014009
##$BF2= 200.13
##$BF3= 200.13
##$BF4= 200.13
##$BF5= 200.13
##$BF6= 200.13
##$BF7= 200.13
##$BF8= 200.13
##$BYTORDA= 1
##$CFDGTYP= 0
##$CFRGTYP= 5
##$CHEMSTR= <none>
##$CNST= (0..31)
1 1 145 1 1 1 1 1 1 1 1 1 1 1 1 1 1 1 1 1 1 1 1 1 1 1 1 1 1 1 1 1 
##$CPDPRG= <waltz16>
##$CPDPRG1= <>
##$CPDPRG2= <waltz16>
##$CPDPRG3= <>
##$CPDPRG4= <mlev>
##$CPDPRG5= <mlev>
##$CPDPRG6= <mlev>
##$CPDPRG7= <mlev>
##$CPDPRG8= <mlev>
##$CPDPRGB= <>
##$CPDPRGT= <>
##$D= (0..31)
0 1 0 0 0 0 0 0 0 0 0 0.03 2e-05 3e-06 0 0 0 0 0 0 0 0 0 0 0 0 0 0 0 0 
0 0 
##$DATE= 1595916200
##$DBL= (0..7)
120 120 120 11 120 120 24 19 
##$DBP= (0..7)
150 150 150 150 150 150 150 150 
##$DBP07= 0
##$DBPNAM0= <>
##$DBPNAM1= <>
$$ [...]
##$SUBNAM3= <"">
##$SUBNAM4= <"">
##$SUBNAM5= <"">
##$SUBNAM6= <"">
##$SUBNAM7= <"">
##$SUBNAM8= <"">
##$SUBNAM9= <"">
##$SW= 369.568048894756
##$SWIBOX= (0..15)
0 1 3 0 0 0 0 0 0 0 0 0 0 0 0 0 
##$SW_h= 29940.119760479
##$TD= 32768
##$TD0= 1
##$TE= 0
##$TE2= 300
##$TE3= 300
##$TEG= 300
##$TL= (0..7)
0 120 53 12 22 120 120 120 
##$TP= (0..7)
150 150 150 150 150 150 150 150 
##$TP07= 0
##$TPNAME0= <>
##$TPNAME1= <>
##$TPNAME2= <>
##$TPNAME3= <>
##$TPNAME4= <>
##$TPNAME5= <>
##$TPNAME6= <>
##$TPNAME7= <>
##$TPOAL= (0..7)
0.5 0.5 0.5 0.5 0.5 0.5 0.5 0.5 
##$TPOFFS= (0..7)
0 0 0 0 0 0 0 0 
##$TUNHIN= 0
##$TUNHOUT= 0
##$TUNXOUT= 0
##$USERA1= <user>
##$USERA2= <user>
##$USERA3= <user>
##$USERA4= <user>
##$USERA5= <user>
##$V9= 5
##$VALIST= <valist>
##$VCLIST= <CCCCCCCCCCCCCCC>
##$VD= 0
##$VDLIST= <DDDDDDDDDDDDDDD>
##$VPLIST= <PPPPPPPPPPPPPPP>
##$VTLIST= <TTTTTTTTTTTTTTT>
##$WBST= 1024
##$WBSW= 4
##$XGAIN= (0..3)
0 0 0 0 
##$XL= 0
##$YL= 0
##$YMAX_a= 40540
##$YMIN_a= -32814
##$ZGOPTNS= <>
##$ZL1= 120
##$ZL2= 120
##$ZL3= 120
##$ZL4= 120
##$ABSF1= 182.463
##$ABSF2= -187.1042
##$ABSG= 5
##$ABSL= 3
##$ALPHA= 0
##$AQORDER= 0
##$ASSFAC= 0
##$ASSFACI= 0
##$ASSFACX= 0
##$ASSWID= 0
##$AUNMP= <proc_1d>
##$AZFE= 0.1
##$AZFW= 0.5
##$BCFW= 0
##$BC_mod= 2
##$BYTORDP= 0
##$COROFFS= 0
##$CY= -3
##$DATMOD= 1
##$DC= 0
##$DFILT= <>
##$DTYPP= 0
##$F1P= 0
##$F2P= 0
##$FCOR= 1
##$FTSIZE= 65536
##$FT_mod= 6
##$GAMMA= 0
##$GB= 0
##$INTBC= 1
##$INTSCL= 5.30512e-09
##$ISEN= 30
##$LB= 1
##$LEV0= 0
##$LPBIN= 0
##$MAXI= 10000
##$MC2= 0
##$MEAN= 0
##$ME_mod= 0
##$MI= 50
##$NCOEF= 0
##$NC_proc= -8
##$NLEV= 6
##$NOISF1= 182.463
##$NOISF2= 159.3651
##$NSP= 0
##$NTH_PI= 0
##$NZP= 0
##$OFFSET= 182.463
##$PC= 4
##$PHC0= -3146.262
##$PHC1= 1120.602
##$PH_mod= 1
##$PKNL= yes
##$PPARMOD= 0
##$PSCAL= 0
##$PSIGN= 0
##$REVERSE= no
##$SF= 81.0140089999434
##$SI= 65536
##$SIGF1= 159.3651
##$SIGF2= -187.1042
##$SINO= 113.3802
##$SIOLD= 16384
##$SREGLST= <1H.CDCl3>
##$SSB= 0
##$STSI= 65536
##$STSR= 0
##$SW_p= 29940.119760479
##$SYMM= 0
##$S_DEV= 0
##$TDeff= 32768
##$TDoff= 0
##$TI= <>
##$TILT= no
##$TM1= 0
##$TM2= 0
##$TOPLEV= 0
##$USERP1= <user>
##$USERP2= <user>
##$USERP3= <user>
##$USERP4= <user>
##$USERP5= <user>
##$WDW= 1
##$XDIM= 65536
##$YMAX_p= 442541076
##$YMIN_p= -85510332
$$ End of Bruker specific parameters
$$ ---------------------------------
##NTUPLES= NMR SPECTRUM
##VAR_NAME=  FREQUENCY,     SPECTRUM/REAL,   SPECTRUM/IMAG
##SYMBOL=    X,             R,               I
##VAR_TYPE=  INDEPENDENT,   DEPENDENT,       DEPENDENT
##VAR_FORM=  AFFN,          ASDF,            ASDF
##VAR_DIM=   65536,         65536,           65536
##UNITS=     HZ,            ARBITRARY UNITS, ARBITRARY UNITS
##FACTOR=    0.456856943014862, 1,           1
##FIRST=     14782.0589164792, 0,            0
##LAST=      -15158.0608439998, 0,           0
##MIN=       -15158.0608439998, -85510332,   0
##MAX=       14782.0589164792, 442541076,    0
$$ Real data points
##PAGE= N=1
##DATA TABLE= (X++(R..R)), XYDATA
$$ [...]
##PAGE= N=2
##DATA TABLE= (X++(I..I)), XYDATA
4835B4667223r449587j4058983Q46137R175280l067536j7568383j3984567R24132
$$ 24667223 15217636 1158653 2004790 11180070 8112534 -9455849 -23440416 -22516284
4827b2516284P124029l0219q474938q756379k821192L310058O983348Q892698
$$ -22516284 -15392255 -15422474 -23897412 -32653791 -35474983 -32164925 -25181577 -16288879
4819a6288879R810324Q487122L371402k886482l884143K162424Q090178O711837
$$ -16288879 -6478555 2008567 5379969 2493487 -1390656 771768 8861946 15573783
4811A5573783M00875l892558m989245n924007o209277l625639j87735J502824
$$ 15573783 15974658 12082100 7092855 1168848 -5040429 -8666068 -8853803 -7350979
4803g350979L680720P139394N427343m458918j2021042o765658M087364O462929
$$ -7350979 -3670259 3469135 8896478 4437560 -7583482 -14349140 -10261776 -3798847
4795c798847K605142N157654J1716728P219519p482552j2853211k148381P044115
$$ -3798847 -1193705 3963949 15680677 22900196 15417644 2564433 416052 7460167
4787G460167K093316n675248m083599j213239o153483p425386O979880K1646929
$$ 7460167 9553483 3878235 -205364 -1418603 -7572086 -14997472 -8017592 13629337
4779A3629337J1714399j7103811l1623191j5294881J1796991K1600760J0031031
$$ 13629337 25343736 8239925 -23383266 -38678147 -26881156 -5280396 4750635
4772D750635o022633j0845202k094397J0761894J4785064N428881p970044j3003943
$$ 4750635 -1271998 -12117200 -14211597 -3449703 11335361 16764242 8794198 -4209745
4764d209745q938347m050233j269095L397377R110117Q419771n18287r584777
$$ -4209745 -13148092 -17198325 -18467420 -15070043 -5959926 2459845 1941558 -7643219
4756g643219j1486561p114341m29464N907456Q398709M825254J94949J944931
$$ -7643219 -19129780 -26244121 -26673585 -20766129 -12367420 -7542166 -7347217 -5402286
4748e402286P908413Q603260K715600j007507M12534n18476o210134p754612j593352
$$ -5402286 2506127 11109387 13824987 12817480 13230014 12711538 6501404 -1253208 -2846560
4739b846560J524900n474685j2015458o754253K947662L512127k389077k775936
$$ -2846560 -1321660 -6796345 -18811803 -25566056 -22618394 -19106267 -21495344 -24271280
4731b4271280J685037J470249q82410N807513J8027170J8514152L636515r261296
$$ -24271280 -22586243 -21115994 -21998404 -16190891 1836279 20350431 23986946 14725650
4723A4725650p260656K584400R050737J1092211R205377k66056j2656059j3289842
$$ 14725650 7464994 10049394 19100131 30192342 39397719 39131663 26475604 13185762
4715A3185762K65263R639730K008784j0137222j0094641k790918j922216m841780
$$ 13185762 13451025 23090755 25099539 14962317 4867676 2076758 154542 -4687238
4707d687238j057209M791682J035036p287485n805168L050598M559826j101724
$$ -4687238 -5744447 -952765 82271 -7205214 -13010382 -9959784 -5399958 -6501682
4699f501682o10721M981482M10936j4089591j9235033q089623L673846N472209
$$ -6501682 -7112403 -2130921 -1719985 -15809576 -35044609 -43134232 -39460386 -33988177
4691c3988177N206368P394636L810781m007324R9347J6084762J9899289L419362
$$ -33988177 -28781809 -21387173 -17576392 -21583716 -21484369 -5399607 14499682 17919044
4683A7919044o875787O277426J7505059k38146k6370743k2241458P134738K2035215
$$ 17919044 11043257 17320683 34825742 34587596 8216853 -14024605 -6889867 15145348
4675A5145348R761051m131065m312296m236043j0838583r168605N622341J3798177
$$ 15145348 24906399 20775334 16463038 12226995 1388412 -7780193 -2157852 11640325
4667A1640325L733465q403837p087543r08285j740768l378371J605681M243763
$$ 11640325 15373790 6969953 -117590 -1025875 -2766643 -6145014 -4539333 -295570
4659b95570k827297p620379J394639J2873515J0032412j719237m595592L207904
$$ -295570 -3122867 -10743246 -9348607 3524908 13557320 11838083 7242491 10450395
4651A0450395Q051655L763281k592087l781669J580784J1048611J6208776O758931
$$ 10450395 18502050 22265331 19673244 15891575 17472359 28520970 44729746 51488677
4643E1488677j2640721k0331755n666279J2297651J0229405n882708j1685828
$$ 51488677 38847956 18516201 12849922 25147573 35376978 29494270 17808442
4636A7808442j009237R650761R036899K577179l262725q714915j1490713p059942
$$ 17808442 16799205 26449966 35486865 38064044 34801319 26086404 14595691 7535749
4628G535749j83633p92978o935670o901099P47451N393820M202366O190666J2542955
$$ 7535749 7352116 6559138 -376532 -7277631 -6530180 -1136360 3066006 9256672 21799627
4619B1799627J0926800k938465j4277443j0110101J906455O550306K618080P1606
$$ 21799627 32726427 29787962 15510519 5400418 7306873 13857179 16475259 16546865
4611A6546865L129397P087844P479061L738273l040051r725957j1783051q621712
$$ 16546865 19676262 26764106 34243167 37981440 34941389 25215432 13432381 4810669
4603D810669m204535M06741Q333057J7016228J5900698J168107j4521422j6126328
$$ 4810669 606134 1012875 9345932 26362160 42262858 43430965 28909543 12783215
4595A2783215n441941K668586J53740p006090j0055728p248619j516463M271067
$$ 12783215 7341274 10009860 10163600 3157510 -6898218 -14146837 -15663300 -11392233
4587a1392233P004668L517268n207070j2632678j2861030p225019j595946K848680
$$ -11392233 -4387565 -870297 -6077367 -18710045 -31571075 -38796094 -40392040 -37543360
4579c7543360J1603655K5904043L3934572K2000718m433435k1416542j4784321
$$ -37543360 -25939705 -35662 33898910 55899628 51466193 30049651 15265330
4572A5265330J310559M273909o190168j1496637m083973L737345K503412l33059
$$ 15265330 16575889 20849798 14659630 3162993 -920980 2816365 5319777 4986718
4564D986718L804951R171941O230942k720651q770674r577062q199168n790695
$$ 4986718 8791669 17963610 24194552 21473901 12703227 3126165 -5073003 -10863698
4556a0863698m020488p225188j2842319q074571J1782550K8956825K2542725j169718
$$ -10863698 -14884186 -22109374 -34951693 -43026264 -31243714 -2286889 20255836 19086118
4548A9086118j4190726l634177J2631142J2055314m354879j8178886j8207441
$$ 19086118 4895392 1261215 13892357 25947671 21592792 3413906 -14793535
4541a4793535q779470J309825Q179132J1483191J0741468N616338k315093r391294
$$ -14793535 -23573005 -22263180 -14084048 -2600857 8140611 13756949 11441856 2050562
4533B050562j1829927q900982l903802l95098J761757M090159M706046N96451
$$ 2050562 -9779365 -18680347 -22584149 -22979247 -21217490 -17127331 -12421285 -11824834
4525a1824834n249540m925996L518596J1350257R622586R25956m373483j702816
$$ -11824834 -17074374 -22000370 -18481774 -7131517 2491069 3417025 -956458 -2659274
4517b659274L338400L992416M75700k695305l434359k920801j831036P28974M573564
$$ -2659274 679126 4671542 5147242 2451937 -982422 -3903223 -5734259 -5005285 -431721
4508d31721P109219N489778o30844q321952j2616124r568763j73659Q830528J0303482
$$ -431721 6677498 12167276 11536432 3214480 -9401644 -18970407 -19144066 -10313538 -10056
4499a0056L844990l593133m760325J209604Q958334J2033967Q026400P83460k514733
$$ -10056 3834934 241801 -4518524 -3308920 5649414 17683381 25709781 26493241 23978508
4490B3978508J021014N594069L351373m906201j0502631q896833m705560k627097
$$ 23978508 24999522 30593591 33944964 29038763 18536132 9639299 4933739 2306642
4482B306642m79005M237932P546241N162213J40974k434645l493577n521370n405741
$$ 2306642 1827637 6065569 13611810 18774023 18914997 16480352 12986775 7465405 2059664
4473B059664m57820L455776J62389m693448j636861N824088N913520j612642n349376
$$ 2059664 1601844 5057620 5220009 526561 -1110300 4713788 10627308 9014666 3665290
4464C665290k167001j129656m831740l678235N505756J1523399P530602K241707
$$ 3665290 1498289 368633 -4463107 -8141342 -2635586 8887813 16418415 18660122
4456A8660122K794596J855905o048720j0251212j285710J0292523R753996K028738
$$ 18660122 21454718 23310623 17261903 7010691 5724981 16017504 25771500 27800238
4448B7800238N68446J635522p885625k2307772k1442549l690778Q875260L788332
$$ 27800238 28368684 30004206 22118581 -189191 -21631740 -25322518 -16447258 -12658926
4440a2658926n145076l329990K231591o79300o493685k052389R665579J3328518
$$ -12658926 -17804002 -21133992 -18902401 -19581701 -26075386 -28127775 -18462196 -5133678
4432e133678N480019m31330M790905J1678770N145670j3661436k6129680j8219103
$$ -5133678 346341 -84989 4705916 16384686 21530356 7868920 -18260760 -36479863
4424c6479863J058929R538114K84414q805243J12802J8666097K3093866P316138
$$ -36479863 -35420934 -25882820 -25598406 -34403649 -34290847 -15624750 7469116 14785254
4416A4785254r660447j0683845k79670P651900Q764448O340720J026926o707011
$$ 14785254 5124807 -5559038 -5838708 1813192 10577640 16918360 17945286 11238275
4408A1238275j0746848o790890j413290l597405r867025q009272M474729J4858156
$$ 11238275 491427 -6299463 -7712753 -11310158 -21177183 -29186455 -24711726 -9853570
4400i853570J0980156l409091j2723977o518834R620696J9365152J1905770o033981
$$ -9853570 1126586 -2282505 -15006482 -21525316 -11904620 7460532 19366302 13332321
4392A3332321j5523402m707919J7685952K9983378J9244442n218734k0717056
$$ 13332321 -2191081 -6899000 10786952 40770330 60014772 54796038 34078982
4385C4078982j4465215K680759Q706583l255383j7099235j5729632l333323L174909
$$ 34078982 19613767 22294526 31001109 27745726 10646491 -5083141 -8416464 -5241555
4377e241555n67473k808385L421655J0253160R840320O233130N165729L065127
$$ -5241555 -5809028 -8617413 -5195758 5057402 14897722 21130852 26296581 29361708
4369B9361708m201634j0290243p175711P97538K973349j003220j981161K494634
$$ 29361708 25160074 14869831 7694120 8491658 11465007 10461787 8480626 10975260
4361A0975260M088019k156315r033372p420793N51942M066258k863290j4714449
$$ 10975260 15063279 12906964 3873592 -3547201 -2995259 1070999 -1792291 -16506740
4353a6506740k1448661j9274447j2193030l916847O943482K0316654K7764282
$$ -16506740 -37955401 -57229848 -69422878 -73339725 -66396243 -46079589 -18315307
4346a8315307K0096993J805878j0285818n933691O904925J2560174M790177r080961
$$ -18315307 1781686 3587564 -6698254 -12631945 -5727020 6833154 11623331 2542370
4338B542370j6069573p672047J1887990K5611053J8928627k570802j8019247j5825611
$$ 2542370 -13527203 -21199250 -9311260 16299793 35228420 32657618 14638371 -1187240
4330a187240m038883N907791J2626339J5949628R432538o694570j7238384j1230589
$$ -1187240 -5226123 681668 13308007 29257635 38690173 31995603 14757219 3526630
4322C526630k23842j774949j1953101j1771813L059928J6719679J6986831Q196904
$$ 3526630 3302788 1527839 -10425262 -22197075 -19137147 -2417468 14569363 22766267
4314B2766267l81794m375286j192076Q758766J5861824R751156m310521j0896921
$$ 22766267 22384473 18009187 16817111 25575877 41437701 51188857 46878336 35981415
4306C5981415p176166m826519p462362m426833P078948J2288912J749403j2031647
$$ 35981415 28805249 23978730 16516368 12089535 19168483 31457395 33206798 21175151
4298B1175151j3676477p480225o601190j0565104r499350l496810j352314l368474
$$ 21175151 7498674 18449 -6582741 -17147845 -26647195 -30144005 -31496319 -34864793
4290c4864793o57033Q400000J3802553Q525559j641715n821626j76184R219705
$$ -34864793 -35521826 -27121826 -13319273 -4793714 -6435429 -12257055 -12433239 -3213534
4282c213534J2572957O032996l298088n477063j883361l638774j2267609j2834456
$$ -3213534 9359423 15392419 12094331 6617268 4733907 1095133 -11172476 -24006932
4274b4006932L987975K2432639J8952366m967802k2702545j6051347M449162J6405462
$$ -24006932 -20018957 2413682 21366048 16398246 -6304299 -22355646 -17906484 -1501022
4266a501022J1778625O03262l854645K288116J1692693J2702581O02788j6436314
$$ -1501022 10277603 10880865 7026220 9314336 21007029 33709610 34312398 17876084
4258A7876084k4941241j9249737m407407J1020813J9403186J4596496k534895
$$ 17876084 -7065157 -26314894 -30722301 -19701488 -298302 14298194 11763299
4251A1763299j8889703j8943392k919855J2316718J3637761N492368m35337j246863
$$ 11763299 -7126404 -26069796 -28989651 -16672933 -3035172 2457196 2021859 774996
4243G74996j482178j654397K492339J0371659J4264930R161543J86876l632660
$$ 774996 -707182 -2361579 130760 10502419 24767349 33928892 34115768 30483108
4235C0483108j517036k446517j1956385k0522486j2420472J1492385K8034437
$$ 30483108 28966072 26519555 14563170 -5959316 -18379788 -6887403 21147034
4228B1147034J7285558j0593350k5474160j3761271P346245J5109786Q089217
$$ 21147034 38432592 27839242 2365082 -11396189 -4049944 11059842 19149059
4221A9149059l0478k544751l323100m282117k851330q27209l590523q932888p533908
$$ 19149059 19118581 16573830 13250730 8968613 6117283 5290074 1699551 -7233337 -14767245
4212a4767245J919220Q014267K719440o144407o230629J706711O685052M436875
$$ -14767245 -12848025 -4833758 -2114318 -8258725 -14489354 -12782643 -6097591 -1660716
4204a660716J375276J947864J956318k321229o274029l670114L729060Q894405
$$ -1660716 -285440 1662424 3618742 1297513 -4976516 -8646630 -4917570 3976835
4196C976835Q898863O263019K694267l128288j1182793j7340740j6459672p482814
$$ 3976835 12875698 19138717 21832984 18704696 7521903 -9818837 -26278509 -33761323
4188c3761323M010317Q649657K170742p478772p236938L861847J1387937N543070
$$ -33761323 -29751006 -21101349 -18930607 -26409379 -33646317 -29784470 -18396533 -12853463
4180a2853463l017919J712029J5431497J8055604L709914j0088101q392059Q73455
$$ -12853463 -15871382 -14159353 1272144 19327748 23037662 12949561 4557502 5430957
4172E430957J738288o702345j3428983j2903957p440246J222611J1036986J5614299
$$ 5430957 7169245 466900 -12962083 -25866040 -33306286 -32083675 -21046689 -5432390
4164e432390J2093211P593452O756501L97425j8300095l3166157k1412631J0441047
$$ -5432390 6660821 14254273 21010774 21408199 3108104 -30058053 -51470684 -41029637
4156d1029637K9313016J9071671Q9665l762857K950614L112671k779461k912948
$$ -41029637 -11716621 7355050 7444715 3681858 6632472 9745143 6965682 4052734
4148D052734M97983m636824j4515039j0650645R714946K3889325J3344386j0693440
$$ 4052734 4550717 -86107 -14601146 -25251791 -15536845 8352480 21696866 11003426
4140A1003426k2201047j2350444M389346J1515126P233196L64175j848506J137365
$$ 11003426 -11197621 -23548065 -19158719 -7643593 -410397 -46222 -1894728 -757363
4132g57363N358917O048779J018858o982094j1993190j0887326p031982n440981
$$ -757363 4601554 10650333 11669191 4687097 -7306093 -18193419 -25225401 -30666382
4124c0666382m770950J435791J3572608K1075629J4208631k139580j3319558j2589650
$$ -30666382 -35437332 -34001541 -20428933 646696 14855327 12715747 -603811 -13193461
4116a3193461o559762l029426k262021k612035n201333p661888j992482J3450909
$$ -13193461 -19753223 -22782649 -25044670 -27656705 -32858038 -40519926 -42512408 -29061499
4108b9061499K6443725K4160895R237507n701050j4501208j8757776j7374336
$$ -29061499 -2617774 21543121 30780628 25079578 10578370 -8179406 -25553742
4101b5553742p425914N847141J2288693J0934188R555676R354590L264543p369277
$$ -25553742 -32979656 -27132515 -14843822 -3909634 5646042 15000632 18265175 10895898
4093A0895898r064990L022599J3443573O907423r204062j5892807r543596l336469
$$ 10895898 1830908 4853507 18297080 25204503 16000441 107634 -9435962 -12772431
4085a2772431m562126n698080m3616P009477P995380N135784N066524P720188
$$ -12772431 -17334557 -23032637 -23076253 -16066776 -8071396 -2935612 2130912 9851100
4077I851100P237603J037865p238258j2539955j2855077r772879o427498m034966
$$ 9851100 17088703 18126568 10888310 -1651645 -14506722 -24279601 -30707099 -34742065
4069c4742065n87722M837271Q042211N133198J088359M686448J2936045J0790842
$$ -34742065 -35329787 -30492516 -22450305 -17317107 -16228748 -11542300 1393745 12184587
4061A2184587o906919k2849841j8255556m4317Q072889k64186o514400J830676
$$ 12184587 5277668 -17572173 -35827729 -35872046 -27799157 -28063343 -34577743 -32747067
4053c2747067J0992623M132673r271914o419910J2586561K2783559J0753346o693815
$$ -32747067 -21754444 -17621771 -26893685 -33313595 -20727034 2056525 12809871 6116056
4045F116056q941498j00779L279338J270506P862880K2725783K6049482P133869
$$ 6116056 -2825442 -2926221 353117 1623623 9486503 32212286 58261768 65395637
4037F5395637j7531775k4793020j2980461J655838R021541J2119393J3220878
$$ 65395637 47863862 23070842 10090381 11746219 20767760 32887153 46108031
4030D6108031Q031979l476180j2477125j3282310j0853971j0224149p310551J236906
$$ 46108031 54140010 50663830 38186705 24904395 14050424 3826275 -3484276 -2247370
4022b247370P145182J564000q011958o488376M023199M402652j1662681k3646624
$$ -2247370 4897812 6461812 -1550146 -8038522 -4015323 387329 -11275352 -34921976
4014c4921976j1150767J5999446K9075891J6730838m442883j4724773j2893185
$$ -34921976 -46072743 -30073297 -997406 15733432 11290549 -3434224 -16327409
4007a6327409r432121q992483o893416J440591J2957883J8533096J2074409l70858
$$ -16327409 -25759530 -34752013 -41645429 -40204838 -27246955 -8713859 3360550 2989692
3999B989692m200039N882966J5958062R858420p163965j4364232n032010M836597
$$ 2989692 -1210347 4672619 20630681 30489101 23325136 8960904 3928894 8765491
3991H765491J819844o185309n706286R30908K560114k247284p114782j0641301
$$ 8765491 10585335 4400026 -1306260 -375352 2184762 -62522 -7177304 -17818605
3983a7818605j3059847p229308J0281822K4148192J6031306n467276j1661831
$$ -17818605 -30878452 -38107760 -27825938 -3677746 12353560 6886284 -4775547
3976d775547N457079K0484621J1834196q019024j4228834n519073O12594j785981
$$ -4775547 681532 21166153 33000349 24981325 10752491 5233418 5846012 4060031
3968D060031k795651J467653L253451P75489L102384J2425489J6863466Q381131
$$ 4060031 1264380 2732033 5985484 6760973 9863357 22288846 39152312 47533443
3960D7533443m628491j1099014j2792263j5960817j6417821n625786J2422869
$$ 47533443 42904952 31805938 19013675 3052858 -13364963 -18990749 -6567880
3953f567880K2407498J5687395j183094j5517567j8978225j0294078M392374J3774541
$$ -6567880 15839618 31527013 30343919 14826352 -4151873 -14445951 -10053577 3720964
3945C720964J1226528K663389j633206r43605j076652l04643P773763J6698741
$$ 3720964 14947492 17610881 15977675 15034070 13957418 13652775 21426538 38125279
3937C8125279J0104292j0723617k0266373l715856J6988054J2050341j2117641
$$ 38125279 48229571 37505954 17239581 13523725 30511779 42562120 30444479
3930C0444479k2588514r362338K929131k921728j0978586k463076J1362588P919052
$$ 30444479 7855965 -1506373 1422758 -1498970 -12477556 -14940632 -3578044 4341008
3922D341008r511506j6656134m253003J1752842J5042331O457050m618243j1376226
$$ 4341008 -5170498 -21826632 -26079635 -14326793 715538 7172588 2554345 -8821881
3914h821881r103742L670753J9131125K4774120J7797166P610872K282780J28423
$$ -8821881 -17925623 -14254870 4876255 29650375 47447541 55058413 57341193 57469616
3906E7469616l627273r293349j3781851j3689016p575477m55243k391819j4524864
$$ 57469616 53842343 44548994 30767143 17078127 9502650 9047407 6655588 -7869276
3898g869276k1798702j1913360L447695L361643q706399p716437J2842279K7204822
$$ -7869276 -29667978 -41581338 -38133643 -34772000 -43478399 -51194836 -38352557 -11147735
3890a1147735J5041000p958770j4061837j819854R154174R696401O000999O46112
$$ -11147735 3893265 -4065505 -18127342 -19947196 -10793022 -1096621 4904378 5550490
3882E550490r093256j6727025j1353937K154586O699465o88602m175062M345381
$$ 5550490 -3542766 -20269791 -31623728 -29469142 -22769677 -23458279 -27633341 -23287960
3874b3287960J1836493O074656m142149l076309P884138J3500095O903312l301225
$$ -23287960 -11451467 -5376811 -9518960 -12595269 -4711131 8788964 15692276 12391051
3866A2391051o978843m205292j233032m58090J653440O950032Q959656q72144
$$ 12391051 5412208 1206916 -26116 -484206 1169234 8119266 17078922 16206778
3858A6206778j8309910k4880226r311562J4546925K2607256J1116779r75337l73443
$$ 16206778 -2103132 -26983358 -36294920 -21747995 859261 11976040 11000703 10627260
3850A0627260N651259P039537O655427Q251539M010746j0949858k2867867j5835447
$$ 10627260 16278519 23318056 29973483 38225022 42235768 31285910 8418043 -7417404
3842g417404K531104J0029976J280374q032803p589575l759272j579554M401534
$$ -7417404 -4886300 5143676 6424050 -1608753 -9198328 -12957600 -14537154 -10135620
3834a0135620J3164755J0269568q436097k1911969j0881419J1143059J4751389
$$ -10135620 3029135 13298703 4862606 -17049363 -27930782 -16787723 -2036334
3827b036334k774166j4306436l313302J4774805J9195294J2331333Q439057Q780971
$$ -2036334 -4810500 -19116936 -22430238 -7655433 11539861 23871194 32310251 41091222
3819D1091222M921967k043580l466386q07559m317868j3620912j5315779l850265
$$ 41091222 46013189 43969609 40503223 39695664 35377796 21756884 6441105 2590840
3811B590840Q850643J0961425O562032N690323P695466M534594m769065j2805791
$$ 2590840 11441483 22402908 28964940 34655263 42350729 46885323 42116258 29310467
3803B9310467j4642883j2032281p735684k242942L753482Q308006R829569P243775
$$ 29310467 14667584 2635303 -5100381 -7343323 -3589841 4718165 14547734 21791509
3795B1791509L62257p398663j0014842o355142l175031n860319r497244n022188
$$ 21791509 22153766 14755103 4740261 -1614881 -4789912 -10650231 -20147475 -25169663
3787b5169663P807146J9244052K0124165R284324p064860j8553050j6700937m230398
$$ -25169663 -17362517 1881535 22005700 31290024 24225164 5672114 -11028823 -15259221
3779a5259221M578542K2725r403380q080259M485942J3323557R901320K461069
$$ -15259221 -10680679 -10657954 -20061334 -28141593 -23655651 -10332094 -430774 2030295
3771B030295J027761L165388J313175l967081o168449l423057L67857K383725
$$ 2030295 3058056 6223444 7536619 3569538 -2598911 -6021968 -5654111 -3270386
3763c270386L129437L325683K744582J213339j504205n164431p274029m933643
$$ -3270386 -140949 3184734 5929316 7142655 5638450 474019 -6800010 -11733653
3755a1733653L59028L603665L335992L140597M431380L408716j685775o075372
$$ -11733653 -11374625 -7770960 -4434968 -1294371 3137009 6545725 4859950 -1215422
3747a215422n721389l911648m996486n880209o49571Q507646J1903166M231093
$$ -1215422 -6936811 -10848459 -15844945 -21725154 -22374725 -13867079 -1963913 2267180
3739B267180q762993j6230209j2202764M1018J1317240J4619988J0948034N860717
$$ 2267180 -6495813 -22726022 -34928786 -34887768 -23570528 -8950540 1997494 7858211
3731G858211Q77609o845967j5104077j4394713j042552J3224315J3862634L317634
$$ 7858211 8735820 1889853 -13214224 -27608937 -28651489 -15427174 -1564540 1753094
3723A753094j679959O478043J5618073J1534478j767129q472236l760032N95935
$$ 1753094 73135 6551178 22169251 33703729 31936600 23464364 19704332 20300267
3715B0300267m891187j3043576j1611185k525047J158284m314565p893485j367700
$$ 20300267 15409080 2365504 -9245681 -11770728 -10612444 -14927009 -22820494 -24188194
3707b4188194Q731747J2967035J2416350J1274734N522092q296341j9719527j5050875
$$ -24188194 -15456447 -2489412 9926938 21201672 26723764 18427423 -1292104 -16342979
3699a6342979J477544J2233332J0631121N708484K962190j519986n708661j41715
$$ -16342979 -14865435 -2632103 7999018 13707502 16669692 15149706 9441045 9299330
3691I299330J1955663J2561666l505788j7561010j5664951r175261j0988064j0673966
$$ 9299330 21254993 33816659 30310871 12749861 -2915090 -12090351 -23078415 -33752381
3683c3752381M539641K0048845J3043489p885248j2438421M392141J5088234L749903
$$ -33752381 -29212740 -9163895 3879594 -4005654 -16444075 -12051934 3036300 6786203
3675F786203j0666295o163270J0380713J7816658J0251495l021726j4416483k0335963
$$ 6786203 -3880092 -10043362 337351 18154009 28405504 25383778 10967295 -9368668
3667i368668j5949184j735156J0423965R493107J18937l891852K209531J0198741
$$ -9368668 -25317852 -27053008 -16629043 -7135936 -7016999 -10908851 -8699320 1499421
3659A499421J0935255M164167k609006j934298N143762Q552904J696590p181320
$$ 1499421 12434676 16598843 13989837 12055539 17199301 25752205 27448795 20267475
3651B0267475m761254O989173J2272828N179768k153171m35435K569706j988873
$$ 20267475 15506221 22495394 34768222 39947990 37794819 37359384 39929090 37940217
3643C7940217p779603n862700k060010o350304j3159610r077901M082709J0324791
$$ 37940217 30160614 24297914 22237904 15887600 2727990 -6349911 -2267202 8057589
3635H057589K588497r275754j3794565q800900K661511J4948542J8235749P266396
$$ 8057589 10646086 1370332 -12424233 -21225133 -18563622 -3615080 14620669 21887065
3627B1887065p123400q264690K722039P771695k09755o517583L19323Q820365
$$ 21887065 14763665 6498975 9221014 16992709 16782954 10265371 10584694 19405059
3619A9405059L657435q075460p984453K965550N461631o261655j3738068k923604
$$ 19405059 23062494 14987034 7002581 9968131 15429762 9168107 -4569961 -7493565
3611g493565J3141300J3306842j120569j0609055o907661j415655l397646n947810
$$ -7493565 5647735 18954577 17834008 7224953 317292 -1098363 -4496009 -10443819
3603a0443819l01306Q181893Q270896l94470q611148j0947054q876318m286468
$$ -10443819 -10745125 -2563232 5707664 5313194 -3297954 -14245008 -23121326 -27407794
3595b7407794J365975M087805J781176q47632N89029K203164O316L53271R290648
$$ -27407794 -26041819 -21954014 -20172838 -21020470 -20431441 -18228277 -18221961 -17868690 -8578042
3586h578042J6497333P447914r969475j2139023L288187J0236251n313470k0295778
$$ -8578042 7919291 15367205 5397730 -6741293 -3453106 6783145 1469675 -18826103
3578a8826103q735182J6698634K1960617J022680j8031410j4792658l26788N693087
$$ -18826103 -27561285 -10862651 11097966 12120646 -5910764 -20703422 -21030210 -15337123
3570a5337123J710318j310165J493567O306786R114335Q865898O329513L921062
$$ -15337123 -13626805 -14936970 -13443403 -7136617 1977718 10843616 17173129 21094191
3562B1094191L109243J048185n052224j0547139p642163K447857R545878P991266
$$ 21094191 24203434 25251619 20199395 9652256 2010093 4457950 14003828 21995094
3554B1995094K149951k972036p881351j2552481j2708257o464506J843137P963292
$$ 21995094 24145045 21173009 13291658 739177 -11969080 -18433586 -16590449 -8627157
3546h627157J1799393J2888280R122354K713172n80704j318885o134678j3173961
$$ -8627157 3172236 16060516 25182870 27896042 27315338 25996453 19861775 6687814
3538F687814r177152R843529K5040084J5412535j2853166l1801218k5655353o343384
$$ 6687814 -2489338 7354191 32394275 47806810 34953644 3152426 -22502927 -28846311
3530b8846311O556604Q343476N968428L515094Q15512R5523L092246M013678m133093
$$ -28846311 -22289707 -13946231 -7977803 -4462709 -3647197 -3551674 -459428 3554250 -578843
3521e78843j6000893j7155144m044554R121613R525733K926101K612676Q385501
$$ -578843 -16579736 -33734880 -37779434 -28657821 -19132088 -16205987 -13593311 -5207810
3513e207810R014730K039800l047465j696782l11108k194650j205455M857164
$$ -5207810 3806920 5846720 2799255 1102473 791365 -1403285 -2608740 2248424
3505B248424P631360K852729p13888L174873N563146k432514j1885421q334358
$$ 2248424 9879784 12732513 12018625 15193498 20756644 18324130 6438709 -1895649
3497a895649N309003J2939652P456127m632779j5527975j9515273j0280046R511804
$$ -1895649 3413354 16353006 23809133 19176354 3648379 -15866894 -26146940 -16635136
3489a6635136K1608267J2486246m539089o266219O114379J1630818N036557J499696
$$ -16635136 4973131 17459377 12920288 6654069 12768448 24399266 29435823 30935519
3481C0935519M790287k11696j5779977k0813199n536092R089515M122666p774351
$$ 30935519 35725806 35514110 19734133 -1079066 -6615158 2474357 6597023 -1177328
3473a177328n761383N566222Q538847K749011o02590k534358j0475076j7618582
$$ -1177328 -6938711 -1372489 7166358 9915369 9312779 6778421 -3696655 -21315237
3465b1315237j1855892O85682L636036k462359k829806N005029R237731O784209
$$ -21315237 -33171129 -32485447 -28849411 -31311770 -34141576 -29136547 -19898816 -13114607
3457a3114607O537507R311635N537085m945230j0452214p571479n094643n398840
$$ -13114607 -6577100 2734535 8271620 3326390 -7125824 -14697303 -19791946 -25190786
3449b5190786j073272O862421P636157K116179M329431J5006259J5822053Q021
$$ -25190786 -26264058 -19401637 -11765480 -9649301 -5319870 9686389 25508442 25516463
3441B5516463j3474971r964550j875981l937667o028285O041658J9137643J0876151
$$ 25516463 12041492 2076942 200961 -3736706 -9764991 -3723333 15414310 26290461
3433B6290461j0208999j3706451M805496J6155217M437977q361253k05556J3701912
$$ 26290461 16081462 2375011 7180507 23335724 27773701 19412448 19206892 32908804
3425C2908804N850475j7213411k2901822k908607J3626205M090983j5263903j6229095
$$ 32908804 38759279 21545868 -1355954 -4264561 9361644 13452627 -1811276 -18040371
3417a8040371L1408R295925K500481m842441l13519Q697879J0515983N072862
$$ -18040371 -18008963 -8713038 -6212557 -11054998 -11368517 -2670638 7845345 12918207
3409A2918207k184753q640217j0255095k290802Q611196P222314o572926j2276392
$$ 12918207 10733454 2093237 -8161858 -10452660 -1841464 5380850 -1192076 -13468468
3401a3468468R29350J4532181Q475829o090614m445237J1685840J8134788P935102
$$ -13468468 -12539118 1993063 10468892 4378278 -66959 11618881 29753669 37688771
3393C7688771q55169J125744K69465j2124811k1571373j3678947J894191N968694
$$ 37688771 36833602 37959346 38228811 26104000 4532627 -9146320 -7252129 -1283435
3385a283435k885255q997902j254997J4934644K3484930J2564633j0575724k1741462
$$ -1283435 -4168690 -13166592 -14421589 513055 23997985 36562618 25986894 4245432
3377D245432p731324J1726083P678417j4482578j9729603L955597K5755748J8144889
$$ 4245432 -3485892 8240191 15918608 1436030 -18293573 -14337976 11417772 29562661
3369B9562661l647325r198476J567097O285623q62095n404005p33861M439874
$$ 29562661 25915336 16716860 18283957 24569580 23707485 18303480 17569619 22009493
3361B2009493M065546L74137n817851j3305585j3243710q38662J0727064O199603
$$ 22009493 26075039 26449176 20631325 7325740 -5917970 -6756632 3970432 10170035
3353A0170035o932090r111069K12063L930484k467729n377291N68796L564422
$$ 10170035 3237945 -5873124 -5661061 -1730577 -4198306 -9575597 -9006801 -5442379
3345e442379k617814p436199k581210M978168O134865J164177o951372j5890085
$$ -5442379 -8060193 -15496392 -18077602 -13099434 -6964569 -5800392 -12751764 -28641849
3337b8641849j7229634l301985J5178444J7246682K984888m093969O001683J3434568
$$ -28641849 -45871483 -49173468 -33995024 -16748342 -13763454 -17857423 -11855740 1578828
3329A578828K520161j0767587n160701J0440850J1935857j788326j0776841p532253
$$ 1578828 4098989 -6668598 -11829299 -1388449 10547408 8759082 -2017759 -9550012
3321i550012m078997p025583q148436k768200J542698Q1750l78064N518203J2112235
$$ -9550012 -13629009 -20654592 -28803028 -31571228 -30028530 -29946780 -30324844 -24806641 -12694406
3312a2694406J2430014Q349748N232795L292813m55115n963346r298712o019972
$$ -12694406 -264392 8085356 13318151 16610964 16155849 10192503 893791 -5126181
3304e126181M031123J2799202R232833n736201j5265894p529274M920033J179508
$$ -5126181 -1095058 11704144 20936977 15200776 -65118 -7594392 -2674359 -1494851
3296a494851j5286666j8811288q8808J7364485J0757605q605946j2949836J729718
$$ -1494851 -16781517 -35592805 -35681613 -18317128 -7559523 -16165469 -29115305 -27385587
3288b7385587J3934399J1468853N965895Q431592J0308574P79720j1346228r571296
$$ -27385587 -13451188 -1982335 3983560 12415152 22723726 23503446 12157218 2585922
3280B585922L371138Q106479k045620j0871009m160705R003916J0657709L99064
$$ 2585922 5957060 14063539 12017919 1146910 -3013795 5990121 16647830 17046894
3272A7046894o471322l435494k86535m106129o702823J190025J3010632J4431100
$$ 17046894 10575572 7140078 6853543 2747414 -3955409 -2765384 10245248 24676348
3264B4676348L643926o961917q201609l622237n14407j05958l14888j385433l538397
$$ 24676348 28320274 21358357 13156748 9534511 9020104 8914146 8599258 7213825 3675428
3255C675428l613509K81086L684679J142684m896369o440821j073041M931015
$$ 3675428 61919 343005 4027684 5170368 273999 -6166822 -7239863 -2308848
3247b308848N494888J421296l207884n485544k245105Q767339K1356365K1642599
$$ -2308848 3186040 4607336 1399452 -4086092 -6331197 2436142 23792507 45435106
3239D5435106M798975j3966453j5743479k839168M381674m435332j7589168k0396352
$$ 45435106 50234081 36267628 20524149 17684981 22066655 17631323 42155 -20354197
3231b0354197j3131256l475798O427044J5399583J6112956N322124n565951l392915
$$ -20354197 -33485453 -36961251 -30534207 -15134624 978332 6300456 734505 -2658410
3223b658410P327894J0660715K420221n811520n410664j012657j16277k721482
$$ -2658410 4669484 15330199 17750420 11938900 6528236 5515579 5399302 2677820
3215B677820m404082k308498L832261J1060059J3913277J0794910O427968K328894
$$ 2677820 -1726262 -4034760 -202499 10857560 24770837 35565747 41993715 44322609
3207D4322609p988953k4611217l1260475j5817563O131217Q885122n398239j0004968
$$ 44322609 36333656 11722439 -19538036 -35355599 -29224382 -20339260 -25737499 -35742467
3199c5742467L811578J3784521L933306j0409021q755034M601408J3340705J4270431
$$ -35742467 -31930889 -18146368 -14213062 -24622083 -33377117 -28775709 -15435004 -1164573
3191a164573J2556185P117063j662711l507435M700289P125804o646752j9172088
$$ -1164573 11391612 18508675 16845964 13338529 18038818 25164622 18517870 -654218
3183f54218r363484J2632555J9912461R577409K007955M374018L439460n170270
$$ -654218 -10017702 2614853 22527314 32104723 34112678 38486696 41926156 36755886
3175C6755886q610587k567314R2752n956009q111996K82097O601874R85870o592378
$$ 36755886 28145299 25577985 25670737 19714728 11602732 11884829 18486703 19472573 12880195
3166A2880195m186326K555884K117357l967382o877738n322003k940319N88492
$$ 12880195 8693869 11249753 13367110 9399728 2521990 -2800013 -5740332 -5151840
3158e151840N271147N291122k318054r985675r201933j866226N008288R373315
$$ -5151840 119307 5410429 3092375 -6893300 -16095233 -17961459 -12953171 -3579856
3150c579856J2270079J2565363R928173O929672L620538k547920q111317n300896
$$ -3579856 8690223 21255586 31183759 38113431 41733969 39186049 31074732 25773836
3142B5773836L296403M467681m680021r681230k139277M902421j132015r217932
$$ 25773836 29070239 33537920 28857899 19176669 17037392 21939813 20807798 11589866
3134A1589866k334824J1987957J1000716p345216k0039415j2325256M294536J2712973
$$ 11589866 9255042 21242999 32243715 24898499 4859084 -7466172 -3171636 9541337
3126I541337J1946994R882546P835005L099686j753184k806252l399051r536157
$$ 9541337 21488331 31370877 39205882 42305568 40552384 37746132 34347081 24810924
3118B4810924j8502987j9904733r038261O012724J3015654Q723324P81229k570219
$$ 24810924 6307937 -13596796 -22635057 -16622333 -3606679 5116645 5897874 3327655
3110C327655j338455o73859k048215k102581N46358K888488L273243M485931Q378797
$$ 3327655 1989200 1315341 -732874 -2835455 -2289097 599391 3872634 8358565 16737362
3101A6737362J1532789R432604K140720o341720j1533987j0238060l047863L430110
$$ 16737362 28270151 37702755 39843475 33501755 21967768 11729708 8681845 12111955
3093A2111955J834801o045686r404720j440652J1771020J8122386J1836213k441373
$$ 12111955 13946756 7901070 -1503650 -2944302 8826718 26949104 38785317 36343944
3085C6343944j4034454j4070685l449225O878644Q046427L520087R40212j368325
$$ 36343944 22309490 8238805 4789580 11668224 19714651 23234738 24174950 22806625
3077B2806625q273774j2640526l307388J2202457J3196458j711944r423511J282397
$$ 22806625 14532851 1892325 -1415063 10787394 23983852 22271908 12848397 14130794
3069A4130794J0687571L51935j6438335j6680063l234552M773940M085476M820347
$$ 14130794 24818365 25170300 8731965 -7948098 -11182650 -6408710 -2323234 2497113
3061B497113N419142l224220j3696304r015725P175040J2801793J738594p958670
$$ 2497113 7916255 4692035 -9004269 -18019994 -10844954 1956839 3695433 -4263237
3053d263237m252840L283829M357893L215241M842145M810137J704833K643149
$$ -4263237 -8516077 -5232248 -874355 2340886 7183031 11993168 13698001 16341150
3045A6341150P917674O875955k089678m804779M562760R746654l041694k1367169
$$ 16341150 24258824 31134779 29045101 24240322 28803082 38549736 35508042 14140873
3037A4140873k4134500j2206661l600753m367052k357213J0282938K3422367K2344790
$$ 14140873 -9993627 -22200288 -25801041 -30168093 -32525306 -22242368 1179999 23524789
3029B3524789O317606j1251392j7809434j3103756n618994n67252L731393P181847
$$ 23524789 29842395 18591003 781569 -12322187 -17941181 -18508433 -14777040 -7595193
3021g595193M347104m323386o690054M613976J7315401J5259358K978550k632014
$$ -7595193 -3248089 -7571475 -14261529 -9647553 7667848 22927206 25905756 23273742
3013B3273742n72254m684002j5442312j6512573l676357O211032L333533j39855
$$ 23273742 22701488 18017486 2575174 -13937399 -17613756 -11402724 -8069191 -8209046
3005h209046N744821J0483071L395964n717261k331352J0010551J7165546J3257631
$$ -8209046 -2464225 8018846 11414810 5697549 3366197 13376748 30542294 43799925
2997D3799925Q12222j5241930k3999777j4510289M473875Q715232n965343j3751353
$$ 43799925 44612147 29370217 5370440 -9139849 -4665974 4049258 -1916085 -15667438
2989a5667438L50285J4032197M017434j4691275j4745838j978017r92090r339207
$$ -15667438 -15317153 -1284956 2732478 -11958797 -26704635 -28682652 -29674742 -39013949
2981c9013949l546222J6001005K3916524J3008331L031266K880219j723850j5224034
$$ -39013949 -42560171 -26559166 -2642642 10365689 13396955 16277174 14553324 -670710
2973f70710j9281351n121116R031259P371749K21860L662103J4779283K0869687
$$ -670710 -19952061 -25073177 -16041918 -8670169 -8448309 -4786206 9993077 30862764
2965C0862764J7249373N256502j1775035k2456275j4879626K222291N513948p915542
$$ 30862764 48112137 53368639 41593604 19137329 4257703 6479994 11993942 4078400
2957D078400j4341097k434899P662936L91173o913023M646505J9175279J0972409
$$ 4078400 -10262697 -12697596 -5034660 -4643487 -11556510 -6910005 12265274 23237683
2949B3237683j0710361j5138658O36298R604352l5399r829607n853643P19955
$$ 23237683 12527322 -2611336 -1975038 7629314 7593915 -2235692 -8089335 -7369380
2941g369380j714076m469035K761404J1030944O896341m092809n568389M505599
$$ -7369380 -9083456 -13552491 -10791087 239857 7136198 3043389 -2525000 1980599
2933A980599J2187542Q974593J690039p91107m62826m693322j3378641j7872840
$$ 1980599 14168141 23142734 24832773 24041666 23578840 18885518 5506877 -12365963
2925a2365963j2292898j565166M146634J439379k766160J27624J0655054K1257511
$$ -12365963 -24658861 -26224027 -22077393 -20638014 -23404174 -23276550 -12621496 8636015
2917H636015K4084411J7579108O726343k157833p497323j2700958j8806080j9364373
$$ 8636015 32720426 50299534 57025877 54868044 47370721 34669763 15863683 -3500690
2909c500690q037556R103114J6271028O503750q310641j1258296k37359J2033786
$$ -3500690 -11538246 -2435132 13835896 20339646 12029005 770709 533350 12567136
2901A2567136J4988775R660435J363112q524210j8774738k2335812j2680534M422339
$$ 12567136 27555911 37216346 38579458 30055248 11280510 -11055302 -23735836 -19313497
2893a9313497J3899244R459322J355149K56508J047886o619231j7211983j4527084
$$ -19313497 -5414253 4045069 5400218 5656726 6704612 85381 -17126602 -31653686
2885c1653686J999805J3504508R309236J322329K043367N151702J031902m252745
$$ -31653686 -29653881 -16149373 -6840137 -5517808 -3474441 1677261 2709163 -1543582
2877a543582k369301j049056r010248j4605136k703963J6300659J9830569R081812
$$ -1543582 -3912883 -4961939 -13972187 -28577323 -31281286 -14980627 4849942 13931754
2869A3931754M454419R089182O751192m280343o927553J007456R80359j0590837
$$ 13931754 18386173 27475355 34226547 29946204 23018651 24026107 25006466 14415629
2861A4415629j3116980k1948O434075n430864j4565500n100584M481629m258454
$$ 14415629 1298649 1276701 7710776 2279912 -12285588 -17386172 -12904543 -17162997
2853a7162997j4559051m115420J4446417J6425739Q026241J0014996J4833208
$$ -17162997 -31722048 -35837468 -21391051 -4965312 3060929 13075925 27909133
2846B7909133K34672k3995187k4706525R67858J9753510J3548779P03299q40798
$$ 27909133 28143805 4148618 -20557907 -19590049 163461 13712240 14415539 13574741
2838A3574741K071700J051663L298341J1312812J1308385k638506j4583793j2256263
$$ 13574741 15646441 16698104 19996445 31309257 42617642 39979136 25395343 13139080
2830A3139080p217483j2925700j9225733p863151J6504448K8887999J4986842
$$ 13139080 5921597 -7004103 -26229836 -34092987 -17588539 11299460 26286302
2823B6286302j2084990k6443354j6077055M922952J1818391p50088j1140544j145378
$$ 26286302 14201312 -12242042 -28319097 -23396145 -11577754 -12327842 -23468386 -24613764
2815b4613764J6214993J5821570o54588q223339J028507P035299l576590j6543826
$$ -24613764 -8398771 7422799 6768211 -1455128 -426621 6608678 3032088 -13511738
2807a3511738j4582868k868453L243584Q86620k177447p09967N938918J4814076
$$ -13511738 -28094606 -30963059 -27719475 -26832855 -29010302 -29720269 -23781351 -8967275
2799h967275J6893943N496718r331756r655952L575632J0174630J861365o440481
$$ -8967275 7926668 13423386 4091630 -5564322 -1988690 8185940 10047305 3606824
2791C606824l818866L1241l428793m926096K973518R690297O604797M156371J0627775
$$ 3606824 -212042 -180801 -3609594 -8535690 -5562172 4128125 10732922 14889293 25517068
2782B5517068J2375648l082387k0421097j7435308l31444P250542J545606q91453
$$ 25517068 37892716 34810329 14389232 -3046076 -3377520 3873022 5418628 4527175
2774D527175N353248Q593016M556569K908761O798432O639239j301611p418216
$$ 4527175 9880423 18473439 23030008 25938769 32737201 39376440 38074829 30656613
2766C0656613m873425O41236J286309m004675j2662510j9766858j6517623K84203
$$ 30656613 25783188 26424424 27710733 23706058 11043548 -8723310 -25240933 -24956730
2758b4956730J7273620J6356654r20639j3624260q752478L727655P179653r86433
$$ -24956730 -7683110 8673544 7752905 -5871355 -14623833 -10896178 -3716525 -4702958
2750d702958j0368916j1704504m576470M667179R185833P556698L672958K79025
$$ -4702958 -15071874 -26776378 -31352848 -26685669 -17499836 -9943138 -6270180 -5991155
2742e991155l282823n005443O44712J2358653J8878192J3784998N419715L225491
$$ -5991155 -9273978 -14279421 -13634709 -1276056 17602136 31387134 36806849 40032340
2734D0032340K913419l526821j1567477j1977907q254830j0426709j5634238j1389304
$$ 40032340 42945759 39418938 27851461 15873554 7618724 -2807985 -18442223 -29831527
2726b9831527L080024J4265897J3895638P595790L028990J282908R68466O12549
$$ -29831527 -26751503 -12485606 1410032 9005822 12034812 13317720 14286186 14898735
2718A4898735k627199p491019n320137O904239J5617785P250155q738598j0636445
$$ 14898735 12271536 4780517 -539620 6364619 21982404 29232559 20493961 9857516
2710I857516L822429J5007573J0946011M16036o233049j0488302j4232394j2111438
$$ 9857516 13679945 28687518 39633529 40049565 33816516 23328214 9095820 -3015618
2702c015618l233236L486786L091691J647229L676443M706847J920227o5280L41692
$$ -3015618 -6248854 -2762068 329623 1976852 5653295 10360142 12280369 12215089 12556781
2693A2556781k108679p088535n364098N170404J2512941P571485k838333p831501
$$ 12556781 10448102 3359567 -2004531 3165873 15678814 23250299 20411966 12580465
2685A2580465o987896n236275k849263J278238M106341K995616o17997n573432
$$ 12580465 5592569 356294 -2492969 -1214731 2891610 5887226 5269229 -304203
2677c04203j0951413j0399085J781656J6793405J7952848N085672l559205N78486
$$ -304203 -11255616 -21654701 -19873045 -3079640 14873208 19958880 16399675 16978161
2669A6978161M198482l069040j0585592o905360p86836m837916j2324149r556007
$$ 16978161 21176643 18107603 7522011 616651 -170185 -5008101 -17332250 -26888257
2661b6888257n22568J140368l056999n03680Q438090J1196986O212283N191396
$$ -26888257 -27410825 -26270457 -29327456 -29831136 -21393046 -10196060 -3983777 1207619
2653A207619J0660834J0383304q80847j0815364q488510m53520J416843j817196
$$ 1207619 11868453 22251757 21370910 10555546 2067036 1613516 3030359 1213163
2645A213163o30628O073426R221280L852272l247010l074252L153307N890936
$$ 1213163 582535 6655961 15877241 19729513 16482503 13408251 16561558 22452494
2637B2452494N98128o284984p225907m232130l710467m762059j533825M478372
$$ 22452494 23050622 16765638 9539731 5307601 1597134 -3164925 -4698750 -220378
2629b20378N345763R75827P98055P395259J0142733J888719q320057p910964J730724
$$ -220378 5125385 6101212 6899267 14294526 24437259 26325978 18005921 10094957 11825681
2620A1825681R469497J0070686P029905M159086J670166k447932j1214049k3722410
$$ 11825681 21295178 31365864 38395769 42554855 44225021 41777089 30563040 6840630
2612F840630k9372713j6802610O923899J8406728P763654n878675r30192J5641690
$$ 6840630 -22532083 -39334693 -32410794 -14004066 -6240412 -12119087 -13049279 2592411
2604B592411J9787191N420523j0090149j2981089q090856m808462l146267N42321
$$ 2592411 22379602 27800125 17709976 4728887 -3361969 -8170431 -11316698 -10774377
2596a0774377M621268N711737N211554O811521J0083437R911683K407043q760800
$$ -10774377 -6153109 -441372 4770182 11581703 21665140 31576823 33983866 25223066
2588B5223066j3291495n248811P216048R433021j092771j1079029r328444K73649
$$ 25223066 11931571 6682760 13898808 23331829 22239058 11160029 1831585 2105234
2580B105234P816908J0236042Q980899L570542m752642r742836p576034j749512
$$ 2105234 9922142 20158184 29139083 32709625 27956983 18214147 10638113 8888601
2572H888601L983620R485951J0971274J206602j6345065k5387378j7196611j874415
$$ 8888601 12872221 22358172 33329446 34536048 18190983 -7196395 -24393006 -26267421
2564b6267421Q742174J5843361K1596158J8227311L442339p909165m732164P15782
$$ -26267421 -17525247 -1681886 19914272 38141583 41583922 33674757 28942593 29658375
2556B9658375o813199j7473901j1101466P804678J3914922k027202k1088040k2299301
$$ 29658375 22845176 5371275 -5730191 2074487 15989409 13962207 -7125833 -29425134
2548b9425134n011420J5697988K3715384J3383848l861769q761262J903732J0201126
$$ -29425134 -34436554 -18738566 4976818 18360666 14498897 5737635 7641367 17842493
2540A7842493M645940k104015L403074J1915347R992544M485911O047354N573851
$$ 17842493 22488433 20384418 23787492 35702839 45695383 50181294 56228648 61802499
2532F1802499o702323j5574950m485517J0760893N372576j1218669j1713107K031106
$$ 61802499 55100176 39525226 35039709 45800602 51173178 39954509 28241402 30272508
2524C0272508O996461K179751K723200M194204j418852R072984N0548040P0633941
$$ 30272508 37268969 39448720 42171920 46366124 44947272 54020256 104568296 175202237
2516A75202237P028809r6565687j20591190l7611379M0172468K4117045k8055980
$$ 175202237 182231046 85665359 -34925831 -72537210 -32364742 -8247697 -36303677
2509c6303677j9225859L3693984M3581985M25874k4856696l480254J7973425Q445166
$$ -36303677 -55529536 -21835552 21746433 22172307 -2684389 -6164643 11808782 20253948
2501B0253948m677368K024965R389720K54631j0009683q011581m821416p211281
$$ 20253948 15576580 17601545 26991265 27245896 17236213 9224632 4403216 -2808065
2493b808065l894666O202559P328646n68038K019396J5604646J5814886k612569
$$ -2808065 -6702731 -500172 6828474 6260436 8279832 23884478 39699364 37086795
2485C7086795j3031678k357734O783726l301311j6500872j4563285o968279p908413
$$ 37086795 24055117 21697383 28481109 25179798 8678926 -5884359 -12852638 -20761051
2477b0761051j0672725o214827k514524m802589j64969J7248598K8484992J9104770
$$ -20761051 -31433776 -37648603 -40163127 -44965716 -45130685 -27882087 602905 19707675
2469A9707675M752599M566020R297070R24274j3446190j4008215j749488N962691
$$ 19707675 24460274 29026294 38323364 39247638 25801448 11793233 10043745 16006436
2461A6006436L766904o98385n493467j2111843j2598273q36240J0226133M625241
$$ 16006436 19773340 19074955 13581488 1469645 -11128628 -11964868 -1738735 2886506
2453B886506r078048r061412M586643R843873j659136j2505131q439955J104580
$$ 2886506 -6191542 -15252954 -10666311 -822438 -2481574 -14986705 -23426660 -22322080
2445b2322080J246697n293308n832505J299644O312652M702841K972283O143655
$$ -22322080 -21075383 -26368691 -32201196 -30901552 -24588900 -19886059 -16913776 -10770121
2437a0770121Q547166L530910k587972K811135J6646040J7920846l181157k5543954
$$ -10770121 -2222955 1307955 -1280017 1531118 18177158 36098004 32916847 7372893
2429G372893k2517779K55378J2823463M221211n745134j491219O235576L656199
$$ 7372893 -15144886 -14889508 -2066045 2155166 -3589968 -5081187 1154389 4810588
2421D810588k821282k027457J189238k123182o467437k790324L648769L429589
$$ 4810588 1989306 -38151 1151087 -972095 -7439532 -10229856 -6581087 -3151498
2413c151498O70096L450680O329479O57092o268941k037228P469394O203924m501827
$$ -3151498 -2481402 969278 7298757 7955849 1686908 -350320 7119074 13322998 8821171
2404H821171p781736K79655N105184o91769n655627J12387Q978700Q548812j194345
$$ 8821171 1039435 1319090 6424274 5732505 76878 189265 9167965 17716777 16522432
2395A6522432j1191073j5126677j1791779k882480O003301P813238K232653k538433
$$ 16522432 5331359 -9795318 -21587097 -24469577 -18466276 -10653038 -8420385 -10958818
2387a0958818N14301Q853668J3932752J0814997K873296k238857j365638K51711
$$ -10958818 -10444517 -1590849 12341903 23156900 26030196 23791339 22425701 22677412
2379B2677412l176444p857179n221405L105113N447213j601070o733143k173541
$$ 22677412 19500968 11643789 6422384 9527497 14974710 13373640 6640497 4466956
2371D466956L688642J219341m473514m388867k047557m968801q435168l450071
$$ 4466956 8155598 9374939 4901425 512558 -1534999 -6503800 -14938968 -18389039
2363a8389039N536319P008413J963336J168215O036888P933284M724396L196172
$$ -18389039 -12852720 -5844307 -3880971 -2712756 3324132 11257416 15981812 19177984
2355A9177984N852881Q296312P987912M061367o729814k0841878k2331862l609576
$$ 19177984 25030865 33327177 41315089 45376456 38646642 17804764 -4527098 -8136674
2347h136674J5791405J2366962n736647j1353789k269007k053041j5346496j6473203
$$ -8136674 7654731 20021693 14285046 2931257 662250 -1390791 -16737287 -33210490
2339c3210490O133544K6191230J9209900o08441o259174L96458p99631j0762178
$$ -33210490 -27076946 -885716 18324184 17715743 11456569 11853027 11053396 291218
2331B91218j2118315r74726P692887N843470L053672Q539112J7178740J7161252
$$ 291218 -11827097 -12801823 -5108936 734534 3788206 12327318 29506058 46667310
2323D6667310L254657j7757639k9739482k0229040K835171J5048402M554807j1878290
$$ 46667310 49921967 32164328 2424846 -17804194 -14969023 79379 4634186 -7244104
2315g244104j2233484J507283J1401779J1238580Q475421N254673k167636p467304
$$ -7244104 -19477588 -17970305 -6568526 4670054 13145475 18400148 16232512 8765208
2307H765208J238544J8656215K3453088P800307j0832624j4580346p144466k326965
$$ 8765208 10003752 28659967 52113055 59913362 49080738 34500392 27355926 25028961
2299B5028961l726294o335641q134249q896963m874876M502018J0125250L946806
$$ 25028961 21302667 14967026 6832777 -2064186 -6939062 -2437044 7688206 11635012
2291A1635012p630084j1268270n012630J133833J588084R32692J819836j438316
$$ 11635012 4004928 -7263342 -12275972 -11142139 -9554055 -8621363 -6801527 -8239843
2283h239843j1452445j8827911j3284821J238732J1468273J2224961R926295R523426
$$ -8239843 -19692288 -38520199 -51805020 -50566288 -39098015 -26873054 -16946759 -7423333
2275g423333Q094729L654486M20408M32626j136040n869423o238555J356960O434415
$$ -7423333 671396 4325882 4746290 5178916 4042876 -1826547 -8065102 -6708142 -273727
2266b73727l97354r178232l260309J3394561J9364884O707386r204728j4275695
$$ -273727 -671081 -9849313 -13109622 284939 19649823 26357209 17152481 2876786
2258B876786j1963499q629755j460655Q303345P978295n626459j3154730Q71499
$$ 2876786 -9086713 -17716468 -19177123 -10873778 -2895483 -8521942 -21676672 -20805173
2250b0805173K0418724J8064899m521506j8879778j0375909N547171J0178872
$$ -20805173 -386449 17678450 13156944 -5722834 -16098743 -10551572 -372700
2243c72700M452574j316152l765288l649284P87118Q365256J1547474N921940
$$ -372700 4079874 2763722 -1001566 -4650850 -3863732 4501524 16048998 21970938
2235B1970938l521992j0566858j4872866j6335944j0635447K967412J5514208
$$ 21970938 18448946 7882088 -6990778 -23326722 -33962169 -30994757 -15480549
2228a5480549J6787768O607629o204475j2598135q852783J651188R801075Q786343
$$ -15480549 1307219 7914848 1710373 -10887762 -19740545 -18089357 -8288282 498061
2220D98061K393099j17480K350888K284282k074691k472682M826977J0861501
$$ 498061 2891160 2773680 5124568 7408850 5334159 2861477 7688454 18549955
2212A8549955P708221J274682J093357M915827M499312J191114K904964P838161
$$ 18549955 26258176 27532858 28626215 33542042 38041354 39232468 42137432 49975593
2204D9975593M974902o953846j3650933n038211Q427601Q913665m048062j2974083
$$ 49975593 54950495 47996649 34345716 29307505 37735106 46648771 42600709 29626626
2196B9626626o784574N017559P751215K175509m20870J480366j649514j0771138
$$ 29626626 22842052 27859611 35610826 37786335 37365465 38845831 37196317 26425179
2188B6425179j3022806l047041M977027j086044j0013928m507614R116076R718135
$$ 26425179 13402373 10355332 15332359 14246315 4232387 -275227 8840849 18558984
2180A8558984m042489j1595251m739899P04862m725733o603726O055192J7335758
$$ 18558984 14516495 2921244 -1818655 -1113793 -5839526 -12443252 -6388060 10947698
2172A0947698Q532139j0101793j4538927l425144M240785J587306k60417K831011
$$ 10947698 19479837 9378044 -5160883 -8586027 -4345242 -2757936 -3018353 -187342
2164a87342J207961o809226q024218L256796J3762899J1270864J471222m490070
$$ -187342 1020619 -5788607 -13812825 -10556029 3206870 14477734 15948956 11458886
2156A1458886o310882p971484o112303K818976J1297904Q648379l346251j2113983
$$ 11458886 5148004 -2823480 -8935783 -6116807 5181097 13829476 10483225 -1630758
2148a630758r594882N65601Q746422P585130k156038j0212457o017410P170054
$$ -1630758 -11225640 -10660039 -1913617 5671513 3515475 -6696982 -12714392 -5544338
2140e544338J3803353O315076m195155m678371R63615O85740m421620k123066
$$ -5544338 8259015 14574091 10378936 5700565 6664180 7349920 2928300 805234
2132H05234R207606J5784737R003242j938036n152668l747306q083133j6431771
$$ 805234 10012840 25797577 34800819 32862783 27710115 23962809 15879676 -552095
2124e52095j6095309l842548O861067M657067k869471j019582Q599075R895548
$$ -552095 -16647404 -20489952 -13628885 -8971818 -11841289 -12860871 -4261796 5633752
2116E633752j836304j0539539l093950J0648202J4012955R291380J0042830J4032475
$$ 5633752 3797448 -6742091 -9836041 812161 14825116 24116496 34159326 48191801
2108D8191801N773059j3532111k2019501j0681380J026306l916377j3311830q055434
$$ 48191801 53964860 40432749 18413248 7731868 8758174 4841797 -8470033 -16525467
2100a6525467N028322N654285n109283p736407K329074R010481M106270j590272
$$ -16525467 -11497145 -5842860 -10952143 -18688550 -16359476 -7348995 -3242725 -4832997
2092d832997J93240L506120M038464P097886J2020084P351388q674391k0262370
$$ -4832997 -4639757 -1133637 2904827 10002713 22022797 29374185 20699794 437424
2084D37424j7531051j0857572r589079m726404J0299597J8815438L904636j9182161
$$ 437424 -17093627 -27951199 -37540278 -42266682 -31967085 -13151647 -9247011 -28429172
2076b8429172j9317473O259015K8404954K6721045J0914727j551209p152671q308861
$$ -28429172 -47746645 -41487630 -13082676 13638369 24553096 23001887 15849216 7540355
2068G540355l144305N717379O995081k844188j0468213m327171P297067Q821917
$$ 7540355 4396050 10113429 17108510 14264322 3796109 -531062 6766005 15587922
2060A5587922L35121m693688l61030N121910L025554n007264j0426476o546613
$$ 15587922 15923043 11229355 10868325 15990235 19015789 14008525 3582049 -2964564
2052b964564N575392J6315120J5460501M973311j150636M474948J0252642J266412
$$ -2964564 2610828 18925948 34386449 39359760 38209124 42684072 52936714 54203126
2044E4203126j7203689k4582523j3447575R2743o19191j0449665j1981742n71552
$$ 54203126 36999437 12416914 -1030661 -937918 -1557109 -12006774 -23988516 -24560068
2036b4560068J0924017J1125237M141541J434404N923093R720003N941368k159634
$$ -24560068 -13636051 -2510814 1630727 3065131 8988224 18708227 24649595 22489961
2028B2489961n537415o71699N824366M224529p508294k0321031k1669378p545585
$$ 22489961 16952546 16280847 22105213 26329742 18821448 -1499583 -23168961 -30714546
2020c0714546J2164682K1457034J3567381j442545o977031J375545J0464045N656060
$$ -30714546 -18549864 2907170 16474551 15032006 8054975 9430520 19894565 25550625
2012B5550625j0125065j8740270r252740P340011J0984663j973613j3668230p922938
$$ 25550625 15425560 -3314710 -12567450 -5227439 5757224 3783611 -9884619 -17807557
2004a7807557P980229J2555160j120833j5893319j3254844K910465J3210630Q751384
$$ -17807557 -9827328 2727832 1606999 -14286320 -27541164 -24630699 -11420069 -2668685
1996b668685K53573P88576Q443705J0998924K893731q408600j2283961p034308
$$ -2668685 -2415112 -1626536 6817169 17816093 20709824 12301224 17263 -7017045
1988g017045l50496R73080r52658N08880N779747P729878K598376l284599k237494
$$ -7017045 -7367541 -6394461 -7347119 -6838239 -1058492 6671386 9269762 5985163 3747669
1979C747669L467035N070354k71501o556464p074081m93455R070833J3365275
$$ 3747669 7214704 12285058 12013557 5457093 -1616988 -2110443 6960390 20325665
1971B0325665N623062q478255j1397776M261932K0150864J3839824p300826j4021072
$$ 20325665 25948727 17470472 6072696 10334628 30485492 44325316 37024490 23003418
1963B3003418J037432J0996281l500852k3004057j8968964K549165J2233270L264920
$$ 23003418 24040850 35037131 31536279 8532222 -10436742 -7887577 4345693 7610613
1955G610613k254084P434838J4885859K947488j7391190k2846000r429629N724139
$$ 7610613 5356529 12791367 27677226 30624714 13233524 -9612476 -19042105 -13317966
1947a3317966Q264686R04291m570162j662475N540527Q488404M642638J10109
$$ -13317966 -5053280 -4148989 -8719151 -10381626 -4841099 3647305 8289943 8400052
1939H400052j94721n03781n732956r700483l247424P659101O692944p071739j3783907
$$ 8400052 8205331 7701550 1968594 -7731889 -10979313 -3320212 3372732 -3699007 -17482914
1930a7482914j163628J5825352J5769141M46163j0916254r836006n177265m916853
$$ -17482914 -18646542 -2821190 12947951 13394114 2477860 -7358146 -12535411 -17452264
1922a7452264p054571q753452j0063887o710724O667888K2270899K2536777N083976
$$ -17452264 -24506835 -33260287 -43324174 -50034898 -43367010 -21096111 1440666 6524642
1914F524642q881659j801720J5221868J8174188L631766r209845p329452J532132
$$ 6524642 -2357017 -4158737 11063131 29237319 32869085 23659240 16329788 17861920
1906A7861920N144975K736121j216627o505491j1897694j0263541O86208J0067491
$$ 17861920 23006895 25743016 24526389 18020898 6123204 -4140337 -3454129 6613362
1898F613362P328570j210176j352793O748622Q663138k152362j5329102j9360532
$$ 6613362 13941932 12731756 11378963 18127585 26790723 24638361 9309259 -10051273
1890a0051273j4511492n916568M570256J3490756J3682004N459006O17840N683891
$$ -10051273 -24562765 -30479333 -25909077 -12418321 1263683 6722689 7340529 13024420
1882A3024420R761414J002768j1990141j0517724N440340J5547185Q469205l050961
$$ 13024420 22785834 23788602 11798461 1280737 6721077 22268262 30737467 27686506
1874B7686506l689235J604401j477288j1623734j3647066l752664K648530n626369
$$ 27686506 23997271 25601672 24124384 12500650 -1146416 -4899080 -2250550 -7876919
1866g876919j6544373j1156877P413910J6510613O547547m392879K790934J9302340
$$ -7876919 -24421292 -35578169 -28164259 -11653646 -5106099 -9498978 -6708044 12594296
1858A2594296K0850267K696448j4827958j5893529p756954m735610p640196p682383
$$ 12594296 33444563 36141011 21313053 5419524 -2337430 -7073040 -14713236 -22395619
1850b2395619j048292Q910484J7104552J8096665R273845k229031m297680L299627
$$ -22395619 -23443911 -14533427 2571125 20667790 29941635 27712604 23414924 26714551
1842B6714551O933642m0231o712425l491559J735750j436352p188083m990791
$$ 26714551 33648193 33607962 26895537 23403978 25139728 23703376 16515293 11524502
1834A1524502N20338j374580o506614k757140P172911R043595P26797n459846
$$ 11524502 12044840 10670260 4163646 1406506 8579417 17623012 18349809 12889963
1826A2889963l209483J553802M183317N312189K789666m455155o957530L294358
$$ 12889963 9680480 11234282 15417599 20729788 23519454 19064299 12106769 15401127
1818A5401127J4220795P396217j1027078j6336081l665536M860803k828836j0472330
$$ 15401127 29621922 37018139 25991061 9654980 5989444 10850247 8021411 -2450919
1810b450919l521930O285890K650534p745445p792752K834768J0403560Q791039
$$ -2450919 -5972849 313041 2963575 -4781870 -12574622 -9739854 663706 9454745
1802I454745L918392J870409L398501O329622P045370M177732K835145P193967
$$ 9454745 13373137 15243546 18642047 24971669 32017039 36194771 39029916 46223883
1794D6223883R488322n67765j5313188j5402645L68167J0598740K772299j0107930
$$ 46223883 55712205 55144440 39831252 24428607 24796774 35395514 38167813 28059883
1786B8059883j2667624p773940l784142L87087N755327N580362j436069o029075
$$ 28059883 15392259 7618319 3834177 4221264 9976591 15556953 14120884 8091809
1778H091809n770802r849331j7655983j3764463M319416J5888021Q559634k337917
$$ 8091809 2321007 -7528324 -25184307 -38948770 -34629354 -18741333 -10181699 -12519616
1770a2519616j284603L792878K642966L138850J0391812R632395o888420j8948859
$$ -12519616 -13804219 -10011341 -7368375 -4229525 6162287 15794682 8906262 -10042597
1762a0042597r312560O367703O595949j109854O505L895229l43013q75820J3349179
$$ -10042597 -19355157 -12987454 -6391505 -7501359 -7494854 -3599625 -3942638 -4818458 8530721
1753H530721K3096224Q608666j1762201j0817258J00914n178215j6362690o410840
$$ 8530721 31626945 40235611 28473410 17656152 17757066 12578851 -3783839 -10194679
1745a0194679J3643351J1044702q495965j0270330O462401R748877l514945l817154
$$ -10194679 3448672 14493374 5997409 -4272921 2189480 11938357 8423412 4606258
1737D606258J1046966R870649j0386314j4181937P998989J9938283K903627j3567184
$$ 4606258 15653224 25523873 15137559 955622 8954611 28892894 31796521 18229337
1729A8229337n891740P018153N263645J130668O119155O296033n344707j0737134
$$ 18229337 12337597 19355750 24619395 25750063 31869218 38165251 32820544 22083410
1721B2083410k732907o81324j0500287r846157P344921J4160232r27924j2468883
$$ 22083410 19350503 18669179 8168892 -1677265 5667656 19827888 18899964 6431081
1713F431081n249010J951802m74565N323508J9728876J5603631n595943o432821
$$ 6431081 1182071 3133873 2659308 7982816 27711692 43315323 37719380 31286559
1705C1286559J4653619J1132998k3349528l0430191J0388637L6550341J0427336
$$ 31286559 45940178 57073176 33723648 3293457 13682094 50232435 60659771
1698F0659771j3704786O296764K0143816j2515477l3336312L988945L0956796
$$ 60659771 46954985 53251749 73395565 60880088 27543776 31532721 62489517
1691F2489517o490679j5285373Q6774655J65034022L0872623k24073016k93420947
$$ 62489517 55998838 40713465 127488120 292522142 323394765 99321749 -194099198
1684a94099198q7026800J31987818J25427835j2894005n9710235M092329L8593495
$$ -194099198 -281125998 -149138180 -23710345 -36604350 -96314585 -92222256 -53628761
1677e3628761N497807r022778K1333666K9551431m679686k3222697m643623M851361
$$ -53628761 -48130954 -57153732 -35820066 -6268635 -10948321 -34171018 -38814641 -33963280
1669c3963280j1629129j3223968J3185174K5694600O199210q268602M964605J8213771
$$ -33963280 -45592409 -58816377 -45631203 -19936603 -13737393 -22005995 -17041390 1172381
1661A172381R300007k842793l23084M340191P32131j1875N049376M35524j3803457
$$ 1172381 10472388 7629595 7306511 11646702 12378833 12366958 17416334 17851858 4048401
1652D048401j4731017L350102J5837690P621963n994521r534436q125804p518093
$$ 4048401 -10682616 -7332514 8505176 16127139 10132618 598182 -7527622 -15045715
1644a5045715k271711N994972N447902k341587j374503R582051J3034364M015115
$$ -15045715 -17317426 -11322454 -5874552 -8216139 -9590642 -8591 13025773 17040888
1636A7040888j611796L198883N291260k889884j1234758j2878217j3215587j2148007
$$ 17040888 15429092 18627975 23919235 21029351 9794593 -3083624 -16299211 -28447218
1628b8447218j573824J3899129J8095757J0026067M832062M560809m452103k0381226
$$ -28447218 -30021042 -16121913 1973844 11999911 16831973 21392782 16940679 -3440547
1620c440547k2352252o427264M866367j0348m031331N094952J2879869O284867
$$ -3440547 -25792799 -32220063 -27353696 -27364044 -31395375 -26300423 -13420554 -7135687
1612g135687k114779K308795J0499774P371798k957549p987370p216060n448898
$$ -7135687 -9250466 -6941671 3558103 10929901 7972352 -15018 -7231078 -12679976
1604a2679976n48118P485937R769801M021105J520347O499348O028204n998621
$$ -12679976 -13228094 -5742157 4027644 8048749 9569096 16068444 22096648 16098027
1596A6098027j3638466m494606P141025K439423j1358253j3620406k647108N796116
$$ 16098027 2459561 -2035045 5105980 7545403 -3812850 -17433256 -20080364 -14284248
1588a4284248N329436M976270J1276901J9094242J8694215L716252k2096578m0237244
$$ -14284248 -8954812 -3978542 7298359 26392601 45086816 48803068 26706490 -13530754
1580a3530754l1119881r74651J8978991J1693003k875103O89281J4938662J4258157
$$ -13530754 -44650635 -45625286 -26646295 -14953292 -17828395 -17139114 -2200452 12057705
1572A2057705l751664j6739449j2923047l731628q9674K455335R188307J3509800
$$ 12057705 8306041 -8433408 -21356455 -25088083 -25177757 -22722422 -13534115 -24315
1564b4315P316619n691319j3915477j0163640K526065J3482466J3197599L593723
$$ -24315 7292304 1600985 -12314492 -22478132 -19952067 -6469601 6727998 10321721
1556A0321721k850098J174927P255912L193099q778899j4742017q390856J193961
$$ 10321721 7471623 8646550 15902462 19095561 10316662 -4425355 -12816211 -11622250
1548a1622250K024776o612901j3994991r186135P210601K1458755J9992424N713461
$$ -11622250 -9597474 -16210375 -30205366 -39391501 -32180900 -10722145 9270279 14983740
1540A4983740m161810P64601J1293618J1602048p15620j3762777j6788699j0459617
$$ 14983740 10821930 11586531 22880149 34482197 33766577 20003800 3215101 -7244516
1532g244516l236595j764989m761997n563704j535027J702381m98206k488910
$$ -7244516 -10481111 -12246100 -17008097 -22571801 -24106828 -22404447 -22902653 -25391563
1524b5391563L487109J2702219J2706337K343378n892624m079522K215756N674123
$$ -25391563 -21904454 -9202235 3504102 5847480 -45144 -4124666 -1908910 3765213
1516C765213O356236O015616M155321K439713K683365l8305r882438j6886662
$$ 3765213 10121449 16137065 20292386 22732099 25415464 25377159 15494721 -1391941
1508a391941p655373J0342953J5145297L861728k760373M271277P134722o584504
$$ -1391941 -9047314 1295639 16440936 20302664 17542291 21813568 28948290 22363786
1500B2363786k1008141j8490290p823303n839090q685664l212159P413574J1584060
$$ 22363786 1355645 -17134645 -24957948 -30797038 -39482702 -42694861 -35281287 -23697227
1492b3697227J1347997J5323125J8919810J2055352r61747p791832p193627n416578
$$ -23697227 -12349230 2973895 21893705 33949057 32987310 25195478 18001851 12585273
1484A2585273k176334L542222L653122o081273j3681081q670652n15333j347598
$$ 12585273 10408939 13951161 17604283 11523010 -2158071 -10828723 -11344056 -12691654
1476a2691654l723420L698282J2078391P525952k624047l936930k531868j0908468
$$ -12691654 -16415074 -12716792 -638401 6887551 4263504 326574 -2205294 -13113762
1468a3113762j8604361q401563Q481075P656503n625550n494399P655822Q605715
$$ -13113762 -31718123 -40119686 -31638611 -23982108 -29607658 -35102057 -27446235 -18840520
1460a8840520n119506q287131M952354J0227957j440309p465724L035949Q479036
$$ -18840520 -23960026 -32247157 -27294803 -17066846 -18507155 -25972879 -22936930 -14457894
1452a4457894m388432j4573922l420094J4492647J9709825J8197677J9978731
$$ -14457894 -18846326 -33420248 -36840342 -22347695 -2637870 15559807 35538538
1445C5538538J5246365k702047j5816434r261119J404547k451214r834788l048266
$$ 35538538 50784903 48082856 32266422 23005303 24409850 21958636 12123848 9075582
1437I075582P212413R74393j3565359j4137073k910932J395829o10980N859893
$$ 9075582 16287995 17262388 3697029 -10440044 -13350976 -11955147 -12566127 -6706234
1429f706234J6028386J0864699o242048j0883955K279271J1068099K876070p155188
$$ -6706234 9322152 20186851 13944803 3060848 5340119 16408218 19284288 12129100
1421A2129100l844877N336720O413886R6358m298027l923243k463660k806192
$$ 12129100 8284223 13620943 20034829 20131187 15833160 11909917 9446257 6640065
1413F640065m602910m398235J122658P409099M223073o795093q001933P450906
$$ 6640065 2037155 -2361080 -1238422 6170677 10393750 3598657 -4403276 3047630
1405C047630J7900130K904531k0557123j8906484O764903K1346144Q776723p695182
$$ 3047630 20947760 23852291 3295168 -15611316 -8846413 12499731 21276454 13581272
1397A3581272o590374J441816j82049m268932K377834J1519485P547897m067663
$$ 13581272 6990898 8432714 8250665 3981733 6359567 17879052 25426949 21359286
1389B1359286n731449K361676L183739q696884j8757622j4213012N23203J2919066
$$ 21359286 15627837 17989513 21173252 12476368 -6281254 -20494266 -19971063 -7051997
1381g051997J6008244J0494762J877331k262979J121790N351477J427324r079513
$$ -7051997 8956247 19451009 21328340 19065361 20187151 25538628 26965952 17886439
1373A7886439j5216165j1488640m300190j318937j527322j48793K582385L861483
$$ 17886439 2670274 -8818366 -13118556 -14437493 -15964815 -16113608 -13531223 -9669740
1365i669740N303895R541242J1542869K708331j4275608k3584503j4853510K989917
$$ -9669740 -4365845 5175397 16718266 19426597 5150989 -18433514 -33287024 -30297107
1357c0297107J3173376J0828324L897099K5828J853186R769035J7722656J1914065
$$ -30297107 -17123731 -6295407 -2398308 -2372480 -519294 9249741 26972397 38886462
1349C8886462j0895715k8259777j5744252J4544239K3452369j349206k6892565
$$ 38886462 27990747 -269030 -16013282 -1469043 21983326 20634120 -6258445
1342f258445k2807798j882722P074772L640168N861364J2916491R092937l778789
$$ -6258445 -29066243 -30948965 -23874193 -20234025 -14372661 -1456170 7636767 3857978
1334C857978q506696l255594j360375k704017N046608J6097404Q939382j4952342
$$ 3857978 -4648718 -7904312 -9264687 -11968704 -6922096 9175308 18114690 3162348
1326C162348k5538196q423900J3134289J4529577K757344l592044m098477o460218
$$ 3162348 -22375848 -30799748 -17665459 -3135882 -378538 -3970582 -8069059 -14529277
1318a4529277o178172K105070Q238224K746453l556163K906709J3270972J0928495
$$ -14529277 -20707449 -18602379 -10364155 -7617702 -11173865 -8267156 5003816 15932311
1310A5932311J329540K594910J2907710J3050152n15667j0483105q643009o620667
$$ 15932311 17261851 19856761 32764471 45814623 45298956 34815851 26172842 19552175
1302A9552175j0756683r461884L405552J2380602K883156j4373675j8415860q594398
$$ 19552175 8795492 -666392 2739160 15119762 18002918 3629243 -14786617 -23381015
1294b3381015k892723r181827j4409952m720156J5509483K9408569K5415465O227482
$$ -23381015 -26273738 -35455565 -49865517 -54585673 -39076190 -9667621 15747844 21975326
1286B1975326j4106122j9611044n591948J3582015J6215504j609001j8642342
$$ 21975326 7869204 -11741840 -17333788 -3751773 12463731 10854730 -7787612
1279g787612j3860738O385477J7906706J1811260K547146J276620m40177j0852348
$$ -7787612 -21648350 -15262873 2643833 14455093 17002239 18278859 17838682 6986334
1271F986334j8555542r556539P093868J0669429N66118m037810M283036J1112771
$$ 6986334 -11569208 -21125747 -14031879 -3362450 -2796332 -6834142 -2551106 8561665
1263H561665N972550j765986j689308J65208m855207j0068686m188766Q323340
$$ 8561665 14534215 12768229 11078921 11244129 6388922 -3679764 -7868530 454810
1255D54810J2257234L164753q369126j2414636r550151n009584j153409K277557
$$ 454810 12712044 15876797 7507671 -4906965 -14457116 -19466700 -20620109 -18342552
1247a8342552N034642N634263L019267j071178k783261j458756j570621n006850
$$ -18342552 -13307910 -7673647 -4654380 -5725558 -8508819 -9967575 -11538196 -16545046
1239a6545046n694481M00339M848199j541085j0083362l686333J4843618K2932347
$$ -16545046 -22239527 -21839188 -16990989 -18532074 -28615436 -32301769 -17458151 5474196
1231E474196J1588135r98279J132065P516516J217731j2397990j4993824l737045
$$ 5474196 17062331 16064052 17196117 24712633 25930364 13532374 -1461450 -5198495
1223e198495P011526O979907j429656j1243882j5433753q200487P483717J8901857
$$ -5198495 1813031 8792938 7363282 -3880600 -19314353 -27514840 -20031123 -1129266
1215a129266J8755513J3264035P379319m659163k1965602k6403831q309210J1264480
$$ -1129266 17626247 30890282 38269601 33610438 11644836 -14758995 -23068205 -11803725
1207a1803725P736553q417805p752535J0390855J7533595L336072r045270k351407
$$ -11803725 -4067172 -12484977 -20237512 -9846657 7686938 11023010 1977740 -373667
1199c73667R575096R136034K325300J941014L841665j223711p567581n533972
$$ -373667 9201429 18337463 20662763 22603777 26445442 25221731 17654150 12120178
1191A2120178j104435n695735j4362396j2600979l86270P927428O274426L464810
$$ 12120178 11015743 5320008 -9042388 -21643367 -22029637 -14102209 -7827783 -4362973
1183d362973N542575N971298j191429r275787q426430j065126J240380m522795
$$ -4362973 1179602 7150900 5959471 -3316316 -11742746 -12807872 -11567492 -16090287
1175a6090287o880286L911287J9593600K2592753R713871l490322n224001k740765
$$ -16090287 -22970573 -19059286 534314 23127067 32840938 29350616 24126615 21385850
1167B1385850o890186j2210112o323016P356248J2912041O444607Q71328L810978
$$ 21385850 14495664 2285552 -4037464 3318784 16230825 22675432 23546760 27357738
1159B7357738O009201j889780j3152346j4081561k278994J1216312J4392205N230462
$$ 27357738 33366939 31477159 18324813 4243252 1964258 13180570 27572775 32803237
1151C2803237p007292j0660382m368303J585348O312l516587k407039j722347
$$ 32803237 25795945 15135563 10767260 12352608 12358920 8842333 6435294 4712947
1143D712947p168034j0143019k73143J3415982J3227558Q45310o410609m890269
$$ 4712947 -2455087 -12598106 -12871249 544733 13772291 14617601 8206992 3316723
1135C316723o228167r823195j312047J6496912K0071494L070672r953078k203890
$$ 3316723 -2911444 -12734639 -14046686 2450226 22521720 25592392 15639314 13435424
1127A3435424R758772P249596L74783M512288Q956438k779097j8797474j5346560
$$ 13435424 23194196 30443792 30818575 35330863 44287301 41508204 22710730 7364170
1119G364170L656278J2882087M326545p409618j3257279j6401995j4174450J56728
$$ 7364170 11020448 23902535 28229080 20819462 7562183 -8839812 -23014262 -22857534
1111b2857534J7568778J9824775P300230k058412k412439n638846j5136629j7788544
$$ -22857534 -5288756 14536019 21836249 19777837 17365398 11726552 -3410077 -21198621
1103b1198621p641261L772437P380401P600882P584505K905929l487594P6219
$$ -21198621 -28839882 -25067445 -17687044 -10086162 -2501657 404272 -3083322 -3007103
1095c007103J2137762J4442926K80956j2323741q019826K781173K819581n192632
$$ -3007103 9130659 23573585 23854541 11530800 3510974 6292147 9111728 3919096
1087C919096p238777j844703J772322J403869J814249K540347R1670j775711K744700
$$ 3919096 -3319681 -5164384 -3392062 -1988193 -173944 2366403 2458073 682362 3427062
1078C427062R098524P810767N17926j786774L357599N470674k490936j2985006
$$ 3427062 12525586 20336353 20854279 19067505 22425104 27895778 25404842 12419836
1070A2419836j4561236p590740k528546m358276n868122K92406Q153016N585817
$$ 12419836 -2141400 -9732140 -12260686 -16618962 -22487084 -22194678 -14041662 -8455845
1062h455845n475561p598770P190315K2281238J8338209J742883m931568L984199
$$ -8455845 -13931406 -21530176 -14339861 7941377 26279586 28022469 23090901 27075100
1054B7075100J2300059R129015J102080n342849j3364526k0747825j5786431J211396
$$ 27075100 39375159 48504174 49606254 44263405 30898879 10151054 -5635377 -4423981
1046d423981J0885476K724704p108765j999954O918895p93100j9892345k5933509
$$ -4423981 6461495 9186199 2077434 77480 6996375 6203275 -13689070 -39622579
1038c9622579j1136726Q087816J7693407J9799126J8853391J2727763K062325
$$ -39622579 -50759305 -42671489 -24978082 -5178956 13674435 26402198 28464523
1031B8464523o299448r932621j3072638j5289258r904043K942463J3092548J4007301
$$ 28464523 22165075 12232454 -840184 -16129442 -26033485 -23091022 -9998474 4008827
1023D008827R354962L438159l528272p669308k110804R249241J1739479J267373
$$ 4008827 13363789 16801948 13273676 5604368 3493564 12742805 24482284 25749657
1015B5749657p144474k319312M021148m346733k0048949k0809267l035656J2187341
$$ 25749657 18605183 16285871 20307019 15960286 -4088663 -24897930 -27933586 -15746245
1007a5746245R442538j693064m939102m45267J818056J200770M289113Q965541
$$ -15746245 -6303707 -7996771 -12935873 -13381140 -11563084 -10362314 -6073201 2892340
999B892340N898463m382118r959355n682878R5383J293764L250094Q782330Q814707
$$ 2892340 8790803 4408685 -5550670 -11233548 -11138165 -9844401 -6594307 2188023 11002730
990A1002730j244248q055974L45704J1209370L724844j5650962j8585408K232408
$$ 11002730 9758482 1702508 2048212 13257582 16982426 1331464 -17253944 -15021536
982a5021536K0102236J3441819m257153q515589L28778M748548P32476q09655
$$ -15021536 5080700 18522519 14265366 5749777 6078555 10827103 11559579 10749924
974A0749924K890989K771665l741187q379328p299564n774529n628693j652972
$$ 10749924 13640913 16412578 12671391 4292063 -3007501 -8782030 -14410723 -16063695
966a6063695O292346R946566N793965J089681J883304L797890O4954p806548j2197096
$$ -16063695 -9771349 175217 5969182 7058863 8942167 12740057 12805011 4998463 -7198633
957g198633q037636L027716J3158277J2797399J53845j3717028j5590605o097947
$$ -7198633 -15236269 -12208553 949724 13747123 13900968 183940 -15406665 -21504612
949b1504612J543957r73594q321719j1322725p565481K18721R174718J5994367
$$ -21504612 -19960655 -20934249 -29255968 -40578693 -48144174 -47925453 -38750735 -22756368
941b2756368J6827527J1201211L266188k142929k464611K062202P049803N818456
$$ -22756368 -5928841 5272370 8538558 6395629 3931018 5993220 13043023 18861479
933A8861479k211895q349856o101278j122781j366964l205951M23573L394584
$$ 18861479 16649584 8299728 2198450 1075669 -291295 -3497246 -3073673 320911
925C20911n307747j8605399j6520778K390796J5104521P732208m206976j707042
$$ 320911 -4986836 -23592235 -40113013 -37722217 -22617696 -14885488 -19092464 -20799506
917b0799506Q635053Q538096j537634n590264R89905O879394N271107J826638
$$ -20799506 -12164453 -3626357 -5163991 -10754255 -9764350 -2884956 2386151 4212789
909D212789J076517l21936l212745j243223P533820J3117969M960604j2764275
$$ 4212789 5289306 4967370 1754625 511402 8045222 21163191 26123795 13359520
901A3359520k3213653j4830858M972440J6481129R239336o254641j2937560r161568
$$ 13359520 -9854133 -24684991 -19712551 -3231422 6007914 -246727 -13184287 -22345855
893b2345855o392748p125831p80020J4058192K0583497Q442235p037150o006319
$$ -22345855 -28738603 -35864434 -36644454 -22586262 -2002765 6439470 -597680 -6603999
885f603999O503423J0481948K385637l563274j562688m51191l336769j624901
$$ -6603999 -100576 10381372 12767009 9203735 7641047 7189856 3853087 2228186
877B228186O410793R864762M618741J471226O284663P661337m259532j9353229
$$ 2228186 8638979 18503741 23122482 24593708 30878371 38539708 34280176 14926947
869A4926947k0815678q387287L867954P205357M774518K360251J957645K961613
$$ 14926947 -5888731 -14276018 -10408064 -3202707 1571811 3932062 5889707 8851320
861H851320L602689K658645K098654L648143K204309q128819j9148203j3066913
$$ 8851320 12454009 15112654 17211308 20859451 23063760 14934941 -4213262 -17280175
853a7280175J0412432K5274414J0821153j8220865k9571211j4924215M131177
$$ -17280175 -6867743 18406671 29227824 11006959 -18564252 -33488467 -29357290
846b9357290R109989M879167M078422P793732R245108N832232J5608n183982o859569
$$ -29357290 -20247301 -15368134 -11289712 -3495980 5749128 11581360 11596968 6412986 -446583
837d46583l984489q22276k258268m915599j308385O157252O095843l762943j1134226
$$ -446583 -4431072 -5253348 -7511616 -12427215 -13735600 -7578348 -1482505 -5245448 -16379674
828a6379674p717304j516650k013897m021163J698290J0302910R953340K131452
$$ -16379674 -24096978 -25613628 -27627525 -31648688 -29950398 -19647488 -9694148 -7562696
820g562696o17452L992195M485227l965217j0067557l753362Q394771J3425788
$$ -7562696 -8180148 -4187953 297274 -3667943 -13735500 -17488862 -9094091 4331697
812D331697R601819M756786K453425j109369q382664j5797235j7609460j0645311
$$ 4331697 13933516 18690302 21143727 20034358 11651694 -4145541 -21755001 -32400312
804c2400312K855064J4016755J2947328N43581r124002m532256Q241469J3492168
$$ -32400312 -29545248 -15528493 -2581165 -2037584 -11161586 -15693842 -7452373 6039795
796F039795O682990j570674k332726K76975k065942r073774j3080861q958985
$$ 6039795 12722785 11152111 8819385 9096360 7030418 -2043356 -15124217 -24083202
788b4083202J221116J0613158J2321601N118015l511127l909742M016790R894521
$$ -24083202 -22862086 -12248928 72673 5190688 1679561 -2230181 1786609 11681130
780A1681130O082806l088248q490833p513153l856812p39836L54309k070054o791239
$$ 11681130 17763936 14675688 6184855 -1328298 -5185110 -5924946 -5570637 -7640691 -14431930
771a4431930q248354l050956M527872Q600527R720528J0792128Q736695j292163
$$ -14431930 -22680284 -25731240 -21203368 -12602841 -2882313 7909815 16646510 15354347
763A5354347j4926821k0675874j3930371j850276O822444J0594347J2734379J5533164
$$ 15354347 427526 -20248348 -34178719 -36028995 -29206551 -18612204 -5877825 9655339
755I655339J8298935J7215563Q187597n879958j3943004r691785j631036j176985
$$ 9655339 27954274 45169837 53357434 47477476 33534472 23842687 22211651 21034666
747B1034666n089753k498041M094908K186592o070666l259811J3004344K0475755
$$ 21034666 15944913 13446872 17541780 19728372 13657706 10397895 23402239 43877994
739D3877994N627409j2685958j0971392L091837M807246q265128j6173186j0999027
$$ 43877994 49505403 36819445 25848053 28939890 33747136 25482008 9308822 -1690205
731a690205n796749p667693n903109O058482J6777168J4732080M889033k267179
$$ -1690205 -7486954 -15154647 -21057756 -14999274 1777894 16509974 21399007 19131828
723A9131828n649999q280828q111718l531602P20071J181573J369657L512700
$$ 19131828 13481829 5201001 -2910717 -6442319 -5722248 -4540675 -3171018 341682
715C41682L266185j162687l843367j281913J917832L301190O869608J0515340
$$ 341682 3607867 2445180 -1398187 -2680100 -762268 2538922 9408530 19923870
707A9923870L421905j3802902k1446093p720205J0086102R551039l176328n051762
$$ 19923870 23345775 9542873 -11903220 -19623425 -9537323 13716 -3162612 -8214374
699h214374O447624J1891520L280755n707809n345604k987098m659412l964661
$$ -8214374 -1766750 10124770 13405525 7697716 2352112 -634986 -5294398 -9259059
691i259059K367022N784280J991156n87668J971955l02566j1667334j7123765
$$ -9259059 -6892037 -1107757 883399 295731 2267686 1965120 -9702214 -26825979
683b6825979l635422J6950027K2374577R440068n698157j0349642m757455N459570
$$ -26825979 -30461401 -13511374 8863203 18303271 12605114 2255472 -2501983 2957587
675B957587J2844895R054577m613586j2413004l096486J1436977J1201672k681343
$$ 2957587 15802482 24857059 20243473 7830469 4733983 16170960 27372632 24691289
667B4691289j0837910n367302K011288K697718K872161O978860P185316j549012
$$ 24691289 13853379 8486077 10497365 13195083 16067244 23046104 30231420 28682408
659B8682408j0001392q670951k317604n60390l238324m817578m957068m828689
$$ 28682408 18681016 10010065 7692461 7132071 3893747 -923831 -5880899 -10709588
651a0709588p63990P812611J1133290J576674j1869797j3976549m549842L193350
$$ -10709588 -11473578 -3660967 7472323 9048997 -2820800 -16797349 -21347191 -18153841
643a8153841L212273J865431K226895k149942j2635891j7084439n240014J4428679
$$ -18153841 -14941568 -13076137 -10849242 -12999184 -25635075 -42719514 -47959528 -33530849
635c3530849K2788470J2655406l636458r159813l42367J1016448J1769374K202001
$$ -33530849 -10742379 1913027 -1723431 -10883244 -11225611 -209163 11560211 13762212
627A3762212m826312p66185O344620K624220j0531666j6099530n269411Q985446
$$ 13762212 8935900 8169715 14514335 17138555 6606889 -9492641 -14762052 -5776606
619e776606J0609813M213745O734722J8826579K0910505K039427k1618580k7209703
$$ -5776606 4833207 9046952 15781674 34608253 55518758 57558185 35939605 8729902
611H729902j4384278j351116K416134M285994R736679J1605038M445321l169318
$$ 8729902 -5654376 -7005492 -4589358 -303364 9433315 21038353 25483674 22314356
603B2314356j389168M056707K40060j1577233j5996299n713461P781686J0004470
$$ 22314356 20925188 24981895 25221955 13644722 -2351577 -8065038 -283352 9721118
595I721118J497357n664037l821039L634351Q497785N880998k329095r198198
$$ 9721118 11218475 5554438 1733399 5367750 13865535 19746533 17417438 8219240
587H219240r478101n926858n766976r538445q599521K652786J6956976K2180161
$$ 8219240 -1258861 -7185719 -12952695 -22491140 -31090661 -28437875 -11480899 10699262
579A0699262J5884860N838368j533682n902770p168432l550996J821384L20601
$$ 10699262 26584122 32422490 30888808 24986038 17817606 14266610 16087994 16408595
571A6408595j0156308j7785954r717861R016383J8464271Q587818o722710p581224
$$ 16408595 6252287 -11533667 -21251528 -12235145 6229126 14816944 8094234 513010
563E13010N048431J1213773N71408j3188680j2638205p69623O339119M168814
$$ 513010 5561441 16775214 17346622 4157942 -8480263 -9249886 -2910767 1258047
555A258047K409211M939766L543893m557493q338867q80932O996875K942168o593581
$$ 1258047 3667258 8607024 12150917 7593424 -745443 -1626375 5370500 8312668 1719087
546A719087o398009L054748O717605j197733r593831q571487j733352L730701
$$ 1719087 -4678922 -1624174 5093431 3895698 -5698133 -14269620 -16002972 -12272271
538a2272271P377145R744939O288795m642999j4342558j2526784k59493J1848672
$$ -12272271 -4895126 4849813 11138608 6495609 -7846949 -20373733 -20633226 -8784554
530h784554J5549105J0658103K353548k787574j363985K342374L87427o612046
$$ -8784554 6764551 17422654 19776202 16988628 15624643 17967017 18354444 11742398
522A1742398p282861M045716J4718713P972003j2591230k4445002j4234506N740657
$$ 11742398 4459537 8505253 23223966 31195969 18604739 -5840263 -20074769 -14334112
514a4334112J4315949O757697m244253p750537n126101j614801L582775J3458820
$$ -14334112 -18163 6739534 2495281 -5255256 -10381357 -11996158 -8413383 5045437
506E045437K3561907K3378754R253878q332857j5006723r252124l782004q015891
$$ 5045437 28607344 51986098 61239976 52907119 37900396 28648272 24866268 16850377
498A6850377j4516442r444588N716521J2518495m41163j9805243k2485071n111924
$$ 16850377 2333935 -7110653 -1394132 11124363 10683200 -9122043 -31607114 -36719038
490c6719038J1783317J0405618l212512j0342020m300894M901194P286201M225183
$$ -36719038 -24935721 -14530103 -17742615 -28084635 -32385529 -27484335 -20198134 -15972951
482a5972951J868251J616848J187399j34990j630391l311594m583193l404673
$$ -15972951 -14104700 -12487852 -11300453 -11435443 -13065834 -16377428 -20960621 -24365294
474b4365294M27152L814472M573113M013559L016448j81767m733136m701369K200615
$$ -24365294 -23938142 -20123670 -15550557 -11536998 -8520550 -8702317 -13435453 -18136822 -15936207
465a5936207P463824J633283j0239751j2388717M54878J4223357J3113723l1656
$$ -15936207 -8472383 -6839100 -17078851 -29467568 -29012690 -14789333 -1675610 -1707266
457a707266q310290l307861N048310L447671o269410j0068679j682707Q398663
$$ -1707266 -10017556 -13325417 -8277107 -4829436 -11098846 -21167525 -22850232 -14451569
449a4451569P906016K47299j550639M733396P753624K009885k517692K744258
$$ -14451569 -6545553 -6298254 -7848893 -3115497 4638127 6648012 4130320 6874578
441F874578R343197M588152p343310j0986668l167714L317702K63054n078127
$$ 6874578 16217775 20805927 13462617 2475949 -691765 2625937 2888991 -2189136
433b189136l473024L020228O673400M676458q96224o931920r138583m661672J834131
$$ -2189136 -5662160 -2641932 4031468 8707926 7811702 879782 -8258801 -12920473 -11086342
424a1086342J792019m330038n952462J574717Q695805N809016k335011m475424
$$ -11086342 -9294323 -13624361 -19576823 -18002106 -9306301 -3497285 -5832296 -10307720
416a0307720J067398O655647P210936L538425k891519j0275438j3443532q079765
$$ -10307720 -9240322 -2584675 4626261 8164686 5273167 -5002271 -18445803 -26525568
408b6525568K210468Q636329O991575Q63445l949164m762364k623168j6293K635918
$$ -26525568 -24315100 -15678771 -8687196 -7823751 -11772915 -16535279 -19158447 -19174740 -16538822
399a6538822P744019J4814321J6185686O011288p287528q469029K323957P494430
$$ -16538822 -8794803 6019518 22205204 28216492 20928964 12459935 14783892 22278322
391B2278322k104009j2636039q575567L711802P093853j015685r380357j2089629
$$ 22278322 20174313 7538274 -1037293 2674509 9768362 8752677 -627680 -12717309
383a2717309j1553548p348593K204420J0484784R690608M736570N051514O316382
$$ -12717309 -24270857 -31619450 -29415030 -18930246 -9239638 -4503068 548446 6864828
375F864828j801386j2468493p846988R850999J6266615Q81189j6117812j3940826
$$ 6864828 5063442 -7405051 -15252039 -5401040 10865575 11746764 -4371048 -18311874
367a8311874M62170P909064N090239J342573l37307k228208o93818P371116J3145682
$$ -18311874 -17849704 -9940640 -4850401 -3507828 -3845135 -6073343 -6767161 603955 13749637
358A3749637O972181l532494k622387Q242288J0545822l787785j9545336j8679524
$$ 13749637 20721818 17189324 14566937 22809225 33355047 29567262 10021926 -8657598
350h657598l343243Q996763Q122749J638671L115622J3548096J8471909O043755
$$ -8657598 -12000841 -3004078 5118671 6757342 9872964 23421060 41892969 47936724
342D7936724j5184820k4282058j4300484o38912J504068k793843R06Q990195J1267888
$$ 47936724 32751904 8469846 -5830638 -6469550 -4965482 -7759325 -7758419 1231776 12499664
333A2499664L058072n487804o575203l596438j448577J249523N723712O883272
$$ 12499664 15557736 10069932 3494729 -101709 -1550286 -300763 5422949 12306221
325A2306221l38416j2259205j8635264j2736082K163543J5670924J9763427J5506618
$$ 12306221 11967805 -291400 -18926664 -31662746 -29499203 -13828279 5935148 21441766
317B1441766Q775202J014544r561724j7828344j3573298J521436J0034484J524292
$$ 21441766 30216968 31231512 21669788 3841444 -9731854 -8210418 1824066 3348358
309C348358j0803082q827206L535923Q111410J482772k486462K313036O111261
$$ 3348358 -7454724 -16281930 -12746007 -4634597 -3151825 -5638287 -3325251 2786010
301B786010K942442J29839K308665K610007k524146m882433J86422M022727K90170
$$ 2786010 5728452 5858291 8166956 10776963 8252817 3370384 3556806 7579533 7869703
292G869703l097978O29936K669937o004881j5507366r811804Q149898K0289222
$$ 7869703 4771725 5401661 8071598 2066717 -13440649 -23252453 -15102555 5186667
284E186667J7913331P629753l353345j2415224j4675715p053372J344483j614213
$$ 5186667 23099998 30729751 27376406 14961182 285467 -6767905 -5423422 -7037635
276g037635j1209382j1028416P85675Q033472L310341k34747P410829J5135343
$$ -7037635 -18247017 -29275433 -28489758 -20456286 -17145945 -17380692 -9969863 5165480
268E165480R603288j768320k795013N865053R794646M078977k707601n296145
$$ 5165480 14768768 13000448 10205435 16070488 25865134 29944111 27236510 21940365
260B1940365p035511q307366m169185L723873N581465j673129q564402p078479
$$ 21940365 14904854 6597488 2428303 6152176 11733641 10060512 1496110 -5582369
252e582369j417606O26102j031621k085123j732381j138933N31137K950588K493503
$$ -5582369 -6999975 -6373873 -7405494 -9490617 -11222998 -12361931 -11830794 -8880206 -6386703
243f386703j524003l549232K3256M762593N888394N926565P715930O298721k623347
$$ -6386703 -7910706 -11459938 -11436682 -6674089 -785695 5140870 12856800 19155521 16532174
234A6532174j1278909q585178K111557O325370m92010p286674n106135R98394
$$ 16532174 5253265 -3331913 -1220356 5105014 4613004 -2673670 -7779805 -6781411
226f781411K229158j591675n408228o668153m393270K199865R205376R548825
$$ -6781411 -4552253 -6143928 -11552156 -18220309 -22613579 -20413714 -11208338 -1659513
218a659513L949471K192579P700939J0207192K096261p189830m544677N978983
$$ -1659513 2289958 4482537 12183476 22390668 24486929 17297099 12752422 18731405
210A8731405R014384N52877q655890j0539226p363448k318974M289541Q099292
$$ 18731405 27745789 28298666 19642776 9103550 1740102 -578872 3710669 11809961
202A1809961L057545o242077p260803J211761N380621j677488p416795J160190
$$ 11809961 14867506 8625429 1364626 2576387 7957008 6279520 -1137275 22915
194B2915J6591104K1183531J1035857k341490r711282j1512380j0274512o977979
$$ 22915 16614019 37797550 48833407 46491917 36780635 25268255 14993743 8015764
186H015764m310722m151819k693435L264350P372946J648697q301792q740586
$$ 8015764 3705042 -446777 -3140212 124138 7497084 9145781 843989 -7896597
178g896597Q39396N890245q4850n563027j596254K476981l650303j0717030l825215
$$ -7896597 -7057201 -1166956 -1251806 -6814833 -8411087 -5934106 -9584409 -20301439 -24126654
169b4126654J0818124J3020942N29405o733207J893112J1702474P076603m882449
$$ -24126654 -13308530 -287588 241817 -6491390 -4598278 7104196 14180799 9298350
161I298350q514459m052992j661410p72522N748732J2122472M985676j1567248
$$ 9298350 783891 -3269101 -4930511 -5703033 45699 12168171 17153847 5586599
153E586599j6444880k188500J3005243J2340682L122105O70127L721118J277209
$$ 5586599 -10858281 -13046781 -41538 12299144 15421249 16091376 19812494 21089703
145B1089703n875349p624646l533664l108639q514951j1344011p082470n36488
$$ 21089703 15214354 7589708 4056044 947405 -7567546 -18911557 -25994027 -26530515
137b6530515L956771O545991N653444q04228p072417m186547N358787R347683
$$ -26530515 -22573744 -16027753 -10374309 -11178537 -18250954 -22437501 -17078714 -7731031
129g731031M230411q78804j266222l203911q298164o870451L856655R686053N59405
$$ -7731031 -3500620 -4379424 -5645646 -8849557 -17147721 -24018172 -20161517 -10475464 -9916059
120i916059j0428327n020464J1753578J8626987R167265j847935k674262J414389
$$ -9916059 -20344386 -25364850 -13611272 5015715 14182980 12335045 9660783 11075172
112A1075172J655357q65732j370019m35960o00045j279825j999016m266872o277885
$$ 11075172 12730529 11864797 10494778 10058818 9458773 8178948 6179932 1913060 -4364825
103d364825k533772O503890J0837198L313158q853634j1774208k231706Q686480
$$ -4364825 -6898597 -394707 10442491 13755649 4902015 -6872193 -9103899 -417419
95d17419R525860J505505m345315r53995O713830Q353895J221700p205775r668564
$$ -417419 9108441 10613946 6268631 5314636 12028466 20382361 21604061 14398286 4729722
86D729722p204162l932904P03220Q197296J3271712Q568806l363832j1026496
$$ 4729722 -2474440 -6407344 -5704124 2493172 15764884 24333690 20969858 9943362
78I943362q640660k829144j945792m981623n045764M73524P189651Q902953L533283
$$ 9943362 1302702 -1526442 -3472234 -8453857 -13499621 -13026097 -5836446 3066507 6599790
69F599790m082842n389038K314233J0264036P727035l260413r974367o737738
$$ 6599790 2516948 -2872090 -557857 9706179 17433214 14172801 4198434 -2539304
61b539304j660732k427394n002847k898946J057037J276263Q66050N572212J0820093
$$ -2539304 -4200036 -6627430 -11630277 -14529223 -13472186 -12195923 -11329873 -5757661 5062432
52E062432P224723k665002o347807j537737p79371j0392628j7413559p910831
$$ 5062432 12287155 9622153 3274346 1736609 957238 -9435390 -26848949 -34759780
44c4759780J0396913J7107448P039329m706391o411999m518130q357147j1893952
$$ -34759780 -24362867 -7255419 -216090 -4922481 -11334480 -15852610 -24209757 -36103709
36c6103709k949570J4719961K2485760J1489466n033285r263548n28657P513692
$$ -36103709 -39053279 -24333318 -1847558 9641908 4608623 -4654925 -5183582 2330110
28B330110O215942K35762k130025K11945J788379j414853o443650o113260J541367
$$ 2330110 8546052 8781814 6651789 6863734 8652113 7237260 793610 -5319650 -3778283
19c778283Q021181M016601n480996m778261R408308J8980977Q474545j0936354
$$ -3778283 4242898 8259499 2778503 -1999758 7408550 26389527 34864072 23927718
11B3927718j5899566l907773N520269J510255n374042m937475l120635o858973
$$ 23927718 8028152 4120379 9640648 11150903 5776861 839386 -2281249 -9140222
3i140222r365212l071869N183641
$$ -9140222 -18505434 -21577303 -16393662
0a6393662
$$ -16393662
##END NTUPLES=NMR SPECTRUM
##END=
