##TITLE=31Pdec_SR1516_3
 D2O, 24 sc
 30.7.2020
##JCAMPDX= 6.0         $$ Bruker NMR JCAMP-DX V2.0
##DATA TYPE= NMR SPECTRUM
##DATA CLASS= NTUPLES
##ORIGIN= UXNMR, Bruker Analytische Messtechnik GmbH
##OWNER= root
$$ XWIN-NMR		Version 3.5
$$ Thu Jul 30 09:59:41 2020 Russian Standard Time (UT+4h)  she@DPX200
##.OBSERVE FREQUENCY= 81.013821
##.OBSERVE NUCLEUS= ^31P
##.ACQUISITION MODE= SIMULTANEOUS
##.ACQUISITION SCHEME= undefined
##.AVERAGES= 24
##.DIGITISER RES= 17
##SPECTROMETER/DATA SYSTEM= spect
##.PULSE SEQUENCE= zgpg30
##.SOLVENT NAME= THF
##.SHIFT REFERENCE= (INTERNAL, THF, 0, 182.463)
##AUDIT TRAIL= $$ (NUMBER, WHEN, WHO, WHERE, WHAT)
$$ ##TITLE= Audit trail, XWIN-NMR		Version 3.5
$$ ##JCAMPDX= 5.01
$$ ##ORIGIN= Bruker BioSpin GmbH
$$ ##OWNER= she
$$ F:/spectra/data/she/nmr/P31/1/pdata/1/auditp.txt
$$ ##AUDIT TRAIL=  $$ (NUMBER, WHEN, WHO, WHERE, WHAT)
(   1,<2020-07-30 09:58:31.14 +0400>,<she>,<DPX200>,
      <created by zg, POWCHK disabled, PULCHK disabled
       configuration hash MD5:
       00 E9 B6 7A A2 85 ED C7 34 08 36 98 17 FE 4E 26
       data hash MD5: 32K
       53 49 9C 9C C0 45 A7 F4 4D 3B 2D 63 1F 74 B8 A9>)
(   2,<2020-07-30 09:58:35.25 +0400>,<she>,<DPX200>,
      <Start of raw data processing
       efp BC_mod = 2 LB = 1 FT_mod = 6 PKNL = 1 PHC0 = -3146.262 PHC1 = 1120.602 SI = 64K 
       data hash MD5: 64K
       4D 3E B9 77 C6 5D F5 2A 78 70 76 A3 49 F2 B6 08>)
(   3,<2020-07-30 09:59:07.32 +0400>,<she>,<DPX200>,
      <pk PHC0 = -119.5432 PHC1 = 162 
       data hash MD5: 64K
       06 A3 98 67 92 03 5B 80 C7 41 49 BF FF 69 15 24>)
(   4,<2020-07-30 09:59:10.40 +0400>,<she>,<DPX200>,
      <abs ABSG = 5 
       data hash MD5: 64K
       04 71 96 CF 44 44 7E F0 38 A9 77 1A 23 AA 54 8A>)
$$ ##END=
$$ 
$$ hash MD5
$$ D4 FD 84 59 D8 3D 21 B9 96 31 83 06 47 C4 16 2C
##$RELAX= 
##$RELAX= 
##$RELAX= 
##$RELAX= 
##$RELAX= 
##$RELAX= 
##$RELAX= 
##$RELAX= 
$$ Bruker specific parameters
$$ --------------------------
##$DU= <F:/spectra>
##$EXPNO= 1
##$NAME= <P31>
##$PROCNO= 1
##$TYPE= <nmr>
##$USER= <she>
##$AMP= (0..31)
100 100 100 100 100 100 100 100 100 100 100 100 100 100 100 100 100 100 
100 100 100 100 100 100 100 100 100 100 100 100 100 100 
##$AQSEQ= 0
##$AQ_mod= 1
##$AUNM= <au_zg>
##$AUTOPOS= <>
##$BF1= 81.014009
##$BF2= 200.13
##$BF3= 200.13
##$BF4= 200.13
##$BF5= 200.13
##$BF6= 200.13
##$BF7= 200.13
##$BF8= 200.13
##$BYTORDA= 1
##$CFDGTYP= 0
##$CFRGTYP= 5
##$CHEMSTR= <none>
##$CNST= (0..31)
1 1 145 1 1 1 1 1 1 1 1 1 1 1 1 1 1 1 1 1 1 1 1 1 1 1 1 1 1 1 1 1 
##$CPDPRG= <waltz16>
##$CPDPRG1= <>
##$CPDPRG2= <waltz16>
##$CPDPRG3= <>
##$CPDPRG4= <mlev>
##$CPDPRG5= <mlev>
##$CPDPRG6= <mlev>
##$CPDPRG7= <mlev>
##$CPDPRG8= <mlev>
##$CPDPRGB= <>
##$CPDPRGT= <>
##$D= (0..31)
0 1 0 0 0 0 0 0 0 0 0 0.03 2e-05 3e-06 0 0 0 0 0 0 0 0 0 0 0 0 0 0 0 0 
0 0 
##$DATE= 1596088710
##$DBL= (0..7)
120 120 120 11 120 120 24 19 
##$DBP= (0..7)
150 150 150 150 150 150 150 150 
##$DBP07= 0
##$DBPNAM0= <>
##$DBPNAM1= <>
##$DBPNAM2= <>
$$ [...]
##$SUBNAM3= <"">
##$SUBNAM4= <"">
##$SUBNAM5= <"">
##$SUBNAM6= <"">
##$SUBNAM7= <"">
##$SUBNAM8= <"">
##$SUBNAM9= <"">
##$SW= 369.568048894756
##$SWIBOX= (0..15)
0 1 3 0 0 0 0 0 0 0 0 0 0 0 0 0 
##$SW_h= 29940.119760479
##$TD= 32768
##$TD0= 1
##$TE= 0
##$TE2= 300
##$TE3= 300
##$TEG= 300
##$TL= (0..7)
0 120 53 12 22 120 120 120 
##$TP= (0..7)
150 150 150 150 150 150 150 150 
##$TP07= 0
##$TPNAME0= <>
##$TPNAME1= <>
##$TPNAME2= <>
##$TPNAME3= <>
##$TPNAME4= <>
##$TPNAME5= <>
##$TPNAME6= <>
##$TPNAME7= <>
##$TPOAL= (0..7)
0.5 0.5 0.5 0.5 0.5 0.5 0.5 0.5 
##$TPOFFS= (0..7)
0 0 0 0 0 0 0 0 
##$TUNHIN= 0
##$TUNHOUT= 0
##$TUNXOUT= 0
##$USERA1= <user>
##$USERA2= <user>
##$USERA3= <user>
##$USERA4= <user>
##$USERA5= <user>
##$V9= 5
##$VALIST= <valist>
##$VCLIST= <CCCCCCCCCCCCCCC>
##$VD= 0
##$VDLIST= <DDDDDDDDDDDDDDD>
##$VPLIST= <PPPPPPPPPPPPPPP>
##$VTLIST= <TTTTTTTTTTTTTTT>
##$WBST= 1024
##$WBSW= 4
##$XGAIN= (0..3)
0 0 0 0 
##$XL= 0
##$YL= 0
##$YMAX_a= 5067
##$YMIN_a= -5674
##$ZGOPTNS= <>
##$ZL1= 120
##$ZL2= 120
##$ZL3= 120
##$ZL4= 120
##$ABSF1= 182.463
##$ABSF2= -187.1042
##$ABSG= 5
##$ABSL= 3
##$ALPHA= 0
##$AQORDER= 0
##$ASSFAC= 0
##$ASSFACI= 0
##$ASSFACX= 0
##$ASSWID= 0
##$AUNMP= <proc_1d>
##$AZFE= 0.1
##$AZFW= 0.5
##$BCFW= 0
##$BC_mod= 2
##$BYTORDP= 0
##$COROFFS= 0
##$CY= -3
##$DATMOD= 1
##$DC= 0
##$DFILT= <>
##$DTYPP= 0
##$F1P= 0
##$F2P= 0
##$FCOR= 1
##$FTSIZE= 65536
##$FT_mod= 6
##$GAMMA= 0
##$GB= 0
##$INTBC= 1
##$INTSCL= 5.30512e-09
##$ISEN= 30
##$LB= 1
##$LEV0= 0
##$LPBIN= 0
##$MAXI= 10000
##$MC2= 0
##$MEAN= 0
##$ME_mod= 0
##$MI= 50
##$NCOEF= 0
##$NC_proc= -8
##$NLEV= 6
##$NOISF1= 182.463
##$NOISF2= 159.3651
##$NSP= 0
##$NTH_PI= 0
##$NZP= 0
##$OFFSET= 182.463
##$PC= 4
##$PHC0= -3265.805
##$PHC1= 1282.602
##$PH_mod= 1
##$PKNL= yes
##$PPARMOD= 0
##$PSCAL= 0
##$PSIGN= 0
##$REVERSE= no
##$SF= 81.0140089999434
##$SI= 65536
##$SIGF1= 159.3651
##$SIGF2= -187.1042
##$SINO= 113.3802
##$SIOLD= 16384
##$SREGLST= <1H.CDCl3>
##$SSB= 0
##$STSI= 65536
##$STSR= 0
##$SW_p= 29940.119760479
##$SYMM= 0
##$S_DEV= 0
##$TDeff= 32768
##$TDoff= 0
##$TI= <>
##$TILT= no
##$TM1= 0
##$TM2= 0
##$TOPLEV= 0
##$USERP1= <user>
##$USERP2= <user>
##$USERP3= <user>
##$USERP4= <user>
##$USERP5= <user>
##$WDW= 1
##$XDIM= 65536
##$YMAX_p= 331797469
##$YMIN_p= -115561378
$$ End of Bruker specific parameters
$$ ---------------------------------
##NTUPLES= NMR SPECTRUM
##VAR_NAME=  FREQUENCY,     SPECTRUM/REAL,   SPECTRUM/IMAG
##SYMBOL=    X,             R,               I
##VAR_TYPE=  INDEPENDENT,   DEPENDENT,       DEPENDENT
##VAR_FORM=  AFFN,          ASDF,            ASDF
##VAR_DIM=   65536,         65536,           65536
##UNITS=     HZ,            ARBITRARY UNITS, ARBITRARY UNITS
##FACTOR=    0.456856943014862, 1,           1
##FIRST=     14782.0589164792, 0,            0
##LAST=      -15158.0608439998, 0,           0
##MIN=       -15158.0608439998, -115561378,  0
##MAX=       14782.0589164792, 331797469,    0
$$ Real data points
##PAGE= N=1
##DATA TABLE= (X++(R..R)), XYDATA
$$ [...]
41131H16870R41827J986282k592572n435517j1312P942548Q556434K159323k533903
41122A1829980j568533P35528L42759j556774k716871l182165l229852k374880
41114a720808j426254j699050j602214J813682O981125P964889K413883m607852
41106H117401p222684n622897l381131j274552J967042M925774M542033J564080
41098C615066K42695J656336J733214j840968m714528j881605L864884M778046
41090G453140p64359n518413l630266J456122L264215K147997K722332L944511
41082A1075279L772q023631j0067819j319794Q304559O367754m455150r577108
41074g692138k405203P468101P930720q73278r245051j0329882n272454R10648
$$ plain form
41131 816870 1758697 3744979 1152407 -4283110 -4294422 3648126 12204560 14363883 11829980
41122 11829980 10261447 10996975 11339734 9782960 7066089 3883924 654072 -1720808
41114 -1720808 -3147062 -4846112 -6448326 -4634644 2346481 10311370 12725253 8117401
41106 8117401 894717 -4728180 -8109311 -9383863 -7416821 -2491047 2050986 3615066
41098 3615066 3857761 5514097 7247311 5406343 691815 -1189790 2675094 7453140
41090 7453140 6688781 1170368 -2459898 -1003776 2260439 4408436 7130768 11075279
41082 11075279 11079051 3055420 -7012399 -8332193 -27634 6340120 1884970 -7692138
41074 -7692138 -10097341 -2629240 5301480 4428202 -4816849 -15146731 -20419185 -19508537
41066a9508537M241188L948765K783289M166622P377493P737266L393025j264822
41058A2874289j918078o62907j676848l551381j959563J666820J372123k963585
41050C180870m144731P00238M357895O66799m729741k420423N712878Q566899
41042A1890684K263462m763824n309778l220118m503083n884711l68101R514813
41034c80656J2973599N556005m833070q370670m237930J230507K778575j86392
41026D529968m804799o795704l725018J749506M227527K363533J40155J96618
41018b118214L68081p49645P0667M642276P865986M125824l604991p143882m063538
41009f07436L87013J268371j518570n606734p537301l063707P456775J4851008
$$ plain form
41066 -19508537 -15267349 -11318584 -8535295 -4368673 3008820 10746086 14139111 12874289
41058 12874289 10956211 10293304 8616456 5065075 3105512 4772332 6144455 3180870
41050 3180870 -963861 -263623 4094272 4761071 31330 -2389093 3323785 11890684
41042 11890684 14154146 9390322 4080544 860426 -3642657 -9527368 -9895469 -380656
41034 -380656 12592943 18148948 13315878 4945208 707278 1937785 4716360 4529968
41026 4529968 -274831 -7070535 -10795553 -9046047 -4818520 -2454987 -2314832 -2118214
41018 -2118214 -1750133 -2499778 -2429111 2213165 10079151 14204975 10599984 3456102 -607436
41009 -607436 -220423 1047948 -470622 -6077356 -13614657 -16678364 -9221589 5629419
41001E629419R844474l626455j1594798p789763m324L287309L382126M178464
40993C306452L875774O79527r85805J872684L376257j997389q249330o257062
40985d378892P86348K041465k962768l797613K698611O847221K671484k119968
40977A785888M82249N634959M829946L48590N3077K981456J562286m094963n661126
40968G922362r34210K126942j139351m359553j365537L007651J191204l747719
40960B701789k494442N117365Q849258L146380n103723p102173l354964K44835
40952B004325J672470K032309r8404o103710j1054819p879878J609924O994344
40944a0823439K980063l140265j666763O319828J0916524O391966k514776p233724
$$ plain form
41001 5629419 15473893 11847438 252640 -7537123 -7541447 -4254138 -872012 3306452
40993 3306452 7182226 7861753 6875948 8748632 12124889 10127500 1878170 -4378892
40985 -4378892 -3592544 -1551079 -4513847 -8311460 -5612849 1234372 3905856 1785888
40977 1785888 2268137 7903096 12733042 13081632 13134709 16116165 17678451 13583488 7922362
40968 7922362 6988152 9115094 7975743 3616190 2250653 5258304 6449508 2701789
40960 2701789 207347 5324712 14173970 17320350 12216627 5114454 1759490 2004325
40952 2004325 3676795 5709104 5610700 -493010 -11547829 -19427707 -17817783 -10823439
40944 -10823439 -7843376 -10983641 -12650404 -6330576 4585948 10977914 8463138 1229414
40936A229414m933160k40403J217691n36410p76415K391873M277302K50486o125946
40927c245568o742788m15950N053921L725582j189077l580835k758113j595551
40919a0748379o64063J161473L106685L654361L121888J981513o26928l805532
40911b818982l889382Q881L255149K348628J65210K18085M69667j615770k795111
40902d653625K30836L308277J157676k677715j454380K405931J258812l366904
40894c791092k444441M191605O040544m67958n151023o27953N590915L702777
40886G043374k854386m248358k36125J184373k156089l805301K86742N813172
40878A027402O700610K474816k745239n564670o013506n879693n174948j628659
$$ plain form
40936 1229414 -3703746 -3944149 -2726458 -3262868 -4039283 -1647410 2629892 2880378 -3245568
40927 -3245568 -9988356 -10404306 -5350385 -1624803 -2813880 -6394715 -9152828 -10748379
40919 -10748379 -11412442 -10250969 -7144284 -3489923 -368035 1613478 986550 -2818982
40911 -2818982 -6708364 -6699483 -3444334 -1095706 -930496 -712411 -242744 -1858514 -4653625
40902 -4653625 -4422789 -1114512 43164 -2634551 -4088931 -1683000 -424188 -3791092
40894 -3791092 -6235533 -2043928 3996616 3528658 -1622365 -2250318 3340597 7043374
40886 7043374 4188988 -59370 -295495 888878 -1267211 -5072512 -4785770 1027402
40878 1027402 7728012 10202828 7457589 1892919 -4120587 -10000280 -15175228 -16803887
40870a6803887M695325Q436955M983497j727730l468905L00470J942905j692492
40862c333862m468480j963115J330571R08860J78951K675848L746716j528612
40854b453123p923005o923627K2486M471848M284888M412562O007278M490904
40846F390211j062681n133666m005991k37615K413609K939823J302305j892223
40838G13772l466834o03174M007699M836354J209200k525520l770114l194216
40830b792833n69494M414276P694864M376732k834400n871105k855723r731o21998
40821I30588k92748L702760O283554K909569k275339k685329P49602J934051q77717
40812A0378991l653395l532794k402162l120382n125360m915896m28562N338578
$$ plain form
40870 -16803887 -12108562 -3671607 1311890 -415840 -3884745 -3584275 -1641370 -3333862
40862 -3333862 -7802342 -9765457 -8434886 -7526026 -7347075 -4671227 -924511 -2453123
40854 -2453123 -10376128 -17299755 -17277269 -12805421 -8520533 -4107971 1899307 6390211
40846 6390211 5327530 193864 -3812127 -4049742 -1636133 1303690 2605995 713772
40838 713772 -2753062 -3356236 651463 5487817 6697017 4171497 401383 -2792833
40830 -2792833 -3362327 1051949 8746813 13123545 10289145 4418040 1562317 1552586 930588
40821 930588 637840 4340600 10624154 13533723 11258384 8573055 9322657 11256708 10378991
40812 10378991 6725596 3192802 790640 -2329742 -7455102 -12370998 -12799560 -7460982
40804g460982O444569J360440l731183k459956K596675L466635j204561m221448
40796e209811j203899K844710J844641j883232j304374N186726J1636945J1363303
40788B3275009L534240n937375r240508m370522J996750K236634k363963m117129
40780E013136p45928J998514P06104l35004K349998M678784K114392k181967k453740
40771A1144289N16912J424871j381766n128909p444835p186420l239305K772882
40763h522281N535951K675121p67778M06610L340066K213134j837455l130277
40755h6909j264490n99198j421659j00923K328750P06937l953495l671828M039773
40746d023042J1090868J0378277N141473J648971o83503n122527q901954o860084
$$ plain form
40804 -7460982 -1016413 344027 -3387156 -5847112 -3250437 216198 -988363 -5209811
40796 -5209811 -6413710 -3569000 -1724359 -3607591 -4911965 274761 11911706 23275009
40788 23275009 26809249 20871874 11631366 7260844 9257594 11494228 9130265 5013136
40780 5013136 4267208 6265722 6971826 6636822 8986820 13665604 15779996 13598029 11144289
40771 11144289 11661201 13086072 11704306 6575397 -869438 -8055858 -11295163 -8522281
40763 -8522281 -2986330 -311209 -1078987 -672377 2667689 4880823 3043368 -86909
40755 -86909 -1351399 -1950597 -3372256 -3473179 -1144429 -437492 -4390987 -8062815 -4023042
40746 -4023042 7067826 17446103 22587576 24236547 23553044 18430517 9528563 2668479
40738B668479j010911J637429k653n6246L786271O212406L410110l93204r8149
40729A6153532J617552j087825o884608q542735m202502n16826k427568n677470
40721a1568450l647593K453370N512796K679232j519548j851168K052069O882921
40713I93629Q835544N712677n54106l924353r82416K970862J88047p064330p855025
40704a679471Q60711P158540J58237j2862656j4527689m77752J4714555J6122778
40696I467253N499694l823667l817028J480345L868590P60661l820735n121330
40688D493783k241179K497481O292292O868646K943783l663848p732026n982771
40680C476161k110751k199867n263377m041057L300233Q798616N942570n83724
$$ plain form
40738 2668479 1657568 3294997 3292344 3236098 7022369 13234775 16644885 16251681 16153532
40729 16153532 17771084 16683259 9798651 1255916 -2946586 -3463412 -5890980 -11568450
40721 -11568450 -15216043 -12762673 -7249877 -4570645 -6090193 -7941361 -5889292 993629
40713 993629 9829173 15541850 14987744 11063391 10080975 13051837 13239884 6175554 -1679471
40704 -1679471 -818760 6339780 6498017 -6364639 -20892328 -21370080 -6655525 9467253
40696 9467253 14966947 11143280 7326252 8806597 12675187 13435848 9615113 4493783
40688 4493783 2252604 4750085 11042377 17911023 20854806 17190958 9458932 3476161
40680 3476161 1365410 -834457 -6097834 -10138891 -6838658 1959958 7902528 7318804
40672G318804k215609R12163J772834j801140m709754l368003r3008K013051K853687
40663B683025K781848J068271j633966l191458l411836m017831m626293k658825
40655a3007065J831455N088566M742375K695388J705283K047020K633797K716268
40647A0453087J648895m56809j544519J3467J863725J18522m333777o108593k938733
40638a284735J188479K203060J225325J251745K112308J823749M59060m81558
40630H497433j046109k432529m367746m981838l149303J29666K615534K963927
40622a770965K251348K583016L518379J912067k710886n408296k494845J387470
40614g32712j057203p817114q737463l30504Q128564P514386J371938o78382K679335
$$ plain form
40672 7318804 5103195 6015358 7788192 5987052 1277298 -2090705 -2183713 -170662 2683025
40663 2683025 5464873 6533144 4899178 1707720 -1704116 -5721947 -10348240 -13007065
40655 -13007065 -11175610 -6087044 -1344669 1350719 3056002 5103022 7736819 10453087
40647 10453087 12101982 11645173 10100654 10114121 11977846 12096368 7762591 1653998 -1284735
40638 -1284735 -96256 2106804 3332129 4583874 6696182 8519931 8978991 8497433
40630 8497433 7451324 5018795 651049 -4330789 -7480092 -7350426 -4734892 -1770965
40622 -1770965 480383 3063399 6581778 8493845 5782959 374663 -2120182 -732712
40614 -732712 -1789915 -9607029 -18344492 -18674996 -10546432 -3032046 -1660108 -2338490 340845
40605C40845M479325J881070K39660L343322O425376L026213m983549r029203
40597E723059m623202L317050O823820L846720j072776l372488k727111r79643
40589F935429P29389J289615r82627n703167r161524q346711m548900m86163L712927
40580a6561732Q115612R246344M157194k977320m424035N82573M706814L149582
40572E995032m35066j168656o21546l057635p630762r055062m835830J607275
40564a9202250N031391L896165J608366K342113N558740O404854K885722m56536
40556H068565M89589K181948q88792n836293m841194J501584L585660k306665
40548A954402p548701m061236M040439P474870M501133N02316o83970O97677L157303
$$ plain form
40605 340845 4820170 6701240 6940900 10284222 16709598 19735811 14752262 5723059
40597 5723059 1099857 4416907 11240727 15087447 14014671 10642183 7915072 6935429
40589 6935429 7664818 8954433 7971806 2268639 -6892885 -15239596 -19788496 -20274659 -16561732
40580 -16561732 -8446120 800224 4957418 1980098 -2443937 -1861364 2845450 5995032
40572 5995032 5559966 4391310 3769764 712129 -6918633 -15973695 -20809525 -19202250
40564 -19202250 -14170859 -10274694 -8666328 -6324215 -765475 5639379 8525101 8068565
40556 8068565 8558154 10740102 9851310 4015017 -826177 675407 4261067 1954402
40548 1954402 -5594299 -9655535 -5615096 1859774 6360907 6863223 6179253 6876930 10034233
40539A0034233M644906L279799O56545O46287K396238J24169o773176j0292938
40531D716063n587166Q37886J300561j328610j93504L049010J822604l254048
40523A362796n513339l028736N98813L945208P508544Q085432K695758l678299
40515A1976177l806106q2885n78265m600553l794076K257895M119372j431371
40507D060188n839041l638681j030105l330102m835978L87370O704602N778793
40499a742954N87431J28506M366217M952248p00429n721903m749781o49494J639124
40490a891035J735166J514906P54063j386786k960840r57974L642088N259795
40482E709383Q3175p862761r948469l344214M776754O077196J353355k020297
$$ plain form
40539 10034233 14679139 17958938 18615483 19261770 21658008 21782177 15009001 4716063
40531 4716063 -871103 -33217 1267344 -61266 -254770 2794240 4616844 1362796
40523 1362796 -4150543 -7179279 -6580466 -2635258 4873286 12958718 15654476 11976177
40515 11976177 8170071 8087186 7508921 2908368 -885708 1372187 5491559 4060188
40507 4060188 -1778853 -5417534 -6447639 -9777741 -14613719 -14226349 -7521747 -1742954
40499 -1742954 -1155523 -1027017 3339200 8291448 7591019 1869116 -2880665 -3530159 -1891035
40490 -1891035 -155869 1359037 2113100 726314 -2234526 -3192500 449588 5709383
40482 5709383 5792558 -2070203 -12018672 -15362886 -10586132 -4508936 -3155581 -5175878
40474e175878o65533K203341L598545L880544K807874j056400n448871n057489
40466d913867M57293M563695K759634j734582m114268m647651n531684n788407
40458a8949837l662248o42125R09463J436821K338236L135227L105071K912767
40450i416625K581941J103109m50937L46563K024033J57599m373894m632721J433505
40441a1227427O168139L292083k616629l798631p65656P73894k63130o89089M03520
40432h722926J857810L718417M695749J049930n972315p523721L56583P918292
40424b622181M921322l292170m474879R73613K894923L08483J600847O471613
40416F781571M752396l988087o724450J091633O184849o50928q118382k601190
$$ plain form
40474 -5175878 -5841411 -3638070 -39525 3841019 6648893 5592493 143622 -4913867
40466 -4913867 -4456574 107121 2866755 1132173 -2982095 -7629746 -13161430 -18949837
40458 -18949837 -22612085 -23254210 -22344747 -20907926 -18569690 -15434463 -12329392 -9416625
40450 -9416625 -6834684 -5731575 -6182512 -5835949 -3811916 -3654317 -8028211 -12660932 -11227427
40441 -11227427 -5059288 -1767205 -4383834 -8182465 -8948121 -8174227 -8437357 -9126446 -8722926
40432 -8722926 -6865116 -3146699 1549050 2598980 -3373335 -10897056 -10540473 -2622181
40424 -2622181 2299141 -993029 -5467908 -4494295 -1599372 -1290889 309958 6781571
40416 6781571 11533967 7545880 821430 1913063 8097912 7446984 -671398 -3272588
40408c272588Q925063R306199k730081j2104450r528305n14518O446742Q614202
40400E142264N790316r15201o028632m404487K64238j2464m451182m434246J673866
40391g375528N255760J934528j349690Q30937K422554l074222r426265n995741
40383a6777667M995147J0431794M796369l175312m112762J35039K085193l99752
40375b021951l806943n366878m369911J88761P604080J2300084Q593132p43336
40367A2377038o150614l464538Q73906K75901j665025K239957R301673R199638
40359B2987936K51488o118089j874252M787925J380105r252626j2033279j669106
40351a539898R424144Q782392K39062m017509j080260J686748p483k374755k059297
$$ plain form
40408 -3272588 5652475 14958674 12228593 124143 -9404162 -9918680 -3471938 5142264
40400 5142264 10932580 10017379 3988747 -415740 -151502 -163966 -4615148 -9049394 -7375528
40391 -7375528 -2119768 -185240 -1534930 -703993 1718561 -1355661 -10781926 -16777667
40383 -16777667 -11782520 -1350726 3445643 270331 -3842431 -3707392 -1622199 -2021951
40375 -2021951 -5828894 -11195772 -15565683 -15376922 -7772842 4527242 13120374 12377038
40367 12377038 6226424 2761886 3635792 3911693 2246668 4486625 13788298 22987936
40359 22987936 23239424 17121335 15247083 20035008 21415113 12162487 129208 -1539898
40351 -1539898 7884246 16666638 16905700 12888191 11807931 13494679 13487196 11112441 9053144
40342I053144j399055k622462l321263j475809M6006j581059l597389k000183
40334f898070J355289J485513j344843j747220K161841N708273M824022J689882
40326G234687N80271J401816N79905l310830p510833q203261m444298M49888J431982
40317a1790673k663708o319549l169827N092829R755395O432834N87910j204338
40309c279127l55680j516538l156676l34951N196793O017623O90874l557338k187591
40300b482611L3408k066434n027832k632897L794673P819855P784424P022644
40292A4245230N594524j36088q565119j1357734m835835L199419L582319j466680
40284B60036k445153K700866N799023J446325m668250m637126j01849J021540
$$ plain form
40342 9053144 7654089 5031627 1710364 234555 280561 -1300498 -4897887 -6898070
40334 -6898070 -5542781 -4057268 -5402111 -7149331 -4987490 720783 5544805 7234687
40326 7234687 7814958 9216774 9796679 6485849 -1024984 -9228245 -13672543 -13222655 -11790673
40317 -11790673 -14454381 -20773930 -23943757 -18850928 -9095533 -2662699 -2074789 -3279127
40309 -3279127 -3634807 -5151345 -8308021 -8642972 -3446179 2571444 3262318 -295020 -2482611
40300 -2482611 -2449203 -4515637 -9543469 -12176366 -8381693 -561838 7222586 14245230
40292 14245230 19839754 19703666 11138547 -219187 -5055022 -1855603 1726716 260036
40284 260036 -2185117 515749 6314772 7761097 3092847 -1544279 -1646128 -624588
40276f24588l146787o199812l419932K129420N162548M716189K523837p63274
40268C77601m152410m459812p3273N397184O985024M495351J591160M15756M28840
40259A1005421P47415j7547m113955j0359760j1808962l735073P417019J0244539
40251f20903L649652j913850p9013L010693M3403n568280n879153r68073K385872
40242e939652J461753k76368k75755L86612P58837R84912J12954k096835k261790
40233g145332K271306P198416N643323j440721n814509l501934Q75537K597768
40225F83854K672246K767777J360061j364091j314635K134648K781664k664971
40217G056553p263129l473764M599705P154700L628254J923597L860429K165176
$$ plain form
40276 -624588 -3771375 -9971187 -13391119 -11261699 -6099151 -1382962 1140875 377601
40268 377601 -3774809 -8234621 -8307894 -2910710 4074314 8569665 10160825 10576581 11005421
40259 11005421 11752836 11735289 7621334 -2738426 -14547388 -18282461 -10865442 -620903
40251 -620903 3028749 1114899 1035886 4046579 4089982 -1478298 -7357451 -8325524 -5939652
40242 -5939652 -4477899 -4754267 -5030022 -4643410 -3884573 -2899661 -2786707 -4883542 -7145332
40233 -7145332 -4874026 2324390 7967713 6526992 712483 -2789451 -1913914 683854
40225 683854 3356100 6123877 7483938 6119847 4805212 6939860 9721524 7056553
40217 7056553 -206576 -3680340 919365 8074065 11702319 13625916 17486345 19651521
40209A9651521n828500j1446631o932577K857639P419738M376986j89720j984517
40201G923939k381403l087548k829984l99741K668043L771669J929461j511254
40193F083182l981963m093978l274086l413365l061957N08369M885764L575194
40185b772840l806781q403248m198751K556665L181173N42523L252838R295345
40177c53076Q017370j254708n953683J10171O226341J480300q213165r664413
40169i604863j685336N873286P456823N372948J105774n841674j1119087p854568
40161a6296697K789969J1431636J2025820O752312m89253p364207r614860l670400
40153d435680N051525N531887l602875j0642145o943512J678443N295754L901086
$$ plain form
40209 19651521 13823021 2376390 -4556187 -1698548 5721190 10098176 9908456 7923939
40201 7923939 5542536 2454988 -374996 -774737 1893306 5664975 7594436 6083182
40193 6083182 2101219 -1992759 -5266845 -8680210 -11742167 -11233798 -6348034 -2772840
40185 -2772840 -6579621 -14982869 -19181620 -16624955 -13443782 -12901259 -9648421 -353076
40177 -353076 7664294 6409586 455903 566074 6792415 8272715 59550 -9604863
40169 -9604863 -11290199 -5416913 2039910 7412858 8518632 2676958 -8442129 -16296697
40161 -16296697 -13506728 -2075092 9950728 16703040 16213787 8849580 -765280 -4435680
40153 -4435680 615845 6147732 2544857 -8097288 -15040800 -13362357 -8066603 -4165517
40145d165517L783604N786798N409362J359615l067465n201202m363315n79827
40137a037947L513923K978782k327687n059168l76179N935636O085965K220055
40129A1933380J164681J473318l351339j0650344r927711J99035P920193M956397
40121C717610k683994n772230m577529l832157k658965K126025P604743Q037345
40113A960848M003248J101308J108054Q72473q62141j593839j58770J390450J644175
40104I465806J476437J166287n72257l760316o048057n335929j940263J841760
40096c706532L241562J306697j026185M50635M432065L629082m704556j1635332
40088h012564o988471N135055J0218034L395459m048734k080158L776733L126295
$$ plain form
40145 -4165517 -381913 5404885 10814247 12173862 9106397 3905195 -458120 -1037947
40137 -1037947 2475976 5454758 3127071 -1932097 -2308276 3627360 9713325 11933380
40129 11933380 13098061 14571379 11220040 569696 -9358015 -9158980 -1238787 3717610
40121 3717610 1033616 -4738614 -9316143 -13148300 -15807265 -13681240 -6076497 1960848
40113 1960848 5964096 7065404 8173458 9045931 8183790 6589951 6431181 7821631 9465806
40104 9465806 10942243 12108530 11536273 7775957 1727900 -3608029 -5548292 -3706532
40096 -3706532 -464970 841727 -184458 266177 4698242 8327324 3622768 -8012564
40088 -8012564 -15001035 -9865980 352054 3747513 -301221 -2381379 1395354 4521649
40080D521649j959353j330529N151150O426711j737014r115825o378569J228484
40072c193296L024764r72364k337410R37537K103760j816347m682440j609626
40064h545422K874780K186441k021806k954111Q21803M011624K967871J89609
40056d69211l24870J574115K859960J111599l214507o844959o160470j265400
40048a2733743L139029L210969J234867K024172M768321L439034l423968q592168
40040f933487n438964K530626O359747L574503j99428r32143j216913l678117
40032e934176n005560j083236N267026P175336L392402k52053K40219J734376
40024E534334K5193l051160k679924J188251L667028J706143k869021o769416
$$ plain form
40080 4521649 2562296 1231767 6382917 12809628 11072614 1956789 -4421780 -3193296
40072 -3193296 -168532 -1140896 -3478306 -2540769 -437009 -2253356 -6935796 -8545422
40064 -8545422 -5670642 -3484201 -5506007 -8460118 -7638315 -3626691 -658820 -469211
40056 -469211 -794081 780034 3639994 4751593 1537086 -5307873 -11468343 -12733743
40048 -12733743 -9594714 -6383745 -5148878 -3124706 1643615 5082649 1658681 -6933487
40040 -6933487 -12372451 -9841825 -3482078 92425 -107003 -1039146 -2256059 -5934176
40032 -5934176 -10939736 -12022972 -6755946 419390 3811792 3559739 3799958 5534334
40024 5534334 5559527 2508367 -171557 1016694 4683722 6389865 3520844 -3248572
40016c248572q040826n719550p49236K588059O47945l342665j905136O133159
40008a3636822J2789332J1344587M578874r51727l618068m785748l282908J435711
40000C873231M406566J252058l296763j371247M970391O042225J24119l437303
39992A2563277N71665M889551J935548m213472n190867j310419Q29529n53106
39984I521706j709463j223593j125318j438412l40311R15810m62605k560639k91386
39975A285789O035934R389532N070444l295450q712783q368694m578952q98710
39967d072890J159936K961745O454967R914361P932494j281904j0718436j1538193
39959H12080m346745J788037J439044j783759k639155r13400J400566L861492
$$ plain form
40016 -3248572 -11289398 -17008948 -17758184 -15170125 -14522180 -17864845 -19769981 -13636822
40008 -13636822 -847490 10497097 15075971 14124244 10506176 5720428 2437520 3873231
40000 3873231 8279797 9531855 6235092 4863845 9834236 15876461 16000580 12563277
39992 12563277 13134942 18024493 19960041 15746569 10555702 9245283 10074812 9521706
39984 9521706 7812243 6588650 5463332 4024920 3684609 4600419 4137814 1577175 1285789
39975 1285789 7321723 16711255 21781699 18486249 9773466 1404772 -3174180 -4072890
39967 -4072890 -2912954 48791 6503758 16418119 24350613 23068709 12350273 812080
39959 812080 -3534665 -1746628 -307584 -2091343 -4730498 -5643898 -4243332 -381840
39951c81840N463304L678448j018050m043752l399391k848170m665291m321854
39943a1536596K221783J0219329J1679352O368861O51484k487811n039757o835064
39935E241581m801763J7444K250756P65366M03185K806359K869939j863433n573361
39926B116073l596310r54209l833908p631018l136115P658618J2436842O219727
39918I279700j657040j856605K205597J934540k580759m184664q83474J671059
39910C928354k24179l054375k263022J161153K911961J198597k067175m146582
39902b555268l668173j094883J574659K240797O96597j281281k032843j436739
39894g557134l21584L19660n39586l094623n407133m348995R40772O945893Q187933
$$ plain form
39951 -381840 5081464 8759912 7741862 3698110 298719 -2549451 -7214742 -11536596
39943 -11536596 -9314813 904516 12583868 18952729 19604213 17116402 12076645 5241581
39935 5241581 439818 457262 2708018 3473384 3876569 6682928 9552867 7689434 2116073
39926 2116073 -1480237 -2434446 -6268354 -13899372 -17035487 -9376869 3059973 9279700
39918 9279700 7622660 5766055 7971652 9906192 7325433 3140769 2257295 3928354
39910 3928354 3704175 649800 -1613222 -452069 2459892 3658489 1591314 -2555268
39902 -2555268 -6223441 -7318324 -5743665 -3502868 -2806271 -4087552 -6120395 -7557134
39894 -7557134 -7878718 -7559058 -8098644 -11193267 -16600400 -20949395 -20008623 -13062730 -4874797
39885d874797K534062n652343q591087k947184N622935Q203221L258193j857074
39877d304074j449079R93086l64245l627706k338373L492301O856660M237046
39869C495616l27976k678703l267459k663895P75689N715385O646451J660193
39861I355301m033817n718408m508863j957814L306647Q946850P285922k609650
39853A0066168r202374l980584M576930L665347l613624m454477J476026K288043
39845H21455m184984n725593L137714J1033798P785884q19795m806366m862292
39837B379821n634878m367016K377438Q318786N526716k462655o371858n314672
39829e548318m510291l291819K746579J0234118J0680896M069072j061972j100304
$$ plain form
39885 -4874797 -2340735 -7993078 -16584165 -19531349 -13908414 -5705193 -2447000 -4304074
39877 -4304074 -5753153 -4760067 -5124312 -8752018 -11090391 -7598090 -741430 3495616
39869 3495616 3167640 488937 -2778522 -5442417 -4666728 1048657 7695108 9355301
39861 9355301 5321484 -396924 -4905787 -6863601 -3556954 5389896 12675818 10066168
39853 10066168 863794 -3116790 1460140 5125487 1511863 -2942614 -1466588 821455
39845 821455 -3363529 -9089122 -5951408 5082390 12868274 12048479 7242113 2379821
39837 2379821 -3255057 -7622073 -5244635 3074151 8600867 6138212 -233646 -5548318
39829 -5548318 -10058609 -13350428 -10603849 -369731 10311165 14380237 13318265 12217961
39821A2217961o25131k012389k359685j836285m481677q654664p163850J77087
39813a4738633M494648K107329L75896M266740P470635L872433j511674j539040
39805D798334R58059n51044m156839l537225M40072J950926P24410P53008J128250
39796B507951j965247n711563l343112L790230O854041L265489n4455O93417L66708
39787F403459m198246o978094k920693K400972J226517l798321m141340P65560
39779a1240186L211292K4734k832425l21727M033897M249466P78079j201009K46042
39770c051837K027470J411844o95128k331235l148242l105692j018588L294390
39762f617018O898147O405864K210274k267258m897903n566605l358416K465184
$$ plain form
39821 12217961 11592830 9580441 7220756 5384471 902794 -7751870 -14915720 -14738633
39813 -14738633 -10243985 -8136656 -7760760 -3494020 3976615 7849048 6337374 4798334
39805 4798334 5756393 5205349 1048510 -2488715 -2048643 -97717 626693 1379701 2507951
39796 2507951 542704 -5168859 -8511971 -4721741 2132300 5397789 5343334 6036751 6403459
39787 6403459 2205213 -4772881 -7693574 -5292602 -4066085 -7864406 -12005746 -11240186
39779 -11240186 -8028894 -8004160 -10836585 -11158312 -7124415 -2874949 -2096870 -3297879 -3051837
39770 -3051837 -1024367 387477 -307651 -2638886 -5787128 -8892820 -9911408 -6617018
39762 -6617018 281129 6686993 8897267 6630009 1732106 -3834499 -7192915 -4727731
39754d727731P981987O511647k081039q867751o944621o67380J698813L68485
39746f727590J392695M386339K716715l636635n548482J226135Q129186N673629
39738G611992l265178q538554o371323j280158K319321L866338L884683L062155
39730A289276K876904K960245J43098n541470p337264k80093R619766J1930116
39722A5660578N881177K47756j38750M76929k055989n570796o805197n839966
39714A855742k865462K783218P863613O632076J67197l224120q85691o91995p072924
39705D561654j0935701k926830J0001662J2969746M443482l172093l031831j097301
39697A0812788k193024j754055L060100N158523j246954r387393r432824l537486
$$ plain form
39754 -4727731 3254256 9765903 7684864 -1182887 -8127508 -8794888 -7096075 -6727590
39746 -6727590 -5334895 -948556 1768159 -1868476 -7416958 -6190823 1938363 7611992
39738 7611992 4346814 -4191740 -10563063 -11843221 -9523900 -5657562 -1772879 1289276
39730 1289276 4166180 7126425 7269523 1728053 -5609211 -5889304 3730462 15660578
39722 15660578 21541755 21789511 21650761 22127690 20071701 14500905 7695708 1855742
39714 1855742 -1009720 1773498 9637111 16269187 16436384 13212264 12326573 11634578 4561654
39705 4561654 -6374047 -9300877 700785 13670531 18114013 14941920 11910089 10812788
39697 10812788 8619764 6865709 9925809 15084332 13837378 4449985 -4982839 -8520325
39689h520325j209353l295717j814030M917018Q409018M029694j167530l0969
39681A317806L374097J336277m466225o193247k944912j430544l992785m883259
39673a7882792n89920L871913K957659j117697k776445j115830J296503L638429
39665a1718180N594051M514191j97435k949908Q25594N660584K503752o583861
39657b351212r504458j570986P333332P083634O00334l039937j959301n99903
39649d008497l15945J095426K919810J991692j269850l319943l172179k301413
39641h380899k61882L734345O242724L466625q21953J019499P930437R515439
39633B2444335J167586p853278o930161J204250N206375J056672m284978m319196
$$ plain form
39689 -8520325 -9729678 -13025395 -14839425 -9922407 -1513389 2516305 1348775 1317806
39681 1317806 4691903 6028180 1561955 -4631292 -7576204 -9006748 -12999533 -17882792
39673 -17882792 -18472712 -14600799 -11643140 -12760837 -15537282 -16653112 -15356609 -11718180
39665 -11718180 -6124129 -1609938 -1807373 -4757281 -3931687 1728897 4232649 -2351212
39657 -2351212 -11855670 -13426656 -6093324 990310 1590644 -1449293 -3408594 -4008497
39649 -4008497 -4324442 -3229016 -309206 1682486 412636 -2907307 -6079486 -8380899
39641 -8380899 -8642781 -4908436 1334288 4800913 3978960 4998459 12928896 22444335
39633 22444335 23611921 15758643 8828482 10032732 15239107 16295779 12010801 7691605
39625G691605r39441R39874J115256K472320M512906L239497k355948p457866
39617I218203p139351k633529R37387J675056J879512K214886k8166m914813p127361
39608e918176l295837J787891J510772k628191l338428J543384O610049P297085
39600C568549M903640K407839N84759m17702l36562q46920l913001p210393o026115
39591g285906o86995L186114L073811K405046L299194K991771M48204j18208L265615
39582A0578646N310908J303045n028846p185429n136417k971931j287173J481825
39574b935372L233708Q34693l218464l562398l84024J359645N18860R25026L573881
39565C45555M078632j51359n280597o179269k769429J027601K391835J767780
$$ plain form
39625 7691605 6752164 7692038 8807294 11279614 15792520 19032017 16676069 9218203
39617 9218203 2078852 -554677 382710 2057766 3937278 6152164 6123998 1209185 -5918176
39608 -5918176 -9214013 -7426122 -5915350 -8543541 -11881969 -10338585 -3728536 3568549
39600 3568549 8472189 10880028 11464787 11047085 10710523 9863603 5950602 -1259791 -7285906
39591 -7285906 -7972901 -4786787 -1712976 692070 3991264 6983035 7431239 7313031 10578646
39582 10578646 15889554 17192599 12163753 4978324 -158093 -3130024 -4417197 -2935372
39574 -2935372 298336 1133029 -2085435 -5647833 -6031857 -4672212 -4153352 -3228326 345555
39565 345555 4424187 4272828 -1007769 -7187038 -9956467 -8928866 -6537031 -4769251
39557d769251J124048J320802J303395J22886r53573l29023N38382p57225k283995
39548d683554M1729M292216L793292j082191j351259N385584Q333185O48552o875548
39539H502006j928056P878714O139411m857903p108212L133763Q905964P25578
39531B1391265q589695o519374m68599j823727n413380j052340N696462K518894
39523E739506o911294q029221j46418K718897l317234m660437O566684J7692741
39515I653224J3694488o56738q197026k877202M997289M894976k018537q230371
39507A1260103j0079858r008255o364644j612002M236264P042354M222847m64373
39499g67564o62383L760051N921191J747330l974427m856697k108294j494272
$$ plain form
39557 -4769251 -3645203 -2324401 -1021006 -898120 -1851693 -2180716 -1642334 -2399559 -4683554
39548 -4683554 -4641825 -349609 3443683 2361492 1010233 6395817 14729002 15377554 8502006
39539 8502006 6573950 14452664 20592075 15734172 8625960 11759723 20665687 21391265
39531 21391265 12801570 6282196 5813597 3989870 -1423510 -2475850 3220612 5739506
39523 5739506 -1171788 -9201009 -9347427 -6628530 -9945764 -14606201 -8039517 9653224
39515 9653224 23347712 22690974 14493948 11616746 16614035 21509011 19490474 11260103
39507 11260103 1180245 -7828010 -14192654 -15804656 -11568392 -4526038 -303191 -767564
39499 -767564 -1429947 2330104 8251295 9998625 6024198 1167501 -940793 -2435065
39491b435065m116724n985588n014804k660362L45632M097888O029685L402312
39483f337026p73379n44355L753239N618356L017964J883825O088189J0443028
39475B3149841Q194331O16029n670617p339322n743068k608698R10275K637501
39467A4146272J037405k277817m463723m655040l196207L8824L778600M229724
39459H638038n54068o819253r186731p257323m643157k754520K44407M647541
39451a7685066P564173O896757L954942J338293N11246J646829L402581K851230
39443A0480985j475379o179515n784048K27250O214140P387705M822499J798096
39435A7491733j245221m874314o723977m148703J50167J42115m946826q431360
$$ plain form
39491 -2435065 -6551789 -12537377 -17552181 -20212543 -19866911 -15769023 -9739338 -6337026
39483 -6337026 -7110405 -7654760 -3901521 1716835 4734799 6618624 12706813 23149841
39475 23149841 31344172 31960201 26289584 18950262 13207194 10598496 11508771 14146272
39467 14146272 15183677 12905860 8442137 3787097 590890 629714 4408314 8638038
39459 8638038 8083970 1264717 -7922014 -15179337 -19822494 -22577014 -22332607 -17685066
39451 -17685066 -10120893 -3224136 730806 2069099 2580345 4227174 7629755 10480985
39443 10480985 9005606 2826091 -2957957 -2730707 3483433 10871138 15693637 17491733
39435 17491733 16246512 11372198 4648221 499518 649685 791800 -4155026 -12586386
39427a2586386m902522K257449N558749L389943R66538J843994L263095J666544
39419A457404j114170q18773K092294K603660j285297n006899l525543J472368
39411d124956L600343L42856l578247k560906K473881N448622L059109j443752
39403C216950l048376j159904P81425L40045j500993k412621j226389J444854
39395c565009L493344K688502n10820k371509n02359J951324K63189m196531m984063
39386g733932k68253L748684J948158j923560j108656L912112O475316L558174
39378H608043o46792j088363K147193M869990L377544k096754p020569o675762
39370A474530j937366J338741L36259j021491P77070K793684J605425K96117K472111
$$ plain form
39427 -12586386 -17488908 -15231459 -9672710 -6282767 -5316229 -3472235 -209140 1457404
39419 1457404 343234 -475539 1616755 4220415 2935118 -2071781 -5597324 -4124956
39411 -4124956 -524613 -181757 -3760004 -6320910 -3847029 1601593 4660702 3216950
39403 3216950 168574 -991330 -209905 130140 -1370853 -3783474 -5009863 -3565009
39395 -3565009 -71665 2616837 2106017 -265492 -767851 1183473 1446662 -2749869 -7733932
39386 -7733932 -8002185 -4253501 -2305343 -4228903 -5337559 -1425447 5049869 8608043
39378 8608043 7961251 6872888 9020081 13890071 17267615 15170861 8150292 1474530
39370 1474530 -462836 875905 1212164 190673 967743 3761427 5366852 5662969 8135080
39361H135080L843255r38495o420085k967818N868155O091052m468460j0860798
39353a718114l987406M904251K695218m457569k256145P396566R271784p65424
39345A1083161r925749q651152k792644r64718j190397K473320P892549Q007544
39337E931914K287670k426031j690995J403875J626152j392429l294255r51859
39329A494042L381518M698058J352847l289484n532077n080598l072949K41257
39321e807386L454120L117485j353368m746538k361926L106401N537350L819260
39313D765398J211306j148217l759739l869721J302358P203533O088685q03310
39305A0990293l711410R27667M854201J108141n151173n072160M23557K693767
$$ plain form
39361 8135080 11978335 11039840 4619755 1651937 7520092 13611144 9142684 -1718114
39353 -1718114 -5705520 -801269 1893949 -2563620 -4819765 2576801 11848585 11083161
39345 11083161 1157412 -7493740 -10286384 -11251102 -12441499 -9968179 -2075630 5931914
39337 5931914 8219584 5793553 4102558 5506433 7132585 5740156 2445901 1494042
39329 1494042 4875560 9573618 10926465 7636981 2104904 -2975694 -6048643 -5807386
39321 -5807386 -2353266 764219 -589149 -5335687 -7697613 -4591212 946138 4765398
39313 4765398 5976704 4828487 1068748 -2800973 -1498615 5704918 11793603 10990293
39305 10990293 7278883 8206550 13060751 14168892 9017719 3945559 4369116 7062883
39297G062883j975619p941020p828099q46728O455531O621726l04164n443120
39289d198610j590852O156579O467491j648539o754241j905488N425750N450196
39281G402286k66122m156612m435041l389395j39143N600755P439519K12485r242017
39272i73285r599209j542564L599306J041255k159204P82M287919N653527M438720
39263D747247L001755J986711K373620M796606N261417j126989j0380133j1891970
39255a231736l547946L947831K311549l039440k965017J643466L799458K443094
39247C361259J918327K757216J375053k207537l581138j177012J281706M13406
39239D141280k651004m448611l024721M13847K139723o01190n270571n443783
$$ plain form
39297 7062883 5087264 -2853756 -10681855 -11528583 -5073052 1548674 1244510 -4198610
39289 -4198610 -5789462 367117 6834608 5186069 -1568172 -3473660 1952090 7402286
39281 7402286 7136164 2979552 -1455489 -4844884 -4984027 616728 8056247 8268732 -973285
39272 -973285 -10572494 -12115058 -8515752 -7474497 -9633701 -9632919 -5345000 308527 4747247
39263 4747247 7749002 9735713 12109333 16905939 22167356 21040367 10660234 -1231736
39255 -1231736 -4779682 -831851 1479698 -1559742 -4524759 -2881293 918165 3361259
39247 3361259 5279586 8036802 9411855 7204318 3623180 2446168 3727874 4141280
39239 4141280 1490276 -2958335 -5983056 -5569209 -3429486 -4030676 -9301247 -14745030
39231a4745030J309798R309435J1106195N851767j125219m894693m454314j629527
39223G28412J029221K427270L905271O038098N172911k002230j0470033j0665646
39215c836726k302467L764281J469454j696697J626467N501104J230778o381218
39207f25024n887455K047623N941777J720600l321475m646702n609561o866463
39199a7246680l445952L990908O824954K407496n40162L610541P781555M342704
39191G725364k257553l597521o16273K50278j510803k088734j945355l741054
39183g781651m854693q66392N393231O628053K046973j982692j895048m71467
39175c783686k05708J29663J042891K68837k761458m658341k395551K783874P001754
$$ plain form
39231 -14745030 -13435232 -4125797 6980398 12832165 11706946 6812253 2357939 728412
39223 728412 1757633 4184903 8090174 14128272 19301183 17298953 6828920 -3836726
39215 -3836726 -6139193 -2374912 -905458 -2602155 -975688 4525416 5756194 -625024
39207 -625024 -6512479 -4464856 1476921 3197521 -123954 -4770656 -10380217 -17246680
39199 -17246680 -20692632 -16701724 -9876770 -7469274 -8009436 -4398895 3382660 7725364
39191 7725364 5467811 1870290 1254017 1504295 -6508 -2095242 -4040597 -7781651
39183 -7781651 -12636344 -13502736 -8109505 -1481452 565521 -1417171 -3312219 -3783686
39175 -3783686 -3989394 -3859731 -2816840 -2548003 -5309461 -9967802 -12363353 -9579479 -2577725
39166b577725P380314L828775r50364l414822k661173j270631j602772k911132
39158d179530l384497k641086o29524K986351O504340O743240L951043J912024
39150A1262361R93624l025964r574289r978431j03622J0270557R581102J066126
39142A0491464k908650L27312K031428j954223n314295l054539J270548L240261
39134D129306L635200L466318R52141k917313l127754J229552M211584K103768
39126A3682802j099996j055169K04878j054617m260941o914939q047033o452296
39118a4997311q91066N494369P086646M353132L292219M126637j4677q986911
39110e36962j1125375n24136J1099377J0092100N00552l648432M28614L764520
$$ plain form
39166 -2577725 4802589 8631364 7681000 4266178 1605005 334374 -1268398 -4179530
39158 -4179530 -7564027 -10205113 -10834637 -7848286 -1343946 5399294 9350337 11262361
39150 11262361 12255985 9230021 -344268 -10322699 -10426321 -155764 9425338 10491464
39142 10491464 7582814 7910126 9941554 7987331 2673036 -381503 889045 4129306
39134 4129306 7764506 11230824 12182965 9265652 6137898 7367450 11579034 13682802
39126 13682802 12582806 11527637 11732515 10677898 6416957 -497982 -8545015 -14997311
39118 -14997311 -15888377 -10394008 -3307362 1045770 4337989 8464626 8449949 -536962
39110 -536962 -11662337 -12186473 -1087096 9005004 9505556 5857124 6285738 10050258
39102A0050258K584177J955213L260609J291245m244889o038331j585191J749151
39094I022242j298735n296635l022719L499414O691913L880147j029397l691934
39086H754296l296361j990890k544279n150630o068962k005188M141890N700428
39078b459696J091884l745541l206359J331698M452857L341137k28627k390074
39070a812721n95000L868991O662484N118877J087105k502266n061403n559533
39062A206534q28352P835992J1008258K545092q523361q034149K721487Q609323
39054A6540824L642684j558693M59867J564982n522126j1603763n458612N401928
39046C467091M698823o384633r984209Q48352J1309428P076476n308374r141719
$$ plain form
39102 10050258 12634435 14589648 17850257 19141502 14896613 8858282 7273091 9022242
39094 9022242 7723507 2426872 -595847 2903567 9595480 13475627 12446230 8754296
39086 8754296 5457935 3467045 922766 -4227864 -10296826 -12302014 -8160124 -2459696
39078 -2459696 -1367812 -5113353 -8319712 -6988014 -2535157 805980 577353 -1812721
39070 -1812721 -2407721 1461270 8123754 13242631 14329736 11827470 6766067 1206534
39062 1206534 378182 8214174 19222432 21767524 13244163 5210014 7931501 16540824
39054 16540824 20183508 18624815 19084682 20649664 15127538 3523775 -1934837 3467091
39046 3467091 8165914 1781281 -8202928 -7354576 3954852 11031328 5722954 -3418765
39038c418765q01856P477967N207663m184713r626347n860369J892048N292821
39030d021551K584293p20424k76366J540660P77536r75280O05588M618639N673962
39021I807057K422772n25738l43855k0322k335146m767600l752140k81248K226873
39012B430653K874908K872404K441385J158376l77106j644905l060257l732210
39004B963248j211538L745913N401389K27330o583473o893321n75455M699599
38996A773692M250625J273094J86176Q47019J489239K122196J948806j627179
38988A2263668p304370p880004K89634R260899Q018712k485150j0301901q616330
38980f754842l016421o04551o7416K364095L998640M96920m363825k496267N651579
$$ plain form
39038 -3418765 -4220621 3257346 8465009 4280296 -5346051 -11206420 -9314372 -4021551
39030 -4021551 -1437258 -2157682 -2434048 -893388 -115852 -1091132 -485544 4133095 9807057
39021 9807057 12229829 11704091 11360236 11339914 9004768 4237168 485028 203780 2430653
39012 2430653 5305561 8177965 10619350 11777726 11400620 9755715 6695458 2963248
39004 2963248 1751710 5497623 10899012 11126342 4542869 -2350452 -2925907 1773692
38996 1773692 6024317 7297411 7483587 8330606 9819845 11942041 13890847 12263668
38988 12263668 4959298 -2920706 -2631072 6629827 14648539 12163389 1861488 -6754842
38980 -6754842 -9771263 -10375814 -10443230 -8079135 -4080495 -3583575 -7947400 -10443667 -4792088
38971d792088J0142449N110449l364821o039068k054125K234740K428595l39608
38963C326523l195746m605519l679395K72732O067171R991323Q497474J980396
38955A8654959m787063p087871n157880l107559k654821q25358M122757P859765
38947G016929N412837p19727l525468j798020r73749k825227j719846N240719
38939F108448J0976765P439847k322465p924630n423723o79582N92653m28755
38931H338558l71128M78011K99346J15422K050646M718530M119489n56968m977425
38922A4214481n031131k109576n75633j251487j192304p0428j738085o779064
38914d533227q648192k600468N506224O628332K164112J072362M143464K253273
$$ plain form
38971 -4792088 5350361 10460810 7095989 1056921 -997204 1237536 3666131 3326523
38963 3326523 130777 -4474742 -8154137 -7881405 -1814234 8177089 16674563 18654959
38955 18654959 13867896 6780025 1622145 -1485414 -4140235 -4965593 -842836 7016929
38947 7016929 12429766 11710039 8184571 6386551 5412802 2587575 867729 6108448
38939 6108448 17085213 24525060 22202595 14277965 8854242 8174660 8767313 8338558
38931 8338558 7967430 8445441 8744787 8860209 10910855 15629385 19748874 19191906 14214481
38922 14214481 9183350 7073774 6498141 5246654 4054350 3983922 2245837 -4533227
38914 -4533227 -13181419 -15781887 -10275663 -3647331 -1483219 -410857 3732607 5985880
38906E985880o975947j2285009n228141O075342Q659092K865573j432639j270236
38898c606085j688702l269047n95497O448926J0303484O771449K06894m220989
38890A0350433n996903n392504j708894K449020K355656r52689j025372L230142
38882C308889M716387k20267m929865k669695K732703L103050j653567m337850
38874D9785j381566L223137M427360K033522l14402L40568K945934L310856m64773
38865A4170421m271477k985518J656102L372148J484620J837462N873113O707266
38857B7844137L73765o333214n526257Q517J846922j495449m451202m075220k577442
38848E614557j619002m61623Q38440J449925K009412K675507J042381l485140
$$ plain form
38906 5985880 -990067 -13275076 -18503217 -12427875 -3768783 -903210 -2335849 -3606085
38898 -3606085 -5294787 -8563834 -9159331 -2710405 7593079 14364528 14571422 10350433
38890 10350433 4353530 -1038974 -2747868 -298848 2056808 1104119 78747 3308889
38882 3308889 8025276 7805009 2875144 205449 2938152 6041202 4387635 49785
38874 49785 -1331781 1891356 6318716 8352238 8037836 8378404 11324338 14635194 14170421
38865 14170421 9898944 6913426 8569528 11941676 13426296 15263758 21136871 27844137
38857 27844137 28217902 21884688 16358431 16366948 18213870 16718421 12267219 8191999 5614557
38848 5614557 3995555 3533932 4372372 5822297 7831709 10507216 11549597 8064457
38840H064457o007332k250499M233481O846700N297512L761895K500077j002513
38832B1443778m590222l760687n24351j022051m411979l605859J959958M348675
38824I837262M59790k738441n13915J828366o18246l062522J64345M890950M099894
38815A4347483R3677J40998L597755L187829k261292n588383k432418K975807
38807A4061456M658261J670435l208524o595864n552236k88770L656491Q37436
38799I238685o044597q751850m816969k81419L76748M51242L796769P495542O823801
38790H287952L034785M20555j186776m704946q437325p123532m61203N492275
38782d678215O813149O224596O792323O131749R71277n877317q117250m465399
$$ plain form
38840 8064457 2057125 -193374 4040107 10886807 16184319 19946214 22446291 21443778
38832 21443778 16853556 13092869 12568518 11546467 7134488 3528629 5488587 9837262
38824 9837262 10297052 7558611 7044696 8873062 8254816 5192294 5356639 10247589 14347483
38815 14347483 14441160 14582158 18179913 21367742 19106450 13518067 11085649 14061456
38807 14061456 18719717 20390152 17181628 10585764 5033528 4744758 8401249 9238685
38799 9238685 3194088 -5557762 -10374731 -10656150 -10279402 -9828160 -6031391 1464151 8287952
38790 8287952 11322737 11743292 10556516 5851570 -2585755 -9709287 -10170490 -4678215
38782 -4678215 2134934 8359530 15151853 21283602 22254879 16377562 8260312 3794913
38774C794913j48586M14942j151542n56349L057314O202066N225761K72982m530629
38765A2580872m753601l90120L313267J317481m870948q315082m708138K768404
38757c057865P724498P500423M060789R6053k884618l650687j708510J067372
38749I147455J802887L18998m92678J299581M003519M604609K425118m11225j266447
38740B1431817P74754M002860N115288K346741k038668l669238r36696L442911
38732C0469769O186126O898907O792510O085866M730928M109256N201794N832086
38724G6307242L020529j630878k565588J817331N209148J145158p142889r767629
38716F6392424l500243L402805K517773l476721n983300l444949j921173l840110
$$ plain form
38774 3794913 3646327 4061269 2909727 2353378 5410692 11612758 16838519 17111501 12580872
38765 12580872 7827271 7437151 10750418 12067899 7196951 -1118131 -5826269 -3057865
38757 -3057865 4666633 12167056 16227845 16323898 13439280 9788593 8080083 9147455
38749 9147455 10950342 11269340 10776662 12076243 16079762 20684371 23109489 22698264 21431817
38740 21431817 22206571 26209431 31324719 33671460 31632792 27963554 27026858 30469769
38732 30469769 36655895 43554802 50347312 56433178 61164106 65273362 70475156 76307242
38724 76307242 79327771 77696893 75131305 76948636 82157784 83302942 76160053 66392424
38716 66392424 62892181 66294986 68812759 65336038 59352738 55907789 53986616 50146506
38708E0146506m631637k484537k917541q574471j1844532n409401M936985P242080
38700B6463452N30916m752094k803495J183321K196651K621483M277108K838252
38692C2555594l470154p624576l964599J894960J856312j531962o16883L096369
38684B2195061J970731k625165j468840N153449N177999n030515j1386263k443937
38676A1542520J1356848J1601261j178163r003773l374690M044881J318235n976427
38668B0330692n138842L862172R404025N684749o12348j596365J810109M067805
38660C7811997L660295L183567L763923L957598L561039M610746P578301R419371
38652G7546837P590812M532939N352897J0954859J6224818J6629746J4559781
$$ plain form
38708 50146506 45514869 43030332 40112791 31538320 19693788 14284387 19221372 26463452
38700 26463452 26994368 22242274 19438779 20622100 22818751 25440234 29717342 32555594
38692 32555594 29085440 21460864 17496265 19391225 21247537 19715575 19098692 22195061
38684 22195061 24165792 21540627 20071787 25225236 30403235 25372720 13986457 11542520
38676 11542520 22899368 34500629 33322466 24318693 20944003 24988884 26307119 20330692
38668 20330692 15191850 19054022 28458047 34142796 33530448 31934083 33744192 37811997
38660 37811997 41472292 44655859 48419782 52377380 55938419 60549165 68127466 77546837
38652 77546837 85137649 89670588 95023485 105978344 122203162 138832908 153392689
38645A53392689J6370735K3903482L1973232L4556870L0564897K2639234J3427131
38638C26828270M969199j227194o493028j4939463k7333273l6942044l6360469
38631B08501998k7843038k1387189k1703478k2747548j7700758q983281l877528
38624H4259178m191092n898232o767514q167299r672455p877559k161270K908473
38616D2432230L113991o56952m824393p046351o019667j056604N251938P160873
38608C8355065K400676l601671m439028j925576l133497q548697r848759k295759
38600F962754O557813O290105j622018n687907p10363N347935L665484k819900
38592A7983903m833315o66419K671000J009377j732448j288627M61908k9498k011442
$$ plain form
38645 153392689 169763424 193666906 225640138 260197008 290761905 313401139 326828270
38638 326828270 331797469 330570275 324077247 309137784 281804511 244862467 208501998
38631 208501998 180658960 159271771 137568293 114820745 97119987 88136706 84259178
38624 84259178 80068086 74169854 67402340 59235041 49562586 41685027 39523757 42432230
38616 42432230 45546221 44889269 40064876 33018525 26998858 25942254 31194192 38355065
38608 38355065 40755741 37154070 32715042 30789466 27655969 19107272 9258513 6962754
38600 6962754 13520567 19810672 18188654 12500747 11790384 17138319 20803803 17983903
38592 17983903 13150588 12484169 15155169 16164546 14432098 13143471 13605379 13575881 11564439
38583A1564439k863348k649301k150453K41824M919536P103276K155076o350522
38575A1970527r448805l905809M074930O848281L098614k948950o382701m898876
38567a592789m45197J900302m05370l049491J37396Q002741J2328583Q061722
38559B4937897q60503o998389o901467k263789K365680K191506l236749p396899
38551A837287l689379M471690O732564M01971n521343m096206p8717k74323k015335
38542b231791N82705M786255L486323k075513l941499o58833R46946k027296l806236
38533d938939j18070M596246M291197J04041k290459o16442K309418K862059M13706
38524F612757j954686l13513M789726P112255K150169n743396q496812n404192
$$ plain form
38583 11564439 8701091 6051790 3901337 4143161 9062697 16165973 18321049 11970527
38575 11970527 2521722 -1384087 2690843 9539124 12637738 9688788 3306087 -1592789
38567 -1592789 -2037986 -137684 -543054 -3592545 -3455149 4547592 16876175 24937897
38559 24937897 24077394 17079005 10177538 7913749 10279429 12470935 9234186 1837287
38551 1837287 -1852092 2619598 9352162 9754133 4232790 136584 57867 -216456 -2231791
38542 -2231791 -1649086 3137169 6623492 4547979 606480 -52353 894593 -1132703 -4938939
38533 -4938939 -5057009 -460763 3830434 3934475 1644016 1027574 3336992 6199051 6612757
38524 6612757 4658071 4344558 9134284 16246539 18396708 12653312 4156500 -1247692
38516a247692k844854l157570j480041M211307P561367K941288n543669r330774
38508h890638n799112J128722P254961J0382495R243248M737011K88556k412948
38500A5932295n360359q785201p967808n94426O541045N245383j703711l802663
38492d95445J575680N141489m570p452135o478752K667085R296480O668938n32222
38483A0386548m167865k725598l10727O50082R30398L13945k603437n666767l637837
38474f831258L698785Q554390M778389l049087n709988j889870J962558K589949
38466D103868K779586L266055O42875m308595m898351N19016L776679j101685
38458D779448q150167q729227m434448k532545l420017j929421K049726L896462
$$ plain form
38516 -1247692 -4092546 -7250116 -8730157 -4518850 3042517 5983805 440136 -8890638
38508 -8890638 -14689750 -13561028 -6306067 4076428 13319676 18056687 18345243 15932295
38500 15932295 10571936 1786735 -6181073 -6775499 -234454 5010929 3307218 -495445
38492 -495445 1080235 6221724 6217154 -1234981 -7713733 -5046648 4249832 10918770 10386548
38483 10386548 6218683 3493085 3182358 3832440 4762838 5076783 2473346 -3193421 -6831258
38474 -6831258 -3132473 5421917 10200306 7151219 1441231 -448639 1513919 4103868
38466 4103868 6883454 10149509 10792384 6483789 1585438 2104454 5881133 4779448
38458 4779448 -3370719 -12099946 -16534394 -19066939 -22486956 -24416377 -22366651 -18470189
38450a8470189L565824N101542P406679M974751j518364m584244j637275J316678
38442c844598Q2918k016222j861486j708320k745318j396317L223252N584726
38434d681365K784792J50565J855728L129684q33771m858392j663941N334403
38426A217703O910168K248406j704664k724062m560537o659763l782537K861579
38418f193707M798242l58523m435529j650484L016676L425703J570178R63342
38410A135898j023105o137444p804089p11212P512131N697333k820754m205116
38402h356358M009231Q447419J045264p939238n846966L365363O655519K142487
38394C522721l86099K915718M178601k031720r113271q384730j477541L657696
$$ plain form
38450 -18470189 -14904365 -9802823 -2396144 2578607 1060243 -3524001 -5161276 -3844598
38442 -3844598 -3761680 -5777902 -7639388 -9347708 -12093026 -13489343 -10266091 -4681365
38434 -4681365 -1896573 -1746008 109720 3239404 2405633 -2452759 -4116700 1217703
38426 1217703 8127871 10376277 8671613 5947551 1387014 -5272749 -9055286 -6193707
38418 -6193707 -1395465 -1753988 -6189517 -7840001 -4823325 -1397622 172556 1135898
38410 1135898 112793 -6024651 -13828740 -14539952 -7027821 -1330488 -4151242 -8356358
38402 -8356358 -4347127 4100292 5145556 -2793682 -8640648 -5275285 1380234 3522721
38394 3522721 3136622 6052340 10230941 8199221 -914050 -9298780 -10776321 -7118625
38386g118625M371822M017448L753019J076522l451580m622245N9993O024995
38378D111349P388639L812107j019644m846189p410979p700902m673499j92280
38370a0531398K426869L017344M327625O568183O009712J074135l616989k920032
38362F355449J095616J501521l623188q046142n602939J870359P347613P120728
38354H019017L634989J018422O80817J277014Q48017j327317l718773l683282
38346F748904r38087J028401q20519m222869m015439O41966M866377M743306J904209
38337I936249k96514j614780l031097l105490l02027K845432K353813j031932
38329E753654k621261r31294K55596j856536m751070m630248j636254J388227
$$ plain form
38386 -7118625 -2746803 1270645 5023664 6100186 2648606 -1973639 -1913646 4111349
38378 4111349 11499988 15312095 14292451 9446262 2035283 -5665619 -10339118 -10531398
38370 -10531398 -8104529 -5087185 -759560 5808623 11818335 12892470 9275481 6355449
38362 6355449 7451065 8952586 5329398 -2716744 -8319683 -6449324 898289 8019017
38354 8019017 11654006 12672428 13353245 14630259 15478276 14150959 10432186 6748904
38346 6748904 5810817 6839218 6018699 1795830 -2219609 -1577643 3288734 8032040 9936249
38337 9936249 9639735 8024955 4993858 1888368 1586341 4431773 6785586 5753654
38329 5753654 3132393 2201099 2456695 600159 -4150911 -8781159 -10417413 -9029186
38321i029186K891684K920359J642734K30220J187500M663342O095253J377025
38313A1978931o364379r337693m857385J431370L400627J666605N04901Q91421
38305f85602N28927r72883j428481n79282j110957l784287m985243j593853M060799
38296a0550862P035311O122219M236219L221405J856774n74774k292297k179029
38288F874966k007207l244461m012821k064242R89413J789474N79966P04613K786479
38279B396180L286006N2323m043612n056307l037059q43138K48732J207289K654003
38270c135583L977994M468008L462950J50106m689992p406167m619644J974892
38262e817436O204122L900648k492250o706998n200774j51198L606049L857533
$$ plain form
38321 -9029186 -6137502 -3217143 -1574409 -1344189 -156689 4506653 10601906 11978931
38313 11978931 5614552 -3723141 -8580526 -7149156 -3748529 -2081924 -1577023 -685602
38305 -685602 -156675 -1129558 -2558039 -3137321 -4248278 -8032565 -13017808 -14611661 -10550862
38296 -10550862 -3515551 2606668 6842887 10064292 11921066 11346292 9053995 6874966
38288 6874966 4867759 1623298 -2389523 -4453765 -3464352 -1674878 -1094912 -390299 2396180
38279 2396180 5682186 5734509 1690897 -3365410 -6402469 -7245607 -6996875 -5789586 -3135583
38270 -3135583 842411 5310419 8773369 8923475 4233483 -3172684 -7792328 -5817436
38262 -5817436 386686 4287334 1795084 -4911914 -10112688 -10263886 -6657837 -2800304
38254b800304K820239L533267N275402M372348j89247m506102m803320k346614
38246A355669o14773J59697J576969J896004j964428p048712n567200L735657
38238f471117J1295179Q570326k97952m604350j760271J173474m43968k679469
38230D781852n05194M583780P339630N198376m04810n952332p499888l861277
38222C680137N98104L38736l135347k786392K428497M602027k65527m023405J329288
38213B766118R158047O553668n658844j2839476p047007L257339P011271M221522
38205G422638R13863j153834l174123l844082j980751l31721j085646j532747
38197d766403O80806K446712Q90027o07163J472020L373528L99729l651600k189991
$$ plain form
38254 -2800304 19935 3553202 8828604 13200952 13011705 8505603 3702283 1355669
38246 1355669 740896 900593 2477562 4373566 2409138 -4639574 -10206774 -6471117
38238 -6471117 4824062 13394388 13096436 8492086 6731815 7905289 7461321 4781852
38230 4781852 4276658 8860438 16200068 21398444 20993634 15041302 7541414 3680137
38222 3680137 4278241 4616977 1481630 -1304762 1123735 5725762 5460235 1436830 2766118
38213 2766118 11924165 18477833 12818989 -20487 -7067494 -3810155 3201116 7422638
38205 7422638 8336501 7182667 4008544 164462 -1816289 -2148010 -3233656 -4766403
38197 -4766403 -4085597 -1638885 -748858 -1356021 115999 3489527 3889256 237656 -1952335
38188a952335K499819L154700N04904J195366L961696M71740q769111j2333767
38180a1266988n544739K089176K704123J334618L713516M503254j663968p109595
38172a1240603k017070Q181845R858069J655619n291800n224429k624443k66798
38164f969610L896673P022915K396779o786939q154606L31033M846345k791832
38156f209242j0655999m585148R438901J4119862O043133j803050n06222M670942
38148A0513177N598876J864794k757408o085488o503891k538996L452955O007382
38140I551401L219290j321328m213999n243962m098119K39757N254950N766285
38132I154275J440931j684286K39738L754426M220566J958480q63531m232920
$$ plain form
38188 -1952335 547484 3702184 4207088 5402454 9364150 9835890 1066779 -11266988
38180 -11266988 -16811727 -14722551 -12018428 -10683810 -6970294 -2467040 -4131008 -11240603
38172 -11240603 -13257673 -5075828 4782241 6437860 1146060 -4078369 -6702812 -6969610
38164 -6969610 -3072937 3949978 6346757 -440182 -8594788 -8263755 -3417410 -6209242
38156 -6209242 -16865241 -21450389 -12011488 2108374 8151507 6348457 5842235 10513177
38148 10513177 16112053 17976847 15219439 9133951 2630060 91064 3544019 9551401
38140 9551401 12770691 11449363 7235364 1991402 -2106717 -1866960 3387990 9154275
38132 9154275 10595206 8910920 9150658 12905084 17125650 19084130 18220599 13987679
38124A3987679p335458o713681j967610J445272N7475j822905J03213J793895
38116d52120k022130o846593m221222L782452O580514J678524j688787J841567
38108a347795N007733K00255q073603j0200534n023665R69520M047110N675055
38100h745924O802270O110933L307916l19909l802346n828952m339690l1946K626883
38091d220765J592957Q27942L097749L619620k290791q914912o457991L575133
38083i171058Q844580L231578n340553p011660k157109K663823M441963M306837
38075a91599K995796P69836r13034j258818j333285j225411P47230M062542N198589
38066H851846K979270L27285j496814m950333r438967q886260j115896O249795
$$ plain form
38124 13987679 6652221 -61460 -2029070 -583798 -526323 -2349228 -2246015 -452120
38116 -452120 -2474250 -9320843 -13542065 -9759613 -3179099 -1500575 -3189362 -1347795
38108 -1347795 3659938 3860193 -4213410 -14413944 -19437609 -18468089 -14420979 -8745924
38100 -8745924 -1943654 4167279 7475195 7155286 3352940 -2476012 -6815702 -6847648 -4220765
38091 -4220765 -2627808 -1799866 1297883 4917503 2626712 -6288200 -12746191 -9171058
38083 -9171058 -326478 2905100 -2435453 -9447113 -11604222 -8940399 -4498436 -191599
38075 -191599 2804197 3574033 2660999 1402181 68896 -1156515 -409285 3653257 8851846
38066 8851846 11831116 12158401 10661587 5711254 -3727713 -12613973 -13729869 -7480074
38058g480074N732038P47206r83782j07756k500108o513998m235574M389174R205941
38049a746933M533250k669033l726448o1642J504428k51023j209947j56846l17875
38040d102069l064643n044865k864649K178417N620286M978465K074646J96799
38032b7613Q8530P7905l73108K16836K052947K836892J439744k39858j154290
38023D917985l183183o370921o372946j111582M246680M660632L376966N630632
38015E794263Q331393N270871n12840q68207K301536r91347j0422163j3034105
38007d130599l966396M319368J402728n021202l031529M001196M612716j410472
37999c224190m447456j477273J709650K248860K419704J873122j277788l218361
$$ plain form
38058 -7480074 -1748036 -1000830 -1984612 -2092368 -4592476 -11106474 -15342048 -10952874 -1746933
38049 -1746933 2786317 117284 -3609164 -3670806 -2166378 -2417401 -3627348 -3784194 -4102069
38040 -4102069 -7166712 -12211577 -15076226 -12897809 -7277523 -2299058 -224412 -27613
38032 -27613 60917 138822 -234286 -17450 2035497 4872389 6312133 6072275 4917985
38023 4917985 1734802 -4636119 -11009065 -12120647 -7873967 -3213335 163631 5794263
38015 5794263 14125656 19396527 18883687 18015480 20317016 19325669 8903506 -4130599
38007 -4130599 -8096995 -3777627 -2374899 -7396101 -10427630 -6426434 -1813718 -3224190
37999 -3224190 -7671646 -9148919 -7439269 -5190409 -2770705 -897583 -2175371 -5393732
37991e393732N81350M875064J399496n071041j684431J0379670J4339513L120437
37983B2546326q762988o839056K857474N730091N60774l163669k674106l166204
37975G088642n101132k997767L331491O827685L793814j562956m405988m335241
37967B638548k360624P44307K082916j169846n865640n110595J768401P126353
37959a46180N376761L22674j160807J519825L591816K235517j038585l763724
37951F937297m810602l930447j641791N21345J299894J013009N56102m0478p58019
37942h53690l29459K158430M715624L754918j261126o171267o536037k692754
37934g215361J266407K791397K722208J949211l36687l456380l785572J67835
$$ plain form
37991 -5393732 -4812382 62682 1462178 -3608863 -5293294 5086376 19425889 22546326
37983 22546326 13783338 6944282 9801756 15531847 16092621 12928952 10254846 7088642
37975 7088642 1987510 -1010257 2321234 9148919 12942733 11379777 6973789 2638548
37967 2638548 277924 1022231 3105147 1935301 -3930339 -9040934 -7272533 -146180
37959 -146180 5230581 5553255 4392448 5912273 9504089 11739606 10701021 6937297
37951 6937297 2126695 -1803752 -3445543 -2924198 -1624304 -611295 -55193 -95671 -853690
37942 -853690 -1183149 975281 5690905 9445823 8184697 2013430 -4522607 -7215361
37934 -7215361 -5948954 -3157557 -435349 1513862 1177175 -2279205 -6064777 -5896942
37926e896942L900029K552118j524013k282786J44818n6754l707460m377325N53980
37917a0694335M519965K227026j759724j315026Q65627p09115l268223m43873
37909a0577678N522867O743919L041766J443600K839516R10045m245673l914253
37901A764109L697024P862682J967554n306950m281192L3006k170215p515610
37893c949592m881261N168519J0388388N936253M42952P33886K281320l56135
37885A5764330l505978j686851K015117N48305n809616r547077o057613J198030
37877g081353N458402L591152j590734m391840k159718J549748J345226k752969
37869f032086n496941l957315p75646J163176K629891M383100M280997J528332
$$ plain form
37926 -5896942 -1996913 555205 -968808 -3251594 -3106776 -3163530 -6870990 -11248315 -10694335
37917 -10694335 -6174370 -3947344 -5707068 -7022094 -6156467 -6865582 -10133805 -10577678
37909 -10577678 -5054811 1689108 4730874 6174474 9013990 9924035 5678362 1764109
37901 1764109 5461133 13323815 15291369 9984419 5703227 5736233 3566018 -3949592
37893 -3949592 -8830853 -3662334 6726054 12662307 13105259 13839145 16120465 15764330
37885 15764330 12258352 10571501 12586618 13134923 7325307 -2221770 -8279383 -7081353
37877 -7081353 -1622951 1968201 377467 -4014373 -6174091 -4624343 -3279117 -6032086
37869 -6032086 -11529027 -15486342 -16261988 -15098812 -12468921 -8085821 -3804824 -2276492
37861b276492k41742J626944L689174J545994k440413k085174L133222O904194
37853I855707M532888j923196p463852r105158o299317l24507N096228N644597
37845A3390J127925l298038k488855K806617O686580M744375o01537k394396K235081
37836H831142O990300L359045p139537j2732644o397554L922051N733916r98119
37828A568600m940309l00684N900271N333096n19325m828334n168917l669390
37820f624992j446593J578004L516814K355025J64586J090595N049179P127632
37812A2810250M155686r71512l186785j811267r07691k889920m212175k81285
37804B705301O204303O857182k54820n673606j378431O127450M302826o260438
$$ plain form
37861 -2276492 -2518234 -891290 2797884 4343878 1903465 -181709 2951513 9855707
37853 9855707 14388595 12465399 5001547 -4103611 -10402928 -10727435 -5631207 13390
37845 13390 1141315 -2156723 -4645578 -1838961 4847619 9591994 8990457 6596061 8831142
37836 8831142 15821442 19180487 12040950 -691694 -7089248 -3167197 2566719 1568600
37828 1568600 -3371709 -3672393 2227878 7560974 7041649 2213315 -2955602 -6624992
37820 -6624992 -8071585 -6493581 -2976767 -621742 -457156 633439 5682618 12810250
37812 12810250 16965936 15994424 12807639 10996372 10088681 7198761 2986586 2705301
37804 2705301 8909604 15766786 15511966 9838360 8459929 14587379 18890205 12629767
37796A2629767j2143254p324990j071148j485690l314176J74979M202377K160494
37788f171641q20217K841409P222088J611194q820667q250000M031568J0750940
37780B394674L448942m880819j727703N648485M263080l310091n336620n24381
37772b4433K690477J608139Q42294J151088j018511m122278l142859n2882j378666
37763c447631n343724l467656L594040M712136l177755q007864j247688P753591
37755h632551O177133k378814m641147J288339N046751K443090J358185O715945
37747G376931J1023826N781118n415301j1767365q620995k93868O856100Q788013
37739A3728459M059989m418313r337221o148497L53364J796426j907655k671373
$$ plain form
37796 12629767 486513 -6838477 -7909625 -9395315 -12709491 -12534512 -8332135 -6171641
37788 -6171641 -6991858 -4150449 3071639 4682833 -4137834 -12387834 -8356266 2394674
37780 2394674 5843616 962797 -764906 4883579 9146659 5836568 499948 -24433
37772 -24433 2666044 4274183 5116477 6267565 5249054 1126776 -2016083 -2068965 -3447631
37763 -3447631 -8791355 -12259011 -8664971 -3952835 -7130590 -15138454 -16386142 -8632551
37755 -8632551 -2455418 -4834232 -9475379 -8187040 -3140289 -697199 660986 7376931
37747 7376931 18400757 24181875 18766574 6999209 -1621786 -1915654 4940446 13728459
37739 13728459 17788448 13370135 4032914 -2115583 -1762219 34207 -1873448 -4544821
37731d544821K852953P480682M353945k420678m025440N9912K485552q9991k996938
37722C155176k112393M42565J511989J868781K530020J235831k972578n805265
37714a45874l444161R71760K007328L52445K64618O39823l395361r803751r332909
37705b1886082O93540R929949Q310685K80383j819321M407549Q679450L449125
37697A2045278n774120q796754l874060K184369L797008J509989j634793l862150
37689d405233m162057j711262K408031M991198L932438O67788j548504r13122
37681g40723J751084L735983K171517k907050o770912m282282K674956N782705
37673A415278J187706m167115k052351M529354N526482p87152n274257k317343
$$ plain form
37731 -4544821 -1691868 5788814 10142759 7722081 3696641 3756553 6242105 6152114 3155176
37722 3155176 1042783 1485348 2997337 4866118 7396138 8631969 5659391 -145874
37714 -145874 -3590035 -2618275 -610947 -258502 6116 645939 -2749422 -12553173 -21886082
37705 -21886082 -21192542 -11262593 -2951908 -2671525 -4490846 -83297 8596153 12045278
37697 12045278 6271158 -2525596 -6399656 -4215287 -418279 1091710 -543083 -4405233
37689 -4405233 -8567290 -10278552 -7870521 -2879323 1053115 1720903 172399 -740723
37681 -740723 1010361 4746344 6917861 4010811 -2760101 -7042383 -4367427 1415278
37673 1415278 2602984 -1564131 -3616482 912872 6439354 5652202 377945 -1939398
37665a939398J984847L79481m358644n320580k805076k015690l128518j860389
37657a9063967J841060L618978K786798L088293M884038L917245l97350k309035
37649a633940J562741O416478N927249P17916l454906l262194n08441J053412
37641F818315l06233k475054j589914K350266L573980j906163q522850p033843
37633i091496K045891P996264M349877l357700o937161n489851k202563J802842
37625a0883897N270794M602484l23910l391270j110968J113777j933681n499972
37617a2156643k304057M733844O630246K558564K29262K939038N563746M096391
37609A2290391Q38616j369518k918667l947371l416722k610202l405148k893900
$$ plain form
37665 -1939398 45449 424930 -3933714 -9254294 -12059370 -14075060 -17203578 -19063967
37657 -19063967 -17222907 -13603929 -10817131 -7728838 -2844800 1072445 675095 -1633940
37649 -1633940 -71199 6345279 12272528 12990444 9535538 6273344 5764903 6818315
37641 6818315 6512082 4037028 2447114 4797380 8371360 6465197 -2057653 -9091496
37633 -9091496 -7045605 950659 5300536 1942836 -4994325 -10484176 -12686739 -10883897
37625 -10883897 -5613103 -1010619 -1334529 -4725799 -5836767 -4722990 -6656671 -12156643
37617 -12156643 -14460700 -9726856 -3096610 -538046 -308784 2630254 8194000 12290391
37609 12290391 13129007 11759489 8840822 4893451 1476729 -1133473 -4538621 -7432521
37601g432521L083719J0639421J0465636J634104n701823m527768K34464J242240
37593I637472p82654j456599q27902r32346o92980P50352L61877l341401n685098
37584b969279k630025K126678L033614J405837J357667J082347l458591q770825
37576h822577p048049J125950O095897K762729k720587k716835J761400M586057
37568d976015L645348K005114K125219K641236Q36736l359250o460817n056101
37560h598530m18802K471483J644020R41394L529092N962361L267289k587270
37552F211037n134727l123464j347996j668939j15926M977023Q263623M737356
37544A2797987k556684o371488m163157L63240K654029J220612k432559n284836
$$ plain form
37601 -7432521 -4348802 6290619 16756255 18390359 12688536 8160768 8395232 9637472
37593 9637472 8854818 7398219 6570317 5637971 4944991 5695343 6057220 2715819 -2969279
37584 -2969279 -5599304 -3472626 -439012 966825 2324492 3406839 -51752 -8822577
37576 -8822577 -15870626 -14744676 -8648779 -5886050 -8606637 -11323472 -9562072 -4976015
37568 -4976015 -1330667 674447 2799666 5440902 6277638 2918388 -3542429 -8598530
37560 -8598530 -9017332 -6545849 -4901829 -3960435 -431343 5531018 8798307 6211037
37552 6211037 1076310 -2047154 -3395150 -5064089 -5180015 -202992 8060631 12797987
37544 12797987 10241303 3869815 -293342 69898 2723927 3944539 1511980 -3772856
37536c772856n120482k867027j337701q58985J352019N944892Q568420N183286
37528G091566j707759n474571l273738J268538L058326P08796l575830p032399
37520h937071q001289n768772o63852M982675P169102L681503k283682m280266
37512a4101652j08232N040063N558711L235858L788351P056980O608141m2983
37504A7035237o718009o866290j834233K611662L951123K980737k72141n523179
37496E364907r044861o717696Q3138N641731O608020M107279J04672l963208n200980
37487c016998r96834N801871P883607K289589m907473n710980J44331N702439
37479G189552N638751J340966k693279m333698m245976k957426k02895K734079
$$ plain form
37536 -3772856 -8893338 -11760365 -13098066 -13957051 -12605032 -6660140 1908280 7091566
37528 7091566 5383807 -90764 -3364502 -2095964 962362 1671158 -1904672 -8937071
37520 -8937071 -16938360 -22707132 -23370984 -18388309 -11219207 -7537704 -9821386 -14101652
37512 -14101652 -14209884 -9169821 -3611110 -375252 3413099 10470079 17078220 17035237
37504 17035237 10317228 3450938 1616705 4228367 8179490 11160227 10888086 5364907
37496 5364907 -3679954 -10397650 -10314512 -4672781 1935239 6042518 6147190 2183982 -3016998
37487 -3016998 -4013832 1788039 9671646 11961235 7053762 1342782 1487113 7189552
37479 7189552 12828303 14169269 11475990 7142292 2896316 -61110 -264005 2470074
37471B470074K509540k365724p947799p971824j469781N071898N233320O22249
37463c848047j710771R87353M081663L293809J291780K849263O093335M249190
37455A7287575l462461q406147l516360O316740J0131331N187110q27070j853119
37447B0857599q24603k453547n232987n592569m840336n545502m931186M36348
37439h126783N960545M053593k799091l994542K464205N693109q65327p807712
37431e422003l416520Q341226J3425932P412197m06145j442726K545272N021284
37423B6058517K773178k991572q337993q564679l020582K179928J055774l462419
37415E690152l494998J785682N257822L294682K00705n91467j557929l841677
$$ plain form
37471 2470074 4979614 2613890 -5333909 -13305733 -14775514 -9703616 -4470296 -3848047
37463 -3848047 -5558818 -4571465 -489802 2804007 4095787 6945050 13038385 17287575
37455 17287575 13825114 5418967 1902607 8219347 18350678 23537788 22710718 20857599
37447 20857599 20032996 17579449 12346462 6753893 1913557 -3631945 -8563131 -8126783
37439 -8126783 -2166238 1887355 -911736 -4906278 -2442073 3251036 2385709 -5422003
37431 -5422003 -8838523 -497297 12928635 20340832 19934687 18491961 21037233 26058517
37423 26058517 28831695 25840123 17502130 8937451 5916869 8096797 9152571 5690152
37415 5690152 2195154 3980836 9238658 12533340 12734045 12142578 10584649 6742972
37407F742972k990322K680110O428827K659080l357309l186014J288644R27457
37399A1193445n801537j0113261o161123Q55023L012805K95769j309155J213436
37391f814598N131818O738324N463353L198963J617770Q48815J00624r95707j954896
37382A3334466k267829j980575j217047j09458L79936r06513k830541j944807
37374B457632K940086P564924O501328K84263m711264m115104n47459P00089j284421
37365I790074k793959j343163J186963J992532J528901K070395L314934K493645
37357A8240322q26421l290361k763875j715786k777749l856254j949476N25470
37349A585870q87337m094907k583289L016626L812711l305262q733630l834785
$$ plain form
37407 6742972 3752650 6432760 12861587 15520667 12163358 8977344 10265988 11193445
37399 11193445 5391908 -4721353 -10882476 -10027453 -7014648 -6718879 -8028034 -6814598
37391 -6814598 -1682780 5055544 10518897 13717860 15335630 16184445 16285069 15289362 13334466
37382 13334466 11066637 9086062 7869015 7759557 8139493 7232980 4402439 2457632
37374 2457632 5397718 12962642 19463970 19748233 15036969 10921865 10374406 11074495 9790074
37365 9790074 6996115 5652952 6839915 8832447 10361348 12431743 15746677 18240322
37357 18240322 17413901 14123540 11359665 9643879 6866130 3009876 1060400 1585870
37349 1585870 698533 -3396374 -5979663 -2963037 849674 -2455588 -11189218 -15024003
37341a5024003N242027O347068o10126m873273k199591M21426j299708j591533
37333a3587713M049637R636520P920073J900452r78945j087416l952951q309254
37325d409597o921115M91488M996166K198755m59191M119122J0186515P308837
37317A7510980k638007o607408P99209Q958692O170658m069127q835756l834370
37309G454871K662332L238698L14757p88019o30495k448471m817273l606055P78057
37300B158402L643371L005392J655269K008622K907166K391159N19497j496827
37292A6792051k677537k429441j371979j682358m230635o138040m258455k43907
37284f240301J698027J371796K081726L708863K271747k277337m184087q22010
$$ plain form
37341 -15024003 -9781976 -3434908 -4045034 -8918307 -11117898 -10696472 -11996180 -13587713
37333 -13587713 -9538076 98444 8018517 9918969 8940024 7852608 3899657 -4409597
37325 -4409597 -11330712 -10839224 -5843058 -3644303 -4103494 15628 10202143 17510980
37317 17510980 14872973 8265565 9064774 18023466 24194124 20124997 11289241 7454871
37309 7454871 10117203 13355901 13670658 12882639 12252144 9803673 4986400 1380345 2158402
37300 2158402 5801773 8807165 10462434 12471056 15378222 17769381 18288878 16792051
37292 16792051 14114514 11685073 10313094 8630736 4400101 -1737939 -5996394 -6240301
37284 -6240301 -4542274 -3170478 -1088752 2620111 4891858 2614521 -1569566 -2391576
37276b391576K456165O20683l300390m062772k842321l438206l874951J87724
37268a6645644N937453O025331M14490k976158p14323J488926o30619k743092
37260i843636n2955M301351M916522K835398K184705K426870Q78571l88655K315990
37251I574161O341914N570788L20942l197607k987319k865466l626003j485533
37243G645877K741148K362771l347839n435561N46959N627761J207297o080437
37235E267976m374482M010716O023081j606948q490779p733363m166768k657447
37227a3728014l97650M104869N396300J251270j010410L772306Q764393N693322
37219A3846386j682859m053230r15858J232574N90334R5789n68082l031945l468256
$$ plain form
37276 -2391576 64589 685272 -2615118 -6677890 -9520211 -12958417 -16833368 -16645644
37268 -16645644 -10708191 -4682860 -4268370 -7244528 -7958851 -6469925 -7100544 -9843636
37260 -9843636 -9896591 -5595240 -678718 2156680 4341385 6768255 7646826 7258171 9574161
37251 9574161 15916075 21486863 21807805 18610198 15622879 12757413 9131410 7645877
37243 7645877 10387025 12749796 9401957 3966396 4513355 10141116 11348413 5267976
37235 5267976 893494 4904210 10927291 9320343 829564 -6903799 -11070567 -13728014
37227 -13728014 -14125664 -10020795 -4624495 -3373225 -4383635 -611329 8153064 13846386
37219 13846386 12163527 8110297 7194439 8427013 9017347 9113136 8545054 5513109 2044853
37210B044853J726943O137574P83271j0054804j2836388m803285K623388K183010
37202a2195438m03757N81009J924717J044436K403324P272332Q045906R22358
37194I594887n764800m692698j306568k493107l157038L555748J0802782P351027
37186A3890233l012933o630794j696216O60325l488837n349104n25130L129303
37178c023153Q6064l178710j40577M575699L889613r7218j365379n69758k200476
37169b023895n481982n597399j491146L319813N705780M541055R0325m504755
37161e442204m341772R41363N342995M413877J026224m04311o69972j993578k354459
37152c481837L71497K691501O58828k547685j399951K292292K311468j064274
$$ plain form
37210 2044853 3771796 9909370 10692641 637837 -12198551 -17001836 -14378448 -12195438
37202 -12195438 -12599195 -12018186 -10093469 -9049033 -6645709 626623 8672529 9594887
37194 9594887 3830087 -862611 -2169179 -4662286 -7819324 -4263576 6539206 13890233
37186 13890233 10877300 4246506 2550290 3210615 -278222 -5627326 -6152456 -3023153
37178 -3023153 -2937089 -6115799 -6256376 -1680677 2208936 2111718 746339 176581 -2023895
37169 -2023895 -7505877 -13103276 -14594422 -11274609 -5568829 -1027774 -937449 -5442204
37161 -5442204 -9783976 -8842613 -3499618 914259 1940483 1536172 866200 -1127378 -3481837
37152 -3481837 -3110340 -418839 239989 -2307696 -3707647 -1415355 896113 -168161
37144a68161j512564K287462M542713K374950j31666r1910k86565k142083j565801
37135C306375L352133O607718K310629n807375r107937n498901k46400K745092
37127b338666M243598M717090K205344l107251o651996m539718J384591N626734
37119A539726N004291J265196j392042n56328K196173L124220O21261l020307
37111H782190m975889n576036o389040n782217l48456Q371964J2721099P639548
37103A4443163j990192o727656m144221n20347q51336k408111q64164J866966
37095a195898J141085j596116k47144N198453O270253j869370j1220925j0086938
37087a3606600R63811R182691O104243k541654o147868l089852k21224j410931
$$ plain form
37144 -168161 -1680725 606737 5149450 7524400 7392734 7300824 7014259 4872176 3306375
37135 3306375 6658508 13266226 15576855 9769480 661543 -4837358 -5083758 -2338666
37127 -2338666 1904932 6622022 8827366 5720115 -931881 -5471599 -4087008 1539726
37119 1539726 6544017 7809213 6417171 5860843 8057016 11181236 11802497 8782190
37111 8782190 3806301 -1769735 -8158775 -13940992 -14289448 -5917484 6803615 14443163
37103 14443163 12452971 5725315 1581094 1060747 209411 -2198700 -3062864 -1195898
37095 -1195898 -54813 -1650929 -1898073 3300380 9570633 7701263 -3519662 -13606600
37087 -13606600 -12642789 -3460098 2644145 102491 -6045377 -9135229 -9356453 -10767384
37079a0767384k692436O41748O783054R658957O161103j081770p045813q546671
37071f889212n568644k45977M612527O685122N071692Q69894l306719n135660
37063c906977m270091j945641Q60949L865943O068418N659776K409018j258867
37055G482528k944209k780925j834098K33116L472384N263893L138874p31135
37047A1300428j747039N01442J993078R31166k69190p22653k947136o316402m965207
37038b241513K828544Q851928N446611k566477m743223p79930M41497l345905
37030C891532m166383J529061N444269O53878o429115n390366K532100O687936
37022D752912K067426n559006q626937n799359j043875J005448j039178l498376
$$ plain form
37079 -10767384 -13459820 -12818072 -6035018 3623939 9785042 8703272 1657459 -6889212
37071 -6889212 -12457856 -12703833 -8091306 -1406184 3665508 4535402 1228683 -3906977
37063 -3906977 -8177068 -10122709 -9261760 -5395817 672601 6332377 8741395 7482528
37055 7482528 4538319 1757394 -76704 156412 3628796 8892689 12031563 11300428
37047 11300428 9553389 10054831 12047909 12979075 12709885 11987232 9040096 2723694 -2241513
37038 -2241513 587031 9438959 14885570 12319093 7575870 6795940 7237437 3891532
37030 3891532 -274851 1254210 6698479 7352357 923242 -4467124 -1935024 4752912
37022 4752912 6820338 1261332 -7365605 -13164964 -14208839 -13203391 -14242569 -17740945
37014a7740945j483534L542085M285545j029849l781900K458320J0247413Q185290
37006D682425j504614o130816j658365K959601J533538q89233J067064M041244
36998D100844L214808L28756j320248k791479m799764l855697R44939L666241
36990e11600M74988l185105j253648K887997K679272o23676j707937j214249k564033
36981e017991k823750K546412Q464602N581048l674454o562518P81900P490455
36973F785704M927909j726509m366727l992253m324550k440317M631274J0488431
36965I982962P073268j993972o030014l182926j518868m507952n813770j107683
36957g098955M033737K982790j743039k956731N93358L736468K950651J75459
$$ plain form
37014 -17740945 -19224479 -15682394 -11396849 -12426698 -16208598 -13750278 -3502865 4682425
37006 4682425 3177811 -2953005 -4611370 -1651769 -118231 -1007464 59600 4100844
36998 4100844 7315652 7644408 6324160 3532681 -1267083 -5122780 -4177841 -511600
36990 -511600 -36612 -3221717 -4475365 -1587368 1091904 468228 -1239709 -2453958 -5017991
36981 -5017991 -7841741 -5295329 3169273 8750321 5075867 -1486651 -704751 6785704
36973 6785704 11713613 9987104 5620377 1628124 -2696426 -5136743 -505469 9982962
36965 9982962 17056230 15062258 9032244 5849318 4330450 -177502 -5991272 -7098955
36957 -7098955 -3065218 -82428 -1825467 -4782198 -4188840 -452372 2498279 2673738
36949B673738p61979J756510O107599Q281722M926960k319368p107884n464678
36941H092620q91601N75085j428449k329349l98458J102367j34580k110790k531758
36932e4913k050362j621090l29202J947049L114531K415498K050513K898073K396645
36923A0766742l71765j680226P61315K883459N79556k826837j780115J846751
36915A0178880J687262k319763m045321j577681N73909K12836L38072J909970
36907F958164J693004n88215p63075J656576J915024n98102k60051L595960L085998
36898A6695283m768010j0578182o455860J424814L511861K131389M824902Q934266
36890A5720463N898290k701556o563895k947347O21060k2996p32205J186329K714223
$$ plain form
36949 2673738 1911759 3668269 9775868 18057590 22984550 20665182 13557298 8092620
36941 8092620 7201019 7776104 6347655 4018306 3619848 4722215 4587635 2476845 -54913
36932 -54913 -2105275 -3726365 -4055567 -2108518 1006013 3421511 5472024 8370097 10766742
36923 10766742 10394977 8714751 9476066 12359525 12939081 10112244 8332129 10178880
36915 10178880 11866142 9546379 5501058 3923377 4497286 4710122 5048194 6958164
36907 6958164 8651168 8062953 7299878 8956454 10871478 10273376 10013325 13609285 16695283
36898 16695283 11927273 1349091 -5106769 -3681955 -170094 1961295 6786197 15720463
36890 15720463 21618753 18917197 12353302 9405955 10027015 10004019 9271814 10458143 13172366
36881A3172366K325376K159781J759366j335987m170933j434910L445302J413432
36873A7333793o410855q218256j81492O798530M275514j857235l488844k756670
36865E494485l906046l372873J769056M588837r69437p366924l706889O458724
36857a011067R870969K985878m988016o657488l098948K980666R816388J2071695
36849B1970077M408351q300938j3478980o634705K833436M682019n9088l627977
36841A792195k480754Q28164L232209M344440N062684N382726L951126j4481m399094
36832A7699215n839335m572015m394106o006951m854463J032844N974542M529081
36824C568812j20084j931431j858485m302870p293392n223125N85811L400389
$$ plain form
36881 13172366 15497742 17657523 19416889 18080902 13909969 12475059 15920361 17333793
36873 17333793 10922938 2704682 2523190 9321720 13597234 11739999 8251155 5494485
36865 5494485 1588439 -1784434 -15378 4573459 3604022 -3762902 -7469791 -1011067
36857 -1011067 8859902 11845780 6857764 200276 -2898672 81994 9898382 21970077
36849 21970077 26378428 18077490 4598510 -2036195 797241 5479260 5420172 1792195
36841 1792195 -688559 139605 3371814 7716254 12778938 18161664 22112790 22098309 17699215
36832 17699215 11859880 7287865 2893759 -3113192 -7967655 -6934811 -960269 3568812
36824 3568812 3448728 1517297 -341188 -4644058 -11937450 -17160575 -16574764 -13174375
36816a3174375K401637L115540O389773O567078K106238j264624m72239M65596
36808F134624j121176j962677j80174O82373j112085j740407M73441R61132k707154
36799e72103n430761k972170P95901Q13197j050414q24668L80517M40437J889542
36790f530522O337516Q236334K410993n859624o818711j33940N307844M404709
36782G354599Q98679n71424m08893p68295j665674j914243p01467J883805L519511
36773G626598P36323n486023q230349l324995L650141M751123R49529r71491o803
36764c05947o06284k062877J513343R190054J1357167L925128m432677m927160
36756A3650747j179542j959140o848039p580398j425200M655488L896435j762210
$$ plain form
36816 -13174375 -10772738 -7657198 -1267425 5299653 7405891 6141267 5669028 6134624
36808 6134624 5013448 3050771 2870597 3552970 2440885 700478 1173919 2135051 -572103
36799 -572103 -6002864 -8975034 -8179133 -7365936 -8416350 -9241018 -8860501 -8420064 -6530522
36790 -6530522 -193006 8043328 10454321 4594697 -2224014 -2357954 2949890 7354599
36782 7354599 8253278 7681854 7272961 6504666 4838992 2924749 2223282 4107087 7626598
36773 7626598 8362921 2876898 -5353451 -8678446 -5028305 -277182 672347 -299144 -305947
36764 -305947 -912231 -2975108 -1461765 7728289 19085456 23010584 18577907 13650747
36756 13650747 12471205 10512065 3664026 -3916372 -5341572 -686084 3210351 1448141
36748A448141m961539j826981M047937N823004J373752l606639k422672L304532
36740C179535N335750P24581l623302j685873K122695K24262n678794p591212
36732f992358m527715l417789o030761m814856M048633J1962936R418743M45230
36724I2063k953543K048764O410456L608077j768700k484186J113566L807458
36716I873955L831094L311361K865675P76793k851963m863889k740028K159099
36708A2362097N330174K936584l767446p869089l801549M204490N266382l773890
36700A0887753j2278869r304553J411604P303688M524899K71194j201057l616944
36692b002285p385854m841835O495115J5070049R141891o050182j4562026j0037082
$$ plain form
36748 1448141 -3513398 -5340379 -1292442 4530562 5904314 2297675 -124997 3179535
36740 3179535 8515285 9239866 5616564 3930691 6053386 6277648 598854 -6992358
36732 -6992358 -11520073 -14937862 -20968623 -25783479 -21734846 -9771910 -353167 92063
36724 92063 -2861480 -812716 5597740 9205817 7437117 4952931 6066497 9873955
36716 9873955 13705049 17016410 19882085 20658878 17806915 12943026 10202998 12362097
36708 12362097 17692271 20628855 16861409 8992320 5190771 9395261 14661643 10887753
36700 10887753 -1391116 -10695669 -9284065 -1980377 2544522 2815716 1614659 -2002285
36692 -2002285 -9388139 -14229974 -7734859 7335190 16477081 10426899 -4135127 -14172209
36684a4172209n32385N141451O353297N503845K909652m36576j701769p73126
36676B292180q03396k086796q54537L372448N023719P85188m439213m509563r20979
36667b140949M86789j328818k377370q71683Q74390J452035K235347L615837L660956
36658E606534J791062J82035j29697j350953m910302p897381o485945j592337
36650a4786984J948231J718107M50516J535382M076930M457982J771925p95679
36642C76410m00046J734323K396451Q56325o61637m58184P39910J602090J990361
36633H176003K030195R84113j419619l388043k517217J082179M303080M131353
36625A3382044O93750l014750m152250k705867j298708k175463m311263m171626
$$ plain form
36684 -14172209 -14704594 -9563143 -3209846 2293999 5203651 4767075 3065306 2292180
36676 2292180 1488784 -598012 -1452549 1919899 6943618 7728806 3289593 -1219970 -2140949
36667 -2140949 -1654160 -2982978 -5360348 -6232031 -5357641 -3905606 -1670259 1945578 5606534
36658 5606534 7397596 7579631 7449934 6098981 1188679 -6708702 -13194647 -14786984
36650 -14786984 -12838753 -11120646 -10670130 -9134748 -5057818 -599836 1172089 376410
36642 376410 -23636 1710687 4107138 4963463 4301826 3843642 4583552 6185642 8176003
36633 8176003 10206198 11190311 9770692 6382649 3865432 4947611 9250691 13382044
36625 13382044 14075794 11061044 6908794 4202927 2904219 728756 -3582507 -7754133
36617g754133K4749N437085P268261M274359J47512j213712l05318l72543k172107
36608E334153k798254j79684L376134L709390n5932m402245n275074k162252J558350
36599h95414J935094j451691m582930l307427J259601L723654J832653P8010L085162
36590A676712P868356P301137N51457n307817n339913l234632m570350p617355
36582h672405n777714K260354R572113R072984J651435n152299n226315L99395
36574a872452N383602M859561N8259l800982l363983Q4448K942144K688985o85770
36565F293812m677432n800665l235557p09971k128176n559895n139992N25915
36557b0431961N893590N924397K108331j060565j861144r31119J347988L775808
$$ plain form
36617 -7754133 -7729384 -2292299 4975962 9250321 9397833 8184121 7878803 7506260 5334153
36608 5334153 2535899 2356215 5732349 9441739 9385807 4983562 -291512 -2453764 -895414
36599 -895414 1039680 -412011 -4994941 -8302368 -7042767 -3319113 -1486460 -1408450 1676712
36590 1676712 9545068 16846205 17397662 12089845 6749932 3515300 -1055050 -8672405
36582 -8672405 -14450119 -12189765 -2617652 6455332 8106767 2954468 -2271847 -1872452
36574 -1872452 3511150 8370711 8428970 4627988 1264005 1348453 4290597 6979582 6293812
36565 6293812 1616380 -4184285 -7419842 -8129813 -10257989 -15817884 -20957876 -20431961
36557 -20431961 -14538371 -8613974 -6505643 -7566208 -9427352 -10358471 -9010483 -5234675
36549e234675L638980M77118k022292j008773J379483J986924J627695K375756
36541C220216K998835J440994q88103j827502k740518n163826n936448j489347
36533a0385699M946058O518835K153248k752517m056338k073656J622250N132769
36525A104950N423195K120423K8870J774705J293423o861836j4894490j0116692
36517b0127452M555876J1661265L710635o388077n500806J138363P74800o600874
36509a6776270r973585m208238M890368R956724Q621900K709009k694313j682473
36501i156878N241403R319008M548325l158917m367964J43509K032666r54828
36493C646324l007435j203842M20991r92523k553324j557296M6366j48771r57624
$$ plain form
36549 -5234675 -1595695 -1118577 -3140869 -4149642 -2770159 -783235 844460 3220216
36541 3220216 6219051 7660045 6771942 4944440 2203922 -2959904 -8896352 -10385699
36533 -10385699 -5439641 1079194 3232442 479925 -3576413 -5650069 -4027819 1104950
36525 1104950 6528145 8648568 8677438 10452143 11745566 4883730 -10010760 -20127452
36517 -20127452 -15571576 -3910311 -199676 -6587753 -12088559 -10950196 -10175396 -16776270
36509 -16776270 -26749855 -30958093 -26067725 -16111001 -7489101 -4780092 -7474405 -9156878
36501 -9156878 -3915475 5403533 9951858 6792941 2424977 2568486 4601152 3646324
36493 3646324 638889 -564953 -143962 -1136485 -3689809 -5247105 -5200739 -5349510 -6307134
36484f307134l49995J102343J610598P26088o02564q57656J025897L669932L439822
36475C457331r29678n455496n612137k126459J226685L307542M891617M655871
36467C415276J228584k353485j975610P39718P99000j688726j797270J407723
36459b24790L068106P51284j869820j601141l14664m06094o07849P96064K497467
36450B088563K461784O26605k238021n210859n998714k855598J633028K967145
36442f526067J459258J583521L965754M008803J67607k726079j232501J483902
36434B184198J564226O9884q26274j697355k118159R27566O227801O274252j744643
36425A0861496q732161n259250M300230Q125629M195983J174817L172107M171513
$$ plain form
36484 -6307134 -6657129 -5554786 -3944188 -3218100 -3820664 -4678320 -3652423 17509 3457331
36475 3457331 2527653 -2927843 -8539980 -10666439 -9439754 -6132212 -1240595 3415276
36467 3415276 4643860 2290375 314765 1054483 1853483 164757 -1632513 -224790
36459 -224790 2843316 3594600 1724780 123639 -191025 -597119 -1204968 -408904 2088563
36450 2088563 4550347 5176952 2938931 -2271928 -8270642 -11126240 -9493212 -6526067
36442 -6526067 -5066809 -3483288 482466 4491269 4658876 1932797 700296 2184198
36434 2184198 3748424 3818308 2992034 1294679 -823480 104086 6331887 12606139 10861496
36425 10861496 2129335 -3129915 1170315 9295944 13491927 14666744 17838851 22010364
36417B2010364m77318o352775p688373n493645l299292o63920L748978O904246
36409H688265M911681m91240l848408l063546n78224J299978K203055J546352
36401A0667913j198587l757970k519028K005054M526231J742321l011723m442106
36393D012105k487584j507071l357174n066177l761973m59591K395986M223639
36385f007840N156448M032270J85374m142682n624052l382813P74445M342507
36377d666343N014161J868326k327541k765110O89289J785933l023665p546103
36369a0971053m155590L779772O130378J669581k29740M751085Q585900L998886
36361A3559219l949508o251919l117384r11756j016917q5418J939196K270554
$$ plain form
36417 22010364 21533046 15180271 7491898 1998253 -1301039 -1964959 1784019 8688265
36409 8688265 13599946 13108706 9260298 6196752 5618528 6918506 9121561 10667913
36401 10667913 9469326 5711356 3192328 5197382 9723613 11465934 8454211 4012105
36393 4012105 1524521 17450 -3339724 -8405901 -12167874 -12627465 -10231479 -6007840
36385 -6007840 -851392 3180878 3366252 -776430 -6400482 -9783295 -9008850 -4666343
36377 -4666343 347818 2216144 -111397 -2876507 -2187218 -401285 -3424950 -10971053
36369 -10971053 -15126643 -11346871 -5216493 -3546912 -3776652 974433 9560333 13559219
36361 13559219 9609711 3357792 240408 -671348 -1688265 -1773683 165513 2436067
36353B436067J672618K712789L242414n72311n732747n169084Q20547M079435
36345C489728Q16184l547375l887617k027900o82268J750476N644548N992329
36337G548105j15268o702733o116097K57554M791773M733295L861269M109197
36329A2367095K430469k803303p836344q406819m962167p50935K534096M920336
36321b507572N963360M870434K123455o70247k275010k286349o71024K075569
36313F622616M471065M698685K187523j578239m091996l959362k122817p32078
36305E495397p24575r95552k13001J210596J632920K99648j698844k374721m30159
36296B201709L383091N910485L834680k186013o610929m662600J376767M416003
$$ plain form
36353 2436067 4108685 6821474 10063888 9491577 3758830 -1410254 -589707 3489728
36345 3489728 4305912 758537 -3129080 -5156980 -5839248 -4088772 1555776 7548105
36337 7548105 7432837 730104 -5385993 -5128439 -336666 4396629 8257898 12367095
36329 12367095 14797564 11994261 4157917 -4248902 -9211069 -9962004 -7427908 -2507572
36321 -2507572 3455788 8326222 10449677 9779430 7504420 5218071 4547047 6622616
36313 6622616 11093681 15792366 17979889 16401650 12309654 8350292 6227475 5495397
36305 5495397 4770822 3775270 3562269 4772865 6405785 6705433 5006589 2631868 2201709
36296 2201709 5584800 11495285 15329965 13143952 6533023 1870423 3247190 7663193
36288G663193J593707k403978k733464j173818j830323l345276j150401L793746
36280D13386N145029R93587k843166j767905J346224K362969K367854L010640
36272A1028618J230469m474360p538550j920590O279824O109079j031787l173300
36264F509403K617342N380711r65783o987055l669680K371567N23629n746929
36256C3205n437794R96887L233869p32207k103808K348479M760749L18542m828416
36247a410494m696987k252831j262337J090345O180189P167093m85586q316097
36239c986705n397882M412779P155274m95716o742232l009578L942968L873053
36231b48039j229800j676106L943147O677663J342557n393381m844064J153338
$$ plain form
36288 7663193 9256900 6852922 4119458 2945640 1115317 -2229959 -3380360 413386
36280 413386 5558415 6552002 3708836 1940931 3287155 5650124 8017978 11028618
36272 11028618 12259087 7784727 246177 -1674413 4605411 10714490 9682703 6509403
36264 6509403 9126745 14507456 13541673 6554618 2884938 5256505 5780134 33205
36256 33205 -5404589 -4407702 -1173833 -1906040 -4009848 -1661369 3099380 3417922 -1410494
36247 -1410494 -6107481 -8360312 -9622649 -8532304 -2352115 4814978 4329392 -3986705
36239 -3986705 -9384587 -4971808 2183466 1687750 -5054482 -8064060 -4121092 -248039
36231 -248039 -1477839 -3153945 789202 7466865 8809422 3416041 -1428023 -274685
36223b74685L356785j348594n835600l165876M114844Q193630N934623P27443
36215A1702570l317218m723030l354495j47608J985500Q53998j364357r64659
36207F70701R79629r0292m021386m661300Q26951O583105N905948M53730l061652
36198C585434k513628j611183k954016m721019m294319j551876J751836L432639
36190h876132K125460o94126j113598K140082M715572K373207j974249k045745
36182c349529J640500J736787m293030q990640n384774K547195N744346L111925
36174g237220J684716M621739O548969L035734j722782j280792L189766M953135
36166A3793265J558240k936594m945325n029922m059111j304680J673414N99777
$$ plain form
36223 -274685 3082100 1733506 -4102094 -7267970 -3153126 5040504 10975127 11702570
36215 11702570 8385352 3662322 307827 160219 2145719 2999717 1635360 670701
36207 670701 1650330 1560038 -2461348 -7122648 -6295697 287408 6193356 6647086 3585434
36198 3585434 1071806 -539377 -3493393 -8214412 -12508731 -14060607 -12308771 -8876132
36190 -8876132 -6750672 -7444798 -8558396 -6418314 -1702742 670465 -1303784 -3349529
36182 -3349529 -1709029 27758 -4265272 -13255912 -18640686 -16093491 -10349145 -7237220
36174 -7237220 -5552504 -930765 5618204 8653938 6931156 5650364 8840130 13793265
36166 13793265 15351505 12414911 7469586 2439664 -1619447 -2924127 -1250713 -650936
36158f50936m691308p723275m208713N97557q04536o368161p018246j7322P501100
36149b3383840R294515P306714N645389L704278k65661l486234k066175K326495
36141i24519M206348J831082r08046k9362L979914P246855O257208O93200o100409
$$ plain form
36158 -650936 -5342244 -13065519 -17274232 -16676675 -17481211 -23849372 -30867618 -30884940 -23383840
36149 -23383840 -14089325 -6782611 -1137222 2567056 2301395 -1184839 -3251014 -924519
36141 -924519 3281829 5112911 4204865 4175503 8155417 15402272 21659480 22352680 16252271
$$ [...]
##END NTUPLES=NMR SPECTRUM
##END=
