##TITLE=31Pdec_SR1516_2
 D2O, 24 sc
 28.7.2020
##JCAMPDX= 6.0         $$ Bruker NMR JCAMP-DX V2.0
##DATA TYPE= NMR SPECTRUM
##DATA CLASS= NTUPLES
##ORIGIN= UXNMR, Bruker Analytische Messtechnik GmbH
##OWNER= root
$$ XWIN-NMR		Version 3.5
$$ Tue Jul 28 09:54:52 2020 Russian Standard Time (UT+4h)  she@DPX200
##.OBSERVE FREQUENCY= 81.013821
##.OBSERVE NUCLEUS= ^31P
##.ACQUISITION MODE= SIMULTANEOUS
##.ACQUISITION SCHEME= undefined
##.AVERAGES= 24
##.DIGITISER RES= 17
##SPECTROMETER/DATA SYSTEM= spect
##.PULSE SEQUENCE= zgpg30
##.SOLVENT NAME= CDCl3
##.SHIFT REFERENCE= (INTERNAL, CDCl3, 0, 182.463)
##AUDIT TRAIL= $$ (NUMBER, WHEN, WHO, WHERE, WHAT)
$$ ##TITLE= Audit trail, XWIN-NMR		Version 3.5
$$ ##JCAMPDX= 5.01
$$ ##ORIGIN= Bruker BioSpin GmbH
$$ ##OWNER= she
$$ F:/spectra/data/she/nmr/P31/1/pdata/1/auditp.txt
$$ ##AUDIT TRAIL=  $$ (NUMBER, WHEN, WHO, WHERE, WHAT)
(   1,<2020-07-28 09:53:58.89 +0400>,<she>,<DPX200>,
      <created by zg, POWCHK disabled, PULCHK disabled
       configuration hash MD5:
       00 E9 B6 7A A2 85 ED C7 34 08 36 98 17 FE 4E 26
       data hash MD5: 32K
       EE 23 8F 77 86 4E B6 1C E3 63 99 96 F6 39 DE B5>)
(   2,<2020-07-28 09:54:01.42 +0400>,<she>,<DPX200>,
      <Start of raw data processing
       efp BC_mod = 2 LB = 1 FT_mod = 6 PKNL = 1 PHC0 = -2620.092 PHC1 = 746.8016 SI = 64K 
       data hash MD5: 64K
       E8 A0 93 B5 21 5E 69 7E 1B 5B 73 A4 72 AB 72 4B>)
(   3,<2020-07-28 09:54:24.15 +0400>,<she>,<DPX200>,
      <pk PHC0 = -42.66778 PHC1 = -68.2 
       data hash MD5: 64K
       EC 68 AA FA DE EA C2 CF AA E1 FB 6F D8 20 1B CB>)
(   4,<2020-07-28 09:54:27.45 +0400>,<she>,<DPX200>,
      <abs ABSG = 5 
       data hash MD5: 64K
       CA D5 FF 1D EC 90 D4 BF 2D C8 16 B6 FA 3F 96 2B>)
$$ ##END=
$$ 
$$ hash MD5
$$ 6A 28 22 E5 28 F5 C1 4E CE 9F 1E F5 B2 28 3E 0D
##$RELAX= 
##$RELAX= 
##$RELAX= 
##$RELAX= 
##$RELAX= 
##$RELAX= 
##$RELAX= 
##$RELAX= 
$$ Bruker specific parameters
$$ --------------------------
##$DU= <F:/spectra>
##$EXPNO= 1
##$NAME= <P31>
##$PROCNO= 1
##$TYPE= <nmr>
##$USER= <she>
##$AMP= (0..31)
100 100 100 100 100 100 100 100 100 100 100 100 100 100 100 100 100 100 
100 100 100 100 100 100 100 100 100 100 100 100 100 100 
##$AQSEQ= 0
##$AQ_mod= 1
##$AUNM= <au_zg>
##$AUTOPOS= <>
##$BF1= 81.014009
##$BF2= 200.13
##$BF3= 200.13
##$BF4= 200.13
##$BF5= 200.13
##$BF6= 200.13
##$BF7= 200.13
##$BF8= 200.13
##$BYTORDA= 1
##$CFDGTYP= 0
##$CFRGTYP= 5
##$CHEMSTR= <none>
##$CNST= (0..31)
1 1 145 1 1 1 1 1 1 1 1 1 1 1 1 1 1 1 1 1 1 1 1 1 1 1 1 1 1 1 1 1 
##$CPDPRG= <waltz16>
##$CPDPRG1= <>
##$CPDPRG2= <waltz16>
##$CPDPRG3= <>
##$CPDPRG4= <mlev>
##$CPDPRG5= <mlev>
##$CPDPRG6= <mlev>
##$CPDPRG7= <mlev>
##$CPDPRG8= <mlev>
##$CPDPRGB= <>
##$CPDPRGT= <>
##$D= (0..31)
0 1 0 0 0 0 0 0 0 0 0 0.03 2e-05 3e-06 0 0 0 0 0 0 0 0 0 0 0 0 0 0 0 0 
0 0 
##$DATE= 1595915638
##$DBL= (0..7)
120 120 120 11 120 120 24 19 
##$DBP= (0..7)
150 150 150 150 150 150 150 150 
##$DBP07= 0
##$DBPNAM0= <>
##$DBPNAM1= <>
##$DBPNAM2= <>
$$ [...]
##$SUBNAM3= <"">
##$SUBNAM4= <"">
##$SUBNAM5= <"">
##$SUBNAM6= <"">
##$SUBNAM7= <"">
##$SUBNAM8= <"">
##$SUBNAM9= <"">
##$SW= 369.568048894756
##$SWIBOX= (0..15)
0 1 3 0 0 0 0 0 0 0 0 0 0 0 0 0 
##$SW_h= 29940.119760479
##$TD= 32768
##$TD0= 1
##$TE= 0
##$TE2= 300
##$TE3= 300
##$TEG= 300
##$TL= (0..7)
0 120 53 12 22 120 120 120 
##$TP= (0..7)
150 150 150 150 150 150 150 150 
##$TP07= 0
##$TPNAME0= <>
##$TPNAME1= <>
##$TPNAME2= <>
##$TPNAME3= <>
##$TPNAME4= <>
##$TPNAME5= <>
##$TPNAME6= <>
##$TPNAME7= <>
##$TPOAL= (0..7)
0.5 0.5 0.5 0.5 0.5 0.5 0.5 0.5 
##$TPOFFS= (0..7)
0 0 0 0 0 0 0 0 
##$TUNHIN= 0
##$TUNHOUT= 0
##$TUNXOUT= 0
##$USERA1= <user>
##$USERA2= <user>
##$USERA3= <user>
##$USERA4= <user>
##$USERA5= <user>
##$V9= 5
##$VALIST= <valist>
##$VCLIST= <CCCCCCCCCCCCCCC>
##$VD= 0
##$VDLIST= <DDDDDDDDDDDDDDD>
##$VPLIST= <PPPPPPPPPPPPPPP>
##$VTLIST= <TTTTTTTTTTTTTTT>
##$WBST= 1024
##$WBSW= 4
##$XGAIN= (0..3)
0 0 0 0 
##$XL= 0
##$YL= 0
##$YMAX_a= 4710
##$YMIN_a= -11897
##$ZGOPTNS= <>
##$ZL1= 120
##$ZL2= 120
##$ZL3= 120
##$ZL4= 120
##$ABSF1= 182.463
##$ABSF2= -187.1042
##$ABSG= 5
##$ABSL= 3
##$ALPHA= 0
##$AQORDER= 0
##$ASSFAC= 0
##$ASSFACI= 0
##$ASSFACX= 0
##$ASSWID= 0
##$AUNMP= <proc_1d>
##$AZFE= 0.1
##$AZFW= 0.5
##$BCFW= 0
##$BC_mod= 2
##$BYTORDP= 0
##$COROFFS= 0
##$CY= -3
##$DATMOD= 1
##$DC= 0
##$DFILT= <>
##$DTYPP= 0
##$F1P= 0
##$F2P= 0
##$FCOR= 1
##$FTSIZE= 65536
##$FT_mod= 6
##$GAMMA= 0
##$GB= 0
##$INTBC= 1
##$INTSCL= 5.30512e-09
##$ISEN= 30
##$LB= 1
##$LEV0= 0
##$LPBIN= 0
##$MAXI= 10000
##$MC2= 0
##$MEAN= 0
##$ME_mod= 0
##$MI= 50
##$NCOEF= 0
##$NC_proc= -9
##$NLEV= 6
##$NOISF1= 182.463
##$NOISF2= 159.3651
##$NSP= 0
##$NTH_PI= 0
##$NZP= 0
##$OFFSET= 182.463
##$PC= 4
##$PHC0= -2662.76
##$PHC1= 678.6016
##$PH_mod= 1
##$PKNL= yes
##$PPARMOD= 0
##$PSCAL= 0
##$PSIGN= 0
##$REVERSE= no
##$SF= 81.0140089999434
##$SI= 65536
##$SIGF1= 159.3651
##$SIGF2= -187.1042
##$SINO= 113.3802
##$SIOLD= 16384
##$SREGLST= <1H.CDCl3>
##$SSB= 0
##$STSI= 65536
##$STSR= 0
##$SW_p= 29940.119760479
##$SYMM= 0
##$S_DEV= 0
##$TDeff= 32768
##$TDoff= 0
##$TI= <>
##$TILT= no
##$TM1= 0
##$TM2= 0
##$TOPLEV= 0
##$USERP1= <user>
##$USERP2= <user>
##$USERP3= <user>
##$USERP4= <user>
##$USERP5= <user>
##$WDW= 1
##$XDIM= 65536
##$YMAX_p= 488710970
##$YMIN_p= -183206323
$$ End of Bruker specific parameters
$$ ---------------------------------
##NTUPLES= NMR SPECTRUM
##VAR_NAME=  FREQUENCY,     SPECTRUM/REAL,   SPECTRUM/IMAG
##SYMBOL=    X,             R,               I
##VAR_TYPE=  INDEPENDENT,   DEPENDENT,       DEPENDENT
##VAR_FORM=  AFFN,          ASDF,            ASDF
##VAR_DIM=   65536,         65536,           65536
##UNITS=     HZ,            ARBITRARY UNITS, ARBITRARY UNITS
##FACTOR=    0.456856943014862, 1,           1
##FIRST=     14782.0589164792, 0,            0
##LAST=      -15158.0608439998, 0,           0
##MIN=       -15158.0608439998, -183206323,  0
##MAX=       14782.0589164792, 488710970,    0
$$ Real data points
##PAGE= N=1
##DATA TABLE= (X++(R..R)), XYDATA
$$ [...]
41681B9808562k2457353j3297380N357592J5783221J0922570j562701j1371864
$$ 29808562 7351209 -5946171 -588579 15194642 26117212 24554511 13182647
41674A3182647j4129297r372501l8165N056312j182502j1441038j0034170M445687
$$ 13182647 -946650 -10319151 -10357316 -5301004 -6483506 -17924544 -27958714 -23513027
41666b3513027J4930280J0903946M298891R403228J8824277J5056103j435516
$$ -23513027 -8582747 2321199 6620090 16023318 34847595 49903698 48468182
41659D8468182j3026484j1105493m688910k320483j414287N43134j243830q152374
$$ 48468182 35441698 24336205 19647295 17326812 15912525 16455659 15211829 7059455
41651G059455j2017719p698675k092225k120464k373696N003655J4562555J3588192
$$ 7059455 -4958264 -12656939 -14749164 -16869628 -19243324 -14239669 322886 13911078
41643A3911078J342692q826407p095727K115142Q677381Q269539K523191n836098
$$ 13911078 15253770 6427363 -668364 1446778 10124159 18393698 20916889 15080791
41635A5080791j3447389j5596700r662079J240496J0234579J2450125Q612283
$$ 15080791 1633402 -13963298 -23625377 -22384881 -12150302 299823 8912106
41628H912106L394706J25209k528238o863190r918890n978240L053494O635519
$$ 8912106 12306812 12432021 9903783 3040593 -6878297 -12856537 -9803043 -3167524
41620c167524J64385o310890k393398N967540O388080K199253P870153K1872931
$$ -3167524 -3003139 -9314029 -11707427 -5739887 648193 2847446 10717599 32590530
41612C2590530K3665702N215145j3023803j1066364J266800K059102p535804q459501
$$ 32590530 56256232 61471377 48447574 37381210 38648010 40707112 33171308 24711807
41604B4711807J725910M639420o554158j4453794n938222O500491N295606n103589
$$ 24711807 26437717 31077137 24522979 10069185 4130963 10631454 15927060 10823471
41596A0823471p466722J086988P169399K415362p146833j2609948j2287192q924276
$$ 10823471 3356749 4443737 11613136 14028498 6881665 -5728283 -18015475 -26939751
41588b6939751m518729J3247M224166P821894Q971280N128778j940615n538543
$$ -26939751 -31458480 -31445233 -27221067 -19399173 -10427893 -5299115 -7239730 -12778273
41580a2778273j806900N480498J0828715J2727896J0189744Q95058j0998653j2713489
$$ -12778273 -14585173 -9104675 1724040 14451936 24641680 25536738 14538085 1824596
41572A824596J751930J8920583J9448144K437593j4062546j6119876p445175P27419
$$ 1824596 3576526 22497109 41945253 44382846 30320300 14200424 6755249 7482668
41564G482668L292561J825902n95990j244770M70136R54453l068240p496614m756679
$$ 7482668 10775229 12601131 12005141 10760371 11230507 12184960 9116720 1620106 -3136573
41555c136573L935982P720170R45444p958976p935433o63112K511676k677258
$$ -3136573 799409 8519579 9465023 1506047 -6429386 -7092498 -4580822 -7258080
41547g258080o828841K27946J3977459J8334563N565849j1938889j5648354m244151
$$ -7258080 -14086921 -13858975 118484 18453047 24018896 12080007 -3568347 -7812498
41539g812498N798221L860183j730392N5852N224618M595585K116131P353389
$$ -7812498 -2014277 1845906 115514 171366 5395984 9991569 12107700 19461089
41531A9461089J4394904O963141j4236887k7796669k1397661q560305n575632
$$ 19461089 33855993 40819134 26582247 -1214422 -22612083 -31172388 -36748020
41524c6748020o718300K454414J7366211J8632935J499760j5950405j7150441
$$ -36748020 -43466320 -41011906 -23645695 -5012760 -3513000 -19463405 -36613846
41517c6613846o360005K231257M331912N629015P927361N633719l567926j2279677
$$ -36613846 -42973851 -40742594 -36410682 -30781667 -22854306 -17220587 -20788513 -33068190
41509c3068190j1553194j896434P798890J0700884P735711L776834K550486N654014
$$ -33068190 -44621384 -46517818 -38718928 -28018044 -20282333 -16505499 -13955013 -8300999
41501h300999J1665497J4436248P591738n693563j2478787m954713Q403094J2814401
$$ -8300999 3364498 17800746 25392484 19698921 7220134 2265421 10668515 23482916
41493B3482916N196201m787882r094475q298998n037627M39161O273378Q132966
$$ 23482916 28679117 23891235 14796760 6497762 1460135 1899296 8172674 16305640
41485A6305640N257656J653662r04491n359396j2403709j6399522j1585699Q92375
$$ 16305640 21563296 23216958 22312467 16953071 4549362 -11850160 -23435859 -22543484
41477b2543484J3869669J9384502J3545905N47199q841591p846391j803096k26714
$$ -22543484 -8673815 10710687 24256592 24803791 15962200 8115809 6312713 6085999
41469F085999l051788k616976K501429N618969L625235j91499n423845j4321569
$$ 6085999 3034211 417235 2918664 8537633 12162868 11971369 6547524 -7774045
41461g774045k0429160j1861923Q604639K0934389J3819904L34484k801655R02991
$$ -7774045 -28203205 -40065128 -31460489 -10526100 3293804 3628288 826633 1729624
41453A729624j653290q887081q031632K138686R142244O739927K155856J500697
$$ 1729624 76334 -8810747 -16842379 -14703693 -5561449 1178478 3334334 4835031
41445D835031R07179l736538q415789p719125l241280m89073j379705l013833
$$ 4835031 5742210 2005672 -6410117 -14129242 -17370522 -17859595 -19239300 -22253133
41437b2253133j591369L724292R257393R849146N200721Q98531Q00679K203619
$$ -22253133 -23844502 -20120210 -10862817 -1013671 4187050 5085581 5886260 8089879
41429H089879K144496L450763Q434897J1077193L935070r046995j5106555q471471
$$ 8089879 10234375 13685138 22120035 33197228 37132298 28085303 12978748 4507277
41421D507277L130826Q692941N243779j902500n752009l616236O90501J094880
$$ 4507277 7638103 16331044 21574823 19672323 13920314 10304078 10994579 12089459
41413A2089459k487952l142319K800575Q882976O978223j392066q373598j0743742
$$ 12089459 9601507 6459188 9259763 18142739 25120962 23728896 15355298 4611556
41405D611556j0383049o984408J038120R519092J0951084M595477k720883o460514
$$ 4611556 -5771493 -12755901 -11717781 -2198689 8752395 13347872 10626989 4166475
41397D166475q394745r783654p120415K331000J4457114K0370842J4064298j226701
$$ 4166475 -4228270 -14011924 -21132339 -18801339 -4344225 16026617 30090915 28864214
41389B8864214j3825353j3944208m574522K286386J458529m34336J657088K743483
$$ 28864214 15038861 1094653 -3479869 -1193483 265046 -169290 1487798 4231281
41381D231281j185565m156174j468263K11548m181939n230581N404974J5412360
$$ 4231281 3045716 -1110458 -2578721 -2367173 -6549112 -11779693 -6374719 9037641
41373I037641P487425j0572588j3825493J781378J2232183J636015j5458889j7632385
$$ 9037641 16525066 5952478 -7873015 -6091637 6140546 7776561 -7682328 -25314713
41365b5314713n131915P015470J1120356R815718O374552K837171J429122Q18209
$$ -25314713 -30446628 -23431158 -12310802 -2495084 3879468 6716639 8145761 8963970
41357H963970k452845n262398q47023O173004J918936j3003186j7990955j961382
$$ 8963970 6511125 1248727 401704 6574708 8493644 -4509542 -22500497 -24461879
41349b4461879J6766556J5438482o47811q600767j926689N621489N327175K592466
$$ -24461879 -7695323 7743159 7095348 -1505419 -3432108 2189381 7516556 10109022
41341A0109022J250032k524973p691147o158400J683777L560589n397685j2058172
$$ 10109022 11359054 8834081 1142934 -5015466 -3331689 228900 -5168785 -17226957
41333a7226957l477563J2747172J7087138L447928j3627843j7501546q225581
$$ -17226957 -20704520 -7957348 9129790 12577718 -1050125 -18551671 -26777252
41326b6777252M86529k37865l945268J211195J5118368K3736316J5837957k874489
$$ -26777252 -26290723 -26528588 -30473856 -29262661 -14144293 9592023 25429980 22555491
41318B2555491j5876898j3509489j510248O362682K107068q525409j1386455k88880
$$ 22555491 6678593 -6830896 -8341144 -1978462 128606 -8396803 -19783258 -20072138
41310b0072138J3142325J2641625J28300n306086M900776J4752452P256169q960388
$$ -20072138 -6929813 5711812 5840112 534026 5434802 20187254 27443423 18483035
41302A8483035j1890017R48612R541144J413643j2142394j4902182o975614O63307
$$ 18483035 6593018 7541630 17082774 18496417 6354023 -8548159 -15523773 -14860466
41294a4860466K673684J352724q56819k027574J415945R381713J3971957Q482570
$$ -14860466 -12186782 -10834058 -11690877 -13718451 -12302506 -2920793 11051164 19533734
41286A9533734j712363n054277O04652O334027O173418M109350M355843L229211
$$ 19533734 17821371 12767094 13371746 19705773 25879191 29988541 34344384 37573595
41278C7573595l291808j0218130r672232k817895K470414L714543M647218M837107
$$ 37573595 34281787 24063657 14391425 11573530 14043944 17758487 22405705 27242812
41270B7242812o24584q944327q823693K203121J0303763M235766p220783q136315
$$ 27242812 26618228 17673901 8850208 11053329 21357092 25592858 18372075 10235760
41262A0235760R06114N210915j607122j0978177j3937820r913933j455657P609260
$$ 10235760 11141874 16352789 14745667 3767490 -10170330 -20084263 -21539920 -13930660
41254a3930660R062733j544624j2963398q462184R820258K1070617J4049815O46551
$$ -13930660 -4867927 -6412551 -19375949 -27838133 -18017875 3052742 17102557 17749108
41246A7749108m123502j222734O89333m02710k255216m284410m100673J376555
$$ 17749108 13625606 12402872 13092205 12689495 10434279 6149869 2049196 3425751
41238C425751O510274J564283q832883q072512N537895J3323483O312824r62340
$$ 3425751 9936025 11500308 2667425 -5405087 132808 13456291 19769115 18806775
41230A8806775J031281q82674j3529952j6494663L216484J9230544L168421k4075451
$$ 18806775 19838056 18955382 5425430 -11069233 -7852749 11377795 14546216 -9529235
41222i529235j9731674J1920720K3744919k22272k1151108q180733J7103737K0672769
$$ -9529235 -29260909 -17340189 6404730 6182458 -14968650 -23149383 -6045646 14627123
41214A4627123O422915q77522K005042J045620m166963k272048M773132K542638
$$ 14627123 21050038 20172516 22177558 23223178 19056215 16784167 21557299 24099937
41206B4099937j1812724k4006865k1325247n863168R663650J2833271K542826
$$ 24099937 12287213 -11719652 -33044899 -38908067 -29244417 -16411146 -13868320
41199a3868320p014388j449008J2200328J2245389m748465j5842302o411154O599710
$$ -13868320 -20882708 -22331716 -10131388 2114001 -2634464 -18476766 -24887920 -18288210
41191a8288210K579551r196761o409209Q231482J1766427j075467j0300807k919145
$$ -18288210 -15708659 -24905420 -31314629 -23083147 -11316720 -12392187 -22692994 -25612139
41183b5612139R070841R346125o63878q454147p902126k460426K343429M104020
$$ -25612139 -16541298 -7195173 -7859051 -16313198 -24215324 -26675750 -24332321 -20228301
41175b0228301M306144N398151N568871j9132r274605j1097414m45360J1214020
$$ -20228301 -15922157 -10524006 -4955135 -4974267 -14248872 -25346286 -25791646 -14577626
41167a4577626J0257211L7633n340184j451458M367161P306253Q347213O175458
$$ -14577626 -4320415 -4282782 -9622966 -11074424 -6707263 598990 8946203 15121661
41159A5121661n08433m643172J014382Q840836M968783p342120j0242098M64293
$$ 15121661 14613228 9970056 10984438 19825274 24794057 17451937 7209839 7674132
41151G674132Q050218K064307n272804n47763Q484940O450568m589390r448282
$$ 7674132 15724350 17788657 12515853 11968090 20453030 26903598 22314208 12865926
41143A2865926l369562L543934L419089p28598l958625o199032p360098l954271
$$ 12865926 9496364 13040298 16459387 15730789 11772164 5573132 -1786966 -5741237
41135e741237M950275J3085405J2610480K962544q271141j2947344r632125l218085
$$ -5741237 -790962 12294443 24904923 27867467 19596326 6648982 -2983143 -6201228
41127f201228J450007L539437L671874J109141l257933m032109L163136J3935997
$$ -6201228 -4751221 -1211784 2460090 3569231 311298 -3720811 -557675 13378322
41119A3378322J8137480J1209273j532327j1809339j5146317j1249301l288053
$$ 13378322 31515802 42725075 41192748 29383409 14237092 2987791 -300262
41112c00262K462363J437307l712136o609698n613963l537552m97632N087514
$$ -300262 2162101 3599408 -112728 -6722426 -12336389 -15873941 -16371573 -11284059
41104a1284059Q916181M222400n342606o958026K811517J1139746P290494j852727
$$ -11284059 -2367878 1854522 -3488084 -10446110 -7634593 3505153 10795647 8942920
41096H942920l574943J501082L045402j639664n634082n069183k658103N54174
$$ 8942920 5367977 6869059 9914461 8274797 2640715 -2428468 -5086571 -4532397
41088d532397O478959J2380068J1677709M373950j743841k765993l517355p401885
$$ -4532397 1946562 14326630 26004339 30378289 28634448 25868455 22351100 14949215
41080A4949215r203226l646050M386049M983225l443785j1419132r470033Q84947
$$ 14949215 5745989 2099939 6485988 11469213 8025428 -3393704 -12863737 -11978790
41072a1978790Q447859M638158o001391r926600p75162J2017650J4777282O322707
$$ -11978790 -3530931 1107227 -4894164 -14820764 -15595926 -3578276 11199006 17521713
41064A7521713l142741p061431p674147p119688m036681q42834l200584q224354
$$ 17521713 14378972 7317541 -356606 -7476294 -11512975 -12355809 -15556393 -23780747
41056b3780747n159602N635020P524555p442357k0755269j1086638J2959045K3826361
$$ -23780747 -28940349 -23305329 -15780774 -23223131 -43978400 -55065038 -42105993 -18279632
41048a8279632J4630338N106106O589130N676169p766695j8839615j0678985O937880
$$ -18279632 -3649294 1456812 8045942 13722111 5955416 -12884199 -23563184 -16625304
41040a6625304J1857185K230767m964575j905106L429067N901438R031549J1403815
$$ -16625304 -4768119 -2537352 -7501927 -9407033 -5977966 -76528 8955021 20358836
41032B0358836N477466o555941j1977336p212787l175182n790594o775064j041130
$$ 20358836 25836302 19280361 7303025 90238 -3084944 -8875538 -15650602 -16691732
41024a6691732K433714k530453o044340J042197R383498N935372l009836j592752
$$ -16691732 -14258018 -16788471 -22832811 -21790614 -12407116 -6471744 -9481580 -11074332
41016a1074332Q436293R660981k573380j2411313q125100K044332O238112P189796
$$ -11074332 -2638039 7022942 4449562 -7961751 -16086851 -14042519 -7804407 -614611
41008f14611J2765237J7934268J0422449q297542k0612161j4398174J784000J0429864
$$ -614611 12150626 30084894 40507343 32209801 11597640 -2800534 -1016534 9413330
41000I413330O278073j193421l472118k243988j538683K10480M317749N263666
$$ 9413330 15691403 14497982 11025864 8781876 7243193 7453673 11771422 17035088
40992A7035088j104407p641497m935733K756438L322436k562139j956934O776212
$$ 17035088 15930681 8289184 3353451 6109889 9432325 6870186 4913252 11689464
40984A1689464Q359809l648044j2555462l463424J1358201R482103q246905k0105075
$$ 11689464 20049273 16401229 3845767 382343 11740544 21222647 12975742 -7129333
40976g129333j5083623l904046J108935P44435R13361K952111N293851N780518
$$ -7129333 -22212956 -26117002 -25008067 -24263632 -23350271 -20398160 -15104309 -9323791
40968i323791J650218m891353m208836P322736J6291250Q809171o185268p968045
$$ -9323791 -7673573 -12564926 -16773762 -9451026 6840224 15649395 9464127 1496082
40960A496082L803792R082304J171166l175162N274923J0891155M68945j2868113
$$ 1496082 5299874 14382178 15553344 12378182 17653105 28544260 29013205 16145092
40952A6145092j1358977j915469k629210j1480363j1305206L6843P025517L069348
$$ 16145092 4786115 2870646 241436 -11238927 -22544133 -22507290 -15481773 -12412425
40944a2412425r33775K234133M391968j925874r671559q348774K26531N544773
$$ -12412425 -13346200 -11112067 -6720099 -8645973 -18317532 -26666306 -26439775 -20895002
40936b0895002K701205l236105m551268J219572R164097J1357505M954030m394460
$$ -20895002 -18193797 -21429902 -25981170 -24761598 -15597501 -4239996 714034 -3680426
40928c680426r135107p769194l134719L705026J2036577J6636799J2099694J892559
$$ -3680426 -12815533 -20584727 -23719446 -20014420 -7977843 8658956 20758650 22651209
40920B2651209m059150j879610K357269K265800j672600o299099j0652599j3389763
$$ 22651209 18592059 16712449 19069718 21335518 19662918 13363819 2711220 -10678543
40912a0678543j0760363j580197R005393J4329602J2455717N334587m685680j3804520
$$ -10678543 -21438906 -23019103 -14013710 315892 12771609 18106196 13420516 -384004
40904c84004j5607527p042516M787379P901279J1003p109290k579442P815317
$$ -384004 -15991531 -23034047 -18246668 -10345389 -10334386 -17443676 -20023118 -12207801
40896a2207801Q526700l298949j2069172n566369O591086O765027m157454q414831
$$ -12207801 -3681101 -6980050 -19049222 -24615591 -18024505 -11259478 -15416932 -23831763
40888b3831763Q45225R396299N352321j934523J946351J1789308R734546o889960
$$ -23831763 -22986538 -13590239 -8237918 -10172441 -8226090 3563218 13297764 6407804
40880F407804j9840967j4202648K999246J3236559Q371342l154448q572576m694585
$$ 6407804 -13433163 -27635811 -24636565 -11400006 -3028664 -6183112 -14755688 -19450273
40872a9450273J014077K064965K466369R750529J9758588J8281134K372062j0595439
$$ -19450273 -18436196 -16371231 -13904862 -4154333 15604255 33885389 36257451 25662012
40864B5662012n189746R076021J0676257k980121j3574614r992703j597637O6911
$$ 25662012 20472266 29548287 40224544 37244423 23669809 13677106 12079469 12146380
40856A2146380l052955n162066p813457j1598894q392477N895291J9226362J7074656
$$ 12146380 9093425 3931359 -3882098 -15480992 -23873469 -17978178 1248184 18322840
40848A8322840K858296p542451p677018m252065j598837L471554J0427086J2100006
$$ 18322840 21181136 13638685 5961667 1709602 110765 3582319 14009405 26109411
40840B6109411O803608J854182L89101l914939j2562665j4539230l258906Q756855
$$ 26109411 32913019 34767201 35156302 31241363 18678698 4139468 880562 9637417
40832I637417O221093m429131l891416Q638330J2453625j400861j3192835l871319
$$ 9637417 15858510 11429379 7537963 16176293 28629918 27229057 14036222 10164903
40824A0164903J3513616J1184592j1701811k6751031j7094595M05138K765292
$$ 10164903 23678519 34863111 23161300 -3589731 -20684326 -20279188 -17513896
40817a7513896o300117o585022N676838J3617310O891623l799125m205709M005053
$$ -17513896 -23814013 -30399035 -24722197 -11104887 -4213264 -8012389 -12218098 -8213045
40809h213045R549023R105368Q488334R744336P332567j566134j0824832j3291548
$$ -8213045 1335978 10441346 18929680 28674016 36006583 34440449 23615617 10324069
40801A0324069r876558o330644m534052k155032J152885L013706L270426L946587
$$ 10324069 447511 -5883133 -10417185 -12572217 -11419332 -8405626 -5135200 -1188613
40793a188613L936172j18701o248451p171260q72811N423211N897560L861283
$$ -1188613 2747559 2628858 -3619593 -10790853 -11663664 -6240453 -342893 3518390
40785C518390L503140J509375n035729r243039l667603N510592N418663m376066
$$ 3518390 7021530 8530905 3495176 -5747863 -9415466 -3904874 1513789 -2862277
40777b862277j1148168o875088L775034J2761748J5519348R677568j569591o331093
$$ -2862277 -14010445 -20885533 -17110499 -4348751 11170597 20848165 19278574 12947481
40769A2947481K541241J2431550N303903j3399977j9516946o539710M493939j085798
$$ 12947481 15488722 27920272 33224175 19824198 307252 -6232458 -1738519 -2824317
40761b824317r966905n582418N935276J0539618R335598R120953N688858m278584
$$ -2824317 -12791222 -18373640 -12438364 -1898746 7436852 16557805 22246663 17968079
40753A7968079r098578l56688Q277339K438511o465565j553104N874759n944865
$$ 17968079 8869501 8512813 16790152 19228663 12763098 11209994 17084753 11139888
40745A1139888k6580142k4145208K566055J9278344R464876l044922K768443J2102753
$$ 11139888 -15440254 -39585462 -37019407 -17741063 -8276187 -11321109 -8552666 3550087
40737C550087L894363j3200549j7634832q766809r27072K609792Q021366J2680925
$$ 3550087 7444450 -5756099 -23390931 -32157740 -33084812 -30475020 -22453654 -9772729
40729i772729Q479749j520660n553665N85388J0283025J4756215P923027r429860
$$ -9772729 -1292980 -2813640 -8367305 -7781917 2501108 17257323 25180350 15750490
40721A5750490k3835565j8626923K948124J7104193J1112136M4975N7705K980834
$$ 15750490 -8085075 -26711998 -23763874 -6659681 4452455 4497430 4555135 7535969
40713G535969m357818j2317340m319839J1104479J1516962k092777p335180R85118
$$ 7535969 3178151 -9139189 -13459028 -2354549 9162413 7069636 -265544 719574
40705G19574K792721j1209956k1858161j1721673P934802J5244556P798198n27453
$$ 719574 3512295 -7697661 -29555822 -41277495 -33342693 -18098137 -10299939 -10827392
40697a0827392k293231j073925O75014M546685Q330895N573904n278194j6571686
$$ -10827392 -13120623 -14194548 -13519534 -8972849 -641954 4931950 -346244 -16917930
40689a6917930j8014202o698299Q659887J4583636P263583j550548J364340J2480749
$$ -16917930 -34932132 -41630431 -32970544 -18386908 -11123325 -12673873 -11309533 1171216
40681A171216J5718130M829728q591402j2243335p708648k435096K650797Q710410
$$ 1171216 16889346 21719074 13127672 884337 -6824311 -9259407 -6608610 2101800
40673B101800J0338513K900914n861620l793938O986632J1156999K031862q690890
$$ 2101800 12440313 15341227 9479607 5685669 12672301 23829300 25861162 17170272
40665A7170272q181074L4796L924687J169984j181152j603199o020582j3707708
$$ 17170272 8989198 9023994 12948681 14118665 12937513 11334314 5313732 -8393976
40657h393976j3635603r23629J2533335J2409069O73323q931352r544582n627405
$$ -8393976 -22029579 -22953208 -10419873 1989196 2662519 -6268833 -15813415 -21440820
40649b1440820j575704L570122R800443J3323713J1593890N295375l848823j1391424
$$ -21440820 -23016524 -19446402 -9645959 3677754 15271644 20567019 16718196 5326772
40641E326772r753840J901483J1185320O947302l179802l211308N982875Q671575
$$ 5326772 -4427068 -2525585 8659735 15607037 12427235 9215927 15198802 23870377
40633B3870377R48230m155437j355594j831628r989227j2673213k879610N571942
$$ 23870377 24818607 20663170 19307576 17475948 7486721 -5186492 -8066102 -2494160
40625b494160J058653o511955m926123j26118Q1256L990896J6120105J7734400
$$ -2494160 -1435507 -7947462 -12873585 -12999703 -12918447 -8927551 7192554 24926954
40617B4926954n497505l1071627k6429444J070290J4412868K818265p716398j306564
$$ 24926954 19429449 -11642178 -38071622 -37001332 -22588464 -19770199 -27486597 -28793161
40609b8793161N982139J97186o904301k954456L046717N73713k561259K760696
$$ -28793161 -22811022 -22613836 -29518137 -32472593 -29425876 -28852163 -31413422 -28652726
40601b8652726Q588807N582254J467288P111501J6835173J7985238R683051q07357
$$ -28652726 -20063919 -14481665 -13014377 -5902876 10932297 28917535 38600586 37793229
40593C7793229r916532j4790546j0144045Q43811M767983k114718o116884L64391
$$ 37793229 27876697 13086151 2942106 3785917 8553900 6439182 322298 686689
40585F86689M108674n128793j3362806m966357Q515513O274466o024227n271922
$$ 686689 4795363 -333430 -13696236 -18662593 -10147080 -3872614 -9896841 -15168763
40577a5168763R984180J7135224O410251n816689n698801j078413l317196q564305
$$ -15168763 -5184583 11950641 18360892 12544203 6845402 5766989 2449793 -6114512
40569f114512p878265k460653J454448L235010M990265N370596K518484k307957
$$ -6114512 -13992777 -16453430 -14998982 -11763972 -6773707 -1403111 1115373 -1192584
40561a192584p122953r340090l632890J1031907K2208769J4407554q113385k1870372
$$ -1192584 -8315537 -17655627 -21288517 -10256610 11952159 26359713 18246328 -3624044
40553c624044j3250735M845752J2600069P623668O4275n551115j0203465r565047
$$ -3624044 -16874779 -12029027 571042 8194710 8258985 2707870 -7495595 -17060642
40545a7060642J193422J3943325J3424745j589547j4801483j3690708m100508
$$ -17060642 -15867220 -1923895 11500850 9911303 -4890180 -18580888 -22681396
40538b2681396J705738K352338M508007Q968828R861674O119192M233433P779972
$$ -22681396 -20975658 -18623320 -14115313 -5146485 4715189 10834381 15067814 22847786
40530B2847786J1552569R357926K145523n039063r469007j0619823q325185m976156
$$ 22847786 34400355 43758281 45903804 40864741 31395734 20775911 12450726 7474570
40522G474570m860700p143475n100295K518355O470338J146701l995876J359199
$$ 7474570 2613870 -4529605 -9629900 -7111545 -641207 505494 -3490382 -2131183
40514b131183R454739N205521p897869j1082507K952Q473080L860368k916313
$$ -2131183 7323556 12529077 4631208 -6451299 -6448347 2024733 5885101 2968788
40506B968788r40552K852094n22157m997288k929836r76171n610821n922150R209831
$$ 2968788 2028236 4880330 4358173 -639115 -3568951 -4545122 -10155943 -16078093 -6868262
40497f868262K6653369K3734679K138513j4168145j2665215l983219n54016l010643
$$ -6868262 19785107 43519786 45658299 31490154 18824939 14841720 14287704 11277061
40489A1277061r118671j7734989k1006729r764412R605286J9186019J3411693
$$ 11277061 2158390 -15576599 -36583328 -46347740 -36742454 -17556435 -4144742
40482d144742L711702k224686p912381j1882576m558856J1416282J7475432O131837
$$ -4144742 -433040 -2657726 -10570107 -22452683 -27011539 -15595257 1880175 8012012
40474H012012o155677m836512J343442j157402p250219n668108j188697m620548
$$ 8012012 1856335 -2980177 -1636735 -2794137 -10044356 -15712464 -16901161 -21521709
40466b1521709j0375111m768416R107291J5064671R646935M935578N917998M074396
$$ -21521709 -31896820 -36665236 -27557945 -12493274 -2846339 2089239 8007237 12081633
40458A2081633l581922o887654l55023O221540L481611k847470k760565J188706
$$ 12081633 8499711 1612057 1257034 7478574 10960185 8112715 5352150 6540856
40450F540856j106317r768810j3162531m306727Q515394J1219286Q24769j1094908
$$ 6540856 5434539 -4334271 -17496802 -21803529 -13288135 -2068849 -1244080 -12338988
40442a2338988j2214717l400901M476535N824485O045658J0062788J2219278M334409
$$ -12338988 -24553705 -27954606 -23478071 -17653586 -11607928 -1545140 10674138 15008547
40434A5008547r846267j6513515q694790M897486J0307416L945972m909220n803953
$$ 15008547 5162280 -11351235 -20046025 -15148539 -4841123 -895151 -5804371 -11608324
40426a1608324R49835N266691L12323q150395r202108k107500K245392l097029
$$ -11608324 -10658489 -5391798 -5079475 -13229870 -22431978 -24539478 -22294086 -25391115
40418b5391115j0818334r074550L037746J4916863J6881262R290386R61702M67274
$$ -25391115 -36209449 -45283999 -42246253 -27329390 -10448128 -1157742 -196040 271234
40410B71234O809687R014446k74796j2119076j1021808K257206R838904K751464
$$ 271234 7080921 16095367 15820571 3701495 -7320313 -5063107 4775797 7527261
40402G527261o001970k858592N415261M985700k368488n335139k847802q43229
$$ 7527261 1525291 -1333301 4081960 9067660 6699172 1364033 -1483769 -2326998
40394b326998L266859J3787261J9870628P144809j5482670k3199991j1220513
$$ -2326998 939861 14727122 34597750 41742559 26259889 3059898 -8160615
40387h160615n38748l131932n456381L487333J0901229L046000r187460p002994
$$ -8160615 -8699363 -11831295 -17287676 -13800343 -2899114 146886 -9040574 -16043568
40379a6043568O457820J2427405N106827l679548m275692J124935O142023O151802
$$ -16043568 -9585748 2841657 7948484 4268936 -6756 1118179 7260202 13412004
40371A3412004m99614q447660p741149J589252N674192k626207r590923n79692
$$ 13412004 12912390 4464730 -3276419 -1687167 3987025 1360818 -8230105 -8809797
40363h809797J5520188J8282537M963961r421468j5152554j3147127l356021J2047612
$$ -8809797 6710391 24992928 29956889 20535421 5382867 -7764260 -11120281 927331
40355I27331J8573953M885021j4103246j3444097L305061Q307459n624351j4247251
$$ 927331 19501284 24386305 10283059 -3161038 144023 8451482 2827131 -11420120
40347a1420120m170920N286454j717602q622444L352507J9933894J6450816j065691
$$ -11420120 -15591040 -10304586 -12022188 -20644632 -17292125 2641769 19092585 18026894
40339A8026894o760648L267194Q659973k16072j0842945j1636671n030257K740032
$$ 18026894 11266246 14533440 23193413 22977341 12134396 497725 -4532532 -1792500
40331a792500P218298L079572p367157q198207Q320840K0955850N428283k3549003
$$ -1792500 5425798 8505370 1138213 -7059994 1260846 22216696 27644979 4095976
40323D095976k6444626L177475K7203083J8480505l510931q620035K24596J925643
$$ 4095976 -22348650 -19171175 8031908 26512413 23001482 14381447 14606043 16531686
40315A6531686m990249n486172K928401P877353L397259m238768p796494l613710
$$ 16531686 11541437 6055265 8983666 16861019 20258278 16019510 8223016 4609306
40307D609306Q210147J7522551R052336j3860822k4226705o667836J6495947J5676080
$$ 4609306 12819453 30342004 39394340 25533518 1306813 -5361023 11134924 26811004
40299B6811004k478280q696040R36022K570843j1189820j8282670o168725O625501
$$ 26811004 24332724 15636684 16572706 19143549 7953729 -10328941 -16497666 -9872165
40291i872165K558048o554796k088087R901923J1064881J446428l712138j83839
$$ -9872165 -7314117 -13868913 -15957000 -6055077 5009804 6456232 2744094 2560255
40283B560255K296975k40731j419668O73050j38755m846758n606429R00510P023815
$$ 2560255 4857230 4616499 3196831 3869881 3731126 -1115632 -6722061 -5821551 1202264
40274A202264N491726j036073o021204p661761o994446l428876K601825O918224
$$ 1202264 6693990 5657917 -363287 -8025048 -15019494 -18448370 -15846545 -8928321
40266h928321O671966M859843N004518M905470J802015L51874O271256J2847582
$$ -8928321 -2256355 2603488 7608006 12513476 14315491 14667365 20938621 33786203
40258C3786203N881854j3484016k3532419j0331022Q937850P641803j0635762
$$ 33786203 39668057 26184041 2651622 -7679400 1258450 8900253 -1735509
40251a735509j5350841N543061K5673296J7226017j0323063k5506242j6759258
$$ -1735509 -17086350 -11543289 14130007 31356024 21032961 -4473281 -21232539
40244b1232539k43450P141487M091270k451183m395043N630899K4131029L1248916
$$ -21232539 -21475989 -14334502 -10243232 -12694415 -17089458 -11458559 12672470 43921386
40236D3921386J2285482j7283055k7075274j2060020K789075N14127p459115o075589
$$ 43921386 56206868 38923813 11848539 -211481 2577594 3091721 -4367394 -10442983
40228a0442983L86065K565483M339141J1198245J4953645O735158n454331q017020
$$ -10442983 -10056918 -7491435 -3152294 8045951 22999596 29734754 24280423 16263403
40220A6263403k292923O22864j774331l938830m408020m315694m24585P655542
$$ 16263403 13970480 14593344 12819013 8880183 4472163 156469 -268116 7387426
40212G387426J0609115L133297l581776J637676R192464K924171j1367235j3212091
$$ 7387426 17996541 21129838 17548062 19185738 28378202 31302373 19935138 6723047
40204F723047o69492O850716Q16082m612703L70549M334429l525071j2941161
$$ 6723047 6053555 12904271 13720353 9107650 9478199 13812628 10287557 -2653604
40196b653604r113880L665211J0830899J0303539J0010101R078661q75072j6764189
$$ -2653604 -11767484 -8102273 2728626 13032165 23042266 32120927 31245855 14481666
40188A4481666k2588788j0953844O015491J3009606R698662N507419L116156k905965
$$ 14481666 -8107122 -19060966 -13045475 -35869 9662793 15170212 18286368 15380403
40180A5380403j2549475j5437643m094261J3281546K0039148J0363746m097802
$$ 15380403 2830928 -12606715 -16700976 -3419430 16619718 26983464 22885662
40173B2885662q260120j66728Q773770P377999l829095j3295529r796355N077509
$$ 22885662 14625542 14458814 23232584 30610583 26781488 13485959 3689604 8767113
40165H767113J6551623J2717337j61444n343246J032747M502699n033480j6256150
$$ 8767113 25318736 38036073 37874629 32531383 33564130 38066829 33033349 16777199
40157A6777199j2798405R66438N117780o483836j6752552r513015Q159742J5579391
$$ 16777199 3978794 4945232 10063012 3579176 -13173376 -22686391 -14526649 1052742
40149A052742M513690j2455330j8371587j0301779J162265P155852R227068J0810329
$$ 1052742 5566432 -6888898 -25260485 -35562264 -34399999 -27244147 -18017079 -7206750
40141g206750P026127p544053k3283775k1304819O28787K0451200J8951216M080479
$$ -7206750 -180623 -7724676 -31008451 -52313270 -51684483 -31233283 -12282067 -8201588
40133h201588l305371J202288N282810K973565J092817L803796O490947O539644
$$ -8201588 -11506959 -10304671 -5021861 -2048296 -955479 2848317 9339264 15878908
40125A5878908O532820M886715l187686j2817043j1582206R45226R201654L411260
$$ 15878908 22411728 27298443 24110757 11293714 -288492 656734 9858388 13269648
40117A3269648p042564r487274n486363l251693k819569R6192L003460J035133
$$ 13269648 6227084 -3260190 -8746553 -11998246 -14817815 -14721623 -11718163 -10683030
40109a0683030k232952P02612Q401115J1696459O780282q70654n119033m884948
$$ -10683030 -12915982 -12213370 -3812255 7884204 14664486 13793832 8674799 3789851
40101C789851j573134K884874N040329K405185k275901l749125k080815l317396
$$ 3789851 2216717 5101591 10141920 12547105 10271204 6522079 4441264 1123868
40093A123868j0295010j6331182j1804212L605516J8473691K1054788J1524909
$$ 1123868 -9171142 -25502324 -37306536 -33701020 -15227329 5827459 17352368
40086A7352368N15055l507492j773335m9172o81378j949611j422263K407755Q125283
$$ 17352368 17867423 14359931 12586596 12537424 11856046 9906435 8484172 10891927 19017210
40077A9017210R739164K811668o165888n260322M124086N162050r460738k2172342
$$ 19017210 28756374 31568042 25402154 20141832 24265918 29427968 19967230 -2205112
40069b205112j3373019R384923K1366478J3955255N59397p069388r535680p805660
$$ -2205112 -15578131 -6193208 15173270 29128525 29687922 22618534 13082854 5277194
40061E277194k30878O270159J129988r836287q348797O758991J3720253P35594
$$ 5277194 5046316 11316475 12446463 2610176 -5738621 1020370 14740623 15476217
40053A5476217j4273457r850727Q591680J9343007J3798481R45364q985462j2304285
$$ 15476217 1202760 -8647967 -56287 19286720 33085201 34030565 25045103 12740818
40045A2740818r265551l905271j668990j294569L554109J0855971J0218175J238970
$$ 12740818 3475267 -430004 -2098994 -3393563 160546 11016517 21234692 22473662
40037B2473662k920280K160722K861356q738486j8935411j4452228m249331k469891
$$ 22473662 19553382 21714104 24575460 15836974 -3098437 -17550665 -21799996 -24269887
40029b4269887m602512N8900N769979K153870k438287O376073K0351447J7689513
$$ -24269887 -28872399 -28813499 -23043520 -20889650 -23327937 -16951864 3399583 21089096
40021B1089096k480934j8335893j7238534p405305K308734J2185922J8821874
$$ 21089096 18608162 272269 -16966265 -24371570 -22062836 -9876914 8944960
40014H944960J3747376J43451p082389l331697l23811n172502r260702m225239
$$ 8944960 22692336 22835787 15753398 12421701 12097890 6925388 -2335314 -6560553
40006f560553M839599Q909073O634629J076017n451107r271131o767538m47617
$$ -6560553 -1720954 7188119 13822748 14898765 9447658 176527 -6591011 -7038628
39998g038628L788241N001814N003081J337184o969346j1190058l536185Q136122
$$ -7038628 -3250387 1751427 6754508 8091692 1122346 -10067712 -13603897 -5467775
39990e467775J0562610N488480M046572O006581L101649j897024m92543J397563
$$ -5467775 5094835 10583315 14629887 20636468 23738117 21841093 21348550 22746113
39982B2746113p747369j9505985j5699967k338364k461184j3680580q289222J6618349
$$ 22746113 14998744 -4507241 -20207208 -22545572 -25006756 -38687336 -46976558 -30358209
39974c0358209K7063676O157260j6162296j0273245Q887157J2665923M984242
$$ -30358209 -3294533 2862727 -13299569 -23572814 -14685657 -2019734 2964508
39967B964508N066411P497429l762039j7815640j0989988J0548676J7767710L919155
$$ 2964508 8030919 15528348 11766309 -6049331 -17039319 -6490643 11277067 15196222
39959A5196222r779977j1355990r753555r140788j822912R721404J1489082L735795
$$ 15196222 5416245 -5939745 -15693300 -24834088 -26657000 -16935596 -5446514 -1710719
39951a710719K487312R732530P747796q668516j9001242p966375J1157667J7425326
$$ -1710719 776593 10509123 18256919 9588403 -9412839 -17379214 -6221547 11203779
39943A1203779R598861j70026n768113p731599n707371j188461R81190R43033
$$ 11203779 20802640 20632614 14864501 7132902 1425531 237070 1218260 2161293
39935B161293L942215P644028K710046q369937r253030M226662J2749432J812456
$$ 2161293 6103508 13747536 16457582 8087645 -1165385 3061277 15810709 17623165
39927A7623165j3708238j1102262N095714J0336387k545666j4036735p671845
$$ 17623165 3914927 -7187335 -2091621 8244766 5699100 -8337635 -16009480
39920a6009480Q557636J6696939J1975747L199606k117594m241204n834458p332563
$$ -16009480 -7451844 9245095 21220842 24420448 22302854 18061650 12227192 4894629
39912D894629q370826r408158r755608o552526Q21114O331218K587005p711793
$$ 4894629 -3476197 -12884355 -22639963 -29192489 -28371375 -22040157 -19453152 -27164945
39904b7164945j1763939l006577Q364416R069110K015035O81800O626316O802862
$$ -27164945 -38928884 -41935461 -33571045 -24501935 -22486900 -21805100 -15178784 -8375922
39896h375922m005359j2285822n193680R872704J5373966O774746m478399p637646
$$ -8375922 -12381281 -24667103 -29860783 -19988079 -4614113 2160633 -2317766 -9955412
39888i955412l419492Q21405J13696l934182m591766K720927J2716946J4021295
$$ -9955412 -13374904 -12553499 -12439803 -16373985 -20965751 -18244824 -5527878 8493417
39880H493417L516135q574175j2089378r187880p279012o239138j521793M513090
$$ 8493417 12009552 3435377 -8654001 -17841881 -25120893 -31360031 -32881824 -28368734
39872b8368734N043688J337629K534915J1231553J7833873J2778242j398923j3415458
$$ -28368734 -23325046 -21987417 -19452502 -8220949 9612924 22391166 20992243 7576785
39864G576785j4804535o270559L952191O919110J518197l502180J43032Q515523
$$ 7576785 -7227750 -13498309 -9546118 -2627008 -1108811 -4610991 -4467959 4047564
39856D047564R698739K32593r560627r208794o57009O612716P380948L098081
$$ 4047564 13746303 13978896 4418269 -4790525 -5447534 1165182 8546130 11644211
39848A1644211k323017m090057Q82546P176774K721520j4232970k5967437j5468747
$$ 11644211 9321194 5231137 6113683 13290457 16011977 1779007 -24188430 -39657177
39840c9657177P441203J5728791K425547q866511J668840K1330771K4306059P963782
$$ -39657177 -32215974 -16487183 -14061636 -22928147 -21259307 71464 24377523 32341305
39832C2341305p689319j0166213n341664l13692N174348P522748j802041j8512997
$$ 32341305 24651986 14485773 9144109 8830417 14004765 21527513 19725472 1212475
39824A212475k2517077l844816J9976348K4542679Q502699q831192j3803385j0216153
$$ 1212475 -21304602 -25149418 -5173070 19369609 27872308 19041116 5237731 -4978422
39816d978422p508278q203487q305210l831695M116268Q809217M873321l159641
$$ -4978422 -12486700 -20690187 -28995397 -32827092 -28710824 -19901607 -15028286 -18187927
39808a8187927m942089J368961O809811O275381N238851P319892P362745M056867
$$ -18187927 -23130016 -21761055 -14951244 -8675863 -3437012 3882880 11245625 15302492
39800A5302492N786739J3457605J2189675m838785j8309314q489705J2128247
$$ 15302492 21089231 34546836 46736511 41897726 23588412 15098707 27226954
39793B7226954J5654257Q68159q275432l474082k169094j2721236j8292699o807829
$$ 27226954 42881211 43749370 35473938 31999856 29830762 17109526 -1183173 -7991002
39785g991002P445475P517264k56535p74914M545625M406329j409057m213447
$$ -7991002 -545527 6971737 6715202 5940288 10485913 14892242 13483185 9269738
39777I269738k171523J78774K264714N393411N812395L86069n960730p277836
$$ 9269738 7098215 7276989 9541703 14935114 20747509 21133578 15172848 7895012
39769G895012n117597k527341K359245Q403994O853188m616556j2471134m554673
$$ 7895012 2777415 250074 2609319 11013313 17866501 13249945 778811 -3775862
39761c775862J0826663J6056435P833231l483144j1541574j6248708j3608250
$$ -3775862 7050801 23107236 30940467 27457323 15915749 -332959 -13941209
39754a3941209J18369J5737705J8035840O114073n919555q720977n821268k116941
$$ -13941209 -13822840 1914865 19950705 26064778 20145223 11424246 5602978 3486037
39746C486037K309983N072012J186522o214774o105546M492266J3835520J0135302
$$ 3486037 5796020 10868032 12054554 5839780 -265766 4226500 18062020 28197322
39738B8197322l613029j4035728j2173305j077252Q057319O490527k701092p574770
$$ 28197322 24584293 10548565 -1624740 -2701992 5355327 11845854 9144762 1569992
39730A569992k579439M029386L498188L40050L049918P423416K995452p119823
$$ 1569992 -1009447 3019939 6518127 6858177 9908095 17331511 20326963 13207140
39722A3207140q856775m27612L206785o322738j7494507j6311339n153112M447184
$$ 13207140 4350365 3922753 7129538 806800 -16687707 -32999046 -38152158 -33704974
39714c3704974Q483331J0478186J1276486Q040837M20820q529443j5353665j6751775
$$ -33704974 -25221643 -14743457 -3466971 4573866 4994686 -3534757 -18888422 -35640197
39706c5640197j0957276j393056N611925R017406J3115079J7099666J2882422
$$ -35640197 -46597473 -47990529 -42378604 -33361198 -20246119 -3146453 9735969
39699I735969j233992j2631562r023387L581161P618763k005417j0237371k054754
$$ 9735969 8501977 -4129585 -13152972 -9571811 -1953048 -3958465 -14195836 -16250590
39691a6250590J6171883K2952918Q730568j0890110j4132769l01406J1508156
$$ -16250590 -78707 22874211 31604779 20714669 6581900 6280494 17788650
39684A7788650R861205L932024L856857K527480r797966k3022382j7769489M809395
$$ 17788650 27649855 31581879 35438736 37966216 28168250 5145868 -12623621 -7814226
39676g814226K1777601J8121254J910738j2341872j9468402j8778824r569886
$$ -7814226 13963375 32084629 33995367 21653495 2185093 -16593731 -26163617
39669b6163617J672959L943965j013325J780416J5620034K2139967Q004908j2713882
$$ -26163617 -24490658 -20546693 -21560018 -19779602 -4159568 17980399 25985307 13271425
39661A3271425j8028596q592054j689286k890165k449624L569406O853455K746540
$$ 13271425 -4757171 -13349225 -15038511 -17928676 -20378300 -16808894 -9955439 -7208899
39653g208899k028975p03735N067486J0203092J1123673N283135n744036j3148063
$$ -7208899 -9237874 -9941609 -4874123 5328969 16452642 21735777 15991741 2843678
39645B843678r862251j985535j451805p926801r517690k510894K624339o42139
$$ 2843678 -7018573 -9004108 -10455913 -18382714 -27900404 -30411298 -27786959 -28429098
39637b8429098l563608K504193R618778M553611q491702j0541743N089130K0508334
$$ -28429098 -31992706 -29488513 -19869735 -15316124 -23807826 -34349569 -29260439 -8752105
39629h752105J5737789l809924j3848327m150502Q108522M246115q265076p751021
$$ -8752105 6985684 3175760 -10672567 -14823069 -6714547 -2468432 -10733508 -18484529
39621a8484529Q034393J8446445J1828355K181677M936776J1983765N790692j1797308
$$ -18484529 -10450136 7996309 19824664 22006341 26943117 38926882 44717574 32920266
39613C2920266k2054819j6526727n851003j658494l103361l699828j250229K250994
$$ 32920266 10865447 -5661280 -11512283 -13170777 -16274138 -19973966 -21224195 -18973201
39605a8973201M166554L417765L138370Q254500J5536012J2686841l764934j7195015
$$ -18973201 -14806647 -11388882 -8250512 3988 15540000 28226841 24461907 7266892
39597G266892j0882608O545662J2408148L453346j779802M885181Q532295j990638
$$ 7266892 -3615716 2929946 15338094 18791440 17011638 21896819 30429114 28438476
39589B8438476j4382895j2589428p58532O728250P177399O598367M340315l155042
$$ 28438476 14055581 1466153 707621 7435871 14613270 21211637 25551952 22396910
39581B2396910r398591m874198N654347P651430j895864j1001080j1123714o358714
$$ 22396910 12998319 8124121 13778468 21429898 19534034 8532954 -2590760 -8949474
39573h949474k020658L445625J0096070J0713113J201077j0046203j1310094k710798
$$ -8949474 -10970132 -7524507 2571563 13284676 14485753 4439550 -6870544 -9581342
39565i581342M744143L857438j117994k133625K086548N628487L529164k144787
$$ -9581342 -4837199 -979761 -2097755 -4231380 -2144832 3483655 7012819 4868032
39557D868032m627008o8480P618787J0002883L057983p294336j0677858m699340
$$ 4868032 241024 172544 7791331 17794214 20852197 13557861 2880003 -1819337
39549a819337R32543l221357j2137678j1950480k73365Q971125O029232J81872
$$ -1819337 -886794 -4108151 -16245829 -28196309 -28469674 -19498549 -13469317 -13287445
39541a3287445L915156J1040026O191260p956942j1758404Q74529J1717788O048287
$$ -13287445 -9372289 1667737 7858997 -97945 -11856349 -10981820 735968 6784255
39533F784255n219536l733411Q629995J5464812J0735835K035322n897986j4420398
$$ 6784255 1564719 -2168692 6461303 21926115 32661950 34697272 28799286 14378888
39525A4378888j9364273j2435611L506616J4480332J4491249J2122955J3401092
$$ 14378888 -4985385 -17420996 -13914380 565952 15057201 27180156 40581248
39518D0581248J1094053p02766j2647196j2557426m334440j398904n270954n162823
$$ 40581248 51675301 50972535 38325339 25767913 21433473 20034569 14763615 9600792
39510I600792R96469Q12428j0909098j8527417o212051J6272674K4278561J1969419
$$ 9600792 10597261 11409689 500591 -18026826 -24238877 -7966203 16312358 28281777
39502B8281777j722241k996393q72563o372209j1248155l287097R575824J0296178
$$ 28281777 26559536 23563143 22690580 16318371 5070216 1783119 11358943 21655121
39494B1655121P60748k663560J660202n88399j0433166j0459435L650300J1293265
$$ 21655121 22415869 19752309 21412511 20824112 10390946 -68489 3581811 14875076
39486A4875076q9122j2911120q296141L053253J535782o058903P81599J8176150
$$ 14875076 14785954 1874834 -6421307 -3368054 -1832272 -7891175 -7109576 11066574
39478A1066574K1550863M887770j0978429j1513072n309550k543603Q72568R015379
$$ 11066574 32617437 37505207 26526778 15013706 9704156 7160553 8033121 17048500
39470A7048500J4397891J0461053J535373o988470j5148721j9530620j2578401
$$ 17048500 31446391 41907444 43442817 36454347 21305626 1775006 -10803395
39463a0803395K705354J1687121Q288859K016651p27539n380349j1810062p524273
$$ -10803395 -8098041 3589080 11877939 13894590 13167051 7786702 -4023360 -11547633
39455a1547633R527127J9660492Q919636p894674r681829q24697P0541p365241
$$ -11547633 -2020506 17639986 26559622 18664948 8983119 8158422 8228963 863722
39447H63722p111151L956601J0890897M903722n539657r731527o315792J293960
$$ 863722 -6247429 -2290828 8600069 13503791 7964134 -1767393 -8083185 -6789225
39439f789225Q563982Q863047M79899o489730j802299Q705766J1019054M162410
$$ -6789225 1774757 10637804 11117703 4627973 2825674 11531440 22550494 26712904
39431B6712904n95251O64530J441996L71373L043654P196799L082554q085008
$$ 26712904 26117653 26782183 28224179 28595552 31639206 38836005 41918559 33833551
39423C3833551j2232335l876454N223967M227659l504026j0214582j3352446j0593901
$$ 33833551 21601216 17724762 22948729 27176388 23672362 13457780 105334 -10488567
39415a0488567N51310J2668656J2431235P06552o292267k296035l99791q404175
$$ -10488567 -9937257 2731399 15162634 15869186 9576919 7280884 6881093 -1523082
39407a523082j3183895k965616J1703750J5716129J3365470J5604666J5920522
$$ -1523082 -14706977 -17672593 -5968843 9747286 23112756 38717422 54637944
39400E4637944J323678k0068513k5584308j0224624P955319J4927773J4562667
$$ 54637944 55961622 35893109 10308801 84177 8039496 22967269 37529936
39393C7529936J3436036R346545K75293q590312j2205694j0689852m889858L751640
$$ 37529936 50965972 60312517 60587810 51997498 39791804 29101952 24212094 27963734
39385B7963734Q690201M247876l867211n096632m21272L94369k793049k2389R515298
$$ 27963734 36653935 40901811 37034600 31937968 31516696 31911065 29118016 29095627 38610925
39376C8610925J4144910R401039M368618K812384l987353j6358566j6683387M290286
$$ 38610925 52755835 62156874 66525492 69337876 65350523 48991957 32308570 36598856
39368C6598856K6437422K4316054K828195j0600974m356394O542694P455389L040921
$$ 36598856 63036278 87352332 90180527 79579553 75223159 81765853 89221242 92262163
39360I2262163M107420J0399460J4858225J5699925J5916691J5889632J3455947
$$ 92262163 96369583 106769043 121627268 137327193 153243884 169133516 182589463
39353A82589463R260627P316896J0375782J6505415K0189212J7293478R989377
$$ 182589463 191850090 199166986 209542768 226048183 246237395 263530873 273520250
39346B73520250N132085N742250O476095Q85193r251427j6503982j8029826j7666850
$$ 273520250 278652335 284394585 290870680 291755873 282504446 266000464 247970638 230303788
39338B30303788j8058169j6445248j0041613j460982L576822K070386l469721
$$ 230303788 212245619 195800371 185758758 184297776 187874598 189944984 186475263
39331A86475263o414110q43444J2245490K3886647K5347414J7582859R978678
$$ 186475263 180061153 179217709 191463199 215349846 240697260 258280119 268258797
39324B68258797R889013J6264691K3550992K8494584L1733617L4484427L4962695
$$ 268258797 278147810 294412501 317963493 346458077 378191694 412676121 447638816
39317D47638816K8460433J2611721o749042j8401053j7746817j3556132j8290478
$$ 447638816 476099249 488710970 481961928 463560875 445814058 432257926 413967448
39310D13967448l3001575m6556637m9362096m2753248l3924875k6508661j9161613
$$ 413967448 380965873 334409236 285047140 242293892 208369017 181860356 162698743
39303A62698743j0971290m938277n310699j1903994j8387934j8411145j3085829
$$ 162698743 151727453 146789176 141478477 129574483 111186549 92775404 79689575
39296G9689575q781504p362291m579882j58660j216493r595823j3887835m130723
$$ 79689575 70908071 63545780 58965898 58807238 57590745 47994922 34107087 29976364
39288B9976364J1338322J5999151Q614799K657694L530151K306001n270337j0151835
$$ 29976364 41314686 57313837 65928636 68586330 72116481 74422482 69152145 59000310
39280E9000310p138478n206364j0507500j2809915k349351J0803257J0191983
$$ 59000310 51861832 46655468 36147968 23338053 20988702 31791959 41983942
39273D1983942j430008o781118o38365M982551J731209m844131q156307r373385
$$ 41983942 40553934 33772816 33134451 38117002 39848211 35004080 26847773 17474388
39265A7474388r318451m245614M812924R044173L991835l993443q148932r362674
$$ 17474388 8155937 3910323 8723247 17767420 21759255 17765812 9616880 254206
39257B54206r336411n333826K250220O068929K301225l133800m960395n954324
$$ 254206 -9082205 -14416031 -12165811 -6096882 -3795657 -6929457 -11889852 -17844176
39249a7844176p113995j506011J1814169J8486097P363525r878735j3370795l125788
$$ -17844176 -24958171 -26464182 -14650013 3836084 11199609 1320874 -12049921 -15175709
39241a5175709M789486N501859Q179615J2349627M721819j4057678k1776790o552611
$$ -15175709 -10386223 -4884364 3295251 15644878 20366697 6309019 -15467771 -22020382
39233b2020382J1803442R174947p421562j1329297M310488J8826858J4750481
$$ -22020382 -10216940 -1041993 -8463555 -19792852 -15482364 3344494 18094975
39226A8094975j135398j0917230o932318M712666J3280560J1815250J837564q006421
$$ 18094975 16959577 6042347 -889971 3822695 17103255 28918505 30756069 22749648
39218B2749648j0934535q228686l435404L836952J1593986J0523244k709855j3242463
$$ 22749648 11815113 3586427 151023 3987975 15581961 26105205 23395350 10152887
39210A0152887m945875J3269337J6493648L3338j3654238r698996j388368m641270
$$ 10152887 5207012 18476349 34969997 35003335 21349097 11650101 10261733 5620463
39202E620463j1475721o359735N700398Q130955P61879k372313J436791J116164
$$ 5620463 -5855258 -12214993 -6514595 1616360 2378239 5926 1442717 2558881
39194B558881n864606q583987k817798J818093r6530p73173M728354P781297P30122
$$ 2558881 -3305725 -11889712 -14707510 -12889417 -12985947 -13759120 -9030766 -1249469 -519347
39185e19347r148779j0129697k328680N366693Q121520P027814L795881O10479
$$ -519347 -9668126 -19797823 -22126503 -16759810 -8638290 -1610476 2185405 2795884
39177B795884K99629J019966l186453j0903382j0037114N859927K4435688K7385544
$$ 2795884 3095513 4115479 929026 -9974356 -20011470 -14151543 10284145 37669689
39169C7669689J2386844o683835j7758114j9498802j5102048p473827n50755K886326
$$ 37669689 50056533 43372698 25614584 6115782 -8986266 -16460093 -17010848 -14124522
39161a4124522N268176R826482J3303981J0094163K114348l671935o565834j1450573
$$ -14124522 -8856346 970136 14274117 24368280 26482628 22810693 16244859 4794286
39153D794286j6452968j2293107K051924J2849169Q076824n648265j0544380J79633
$$ 4794286 -11658682 -23951789 -21899865 -9050696 -973872 -6622137 -17166517 -16986884
39145a6986884J4161659J4502816j043801j7281412j7877682l544033Q911361
$$ -16986884 -2825225 11677591 10633790 -6647622 -24525304 -28069337 -19157976
39138a9157976P068222k479357n271446J32248K381778l019992o767156j931153
$$ -19157976 -12089754 -14569111 -19840557 -19708309 -17326531 -20346523 -27113679 -29044832
39130b9044832M694450M737587J997156M195563Q374377O425096Q19122J690825
$$ -29044832 -24350382 -19612795 -17615639 -13420076 -5045699 1379397 2198519 3889344
39122C889344R100916J1408955L894395l357855j882102J732144k242547r384335
$$ 3889344 12990260 24399215 28293610 24935755 23053653 24785797 22543250 13158915
39114A3158915p280348M635912J2997606Q408052m506081j6474399k3151501k1832984
$$ 13158915 5878567 10514479 23512085 31920137 27414056 10939657 -12211844 -34044828
39106c4044828r099872J0407849K0903855J2141730m616760q581315L695217J4879676
$$ -34044828 -43144700 -32736851 -11832996 308734 -4308026 -12889341 -9194124 5685552
39098E685552J1654464J006995l284596J86924L017099J114992k936092o695424
$$ 5685552 17340016 18347011 15062415 15249339 18266438 19381430 16445338 9749914
39090I749914q324288m119404N778367J2522748Q342677j709996p261668q752608
$$ 9749914 1425626 -2693778 3084589 15607337 23950014 22240018 14978350 6225742
39082F225742j4152443k0878703j5551598M522725K2746248K3200144R554323
$$ 6225742 -7926701 -28805404 -44357002 -39834277 -17088029 6112115 15666438
39075A5666438l090165o784462l492231L148781R690192J1253362O261707j33337
$$ 15666438 12576273 5791811 2299580 5448361 15138553 26391915 32653622 32520285
39067C2520285l085722m445493p055208q515682o993359o697044r528275p979518
$$ 32520285 29434563 24989070 17933862 9418180 2424821 -4272223 -13800498 -21780016
39059b1780016L338709J4887345J3475122K687293j813967L954918Q166587M370954
$$ -21780016 -18441307 -3553962 9921160 12608453 10794486 14749404 22915991 27286945
39051B7286945J299934N695257R161351J654948j1816616j8440941j4984212q006652
$$ 27286945 28586879 34282136 43443487 45098435 33281819 14840878 -143334 -8149986
39043h149986j450924N747172J1740660J1241078M156604k066745j172409M497949
$$ -8149986 -9600910 -3853738 7886922 19128000 23284604 21217859 20045450 24543399
39035B4543399P079305K171517n788271p543910k77174O421073J306400j1518791
$$ 24543399 31622704 33794221 28005950 20462040 20184866 26605939 27912339 16393548
39027A6393548j5056629l185169P795812J022607j5319581j8575101m627534O730066
$$ 16393548 1336919 -1848250 5947562 6970169 -8349412 -26924513 -31552047 -24821981
39019b4821981K336959n801832k091982P507809P651153J026971L403533J3985668
$$ -24821981 -22485022 -28286854 -30378836 -22871027 -15219874 -14192903 -10789370 3196298
39011C196298J2823455o521992k2032423j3880316N694634J0849058o4034o154034
$$ 3196298 16019753 9497761 -12534662 -26414978 -20720344 -9871286 -9935320 -16089354
39003a6089354J304551Q700987O339637K424202L456848J378261p789141j0989696
$$ -16089354 -14784803 -6083816 255821 2680023 6136871 7515132 -274009 -11263705
38995a1263705J83302J0601605L855801r206321o871761P280687J0272182j702451
$$ -11263705 -11080403 -478798 3377003 -5829318 -12701079 -5420392 4851790 3149339
38987C149339p639415K784473J4022417J2178393L883710k485707j1619483k3423920
$$ 3149339 -4490076 -1705603 12316814 24495207 28378917 25893210 14273727 -9150193
38979i150193k1676682P86723K2358851J9231553m7451p539797M661723J8225493
$$ -9150193 -30826875 -30040152 -7681301 11550252 11502801 3963004 8624727 26850220
38971B6850220J6839710K274366j4632427k3131990j6451278j222926K711589
$$ 26850220 43689930 45964296 31331869 8199879 -8251399 -9474325 -6762736
38964f762736j2256501k4071118r017892J9971628K8176538R536421n959385J191979
$$ -6762736 -19019237 -43090355 -52108247 -32136619 -3960081 5576340 -383045 808934
38956H08934J4585134J2931378N60518p946812j1904842j5755505j3647567j700524
$$ 808934 15394068 28325446 28885964 20939152 9034310 -6721195 -20368762 -22069286
38948b2069286P507363J387912j1341504j2783478j341129J0467665J5914492
$$ -22069286 -14561923 -13174011 -24515515 -37298993 -38640122 -28172457 -12257965
38941a2257965J6159269R592502m453855j6261183j5380401n891940J351526N848650
$$ -12257965 3901304 13493806 9039951 -7221232 -22601633 -28493573 -27142047 -21293397
38933b1293397J2143703J4488029N139981o963428o362922K308637J7930j3299486
$$ -21293397 -9149694 5338335 10478316 3514888 -2848034 -539397 -521467 -13820953
38925a3820953j4979301L989359K1635937J6628782j392252r069199l110107J150612
$$ -13820953 -28800254 -24810895 -3174958 13453824 12061572 2992373 -117734 1032878
38917A032878l206255p226962l851064J721141J983911j986624l135700K264680
$$ 1032878 -2173377 -9400339 -13251403 -11530262 -9546351 -11532975 -14668675 -12403995
38909a2403995R492732R008176k207040j2774824p082459J3611858K8201211K0220423
$$ -12403995 -2911263 6096913 3889873 -8884951 -15967410 -2355552 25845659 46066082
38901D6066082j591365j5445214j3364121n489379j221516J236974N126963O357276
$$ 46066082 44474717 29029503 15665382 10176003 8954487 10191461 15318424 21675700
38893B1675700M63753q221493j0814255m713747M295278R372129Q477288L558192
$$ 21675700 22139453 13917960 3103705 -1610042 2685236 12057365 20534653 24092845
38885B4092845k532221o962593o967587j803225M885336O821513J250010p230946
$$ 24092845 21560624 14598031 7630444 5827219 10712555 17534068 18784078 11553132
38877A1553132j0667782n516611M403558J1638267J0589482J323195r465621j2862872
$$ 11553132 885350 -4631261 -227703 11410564 22000046 23323241 13857620 994748
38869I94748o317736L200072P330577N458656K090836j571692o999751j1363768
$$ 994748 -5322988 -2122916 5207661 10666317 12757153 11185461 4185710 -7178058
38861g178058r479068k981692P07013J2404J144067N688230N790666k612925j0241575
$$ -7178058 -16657126 -19638818 -18931805 -18919401 -17775334 -12087104 -6296438 -8909363 -19150938
38852a9150938o444868M968970J1105740Q354156O145255J1836139J9461575J7393349
$$ -19150938 -25595806 -20626836 -9521096 -1166940 4978315 16814454 36276029 53669378
38844E3669378L805368j0171693j4128522j1883797j4946410k1857100j5240588
$$ 53669378 57474746 47303053 33174531 21290734 6344324 -15512776 -30753364
38837c0753364J0984456L2041591J9333000j6085006l1366927r293971J7242765
$$ -30753364 -19768908 12272683 31605683 15520677 -15846250 -25140221 -7897456
38830g897456J3303366q541144j1343212R508099K3908513J6013637L563622L552153
$$ -7897456 5405910 -3135234 -14478446 -4970347 18938166 34951803 38515425 42067578
38822D2067578P020264L93538r993610j0680494l484096M90738r77460l045771
$$ 42067578 49087842 49481380 39487770 28807276 25323180 25813918 24836458 21790687
38814B1790687n904295j1733461j5188022r406623J811498Q398128P849849N248403
$$ 21790687 15886392 4152931 -11035091 -20441714 -18630216 -10232088 -2382239 2866164
38806B866164K320345l440947r815288r787285j951153O100476O885648J181195
$$ 2866164 5186509 1745562 -8069726 -17857011 -19808164 -13707688 -6822040 -5640845
38798e640845l917221k222414N842952J2638456J0225882k42683r375933j1596527
$$ -5640845 -9558066 -11780480 -5937528 6700928 16926810 16684127 7308194 -4288333
38790d288333j0699953j0106182n602937M825755J1494046M820771p520736q384659
$$ -4288333 -14988286 -25094468 -30697405 -25871650 -14377604 -9556833 -17077569 -25462228
38782b5462228M386292J4332170R848851r87724m728036j164670P30122j840658
$$ -25462228 -21075936 -6743766 3105085 2117361 -2610675 -3775345 -3045223 -4885881
38774d885881l802140k316127P9571J371549K027542R87165m076978j0928570
$$ -4885881 -8688021 -11004148 -10924577 -9553028 -7525486 -6538321 -10615299 -21543869
38766b1543869j2033766k692179J2150833K1674494J9629197J0081875K436731
$$ -21543869 -33577635 -36269814 -24118981 -2444487 17184710 27266585 29703316
38759B9703316J025206J007249m016491j2058128j4390860p383254K220842O307233
$$ 29703316 30728522 31735771 27719280 15661152 1270292 -6112962 -3892120 2415113
38751B415113M974284K816562r5493o612441j3757609j3864235o075139O24261
$$ 2415113 7389397 10205959 10110466 3498025 -10259584 -24123819 -30198958 -29574697
38743b9574697k54830l325641J5150P808700R927810L210463l450504j679656
$$ -29574697 -29829527 -33155168 -33140018 -25331318 -15403508 -12193045 -15643549 -17323205
38735a7323205M411505L923007n298023j2472868p263657O159575J3186184P034040
$$ -17323205 -12911700 -8988693 -14286716 -26759584 -34023241 -27863666 -14677482 -7643442
38727g643442k665010l686707J398237M55488p336295q395203L067608J2604810
$$ -7643442 -10308452 -13995159 -12596922 -12141434 -19477729 -27872932 -24805324 -12200514
38719a2200514N970542q002363r995497N24080O748354L369889L348081J1922097
$$ -12200514 -6229972 -14232335 -24227832 -23703752 -16955398 -13585509 -10237428 1684669
38711A684669J5074939M304054o203556k550618M695628j228589j3014232j0457179
$$ 1684669 16759608 21063662 14860106 12309488 17005116 15776527 2762295 -7694884
38703g694884M758642J0459053k91339r261698l791127M904719L509837k496619
$$ -7694884 -2936242 7522811 7231472 -2030226 -5821353 -916634 2593203 96584
38695I6584k187815J868291J845712L8618K013120L641725j089536o539959l513002
$$ 96584 -2091231 -222940 1622772 1661390 3674510 7316235 6226699 -313260 -3826262
38686c826262M449173O257462O88072m538803p700869j2946919j6790718j0066796
$$ -3826262 622911 6880373 7568445 3029642 -4671227 -17618146 -34408864 -44475660
38678d4475660M448936J0854458K321638p479465l401481R591648J3976507M172913
$$ -44475660 -40026724 -29172266 -26850628 -34330093 -37731574 -28139926 -14163419 -9990506
38670i990506o898360n762770N519553J4561715J4413753Q558824K364955l411916
$$ -9990506 -16888866 -22651636 -17132083 -2570368 11843385 20402209 22767164 19355248
38662A9355248q402131q339543j278000N521081L008078o234993j0410944n006215
$$ 19355248 10953117 2613574 1335574 6856655 9864733 3629740 -6781204 -11787419
38654a1787419K052383L662984K098687O18466k662215o340030k322066R880890
$$ -11787419 -9735036 -6072052 -3973365 -3354899 -6017114 -12357144 -14679210 -4798320
38646d798320J5838369N462871q956927q728456L378205Q114513k77401p499283
$$ -4798320 11040049 16502920 7545993 -1182463 2195742 10310255 10032854 2533571
38638B533571m173441Q71736j332110m468510J53288P087832N367829l415311
$$ 2533571 -1639870 -768134 -2100244 -6568754 -6415466 672366 6040195 2624884
38630B624884p471658k194288M752776N249499M9479m600833m324708Q65043P770968
$$ 2624884 -4846774 -7041062 -2288286 2961213 3010692 -1590141 -5914849 -5049806 2721162
38621B721162J1689374Q716293r45581j1129879j3239594m996104M750990M805684
$$ 2721162 14410536 23126829 22181248 11051369 -2188225 -7184329 -2433339 2372345
38613B372345l644885p392830N42372J0661810J1172968M684195J346942J982558
$$ 2372345 -1272540 -8665370 -8122998 2538812 13711780 18395975 19742917 21725475
38605B1725475K63083k804383p33473L977358K173172m674034m800034L433173
$$ 21725475 21988558 19184175 18450702 22428060 24601232 19927198 15127164 18560337
38597A8560337O707092k344214j3463595j4852876q300847j179048M261774O038270
$$ 18560337 25267429 22923215 9459620 -5393256 -13694103 -14873151 -10611377 -4573107
38589d573107j74713r698305p887146Q440103K1041734J4641186m20984m989859
$$ -4573107 -4747820 -14446125 -22333271 -13893168 7148566 21789752 21368768 16378909
38581A6378909K8918m19608q340571j1349213n511875m76155j505750l204402
$$ 16378909 16407827 15988219 7647648 -3701565 -9213440 -9689595 -11195345 -14399747
38573a4399747k521625k628242k373615K786266P610864J400532j0916572r715874
$$ -14399747 -16921372 -19549614 -21923229 -19136963 -11526099 -10125567 -21042139 -30758013
38565c0758013J0031187K7155669K2635542M919028o222802q417559j2425442
$$ -30758013 -20726826 6428843 29064385 33983413 27760611 19343052 6917610
38558F917610j7621908j1718207N611351J6811170R976257m250168p549208K101751
$$ 6917610 -10704298 -22422505 -16811154 16 9976273 5726105 -1823103 278648
38550B78648J0492756P711972q99464n838621p414253j1818187j6778741j1273181
$$ 278648 10771404 18483376 17583912 11745291 4331038 -7487149 -24265890 -35539071
38542c5539071O909621K2004559J7590775j203443j3377936q990489R05652L161786
$$ -35539071 -28629450 -6624891 10965884 9762441 -3615495 -12605984 -11700332 -8538546
38534h538546p61506k948341k804618k989443O8796R555352J7301009J2600224
$$ -8538546 -9300052 -12248393 -15053011 -18042454 -17973658 -8418306 8882703 21482927
38526B1482927o300n324770n63726N87169q533010j4512735m544492J1250919
$$ 21482927 21476627 16151857 15588131 16175300 7642290 -6870445 -11414937 -164018
38518a64018J2948598M18443o927034j16053O491942r52868j3098072j1085918
$$ -164018 12784580 13203023 6275989 6159936 12651878 11699010 -1399062 -12484980
38510a2484980N028074J6265619J1499713M92908k933644P85120K253247j338227
$$ -12484980 -7456906 8808713 20308426 20801334 17867690 18652810 20906057 19567830
38502A9567830m687836m482263k807342j603658m14760L65523k99909k89506L654768
$$ 19567830 14879994 10397731 7590389 5986731 5571971 5937494 5637585 5348079 9002847
38493I002847Q912864P752449j929202j1443946j1343504l487849K010264L38458
$$ 9002847 17915711 25668160 23738958 12295012 951508 -2536341 -526077 -187619
38485a87619l123839j849112L364035P312682P249570L233182m431528j2934277
$$ -187619 -3311458 -5160570 -1796535 5516147 12765717 15998899 11567371 -1366906
38477a366906j5183946p430869K396753K512960n205900n279004Q749861K1329146
$$ -1366906 -16550852 -23981721 -21584968 -19072008 -24277908 -29556912 -20807051 522095
38469E22095J4188431p680781k1294885j4782700N25168P930314M541140o71495
$$ 522095 14710526 7029745 -14265140 -29047840 -28522672 -20592358 -16051218 -16722713
38461a6722713L69168P917499J4549580J0623117m480286j6981252j3090556J379247
$$ -16722713 -16353545 -8436046 6113534 16736651 12256365 -4724887 -17815443 -16436196
38453a6436196O858398k972834j3142321j0829995k712089m34508j818041J527541
$$ -16436196 -9577798 -12550632 -25692953 -36522948 -39235037 -39669545 -41487586 -39960045
38445c9960045P950517J0402944J0045936J2057909J3384254P545550k472183
$$ -39960045 -32009528 -21606584 -11560648 497261 13881515 21427065 18954882
38438A8954882q160868q393116o872486j758795Q689509J4594711M620972j3533334
$$ 18954882 10794014 2400898 -4471588 -6230383 2459126 17053837 21674809 8141475
38430H141475j8747010m279863J3956834J9209755J1202684n28108p943561o386811
$$ 8141475 -10605535 -14885398 -928564 18281191 29483875 28955767 21012206 14625395
38422A4625395K680792P922706j072636j6759613k0044370o564223P217883Q337076
$$ 14625395 17306187 25228893 24156257 7396644 -12647726 -19211949 -11994066 -3656990
38414c656990L076470J992324L738149K968083J764811K763089J407514m422352
$$ -3656990 -580520 1411804 5149953 8118036 9882847 12645936 14053450 9631098
38406I631098o429698J586207J1198578J0262254L2012q630259j0541387q493727
$$ 9631098 3201400 4787607 15986185 26248439 26280451 17650192 7108805 -1384922
38398a384922n583163l681132m353673m191573L920844J7566814K1759572Q809496
$$ -1384922 -6968085 -10649217 -15002890 -19194463 -15273619 2293195 24052767 32862263
38390C2862263p992132j2534213q679799r827832j3419687n342806J2482899J9555478
$$ 32862263 24870131 12335918 3656119 -6171713 -19591400 -24934206 -12451307 7104171
38382G104171O232941j1590627j5261001p077257r35148K57725M499251J2530448
$$ 7104171 13337112 1746485 -13514516 -20591773 -21526921 -21269196 -16769945 -4239497
38374d239497J3681414K892096q147312n076866P883956J1205505k912184j7059542
$$ -4239497 9441917 12334013 4186701 -890165 6993791 18199296 15287112 -1772430
38366a772430j1228953Q396272J7303217O918825n539114m414865M109901O982197
$$ -1772430 -13001383 -4605111 12698106 19616931 14077817 9662952 13772853 20755050
38358B0755050M249437K748709K348650P77972J199301K872109l664642j8289459
$$ 20755050 25004487 27753196 30101846 30879818 32079119 34951228 31286586 12997127
38350A2997127k2024225m474136J2846002M736406j6216241j5703594Q717625
$$ 12997127 -9027098 -13501234 -655232 4081174 -12135067 -27838661 -19121036
38343a9121036K2509433O854469j5175045j6850948m195456K878945K693761M621254
$$ -19121036 3388397 10242866 -4932179 -21783127 -25978583 -23099638 -20405877 -15784623
38335a5784623P319814N402875M763790J0624142J1342179m145882k1263693j5970036
$$ -15784623 -8464809 -3061934 1701856 12325998 23668177 19522295 -1741398 -17711434
38327a7711434P718177K0400038Q898504p557277q976279j758078k422344r843669
$$ -17711434 -9993257 10406781 19305285 11748008 2771729 1013651 -1408693 -11252362
38319a1252362r504568K374755J3959811J5326164R248750L175082p83531m256438
$$ -11252362 -20756930 -18382175 -4422364 10903800 20152550 23327632 22544101 18287663
38311A8287663o614696n359354o77113L902403N299673L414371K49052j423941
$$ 18287663 11672967 6313613 5636500 9538903 14838576 18252947 18501999 17078058
38303A7078058J137695Q092474J4419229J3451827N418689r07268J157949O800394
$$ 17078058 18215753 26308227 40727456 54179283 59597972 58690704 59848653 66649047
38295F6649047N990650k727810j0758702j1161316n425450J900964Q246248J0281766
$$ 66649047 72639697 69911887 59153185 47991869 42566419 44467383 52713631 62995397
38287F2995397L239536j1574746k2703894j8341459k07680J5969682J5254845
$$ 62995397 66234933 54660187 31956293 13614834 13407154 29376836 44631681
38280D4631681j454345j7364258j5993748J587457J7705143J7712906N043209
$$ 44631681 43177336 25813078 9819330 11406787 29111930 46824836 51868045
38273E1868045o389659r460852o821218j239591O730894J2321723Q419824l718882
$$ 51868045 45478386 36017534 29196316 27956725 34687619 47009342 55429166 51710284
38265E1710284j3850178j5236422j0716347n210219l99046J667209j236712n236847
$$ 51710284 37860106 22623684 11907337 6697118 6298072 7965281 6728569 1491722
38257A491722l264327L264009N268966J033090q84911K332702J631702p211091
$$ 1491722 -1772605 1491404 6760370 7793460 6908549 9241251 10872953 3661862
38249C661862j3295674o651300N905014J1469624Q682918M231239L74665k861432
$$ 3661862 -9633812 -16285112 -10380098 1089526 9772444 14003683 14378348 11516916
38241A1516916j121481O665446J1191396N257498l630123n379468m238582r448936
$$ 11516916 10395435 17060881 28252277 33509775 29879652 24500184 20261602 10812666
38233A0812666j6496504j4298233n396233j088076o29187N451158J3958078J2096461
$$ 10812666 -5683838 -19982071 -25378304 -26466380 -27095567 -21644409 -7686331 4410130
38225D410130J904207p07686N757051M469568q788518j4976977l764767O935290
$$ 4410130 6314337 5606651 11363702 15833270 7044752 -7932225 -11696992 -4761702
38217d761702L43083j0429211m741902R830334R490418o804795j6544291r487617
$$ -4761702 -4418619 -14847830 -19589732 -9759398 -268980 -7073775 -23618066 -33105683
38209c3105683N73260K619271L852205J0390050J2381590J233187j2314609j2009133
$$ -33105683 -32532423 -29913152 -26060947 -15670897 -3289307 -2056120 -14370729 -26379862
38201b6379862J21999P662123L572267k492317l33293P701689J2318913Q921949
$$ -26379862 -26257863 -18595740 -15023473 -17515790 -17849083 -10147394 2171519 11093468
38193A1093468L81299p401488r655356n266913J900060N148779M05411r874083
$$ 11093468 11474767 4073279 -5582077 -10848990 -8948930 -3800151 -3394740 -13268823
38185a3268823j7911452j5796909j801456J5922423K3628174J4585871j900491
$$ -13268823 -31180275 -46977184 -48778640 -32856217 -9228043 5357828 3457337
38178C457337q637920P0040J1449771J0215337k568549j2100774q615837L304172
$$ 3457337 -5180583 -5110543 6339228 16554565 13986016 1885242 -6730595 -3426423
38170c426423J3208702J4957416P659401n247941j4550996j0648295M075685J4319215
$$ -3426423 9782279 24739695 32399096 27151155 12600159 1951864 6027549 20346764
38162B0346764R481631k998004q602785m779232m15583l47961r93097k66186j087441
$$ 20346764 29828395 26830391 18227606 13448374 13032791 12684830 11691733 11425547 10338106
38153A0338106l617759l683254j458659k525343o823535o061592K260930P350999
$$ 10338106 6720347 3037093 1578434 -946909 -7770444 -13832036 -11571106 -4220107
38145d220107K19387j0560580r172591M269178J2396630M039714j0669108j3636639
$$ -4220107 -4000720 -14561300 -23733891 -19464713 -7068083 -3028369 -13697477 -27334116
38137b7334116r87006J4397318J9350937J2831023K307344n526690p505477k695460
$$ -27334116 -28321122 -13923804 5427133 18258156 20565500 15038810 7533333 4837873
38129D837873N897300J0502267N770025l253807o413529k307857M26493k238185
$$ 4837873 10735173 21237440 27007465 23753658 17340129 15032272 15458765 13220580
38121A3220580l012873K989314P159784L04863j0093837q840194L605400J0936239
$$ 13220580 10207707 13197021 20356805 20661668 10567831 1727637 5333037 16269276
38113A6269276M879708m647847o794398l925821k299534n13433M053608O844536
$$ 16269276 21148984 16501137 9706739 5780918 3481384 2967951 7021559 13866095
38105A3866095M017430J378947N244512J0110017O099930n067768j2022832r647961
$$ 13866095 17883525 19262472 24506984 34617001 40716931 35649163 23626331 13978370
38097A3978370l609458k86111r80691n150155j0541138j0553316o08209J2169292
$$ 13978370 10368912 10082801 9102110 3951955 -6589183 -17142499 -17750708 -5581416
38089e581416J4551475M273524o646906p675328o99997P144838J2410995J2622909
$$ -5581416 8970059 13243583 6596677 -1078651 -1778648 5366190 17777185 30400094
38081C0400094L850608j1252531j9552571j0904533P401179J7859539J3146356
$$ 30400094 34250702 22998171 3445600 -7458933 -57754 17801785 30948141
38074C0948141K117012l858190l004321l32670M98583q20014l107886m251844
$$ 30948141 33065153 29206963 26202642 25869972 26368555 25548541 22440655 18188811
38066A8188811k395243J222384K643003k57012n722347j1015076j3964502j1296310
$$ 18188811 15793568 17015952 19658955 19401943 13679596 2664520 -11299982 -22596292
38058b2596292j010296J0918425J2421896l11309j4914928j6589425o834726L1643
$$ -22596292 -23606588 -12688163 -266267 -577576 -15492504 -32081929 -38916655 -38885012
38050c8885012k247782m549341J997857J2562585J6000337R077765j960673r014536
$$ -38885012 -41132794 -45682135 -43684278 -31121693 -15121356 -6043591 -8004264 -17018800
38042a7018800p073025K921694J1680654Q281663n149055j2160346k759964J1053119
$$ -17018800 -24091825 -21170131 -9489477 -1207814 -6356869 -18517215 -21277179 -10224060
38034a0224060J0456379m133888j3787343o341138J0193950K0194454J6574212
$$ -10224060 232319 -3901569 -17688912 -24030050 -13836100 6358354 22932566
38027B2932566K769171j2450537j9373475j3715111j523677O892274Q172106O243821
$$ 22932566 25701737 13251200 -6122275 -19837386 -21361063 -14468789 -6296683 -52862
38019e2862L850020J231003Q44420L851408L607595o219018j7832263j6344584
$$ -52862 3797158 5028161 5872581 9723989 13331584 7112566 -10719697 -27064281
38011b7064281j577667J0511953J0338792M449577l73777o598771j3256403j0564248
$$ -27064281 -28641948 -18129995 -7791203 -3341626 -3715403 -10314174 -23570577 -34134825
38003c4134825K489386J0193127K409145q164079n119672O677128J0949573N568248
$$ -34134825 -31645439 -21452312 -19043167 -27207246 -32326918 -25649790 -14700217 -9131969
37995i131969J309150J630126Q84438j084709J129171N845833O302176L954742
$$ -9131969 -7822819 -6192693 -5308255 -6392964 -5263793 582040 6884216 10838958
37987A0838958N827257R729577O330998l835767r099862l961140M252366P551706
$$ 10838958 16666215 26395792 32726790 28891023 19791161 15830021 20082387 27634093
37979B7634093N233841j351868j1154728j8904805j7855320q707627J447123P934235
$$ 27634093 32867934 31516066 20361338 1456533 -16398787 -25106414 -23659291 -15725056
37971a5725056R037140K406776q658725j0817104L674992K1122642K1668488P113425
$$ -15725056 -6687916 -4281140 -12939865 -23756969 -20081977 1040665 22709153 29822578
37963B9822578l565852l685973l924552q471587q428606k514026k050908q634051
$$ 29822578 26256726 22570753 18646201 10174614 1746008 -768018 -2818926 -11452977
37955a1452977q204003L956177J3103145J0125607O039171R280403R527951o22051
$$ -11452977 -19656980 -15700803 -2597658 7527949 13567120 22847523 32375474 31753423
37947C1753423q167168k348640L807977m166629j4871443j0151948K216845J757059
$$ 31753423 23586255 21237615 25045592 20878963 6007520 -4144428 -1927583 -170524
37939a70524q584916q132505M686071J0202388K244956k860490L434443Q265355
$$ -170524 -8755440 -16887945 -12201874 -1999486 245470 -2615020 819423 9084778
37931I084778K325478m060508j101740K920908k559614j1307098j0470204j76428
$$ 9084778 11410256 7349748 6248008 9168916 6609302 -4697796 -15168000 -15344428
37923a5344428Q862246J0771590Q153929N093734L579456L427014J794838l467991
$$ -15344428 -6482182 4289408 12443337 17537071 21116527 24543541 26338379 22870388
37915B2870388q803421q831406n050921l160354k634434J192078N426687K387277
$$ 22870388 14066967 5235561 184640 -2975714 -5610148 -4418070 1008617 3395894
37907C395894n248900o167436J94590J451115n763260q261083J172482J0181379
$$ 3395894 -1853006 -8020442 -7825852 -6374737 -12137997 -20399080 -19226598 -9045219
37899i045219P174882J30554R48268M445317j92580p726309n492686L452418N142240
$$ -9045219 -1870337 -1739783 -791515 3653802 3461222 -4265087 -9757773 -6305355 -1163115
37890a163115j442427m394655j027049r71838o238192o606051J570037Q887392
$$ -1163115 -2605542 -7000197 -8027246 -8999084 -15237276 -21843327 -20273290 -11385898
37882a1385898R917099J0391818J1646501N003941r346109j4521702j115647J4613727
$$ -11385898 -1468799 8923019 20569520 25573461 16227352 1705650 590003 15203730
37874A5203730J2602152j386643n861079L313958R435368L004994n946211p191232
$$ 15203730 27805882 26419239 20558160 23872118 33307486 36312480 30366269 23175037
37866B3175037n210106p239739r454220m791577M136258R426561R349467P182734
$$ 23175037 17964931 10725192 1270972 -3520605 615653 10042214 19391681 26574415
37858B6574415L543402j779550m269127k2488N252105J615520j0329325j8033666
$$ 26574415 30117817 28338267 24069140 24046652 29298757 30914277 20584952 2551286
37850B551286j2621875J77888P663443M382259m164600q967739n846268K095138
$$ 2551286 -10070589 -9892701 -2229258 2153001 -2011599 -10979338 -16825606 -14730468
37842a4730468Q289148R048694O046547K395137j426925n668781p955022n714331
$$ -14730468 -6441320 2607374 8653921 11049058 9622133 3953352 -4001670 -9716001
37834i716001o71339K671693J972585k228003p964354j0537897m282125Q426646
$$ -9716001 -10387340 -7715647 -5743062 -7971065 -15935419 -26473316 -30755441 -22328795
37826b2328795J4926271P719063k517496j084803P266548M761406r774243j6519545
$$ -22328795 -7402524 316539 -2200957 -3285760 3980788 8742194 -1032049 -17551594
37818a7551594n098305R733606J3007514J1638238J6250388J7543893K172917
$$ -17551594 -22649899 -12916293 91221 11729459 27979847 45523740 47696657
37811D7696657j8903080k2479934q951164j614512r605491j5255533m146000J3434119
$$ 47696657 28793577 6313643 -2637521 -4252033 -13857524 -29113057 -33259057 -19824938
37803a9824938K0730112J6929484J0047389J636372q753947j4534115j0329550
$$ -19824938 905174 17834658 27882047 29518419 20764472 6230357 -4099193
37796d099193k323588L36075j312711p51976J842321J523798j545531k602348
$$ -4099193 -6422781 -6086706 -7399417 -8151393 -6309072 -4785274 -6330805 -8933153
37788h933153K65391N373247J0429848J1469684M574512n871737p759113K738287
$$ -8933153 -8667762 -3294515 7135333 18605017 23179529 17307792 9548679 12286966
37780A2286966J2867390R764547j265211n097612J658255Q387175O587881k138796
$$ 12286966 25154356 34918903 33653692 28556080 30214335 38601510 45189391 43050595
37772D3050595j2186421j8495131j6685642p450293Q98115K055982M91698K032769
$$ 43050595 30864174 12369043 -4316599 -11766892 -10868777 -8812795 -8321097 -6288328
37764f288328J251840r218729k1037991j7903013p71169J1306681Q820837L877377
$$ -6288328 -5036488 -14255217 -35293208 -53196221 -53967390 -42660709 -33839872 -29962495
37756b9962495Q134435J4360927J0675519O72690l718147r40664J816452L024229
$$ -29962495 -21828060 -7467133 3208386 3881076 162929 -777735 1038717 4062946
37748D062946O143934P998316J689360q893443j0517585K34420J0287522Q106132
$$ 4062946 10206880 18205196 19894556 11001113 483528 717948 11005470 19111602
37740A9111602l79709j558081N807774R374696P95051j3396477k0366348j5082630
$$ 19111602 18731893 17173812 22981586 32356282 33151333 19754856 -611492 -15694122
37732a5694122l010395P308138J0594136O361397j225165n552479l568275L91273
$$ -15694122 -18704517 -11396379 -802243 5559154 4333989 -1218490 -4786765 -4395492
37724d395492K91146k752605k406705K051833L885212L76041j573711L149362
$$ -4395492 -4104346 -6856951 -9263656 -7211823 -3326611 -2950570 -4524281 -1374919
37716a374919P898797M121755l779954l886603M789041J0090962M124675o725676
$$ -1374919 6523878 10645633 6865679 2979076 7768117 17859079 21983754 15258078
37708A5258078j2052890r490316k911965L996450P744518M869131k828909p317310
$$ 15258078 3205188 -6285128 -9197093 -5200643 2543875 7413006 4584097 -2733213
37700b733213l572316L521112N599303J037326m979781p568465n635984r14007
$$ -2733213 -6305529 -2784417 2814886 3852212 -1127569 -8696034 -14332018 -15246025
37692a5246025L015792K956429J96489l6787M258888Q141192O107273m55893n307643
$$ -15246025 -12230233 -9273804 -9077315 -9114102 -4855214 3285978 9393251 8937358 3629715
37683C629715m784384o03720K926559K692978j62865k00884N885713J2247960
$$ 3629715 -1154669 -1758389 1168170 3861148 3698283 3497399 9383112 21631072
37675B1631072Q768973m762662j5547527j3231270k920787L163153K380570K155588
$$ 21631072 30400045 25637383 10089856 -3141414 -6062201 -2899048 -518478 1637110
37667A637110N863967P043086M2382r588336j0401300K78893J1099329R184801
$$ 1637110 7501077 14544163 14586545 4998209 -5403091 -5124198 5975131 15159932
37659A5159932l174316r935731k397423P774578M706129p763517j1289782q81741
$$ 15159932 11985616 2049885 -347538 7427040 12133169 4369652 -6920130 -7801871
37651g801871Q262980N504371k70014R04570K602906l459597r026449l001613
$$ -7801871 461109 5965480 5695466 6600036 9202942 5743345 -3283104 -6284717
37643f284717O379578L220611q137590q635936L689329R752391L36924j0484150
$$ -6284717 94861 3315472 -4822118 -13458054 -9768725 -16334 320590 -10163560
37635a0163560j0048785n522656o622166o918904L086303J6586599J9788270J2724968
$$ -10163560 -20212345 -25735001 -32357167 -39276071 -36189768 -19603169 185101 12910069
37627A2910069O108225K663955m011316j4092292j8329364j1680737m54247O569593
$$ 12910069 19018294 21682249 17670933 3578641 -14750723 -26431460 -26885707 -20316114
37619b0316114P564759O268859N818469N776150L348300k448098p622468p061472
$$ -20316114 -12751355 -6482496 -664027 5112123 8460423 6012325 -1610143 -8671615
37611h671615j949326J569517K062044M003171O963963L081931q823900j6224952
$$ -8671615 -10620941 -9051424 -6989380 -2986209 3977754 7059685 -1764215 -17989167
37603a7989167r352199L064993N964152N8941j372313N449245J0472179Q091536
$$ -17989167 -27341366 -24276373 -18312221 -18253280 -19625593 -14176348 -3704169 4387367
37595D387367N619590Q953884J1450918M625068p416418j2232516m885601O172221
$$ 4387367 10006957 18960841 30411759 35036827 27620409 15387893 10502292 16674513
37587A6674513Q831859N41765q836090q452204p44977N77953r852965j8398843
$$ 16674513 25506372 26048137 17212047 8759843 8014866 8592819 -1260146 -19658989
37579a9658989j0005748Q533092J5413939L196320j1977060j3632565m733787
$$ -19658989 -29664737 -21131645 -5717706 -2521386 -14498446 -28131011 -32864798
37572c2864798K268639M031932N165469O026473L072570j512955p69438O051290
$$ -32864798 -30596159 -26564227 -21398758 -15372285 -12299715 -13812670 -14582108 -8530818
37564h530818J1133385Q665268K283601q52522R7389l72422m808943p433555j584331
$$ -8530818 2602567 11267835 13551436 12698914 12796303 12423881 7614938 181383 -1402948
37555a402948Q823628J1282141Q64753j1399073j2147750l130665K753411m23765
$$ -1402948 7420680 18702821 19567574 8168501 -3979249 -7109914 -4356503 -4780268
37547d780268o853698j0513413j0698078o115246M747454J5241631J4490268L526756
$$ -4780268 -11633966 -22147379 -32845457 -38960703 -34213249 -18971618 -4481350 -954594
37539i54594m239681l172543k787562q302234q837150L150817J4217140Q315640
$$ -954594 -5194275 -8366818 -11154380 -19456614 -28293764 -25142947 -10925807 -2610167
37531b610167o407454q104206N867666J5717838R166268l152136o313111k74566
$$ -2610167 -9017621 -17121827 -11254161 4463677 13629945 10477809 4164698 3890132
37523C890132N720806O180223K33545j0941489k0783878j9198789m810436R971763
$$ 3890132 9610938 15791161 16024706 5083217 -15700661 -34899450 -39709886 -29738123
37515b9738123J2246317L323426m501891k876016M783772Q681460L690173m359612
$$ -29738123 -17491806 -14168380 -18670271 -21546287 -16762515 -8081055 -4390882 -8750494
37507h750494m498377N479354J4720815J3580124P077070N721683P676258K754270
$$ -8750494 -13248871 -7769517 6951298 20531422 27608492 33330175 41006433 43760703
37499D3760703p544609r530314R6201O678643N668r511370p819101O74476J408375
$$ 43760703 36216094 26685780 26781981 33460624 33466292 23954922 16135821 16810297 18218672
37490A8218672o779222j0648834l130985P346927R604012L251619l082015k308087
$$ 18218672 11439450 790616 -2340369 5006558 14610570 17862189 14780174 12472087
37482A2472087M031834P407456J688490q670109j3255802r053247l345912j740232
$$ 12472087 16503921 23911377 25599867 16929758 3673956 -5379291 -8725203 -10465435
37474a0465435j274432Q03485M76102m233659o340345m34796O897990O828678
$$ -10465435 -11739867 -10936382 -10460280 -14693939 -21034284 -21469080 -14571090 -7742412
37466g742412K514335L140211Q390671R756456M260458l295162r071680j1539296
$$ -7742412 -5228077 -2087866 6302805 16059261 20319719 17024557 7952877 -3586419
37458c586419p431442L107539J0339999N205140o385040j0704764n298555R54663
$$ -3586419 -11017861 -7910322 2429677 7634817 1249777 -9454987 -14753542 -13798879
37450a3798879M035643P024508P804243M82668r979482j0869179k445800O75728
$$ -13798879 -9763236 -2738728 5065515 5548183 -4431299 -15300478 -17746278 -17070550
37442a7070550o492187j0576300k381745P717035O884754j214030n378179l209401
$$ -17070550 -23562737 -34139037 -36520782 -28803747 -21918993 -23133023 -28511202 -31720603
37434c1720603K010275R709447J6591079J3807622J108663o956411j448014N307955
$$ -31720603 -29710328 -20000881 -3409802 10397820 11506483 4550072 3102058 8410013
37426H410013j015521j2264867j0161327M410873J3425642Q838624p09163p794984
$$ 8410013 7394492 -4870375 -15031702 -10620829 2804813 11643437 10934274 3139290
37418C139290j2303431j0593096J959118J5618982J2822896m847547j4314822
$$ 3139290 -9164141 -19757237 -17798119 -2179137 10643759 5796212 -8518610
37411h518610l248067J2227717J2647520L168105K206331J2265078J7962549R454740
$$ -8518610 -11766677 461040 13108560 16276665 18482996 30748074 48710623 58165363
37403E8165363n579428j3859920j1259113l875561k2424l007724r245571j2489753
$$ 58165363 52585935 38726015 27466902 23591341 23568917 20561193 11315622 -1174131
37395a174131j0091374m267065J778288O197834P791780O396004L380741q28636
$$ -1174131 -11265505 -15532570 -13754282 -7556448 235332 6631336 10012077 9183441
37387I183441o973780j1471623o670269O473269J3063061L065037j0677387q720452
$$ 9183441 2209661 -9261962 -15932231 -9458962 3604099 6669136 -4008251 -12728703
37379a2728703M798657P897626l623716r375216J096724J0968870N481367l700727
$$ -12728703 -7930046 -32420 -3656136 -13031352 -11934628 -965758 4515609 814882
37371H14882j003669N398752K54985r541996p152135L252177L933126m141831
$$ 814882 -188787 5209965 5464950 -4077046 -11229181 -7977004 -4043878 -8185709
37363h185709l431035P661051J1380332K017308n438568l703973m657736j2857136
$$ -8185709 -11616744 -3955693 7424639 9441947 4003379 299406 -4358330 -17215466
37355a7215466j2364613N216202K0758954J4151334n296999j4244170q460584
$$ -17215466 -29580079 -24363877 -3604923 10546411 5249412 -8994758 -17455342
37348a7455342p04355M528800J2419993J9367155J4878287J601176n717901l356203
$$ -17455342 -18159697 -13630897 -1210904 18156251 33034538 34635714 28917813 25561610
37340B5561610l066108r331916r602620M007958J7573574J2949102n359148j4540420
$$ 25561610 22495502 13163586 3560966 7568924 25142498 38091600 32732452 18192032
37332A8192032l250356J4126690J6391887J813209j0952507p093777N829585Q468026
$$ 18192032 14941676 29068366 45460253 47273462 36320955 29227178 35056763 43524789
37324D3524789m524003j7944044j7255555p193249k200457n270878o781741j349956
$$ 43524789 39000786 21056742 3801187 -3392062 -5592519 -10863397 -17645138 -18995094
37316a8995094N464702P852188O979749M935252L15246o208669r349503o717813
$$ -18995094 -13530392 -5678204 1301545 6236797 6552043 343374 -9006129 -15723942
37308a5723942k646442k87177L601856J0653810J4105110P572216l594592p997680
$$ -15723942 -18370384 -18657561 -15055705 -4401895 9703215 17275431 13680839 5683159
37300E683159l305037K170230K392782J27835p11075j407851l322542k852410
$$ 5683159 2378122 4548352 6941134 7068969 6357894 4950043 1627501 -1224909
37292a224909K380421O280123R62226r790457j1801489J124839J6278171J6332528
$$ -1224909 1155512 7435635 8397861 -1392596 -13194085 -12069246 4208925 20541453
37284B0541453J685810r936017o961431J993892K729113l630855m030119N413414
$$ 20541453 22227263 12291246 5329815 7323707 10052820 6421965 2391846 7805260
37276G805260J3075025Q820351k101832p630726m932626j196191k067684o019639
$$ 7805260 20880285 29700636 27598804 19968078 15035452 13839261 11771577 5751938
37268E751938q971480q740640m653481K758189J0443386J3869086J0370142P53613
$$ 5751938 -3219542 -11960182 -16613663 -13855474 -3412088 10456998 20827140 21580753
37260B1580753j1037884j8416528j5388652l429512O793552N848163k751383o711394
$$ 21580753 10542869 -7873659 -23262311 -26691823 -19898271 -14050108 -16801491 -23512885
37252b3512885j093998O234052P362979N154337N709355O166386o81696j1576501
$$ -23512885 -24606883 -18372831 -11009852 -5855515 -146160 6020226 5338530 -6237971
37244f237971j3207174o11739J3454167J4101428L694733k621660J836145Q121064
$$ -6237971 -19445145 -20056884 -6602717 7498711 11193444 8571784 10407929 18528993
37236A8528993O987980J930505J207580L675894J278262o939139j2399285r619235
$$ 18528993 25516973 27447478 28655058 32330952 33609214 26670075 14270790 4651555
37228D651555l357278J48494K175494O048229P906497J356400r987833j3562252
$$ 4651555 1294277 1442771 3618265 9666494 17572991 18929391 8941558 -4620694
37220d620694m446294O082153M483902o586141j1418241k609324Q612732P721681
$$ -4620694 -9066988 -2984835 1499067 -5087074 -16505315 -19114639 -10501907 -2780226
37212b780226k836462o353490N530041K0383280J9484330Q84855j7740910j9050503
$$ -2780226 -5616688 -11970178 -6440137 13943143 33427473 34312328 16571418 -2479085
37204b479085m205941J0537010J2112487K545614o181020n937024K29054L450103
$$ -2479085 -6685026 3851984 15964471 18510085 12329065 6392041 6621095 10071198
37196A0071198k65340o205793p724470m685566k860859n398602q014109m668335
$$ 10071198 9805858 3600065 -4124405 -8809971 -11670830 -17069432 -25083541 -29751876
37188b9751876L588494Q585400M694043l680574o663858n30112P953800R928690
$$ -29751876 -26163382 -17577982 -12883939 -16564513 -23228371 -23758483 -15804683 -5875993
37180e875993M627226j530526m073130m188346l343675K80411P005260J1502205
$$ -5875993 -1248767 -2779293 -6852423 -11040769 -14384444 -14104033 -7098773 4403432
37172D403432Q219227p52602p548603p695667l889305j066786j214586l272512
$$ 4403432 12622659 11870057 4321454 -3374213 -7263518 -8330304 -9544890 -12817402
37164a2817402n269603n947797n844212o251672o005983j778994N980655J0842298
$$ -12817402 -18087005 -24034802 -29879014 -36130686 -42136669 -43915663 -37935008 -27092710
37156b7092710Q546015M075681M447921P254210M673570k281158l665216L326010
$$ -27092710 -18546695 -14471014 -10023093 -2768883 1904687 -376471 -4041687 -715677
37148g15677Q331051K919078o669861q784131k464041K965497R08312o001581
$$ -715677 7615374 10534452 3864591 -4919540 -7383581 -4418084 -3509772 -9511353
37140i511353j0290077o494668L900797J2081799J0579833L711735K509752P482714
$$ -9511353 -19801430 -26296098 -22395301 -10313502 266331 3978066 6487818 13970532
37132A3970532P027437k067563n943271L878628J2499457K934600j4202884j3884056
$$ 13970532 20997969 18930406 12987135 16865763 29365220 32299820 18096936 4212880
37124D212880M332414J4307169K958604j1724843j1060607k419617j145949l439160
$$ 4212880 8545294 22852463 25811067 14086224 3025617 606000 -539949 -3979109
37116c979109L444445J5098586J4882677O50493j1938966j2573539p073777l403405
$$ -3979109 -534664 14563922 29446599 30097092 18158126 5584587 -1489190 -4892595
37108d892595r35159K384356L650739J047537k103944l731388o096353q483424
$$ -4892595 -5827754 -3443398 207341 1254878 -849066 -4580454 -10676807 -19160231
37100a9160231m310638Q702345K1037723K0682806P532380o476149j0439408m183538
$$ -19160231 -23470869 -14768524 6269199 26952005 34484385 28008236 17568828 13385290
37092A3385290M165235P007887L033059m031823j0192558j3023265j0118965p56669
$$ 13385290 17550525 24558412 27591471 23559648 13367090 343825 -9775140 -10531809
37084a0531809Q928252Q481791l475809j3345481q336678N003471Q438894k316432
$$ -10531809 -1603557 6878234 3402425 -9943056 -18279734 -13276263 -4837369 -7153801
37076g153801j1365736n352920Q403907J3068903L774991r222420j3560204m936370
$$ -7153801 -18519537 -23872457 -15468550 -2399647 1375344 -7847076 -21407280 -26343650
37068b6343650J0809906K0291156J2463510q095524k2586985j8444405l302228
$$ -26343650 -15533744 4757412 17220922 9125398 -13461587 -31905992 -35208220
37061c5208220P154118Q579399P239904O440237M287241J113878j149421m180669
$$ -35208220 -28054102 -19474703 -12234799 -5794562 -1507321 -393443 -1542864 -5723533
37053e723533q616647q382351J0174P790506O229854K654874P746263J2438296
$$ -5723533 -14340180 -22722531 -22712357 -14921851 -8691997 -6037123 1709140 14147436
37045A4147436k68607k1871115k3595620p52704J6118968O953842q617093p053973
$$ 14147436 13878829 -7992286 -31587906 -32340610 -16221642 -9267800 -17884893 -24938866
37037b4938866N01565o692163j6705796l558709K3496943K7968534K273711k0286189
$$ -24938866 -24437301 -31129464 -47835260 -51393969 -27897026 71508 2345219 -17940970
37029a7940970j5463948K661945J2298646J3637547J3622320P798959m515309
$$ -17940970 -33404918 -30742973 -18444327 -4806780 8815540 16614499 12099190
37022A2099190q630728K956571J3993853Q401382n121353r672975n602069j527569
$$ 12099190 3468462 6425033 20418886 28820268 23698915 14025940 8423871 6896302
37014F896302M116565J2565608J1017707p749887k4915135j9200318n74585M880610
$$ 6896302 11012867 23578475 34596182 26846295 1931160 -17269158 -17843743 -12963133
37006a2963133m829818r367351j958323M453102M291346N059172O368947J01166
$$ -12963133 -17792951 -27160302 -29118625 -24665523 -20374177 -15315005 -8946058 -8844892
36998h844892p839829l125850P999069L935715j4396179k1070352p245399N496000
$$ -8844892 -16684721 -19810571 -11811502 -7875787 -22271966 -43342318 -50587717 -45091717
36990d5091717M183706M676684J7562141K5221651J3628901j039326j266156J722692
$$ -45091717 -40908011 -36231327 -18669186 6552465 20181366 19142040 17875884 19598576
36982A9598576p161038j5433757o288927O853239K101171j0245786m208225J5055647
$$ 19598576 12437538 -2996219 -9285146 -2431907 -330736 -10576522 -14784747 270900
36974B70900J7637064k049633j8120063j6071911r365153q346824m085417P504361
$$ 270900 17907964 15858331 -2261732 -18333643 -27698796 -36045620 -40131037 -32626676
36966c2626676J3105432N854878j065358K557349O715128r156j0376852j0341564
$$ -32626676 -19521244 -13666366 -14731724 -12174375 -5459247 -5468403 -15845255 -26186819
36958b6186819O39571J1743977J4548550Q042866j816633m517916L591211J0420314
$$ -26186819 -25547248 -13803271 745279 8788145 6971512 2453596 6044807 16465121
36950A6465121L056782j0468293j1260119j0516M070603l609978n804810M155760
$$ 16465121 19521903 9053610 -2206509 -2217025 1853578 -1756400 -7561210 -3405450
36942c405450Q888659j846068j1340508m479986N924699K286719o624176j878764
$$ -3405450 5483209 3637141 -7703367 -12183353 -6258654 -3971935 -10596111 -12474875
$$ [...]
##END NTUPLES=NMR SPECTRUM
##END=
