##TITLE=31Pdec_SR149_EtAc H2O
 , 124 sc
 22.11.2022
##JCAMPDX= 6.0         $$ Bruker NMR JCAMP-DX V2.0
##DATA TYPE= NMR SPECTRUM
##DATA CLASS= NTUPLES
##ORIGIN= UXNMR, Bruker Analytische Messtechnik GmbH
##OWNER= root
$$ XWIN-NMR		Version 3.5
$$ Tue Nov 22 16:26:11 2022 Russian Standard Time (UT+4h)  she@DPX200
##.OBSERVE FREQUENCY= 81.013821
##.OBSERVE NUCLEUS= ^31P
##.ACQUISITION MODE= SIMULTANEOUS
##.ACQUISITION SCHEME= undefined
##.AVERAGES= 124
##.DIGITISER RES= 16
##SPECTROMETER/DATA SYSTEM= spect
##.PULSE SEQUENCE= zgpg30
##.SOLVENT NAME= CDCl3
##.SHIFT REFERENCE= (INTERNAL, CDCl3, 0, 248.564)
##AUDIT TRAIL= $$ (NUMBER, WHEN, WHO, WHERE, WHAT)
$$ ##TITLE= Audit trail, XWIN-NMR		Version 3.5
$$ ##JCAMPDX= 5.01
$$ ##ORIGIN= Bruker BioSpin GmbH
$$ ##OWNER= she
$$ F:/spectra/data/she/nmr/P31/1/pdata/1/auditp.txt
$$ ##AUDIT TRAIL=  $$ (NUMBER, WHEN, WHO, WHERE, WHAT)
(   1,<2022-11-22 16:22:28.64 +0400>,<she>,<DPX200>,
      <continue with go, POWCHK disabled, PULCHK disabled
       configuration hash MD5:
       00 E9 B6 7A A2 85 ED C7 34 08 36 98 17 FE 4E 26
       data hash MD5: 32K
       80 14 34 8E 2F CD E3 12 41 2A 1A B5 D1 B0 8D C8>)
(   2,<2022-11-22 16:24:59.03 +0400>,<she>,<DPX200>,
      <Start of raw data processing
       efp BC_mod = 2 LB = 1 FT_mod = 6 PKNL = 1 PHC0 = -10063.61 PHC1 = -488.944 SI = 64K 
       data hash MD5: 64K
       65 FD 1B 11 A2 93 A5 24 F9 6F E2 43 6A D3 94 CD>)
(   3,<2022-11-22 16:25:36.35 +0400>,<she>,<DPX200>,
      <pk PHC0 = -448.6945 PHC1 = 333.9997 
       data hash MD5: 64K
       5E A9 4D A7 84 CF DD 3B 40 1A E0 67 24 61 D5 73>)
(   4,<2022-11-22 16:25:39.59 +0400>,<she>,<DPX200>,
      <abs ABSG = 5 
       data hash MD5: 64K
       25 D3 21 3F 10 72 A4 5D 73 12 46 1E A2 6B D6 3A>)
$$ ##END=
$$ 
$$ hash MD5
$$ 68 F9 CF A4 B8 61 EB C8 48 45 03 92 AA 76 EB C0
##$RELAX= 
##$RELAX= 
##$RELAX= 
##$RELAX= 
##$RELAX= 
##$RELAX= 
##$RELAX= 
##$RELAX= 
##$RELAX= 
$$ Bruker specific parameters
$$ --------------------------
##$DU= <F:/spectra>
##$EXPNO= 1
##$NAME= <P31>
##$PROCNO= 1
##$TYPE= <nmr>
##$USER= <she>
##$AMP= (0..31)
100 100 100 100 100 100 100 100 100 100 100 100 100 100 100 100 100 100 
100 100 100 100 100 100 100 100 100 100 100 100 100 100 
##$AQSEQ= 0
##$AQ_mod= 1
##$AUNM= <au_zg>
##$AUTOPOS= <>
##$BF1= 81.014009
##$BF2= 200.13
##$BF3= 200.13
##$BF4= 200.13
##$BF5= 200.13
##$BF6= 200.13
##$BF7= 200.13
##$BF8= 200.13
##$BYTORDA= 1
##$CFDGTYP= 0
##$CFRGTYP= 5
##$CHEMSTR= <none>
##$CNST= (0..31)
1 1 145 1 1 1 1 1 1 1 1 1 1 1 1 1 1 1 1 1 1 1 1 1 1 1 1 1 1 1 1 1 
##$CPDPRG= <waltz16>
##$CPDPRG1= <>
##$CPDPRG2= <waltz16>
##$CPDPRG3= <>
##$CPDPRG4= <mlev>
##$CPDPRG5= <mlev>
##$CPDPRG6= <mlev>
##$CPDPRG7= <mlev>
##$CPDPRG8= <mlev>
##$CPDPRGB= <>
##$CPDPRGT= <>
##$D= (0..31)
0 1 0 0 0 0 0 0 0 0 0 0.03 2e-05 3e-06 0 0 0 0 0 0 0 0 0 0 0 0 0 0 0 0 
0 0 
##$DATE= 1669119577
##$DBL= (0..7)
120 120 120 11 120 120 24 19 
##$DBP= (0..7)
150 150 150 150 150 150 150 150 
##$DBP07= 0
##$DBPNAM0= <>
$$ [...]
##$SUBNAM3= <"">
##$SUBNAM4= <"">
##$SUBNAM5= <"">
##$SUBNAM6= <"">
##$SUBNAM7= <"">
##$SUBNAM8= <"">
##$SUBNAM9= <"">
##$SW= 501.771253377433
##$SWIBOX= (0..15)
0 1 3 0 0 0 0 0 0 0 0 0 0 0 0 0 
##$SW_h= 40650.406504065
##$TD= 32768
##$TD0= 1
##$TE= 0
##$TE2= 300
##$TE3= 300
##$TEG= 300
##$TL= (0..7)
0 120 53 12 22 120 120 120 
##$TP= (0..7)
150 150 150 150 150 150 150 150 
##$TP07= 0
##$TPNAME0= <>
##$TPNAME1= <>
##$TPNAME2= <>
##$TPNAME3= <>
##$TPNAME4= <>
##$TPNAME5= <>
##$TPNAME6= <>
##$TPNAME7= <>
##$TPOAL= (0..7)
0.5 0.5 0.5 0.5 0.5 0.5 0.5 0.5 
##$TPOFFS= (0..7)
0 0 0 0 0 0 0 0 
##$TUNHIN= 0
##$TUNHOUT= 0
##$TUNXOUT= 0
##$USERA1= <user>
##$USERA2= <user>
##$USERA3= <user>
##$USERA4= <user>
##$USERA5= <user>
##$V9= 5
##$VALIST= <valist>
##$VCLIST= <CCCCCCCCCCCCCCC>
##$VD= 0
##$VDLIST= <DDDDDDDDDDDDDDD>
##$VPLIST= <PPPPPPPPPPPPPPP>
##$VTLIST= <TTTTTTTTTTTTTTT>
##$WBST= 1024
##$WBSW= 4
##$XGAIN= (0..3)
0 0 0 0 
##$XL= 0
##$YL= 0
##$YMAX_a= 2409
##$YMIN_a= -14124
##$ZGOPTNS= <>
##$ZL1= 120
##$ZL2= 120
##$ZL3= 120
##$ZL4= 120
##$ABSF1= 248.5645
##$ABSF2= -253.2056
##$ABSG= 5
##$ABSL= 3
##$ALPHA= 0
##$AQORDER= 0
##$ASSFAC= 0
##$ASSFACI= 0
##$ASSFACX= 0
##$ASSWID= 0
##$AUNMP= <proc_1d>
##$AZFE= 0.1
##$AZFW= 0.5
##$BCFW= 0
##$BC_mod= 2
##$BYTORDP= 0
##$COROFFS= 0
##$CY= -3
##$DATMOD= 1
##$DC= 0
##$DFILT= <>
##$DTYPP= 0
##$F1P= 0
##$F2P= 0
##$FCOR= 1
##$FTSIZE= 65536
##$FT_mod= 6
##$GAMMA= 0
##$GB= 0
##$INTBC= 1
##$INTSCL= 6.047779e-11
##$ISEN= 30
##$LB= 1
##$LEV0= 0
##$LPBIN= 0
##$MAXI= 10000
##$MC2= 0
##$MEAN= 0
##$ME_mod= 0
##$MI= 50
##$NCOEF= 0
##$NC_proc= -7
##$NLEV= 6
##$NOISF1= 182.463
##$NOISF2= 159.3651
##$NSP= 0
##$NTH_PI= 0
##$NZP= 0
##$OFFSET= 248.5645
##$PC= 4
##$PHC0= -10512.3
##$PHC1= -154.9443
##$PH_mod= 1
##$PKNL= yes
##$PPARMOD= 0
##$PSCAL= 0
##$PSIGN= 0
##$REVERSE= no
##$SF= 81.0140089999694
##$SI= 65536
##$SIGF1= 159.3651
##$SIGF2= -187.1042
##$SINO= 113.3802
##$SIOLD= 16384
##$SREGLST= <1H.CDCl3>
##$SSB= 0
##$STSI= 65536
##$STSR= 0
##$SW_p= 40650.406504065
##$SYMM= 0
##$S_DEV= 0
##$TDeff= 32768
##$TDoff= 0
##$TI= <>
##$TILT= no
##$TM1= 0
##$TM2= 0
##$TOPLEV= 0
##$USERP1= <user>
##$USERP2= <user>
##$USERP3= <user>
##$USERP4= <user>
##$USERP5= <user>
##$WDW= 1
##$XDIM= 65536
##$YMAX_p= 332981783
##$YMIN_p= -23883792
$$ End of Bruker specific parameters
$$ ---------------------------------
##NTUPLES= NMR SPECTRUM
##VAR_NAME=  FREQUENCY,     SPECTRUM/REAL,   SPECTRUM/IMAG
##SYMBOL=    X,             R,               I
##VAR_TYPE=  INDEPENDENT,   DEPENDENT,       DEPENDENT
##VAR_FORM=  AFFN,          ASDF,            ASDF
##VAR_DIM=   65536,         65536,           65536
##UNITS=     HZ,            ARBITRARY UNITS, ARBITRARY UNITS
##FACTOR=    0.620285442955139, 1,           1
##FIRST=     20137.2065510682, 0,            0
##LAST=      -20513.1999529968, 0,           0
##MIN=       -20513.1999529968, -23883792,   0
##MAX=       20137.2065510682, 332981783,    0
$$ Real data points
##PAGE= N=1
##DATA TABLE= (X++(R..R)), XYDATA
$$ [...]
##PAGE= N=2
##DATA TABLE= (X++(I..I)), XYDATA
13019f178660l369342P46128K304537J790642J393843J646891K004254K063144
13011B401437J343937j47400r26239L94475K514407K471549n37639l986005m813651
13002a285129k316606J532108L875692L570811K223345J672060J060724j224200
12994I108805l461731k482212L76229N12288j706311m21848N350066P952843K417066
12985A7645195n145315o690675l657878j847394o55433L486550P406896N203469
12977A5745415p60942l199213k337973m181665p475416m507756M053229P444802
12969D780481J287883n520878n118297j434690o97963p73206K466848N809148
12961G99326M001319r21805l043245j357513R63738K334776K399038j57536m287839
$$ y = [-6178660, -9548002, -8801874, -6497337, -4706695, -3312852, -1665961, 338293, 2401437, 3745374, 3597974, 2671735, 3066210, 5580617, 8052166, 7514527, 3528522, -1285129, -3601735, -2069627, 1806065, 5376876, 7600221, 9272281, 10333005, 9108805, 5647074, 3164862, 3541091, 4053379, 2347068, 1925220, 7275286, 15228129, 17645195, 12499880, 5809205, 2151327, 303933, -351500, 3135050, 10541946, 15745415, 14984473, 11785260, 9447287, 5265622, -2209794, -6717550, -2664321, 4780481, 6068364, 547486, -4570811, -6005501, -6703464, -7476670, -5009822, 799326, 4800645, 3878840, 835595, -521918, 441820, 2776596, 5175634, 5018098, 730259]
12952G30259n062789m46555M469412M706302K243152P36795j121429m852229o279487
12943d876569j924781L198532K380607j844426k185205R67598J020456k619259
12935e883047l685153l05120K453407K399041L313137N959414N020420j069838
12927H202261n285782k347495K612822J963271k689533l609436Q77976M222010
12919C946094J552386l794708n284547j328012L646468M756206J596023k193532
12911B896378l240093j647487p4599n66269k788457m568473l567794N39326M771265
12902h246203N126045J368948k051240j502479J165690J705866m33679k040098
12894d907150j120583J120938K745533K676068M20168k869044l746277k70997
$$ y = [730259, -4332530, -4779085, -309673, 4396629, 6639781, 7376576, 6255147, 1402918, -4876569, -6801350, -3602818, -1222211, -3066637, -5251842, -4284244, -3263788, -5883047, -9568200, -9873320, -7419913, -5020872, -1707735, 4251679, 9272099, 8202261, 2916479, 568984, 3181806, 5145077, 2455544, -1153892, -275916, 3946094, 5498480, 1703772, -3580775, -4908787, -1262319, 3493887, 5089910, 2896378, -343715, -1991202, -2065801, -2632070, -5420527, -9989000, -13556794, -13017468, -8246203, -3120158, -1751210, -3802450, -5304929, -4139239, -2433373, -2867052, -4907150, -6027733, -4906795, -2161262, 514806, 934974, -1934070, -5680347, -5951344]
12886e951344M038438L905578j38668k286396j83556J813495J35029k133238o76003
12877a476665K472411J895133k344184m166722k99632M783926M743166o13229
12869D994204n599625n542843j250506K878149L491757J024508j152157l77671
12861a534184J992804J911913j678191m259702j563983L393802L604634j455471
12853D11622m308087q04217L068753P55742l743101j948345N027240P644282K743211
12844H847100k193306j502072Q33384k67028k437837j345211J389648J615502
12836D940180n50240k541095l771857l676152j70579M984936M855022k492670
12828A577545q129167m176350L658788M570520o73981k288183J892764M173021
$$ y = [-5951344, -1912906, 1992672, 1854004, -432392, -615948, 1197547, 1332576, -800662, -1476665, 995746, 2890879, 546695, -3620027, -3919659, 864267, 5607433, 4994204, -605421, -6148264, -7398770, -4520621, -1028864, -4356, -1156513, -1534184, 458620, 2370533, 692342, -3567360, -5131343, -1737541, 1867093, 411622, -3896465, -4700682, -1631929, -876187, -4619288, -6567633, -1540393, 6103889, 8847100, 6653794, 5151722, 5985106, 5718078, 3280241, 1935030, 3324678, 4940180, 4389940, 1848845, -1923012, -5599164, -5769743, -784807, 4070215, 1577545, -6551622, -10727972, -7069184, -2498664, -3172645, -5460828, -3568064, 604957]
12820F04957J253932j126738R2251J17893l262230m287379K21921L788806N60890
12811b035697m490099l249518K882327N827275L059682m23691q77509k9478m58222
12802B05070j687680j834815k39429K146035L507537K601087K78036j381888j784319
12793A809634j938208j882257o99543P61262O06753k64786Q99610L241117K594327
12784E127909j298566l214165n32428K472674J717177n68864q72921m92419j639283
12775F99114k045790P11977L202319P83052m316241n775990k319650J676400L226630
12766d158179K869219J145741j483132k357335K28286K700176O89044l329233
12758c695413l104289J487669M464299L587302K851453M087818L590320l33879
$$ y = [604957, 1858889, 732151, 824402, 942295, -2319935, -6607314, -6385393, -2596587, -2035697, -6525796, -9775314, -6892987, -1065712, 1993970, 1570279, 692770, 663292, 205070, -1482610, -3317425, -3556854, -1410819, 2096718, 4697805, 4975841, 3593953, 1809634, -128574, -2010831, -2710374, -1949112, -1342359, -1607145, -707535, 2533582, 5127909, 3829343, 615178, 82750, 2555424, 4272601, 3703737, 2830816, 2338397, 699114, -1346676, -634699, 2567620, 3350672, -965569, -6741559, -9061209, -7384809, -4158179, -1288960, -143219, -1626351, -3983686, -3755400, -1055224, -366180, -3695413, -6799702, -5312033, -847734, 2739568, 5591021, 9678839, 13269159, 12935280]
12750A2935280l258778j701247J284517J356269r89947l129978m685571n462320
12742c651775l266572K026863N794658M318603K18042j696750j190250j199397
12734A353422k221026k344730j078069O06536K445452L971847L445747P18200
12726F897379j264222q91050p80358k731421l558810o64108K146823N07800k362328
12717b700295q26871K578058P06382n130289n691066J366348P185642N528057
12709C015966J431930R97130J312547k222759n681820k647413L962848N249589
12701E418018l98193n522712m641923r5458L454286M322668K778848k08649k157632
12692B949253r86080J674094K409681R27438n75228j940734m359333n855882k903810
$$ y = [12935280, 9676502, 7975255, 9259772, 10616041, 9626094, 6496116, 1810545, -3651775, -6918347, -4891484, 903174, 5221777, 5439819, 3743069, 2552819, 1353422, -867604, -3212334, -4290403, -3683867, -1238415, 2733432, 6179179, 6897379, 5633157, 4742107, 3961749, 1230328, -2328482, -2992590, -845767, -337967, -2700295, -3527166, -949108, -242726, -5373015, -11064081, -9697733, -2512091, 3015966, 4447896, 5445026, 6757573, 4534814, -1147006, -3794419, 168429, 5418018, 5019825, -502887, -5144810, -5240268, -1785982, 2536686, 5315534, 5106885, 2949253, 1963173, 3637267, 6046948, 6974386, 6399158, 4458424, 99091, -5756791, -8660601]
12683h660601L100978O344510M640348J931303J399966J245684n03098j872295
12675G626795q23605N47251p90983l892251n178030l189902J37738J952449J239161
12666b371377J3768J287992M264904L662964k524454p254603k887602O042428
12658B34020P264049j089371o833535k232754M142171J718478m692010k875206
12650d364158O612855J0819881M054244m552241n575729j655537o31340l495118
12642A212857n132478l003780M69202K443891K319194M65694k443549m583142
12634h252111l757569l9545L408073L359768M41092j126266J346480N170746N484619
12625F035287J655353k293890l581175l383181k777404k03587M530983P446579
$$ y = [-8660601, -5559623, 784887, 5425235, 7356538, 8756504, 10002188, 9499090, 7626795, 6803190, 7350441, 6559458, 2667207, -2510823, -5700725, -5562987, -3610538, -2371377, -2357609, -1069617, 3195287, 6858251, 4333797, -2920806, -5808408, 234020, 7498069, 6408698, -424837, -2657591, 1484580, 3203058, -1488952, -4364158, 2248697, 13068578, 17122822, 12570581, 6994852, 5339315, 4707975, 1212857, -3919621, -6923401, -6454199, -4010308, -1691114, -1225420, -3668969, -8252111, -12009680, -12049225, -8641152, -5281384, -4840292, -5966558, -4620078, 550668, 6035287, 7690640, 5396750, 1815575, -1567606, -4345010, -4548597, -17614, 7428965]
12617G428965N247353N11673j607789j51065J496732Q40165j388342l100154k654184
12608F623354M3219K472622J418472k392463m221873j825533J254585J338162
12600D710545k31555o96378o07051j085091m85715J725170K045426q91713j818321
12591B665317K922963P038906K544197o691446r162179k432166L991159L234232
12583D110983o33037j266347R71479K354686K035353J209336L41018m0253Q07480
12574I890698J674492M33934k190349l489967l192714k869953j759560J662748
12566A59329M712198L093716j758006m130935k777689j769526k631098k584736
12558g686747j010863m52826n62357J558166M362354L137516r57306j682088J423796
$$ y = [7428965, 12676318, 13187991, 11580202, 11429137, 12925869, 13766034, 12377692, 9277538, 6623354, 6666573, 9139195, 10557667, 8165204, 3943331, 2117798, 3372383, 4710545, 4478990, 3782612, 3175561, 2090470, 1604755, 3329925, 5375351, 4483638, 2665317, 5588280, 12627186, 15171383, 8479937, -682242, -3114408, 876751, 4110983, 3477946, 2211599, 3183078, 5537764, 7573117, 8782453, 9123471, 9083218, 9890698, 11565190, 11999124, 9808775, 6318808, 3126094, 256141, -1503419, 159329, 4871527, 7965243, 6207237, 2076302, -701387, -2470913, -5102011, -7686747, -8697610, -9150436, -9712793, -8154627, -3792273, -654757, -1612063, -3294151, -1870355]
12549a870355K308958j3675L90966M172889M062701j433566l588047J309320M090667
12540I429858j884815q504349n919333J724856M375600J843143K95619j5545j935337
12531e90303k329232K265636O046183K149576m063075k658216L747943M265287
12523H833799j344014k790057J942209L034183l322559p631345k761641M905872
12515H66447O281642K103497j541555k534727j782270O45856L397724L345601
12507A0782215R21700J49861O05727l196022j0703980j2270876l347464O154864
12499a0903975M925515l333641n969034m8256N101244L082233j347681j136808
12491i630403L342342O783779O279705K814008j397922m132974l807080j309395
$$ y = [-1870355, 438603, 424928, 815894, 4988783, 9051484, 7617918, 4029871, 5339191, 9429858, 7545043, -959306, -6878639, -5153783, -778183, 1064960, 1360579, 1345034, -590303, -2919535, -653899, 5392284, 7541860, 3478785, 820569, 4568512, 8833799, 7489785, 4699728, 6641937, 9676120, 6353561, -1277784, -4039425, 866447, 7148089, 9251586, 7710031, 5175304, 3393034, 4038890, 7436614, 10782215, 11703915, 11853776, 12459503, 9263481, -1440499, -13711375, -17058839, -10903975, -5978460, -9312101, -15281135, -15329391, -10228147, -7145914, -8493595, -9630403, -6288061, 495718, 6775423, 9589431, 8191509, 4058535, 251455, -1057940]
12483a057940K72834l59383n94198J994318M908982L409222k275093o161021m310044
12474d172323R5295K079265J958467K908405M107483K272011j066790r37410J739544
12465H983947J47567o243794p914559M79708R589724P573590k411836o955892
12457C248455j997441L070469J242797k502370r53705M067844N515564J414775
12449A3106388l551627m497194j166761K554573K650394n03941k134008N02443
12441F960267L438533J441961l565523m807979q03714K670935J460877j833304
12433D962053l227554k697592j906577r17487M08193J038885O44735J52852l12901
12424a855393j096938p11925K360239N814048N780839K603457k94129k319248
$$ y = [-1057940, -785106, -1144489, -1738687, 255631, 5164613, 8573835, 6298742, 137721, -4172323, -4077028, -1997763, -39296, 2869109, 6976592, 9248603, 8181813, 7244403, 8983947, 9131514, 2887720, -5026839, -4547131, 5042593, 12616183, 10204347, 3248455, 1251014, 4321483, 5564280, 3061910, 2108205, 6176049, 11691613, 13106388, 9554761, 5057567, 3890806, 6445379, 9095773, 8591832, 6457824, 6960267, 10398800, 11840761, 8275238, 3467259, 2663545, 5334480, 6795357, 4962053, 1734499, -963093, -2869670, -3787157, -3378964, -2340079, -1695344, -1542492, -1855393, -2952331, -3664256, -1304017, 4510031, 10290870, 12894327, 12600198, 10280950]
12416A0280950m690401m869407J31716N288228K028071p316741j0044191j799283
12408a0991058O002168L541966l019628l158447J156779J256700k277774j925420
12400i414714K158459K381222k251145l894509J045672O524296O920753M032350
12392G502384J234167j801839n194761o100519l515506o60131N35767K384010
12384e616428N821538O866053K605677l324035n388728l279619p21829J39079
12376b898292m20350k022577l617131k565515J912466N909266N297372J870237
12368C465476Q56838K846759K926886j235010n135563l998293n1064Q36166k017227
12359a505032l398080n47172K520557J430358j536927r69831L026917M646921
$$ y = [10280950, 5590549, 721142, 852858, 6141086, 8169157, 852416, -9191775, -10991058, -4988890, -1446924, -4466552, -7624999, -6468220, -5211520, -7489294, -9414714, -7256255, -4875033, -7126178, -11020687, -9975015, -3450719, 3470034, 7502384, 8736551, 6934712, 1739951, -4360568, -7876074, -8536205, -8000438, -5616428, 205110, 7071163, 9676840, 6352805, 964077, -2315542, -3037371, -2898292, -3318642, -5341219, -8958350, -11523865, -9611399, -3702133, 1595239, 3465476, 4322314, 7169073, 10095959, 8860949, 3725386, -272907, -323971, 512195, -1505032, -4903112, -5450284, -2929727, -1499369, -3036296, -4006127, -979210, 3667711]
12351C667711J054042l398469l479216M4585K533913J826881n14155k405115k674949
12342c344772o72370K616857M149896K402184K09781P91184K129361l28691n578446
12333B374984o815588j019439N804951O245691J103766k614766j453936J142133
12325D767796J017131j239130k442321j638550n99258p30225j433195j390824
12317c688576k81070R74140J148183o6539j468937j342316M31508J685271L69410
12308b238926k427632l125730J5398M188940M885206J158680l190526m004875
12300d739465j339539J161201R94609k60863O21576L741213N219238K015200l451472
12291C961698n452653j867193L104729M231967J489146q46389j65612J756765
$$ y = [3667711, 4721753, 1323284, -2155932, -2111347, 422566, 2249447, 1735292, -669823, -3344772, -4017142, -1400285, 2749611, 5151795, 5361576, 6152760, 8282121, 7953430, 2374984, -4440604, -5460043, 344908, 6590599, 7694365, 5079599, 3625663, 4767796, 5784927, 4545797, 2103476, 464926, -134332, -864557, -2297752, -3688576, -3969646, -2995506, -1847323, -1913862, -3382799, -4725115, -4293607, -2608336, -2238926, -4666558, -7792288, -7776890, -3587950, 1297256, 2455936, -734590, -4739465, -6079004, -4917803, -3923194, -4184057, -3562481, 178732, 5397970, 7413170, 3961698, -1490955, -3358148, -253419, 3978548, 5467694, 4621305, 4455693, 6212458]
12283F212458J832739o28470l690395m843064k970766O18378L064762K871128
12275B466770J603760J404344J545344l18822l721268n089450k772616K59084
12267d622854M83900j330255j544698J127919M039876M179514J677785p68318
12259C242869j139423o9100M56795j44315n57134n3444P4541j033485j378354
12250f01050J246463M723110M027079j934776p737814p484494j647552L830575
12242e578459M098767k60240m467021m129972N59135M764385M230966M07614j649373
12233b024198k37417J407068J081371R20716K458126K630126j221917n547839
12225e33964m916561l37914K250578J115536M33236K188782K513423j210485m861604
$$ y = [6212458, 8045197, 7416727, 3726332, -1116732, -4087498, -3469120, -404358, 2466770, 4070530, 5474874, 7020218, 6701396, 2980128, -2109322, -4881938, -4622854, -4138954, -5469209, -7013907, -5885988, -1846112, 2333402, 4011187, 3242869, 2103446, 2034346, 2491141, 2346826, 1789692, 1736248, 1810789, 777304, -601050, 645413, 5368523, 9395602, 7460826, -276988, -7761482, -9409034, -5578459, -1479692, -1739932, -6206953, -10336925, -9777790, -5013405, -782439, -374825, -2024198, -2261615, -854547, 226824, 1147540, 3605666, 6235792, 5013875, -533964, -5450525, -5788439, -3537861, -2422325, -1989089, 199693, 2713116, 1502631, -3358973]
12216c358973l484169R44388K582861M42028j136651M4494J342875Q01037M59537
12207a362573J957054K946938J259993n10121J038982L508413J400992m600539
12199E639139o783523j200126N554684M753213k329641o223068k376163L266314
12191C00829L327407j183299l572346j133161K122980J863961j081454k838634
12183b193717j892335l72861l77177q63927N13004L095603K951350j736016o650871
12174g526947n544477J614563P670501O719682J043093k498194j145534J574117
12166A906804J658036n40334k134119j990643j371164j276162j042539Q6914J146169
12157c557038L01603k365703l856879j220504M347349P666694M984926j408100
$$ y = [-3358973, -6843142, -5898754, -3315893, -2873865, -4010516, -3966022, -2623147, -1822110, -1362573, 594481, 3541419, 4801412, 4291291, 5330273, 8838686, 10239678, 5639139, -1144384, -2344510, 3210174, 7963387, 5633746, -589322, -2965485, 300829, 3628236, 2444937, -1127409, -2260570, -137590, 1726371, 644917, -2193717, -4086052, -4458913, -4836090, -5700017, -5187013, -2091410, 859940, -876076, -7526947, -13071424, -11456861, -3786360, 2933322, 3976415, 1478221, 332687, 1906804, 3564840, 3024506, 890387, -1100256, -2471420, -3747582, -4790121, -4703207, -3557038, -3255435, -5621138, -9478017, -10698521, -6351172, 1315522, 6300448, 4892348]
12149D892348n458747m185361n37379J190866Q85434J615740M200941N624906
12141H228748L426413p62199l525178l734036k546575q77665Q01092J146187q34001
12132A322786l441621l698739j232788J465858K574379K238603O12125k142012
12124b301409l736734j572735K411885K986651n83141k661112J05051L222836
12116b128708J797302j070748M90416M698756M427561j005830m025621j45486
12108C037642N460714N637685N20132m354731n687090m520930k743986q53314
12100c503878J098502K235870J100503k531712n803099m465165J636768O575881
12092c656330N051590l44064k703007o42498P34771j071392j996960J192298M972188
$$ y = [4892348, -566399, -4751760, -5289139, -4098273, -3212839, -1597099, 2603842, 8228748, 11655161, 10892962, 7367784, 3633748, 1087173, 209508, 1010600, 2156787, 1322786, -2118835, -5817574, -7050362, -5584504, -3010125, -771522, -159397, -2301409, -6038143, -7610878, -5198993, -2212342, -2795483, -5456595, -5351544, -2128708, -331406, -1402154, -911738, 3787018, 8214579, 7208749, 3183128, 3037642, 8498356, 14136041, 14656173, 10301442, 4614352, 93422, -2650564, -3503878, -2405376, -169506, 930997, -1600715, -7403814, -11868979, -10232211, -3656330, 1395260, 1051196, -1651811, -2294309, -1559538, -2630930, -4627890, -3435592, 1536596]
12083A536596M352693K38325k694674k844286k182815j532583L32709K959517
12075A65482L249034l61244m699364m814617j12932M094970K799299j837774l009741
12066d526887R14454L779167J512054q41526K363455O605545L579745m314151
12058I071856o412507p88351K631674j153970m062622L33921M878126J064038
12050E562165n491403l643320M672740P217812P04548n205092l819745J19857
12042A17562P64761j11036O75210J018801j237175k708057k50924K372672m4640
12033E97174n197240o052631j022150M321117N220505K526580o09121k387220
12025b602986j975578N91521K931671K121839p96058j591496M37583P58018k613959
$$ y = [1536596, 5889289, 6127614, 3432940, 588654, -1594161, -3126744, -2794035, 165482, 3414516, 3053272, -1646092, -6460709, -6573641, -2478671, 320628, -1517146, -4526887, -3612433, 166734, 1678788, 837262, 3200717, 9806262, 13386007, 9071856, 2659349, 1870998, 4502672, 3348702, -713920, -379999, 4498127, 5562165, 70762, -3572558, 1100182, 8317994, 9022542, 3817450, -2295, 117562, 882323, 771287, 1446497, 2465298, 1228123, -1479934, -1730858, 641814, 597174, -4600066, -10652697, -11674847, -7353730, -2133225, 393355, -215766, -2602986, -4578564, -3987043, -1055372, 1066467, 270409, -1321087, -883504, -125486, -2739445]
12016b739445m256631N65759O563166M617651l906793p724037k118352M025806
12008d972876K243915k776336k109374K274487J573372l973788m759923K258811
12000a0241712Q103951N543755p45083k780982p60730J78930o64372j77351J579347
11991C5753J278434j722293m054555k978326N98860L639126L783666J164443j698738
11982D6370k673507k499395k672339j886316J801430N888302N465978Q11724k372165
11973A910082j443292Q7478l59532l75845J681782K874282J140236q72139r77030
11964C666022j008816j726452k47999L350814L526901j503376m839051j482480
11956b64437K919394J535486j946685m29597L206836Q96227n653703o607020r9419
$$ y = [-2739445, -6996076, -6430317, 132849, 4750500, 843707, -6880330, -8998682, -4972876, -2728961, -5505297, -7614671, -5340184, -3766812, -7740600, -12500523, -10241712, -2137761, 3405994, 2660911, -120071, -880801, -701871, -1366243, -1543594, 35753, 1314187, -408106, -4462661, -7440987, -6842127, -3203001, 580665, 1745108, 46370, -2627137, -5126532, -7798871, -9685187, -7883757, -1995455, 3470523, 4282247, 1910082, 466790, 554268, 194736, -181109, 1500673, 4374955, 5515191, 4643052, 3666022, 2657206, 930754, 682755, 4033569, 7560470, 6057094, 1218043, -264437, 2654957, 4190443, 2243758, 1814161, 5020997, 5917224, 263521, -6343499, -6442918]
11947f442918M511908J288645m053416l878932R38479M262245L199040k8262j588587
11938a791798L59852L598171L800142O38978o76253K516549M662458J57042o667472
11929F597669p403730k533398L73465l96772M08173L395670K572901k947053n521093
11920e454168j162162L778680K995420l87144l38418K500005L589256K046123
11912G567592L5599j687988l049783k661396m27010Q76144j37026q48248O71212
11903C39096J856026r0343l288722m008931j847429R11779K702938K871212J015900
11894D61526j393228j346766J359317K804042M57878k728984k623667J02891J498565
11885a408426K60130r79174K26483K996835M282492K260612j452855l235563j679061
$$ y = [-6442918, -1931010, -642365, -4695781, -8574713, -7636234, -3373989, -174949, -203211, -1791798, -1431946, 2166225, 5966367, 6605345, 5929092, 8445641, 13108099, 13265141, 6597669, -806061, -3339459, -2965994, -3362766, -2954593, 441077, 3013978, 66925, -5454168, -6616330, -2837650, 157770, -229374, -567792, 1932213, 5521469, 7567592, 7603191, 5915203, 2865420, 204024, -222986, 653158, 516132, -332116, 339096, 2195122, 2104779, -1183943, -5192874, -7040303, -6128524, -3425586, -554374, 461526, -931702, -2278468, -919151, 1884891, 2342769, -386215, -3009882, -2906991, -1408426, -1148296, -2127470, -1900987, 1095848, 5378340, 7638952, 6186097, 2950534, 1271473]
11876A271473O19203P33180o99676j348039j064248r30562l22772J390362K039200
11867A688121j38489k269724q79562J505928k20111m811366n887782j887877K172639
11858a0728223L336804L883408M769802L374307j58005j512560K72344Q35560
11850D073437j177292j106996K781591M707878O37382m333700l523443J594964
11842C653821M747731L658670M62255k671610l686362n03953M639469M911631
11834A5211652k117455r151655q085758p70607M432248L801978N83675j428379
11826B475699j398423j9723J206553N14633j410232j411013J066195K224461K9265
11817C277415k017668p57551J309217Q84569k33395Q50376K170672N88515j862849
$$ y = [1271473, 1890676, 2623856, 1924180, 576141, -488107, -1418669, -1741441, -351079, 1688121, 1549632, -720092, -1599654, -93726, -313837, -5125203, -11012985, -12900862, -10728223, -7391419, -3508011, 1261791, 4636098, 4478093, 2965533, 3237877, 4073437, 2896145, 1789149, 4570740, 9278618, 9916000, 5582300, 2058857, 3653821, 8401552, 12060222, 12522477, 9850867, 6164505, 5660552, 10300021, 15211652, 13094197, 3942542, -4143216, -4913823, -481575, 3320403, 3904078, 2475699, 1077276, 1057553, 2264106, 2778739, 1368507, -42506, 1023689, 3248150, 3277415, 1259747, 502196, 1811413, 2695982, 2462587, 3312963, 5483635, 6072150, 4209301]
11808D209301j268144J082460P72080k492393n150297n533441m213253o62128
11800a3255815M889417Q062940M792843j771622m517074j953161R41877J066441
11792a744154M98951P81910l34816m046842o556977l338708M239721R148387O032773
11783D680245k402324p596854m667902J888162M598588L121209K858018M517524
11775F996666K660997l629392o931239k850147K252523J225048k556213j556883
11767d388640L200269M570222J441606m12008J431334K979870J285851j603340
11759H505164k851306j930853O00016L157202K723399j448678n124157m353194
11751g22407j377745m85728o22096J833772N183950M402245R835k159428j34185
$$ y = [4209301, 2941157, 4023617, 4795697, 2303304, -2846993, -8380434, -12593687, -13255815, -8366398, -303458, 4489385, 2717763, -1799311, -3752472, -2810595, -1744154, -1245203, -463293, -798109, -4844951, -11401928, -14740636, -10500915, -1352528, 4680245, 2277921, -5318933, -9986835, -8098673, -3500085, -378876, 2479142, 6996666, 9657663, 6028271, -902968, -3753115, -1500592, -275544, -2831757, -4388640, -1188371, 3381851, 4823457, 4411449, 5842783, 8822653, 10108504, 8505164, 5653858, 3723005, 4323021, 7480223, 10203622, 8754944, 3630787, -722407, -2100152, -2585880, -3207976, -1374204, 3809746, 8211991, 8221826, 6062398, 5928213]
11742E928213J837441P41264j387002k079221j576428l81208J609682K747684
11734G440425P58610l106276m853798k972399L59210K667703K609724l78227m177532
11725a652560m100870O41998L498823q21568p253221o712029P72639O823117P027889
11716a775782M505474K095698n99316k353598p57019J869878Q28582k298998j579210
11707f4291K332317K545700j422437j634013M397111P983145K745863n024090
11699A1859305o123832j516911J364982N6240k071825k643726j923956j30761
11691a130484K204838L216047K182786O44883p78985k982597m312321j150408
11683b106241N079287P333980K779075k573358l032444j139468j515585k537715
$$ y = [5928213, 7765654, 8506918, 7119916, 5040695, 3464267, 3083059, 4692741, 7440425, 8199035, 5092759, 238961, -2733438, -2374228, 293475, 2903199, 2524972, -1652560, -5753430, -5111432, -1612609, -2434177, -9687398, -16399427, -15626788, -8803671, -1775782, 2729692, 4825390, 4226074, 1872476, 1115457, 2985335, 3813917, 1514919, -64291, 2268026, 4813726, 3391289, 1757276, 6154387, 14137532, 16883395, 11859305, 5735473, 4218562, 5583544, 5639784, 3567959, 924233, -999723, -1130484, 1074354, 4290401, 6473187, 7118070, 6339085, 3356488, -955833, -2106241, 2973046, 10307026, 13086101, 10512743, 7480299, 6340831, 4825246, 2287531]
11675B287531l64663L206027L507758N29093k292609m047418n431269m585193
11667g190743J4654M526132L850500l14555j464288K019278M728776K326924k947044
11658E549634o030514m784026q49987K680759L499627J547812j246374l161550
11650b794619l755478k489545J275814N548629N872351Q55571m682398n051890
11642e221565o26763L272392L077720j8781k599863k175740J246417M745473M620763
11633F320053N87849l299558l231694K98300M012626N350165L346500j309587
11625A2074654n408143n108752p64830K649450J936094k97778l32348R89745M72242
11616F210334j944280l370722k174260P99438L763383M451251J030442m813647
$$ y = [2287531, 1922868, 5128895, 8636653, 9165746, 6873137, 2825719, -2605550, -7190743, -7176089, -2649957, 1200543, 885988, -578300, 1440978, 6169754, 8496678, 5549634, -480880, -5264906, -6114893, -3434134, 65493, 1613305, 366931, -2794619, -6550097, -9039642, -7763828, -2215199, 3657152, 4512723, -169675, -5221565, -5848328, -2575936, 501784, 483003, -2116860, -4292600, -3046183, 1699290, 6320053, 6907902, 3608344, 376650, 674950, 4687576, 10037741, 13384241, 12074654, 6666511, 1557759, 792929, 3442379, 5378473, 5080695, 4748347, 5738092, 6210334, 4266054, 895332, -1278928, -479490, 3283893, 7735144, 8765586, 3951939]
11608C951939p700820m435211J527652M279490K522220l87812j758974j599369
11600c600885m44410J378404K473942J193071j895524m116335l460931k83611
11592h756279L334098N096088M090775J604160k81563r19147q49833L3458J916829
11583E268586L123062J600832j639835l490489l030275j708847J39588K811570
11575C074192L824315L60952m607504m666263M20404L740347J727188j085577
11567B788054n79614N97219p59123k205941n50306K330784L219628K343129O01749
11558G785579k554512m916186j871493M775461O085696m57644n236964j455222
11550B154715L381573M65385m787260k575981L313170K109264m220533l990424
$$ y = [3951939, -3748881, -8184092, -6656440, -2376950, 145270, -242542, -2001516, -3600885, -4045295, -2666891, -192949, 1000122, -895402, -5011737, -8472668, -8756279, -5422181, -326093, 3764682, 5368842, 5087279, 4168132, 3318299, 3351757, 5268586, 8391648, 9992480, 8352645, 4862156, 1831881, 123034, 262622, 3074192, 6898507, 7259459, 2651955, -2014308, -1593904, 2146443, 3873631, 2788054, 2208440, 2805659, 2046536, -159405, -709711, 1621073, 4840701, 7183830, 7785579, 5231067, 314881, -1556612, 3218849, 9304545, 8846901, 3609937, 2154715, 5536288, 6001673, 1214413, -1361568, 1951602, 4060866, -159667, -4150091]
11542d150091L365543O078754P08603k320704K238135N264305j33862o224867
11534D825816l773995L006072M433861M93376j773643n71779J91709n46787j68719
11525F115911J406164J132004j824240m459572l624802O83667M842323M147792
11517H419247j604768n674282k019130N145731N898944r02489n788923l419671
11509E4659n9300j849903m580875k088576K629166L063998L44870L586J816482
11500f65893J743679Q51835L056652N768812K364882n809924q917941k344503
11492c952401O312492P250731L07464o448358o540541q56509M415006M178967
11484D666851j81915k335743O31904L722043J319831l631840l501007K049941
$$ y = [-4150091, -784548, 5294206, 6002809, 3682105, 5920240, 11184545, 11050683, 4825816, 1051821, 4057893, 8491754, 8985130, 7211487, 6639708, 6831417, 6284630, 6115911, 7522075, 8654079, 6829839, 2370267, -1254535, -570868, 4271455, 8419247, 6814479, 1140197, -878933, 4266798, 10165742, 9263253, 3474330, 54659, -4641, -1854544, -6435419, -8523995, -5894829, -2830831, -2485961, -2482375, -665893, 1077786, 1929621, 4986273, 10755085, 13119967, 7310043, -1607898, -3952401, 2360091, 9610822, 9918286, 3469928, -3070613, -3927122, 487884, 4666851, 4484936, 2149193, 2781097, 6503140, 7822971, 4191131, 690124, 2740065]
11476B740065M891728N77116m923414m091686J611352M789782K614758p28821
11468G480880j149640J70840l25755l112013m809432k503604K218910M479393
11460B449579J684454l179672n118502l095796l33881Q75428J645295K960072
11452b113023K822942n29796m473600m378154J02787M149957M021024J550012
11444A152149O19384J319620P03809j552386k150671K50942K179099N63851k125966
11435I59831j571165J522759K603677N15415j248184r81159j507850m518552o486961
11426a0712189l488134K762232O997501O734051L734892P29080o02192L69432
11418F524673K515903L016915M18123l045728m180043l048022k289651k822282
$$ y = [2740065, 7631793, 8208909, 3285495, -806191, 805161, 5594943, 8209701, 7480880, 6331240, 6502080, 6176325, 3064312, -1745120, -4248724, -2029814, 2449579, 4134033, 954361, -4164141, -7259937, -7593818, -6718390, -5073095, -2113023, 709919, 180123, -4293477, -8671631, -8568844, -4418887, -397863, 1152149, 1771533, 3091153, 3794962, 2242576, 91905, 342847, 2521946, 3085797, 959831, -611334, 911425, 3515102, 4030517, 2782333, 1801174, 293324, -4225228, -10712189, -14200323, -11438091, -4440590, 2293461, 6028353, 6757433, 6155241, 6524673, 9040576, 12057491, 12475614, 9429886, 5249843, 2201821, -87830, -2910112]
11410b910112k574410K51099M323068O278838M214482j23534k926531k555565
11402C977335j298357j604456k117154m14196J626383O958l770952l154462L365387
11393c383514Q514066O316268N84204j645248m83799p81677k882580k946939o46515
11384B644266N96569L78155J433241K906289N06330n254494p622794l173916K636299
11375d950055L047941q90800k591690J078331O344568P199361J845832n052381
11367F031107o567359j101092N247640N981434K087421q21349j257158k471404
11359G129240n182359n927926l399824m66740J456140M125210O865547N679433
11351A0278721O68655k104091J35049K047952p94580m253359k883154O50653N16891
$$ y = [-2910112, -5484522, -5233423, -910355, 5368483, 9582965, 9459431, 6532900, 3977335, 2678978, 1074522, -1042632, -1456828, 169555, 176513, -3594439, -6748901, -3383514, 5130552, 11446820, 12031024, 10385776, 9901977, 9120300, 6237720, 3290781, 2644266, 3240835, 3618990, 5052231, 7958520, 8464850, 3210356, -4412438, -7586354, -4950055, -1902114, -2792914, -5384604, -4306273, 2038295, 9237656, 11083488, 6031107, -536252, -1637344, 3610296, 9591730, 11679151, 10857802, 9600644, 7129240, 1946881, -3981045, -7380869, -7847609, -6391469, -2266259, 4599288, 10278721, 10947376, 8843285, 8978334, 11026286, 10231706, 5978347, 3095193, 3745846, 4262737]
11342D262737k210791k189319N26076J483968N08933J100665K224343n17598n146499
11333D2515l852869M295439R661679N325045l074445o226676m035238k913048
11325g77598m230010l240555J511008M899988K919167j431106k590332L17181
11317b622257L360043L205396J75676l377457n447729m833916j210957L784187
11309f967014O451509M018420j856395o088696n523832k037692O70699J781827
11301i551174K920069M189142L546839M68351k286694j933072P44005K482490
11293E79956J598523k57540m19906J422921K695680J001867k628947m589225l165263
11284c761934q75065j078410l164595l063633J294973O699920P859143L365153
$$ y = [4262737, 2051946, -137373, 388703, 1872671, 2381604, 3482269, 5706612, 5189014, 42515, -3810354, 485085, 10146764, 15471809, 12397364, 6170688, 2135450, -777598, -5007608, -8248163, -6737155, -1837167, 1082000, -349106, -2939438, -2622257, 737786, 3943182, 4118858, 741401, -4706328, -9540244, -10751201, -6967014, -515505, 3502915, 1646520, -4442176, -9966008, -12003700, -11333001, -9551174, -6631105, -2441963, 1104876, 1573227, -713467, -2646539, -1902534, 579956, 2178479, 1920939, 1501033, 2923954, 5619634, 6621501, 3992554, -596671, -3761934, -4636999, -5715409, -8880004, -11943637, -10648664, -3948744, 3910399, 7275552]
11276G275552k402789l742513J29432M129133L336654j021161l508370j846377
11268B349561O56128P04642l72113J69272J488920O58276k385597m628859m096866
11259e456636j582521J207602L026818L266468K675435K889474L551427J827884
11251A1405951k855328o099003m107974K37673J332756q06333j272271J535879
11243f28650L903315L012611K6565l247085n679482m808945O76026O089057M965742
11234D309154q20069k476570K169813M812372K36440m691334j936819M992968
11226F595955P160852L516733m41205l059707o350835q262955m873876P73363
11218d941675J497541k280042k902927J441885L631530J71145k691808q604L341652
$$ y = [7275552, 4872763, 1130250, 1259682, 5388815, 8725469, 7704308, 4195938, 2349561, 3005689, 3710331, 3338218, 3507490, 4996410, 5654686, 3269089, -1359770, -5456636, -7039157, -5831555, -2804737, 461731, 3137166, 6026640, 9578067, 11405951, 8550623, 2451620, -1656354, -1418681, -85925, -892258, -2164529, -628650, 3274665, 6287276, 6313841, 3066756, -2612726, -7421671, -6745645, -656588, 4309154, 3489085, 1012515, 3182328, 7994700, 8231140, 3539806, 1602987, 6595955, 13756807, 17273540, 16832335, 13772628, 7421793, -841162, -5715038, -4941675, -3444134, -5724176, -8627103, -7185218, -3553688, -3382543, -6074351, -6082955, -2741303]
11209b741303J534956j916445n27823L658970L482387j278142l653583m90361
11201a931344L805604M913096L275677P6527m947133r406756q055117m80790N739108
11192g011128M236426j243920k353194J767164M047555Q35850k743667j090281
11184c555195L442532M696384K091392N94565K183029K666350j367875o465094
11176D286088o432266p94955M215389L284736j749658m495788j709567L230422
11168a65599M821048K014925j314218k047993j356075j319814p32165K532774
11160B432883O385280N982554P09427m229356m612909k110913l81609L28595J590676
11151F094628K465237P66442k526240l911204k270091k695R05870J100987J554942
$$ y = [-2741303, -1206347, -3122792, -3650615, 8355, 3490742, 2212600, -1440983, -1931344, 1874260, 6787356, 10063033, 10139560, 5192427, -4214329, -12269446, -12750236, -7011128, -2774702, -4018622, -6371816, -4604652, -557097, 278753, -2464914, -3555195, -112663, 4583721, 6675113, 7269678, 9452707, 12119057, 10751182, 4286088, -2146178, -2941133, 1274256, 4558992, 2809334, -1686454, -3396021, -165599, 4655449, 6670374, 5356156, 3308163, 1952088, 632274, -99891, 2432883, 8818163, 14800717, 15510144, 11280788, 6667879, 4556966, 4175357, 4503952, 6094628, 8559865, 9326307, 6800067, 2888863, 618772, 616077, 1521947, 2622934, 4177876]
11142D177876J573329K85687j490361k018878n43329J965333L285755J416563
11134H651975l163664o742768n479914M6406M544099L366710k179211n941255
11126f897622l771823J514293L427699Q2787l092232o35715N169618P306868L724193
11117F828066n85760j569324r85772j266663p57544J936662L221744l59725n036960
11108A424724m074538J893787N037698J394647m008027m963402j986668O42396
11100d639383J788532L258424M784511L633154o80677m596182m686959j692101
11092b830681J092665K109088K250843J991813N81104j328992j364861L60069
11084B861048o7648m101689o299346j453847O007462O789615M10450l985040j810845
$$ y = [4177876, 5751205, 6036892, 4546531, 2527653, 1984324, 3949657, 7235412, 8651975, 5488311, -1254457, -6734371, -6687965, -2143866, 1222844, -956367, -6897622, -10669445, -9155152, -5727453, -5644666, -8736898, -9372613, -4202995, 3103873, 6828066, 6242306, 4672982, 3687210, 2420547, 1663003, 3599665, 6821409, 6461684, 1424724, -2649814, -756027, 4281671, 5676318, 1668291, -3295111, -5281779, -4639383, -2850851, 407573, 5192084, 8825238, 8144561, 3548379, -1138580, -2830681, -1738016, 371072, 2621915, 4613728, 5194832, 3865840, 2500979, 2861048, 2793400, -1308289, -7607635, -9061482, -3054020, 3735595, 4146045, 161005, -1649840]
11075a649840R15654o93325j950842J620894M479612J74544o038811m408256L296690
11066d253680O185564J156752l606023k506655M50046O82783o2554Q62002K120697
11057A028932K255079K246862J674345j613391n789784n464465l33630L036082
11049b959970R40343k324816k214206m05951J84552O84595K347525L021005J813911
11040A086988J843923M012984L695884j431552n765761l661170J857987M177011
11032E816294K559939M63467j543271m480038n817177k628475K166258L150324
11024c12679M91228j170452l71282M48142N22517J204093J738791K75453j514817
11015A310994k78355L000152M072090K116861J44080q21012k360428l623311j691152
$$ y = [-1649840, -734186, -1427511, -3378353, -1757459, 2722153, 2896697, -3142114, -7550370, -4253680, 1931884, 3088636, -517387, -3024042, -2573996, -1891213, -1953767, -1091765, 1028932, 3284011, 5530873, 7205218, 5591827, -197957, -5662422, -5996052, -2959970, -2019627, -4344443, -6558649, -6964600, -6780048, -6095453, -3747928, -726923, 1086988, 2930911, 6943895, 10639779, 9208227, 3442466, -218704, 1639283, 5816294, 8376233, 8839700, 7296429, 2816391, -3000786, -5629261, -3463003, -312679, 178549, -991903, -1363185, -915043, -392526, 811567, 2550358, 2825811, 1310994, 1032639, 4032791, 8104881, 10221742, 10365822, 9544810, 7184382, 3561071, 1869919]
11006A869919K328240L510811P86022j358005p32510j072119m621184o604403
10998e893229j998959N812711Q617285M064832k025144l793631j587854P97008
10990C993019J645283J862653J860879P02815j560167k875669j763206L60228
10982D225835J080085M22985K40681M55592j168658m581538n757373j861448L812702
10973c131137N139151R18478l399057k376664K891562O209967L581868k284658
10965G549510n454057l896775j220083r30388j706543n69720J677086J884276
10957b666694Q8549o75359L32131Q88037M92728R72775J841625K31844l237111
10948a731475l946034p62489J431576l31634k063810L17567M023996M134630J260308
$$ y = [1869919, 4198159, 7708970, 8494992, 7136987, 6404477, 5332358, 711174, -5893229, -7892188, -2079477, 6537808, 10602640, 8577496, 4783865, 3196011, 3993019, 5638302, 7500955, 9361834, 10064649, 8504482, 5628813, 3865607, 4225835, 5305920, 5728905, 5969586, 6425178, 5256520, 674982, -5082391, -6943839, -3131137, 2008014, 2926492, -472565, -2849229, 42333, 6252300, 9834168, 7549510, 2095453, -1801322, -3021405, -3951793, -5658336, -6228056, -4550970, -2666694, -2578145, -3253504, -2921373, -2033336, -1540608, -567833, 1273792, 1505636, -1731475, -5677509, -6439998, -5008422, -5340056, -7403866, -7086299, -3062303, 1072327, 2332635]
10939B332635o74474j017998j534694j676758j4001J636474N85992j735681j823419
10930c921924J85597J154568R5416j245902j633757o93560K076084N145717M449041
10921E611280p96923m690484k069769L485234M840354J858491j1592L10337j085069
10912G451859m207182l936980Q34034M285045K503209j112935k282590j893786
10904A640674k074983j462935J136527K457372p27383n242129m721153J529789
10896g464221P164199O791437K066124j598812k079130j821637k755577l096807
10888b794424j009078J035489o28072m242002m007348J026046M739555L145039
10880b734795M22220J470459L439791R89797l557373l005318L036763O911309
$$ y = [2332635, 1658161, 640163, -894531, -2571289, -2585290, -948816, -362824, -2098505, -3921924, -3736327, -2581759, -2486343, -3732245, -5366002, -6059562, -3983478, 1162239, 5611280, 4814357, 123873, -1945896, 1539338, 6379692, 8238183, 8226591, 8536928, 7451859, 3244677, -692303, 141731, 4426776, 6929985, 5817050, 3534460, 1640674, -434309, -1897244, -760717, 1696655, 969272, -4272857, -8994010, -7464221, -300022, 6491415, 8557539, 6958727, 4879597, 3057960, 302383, -2794424, -3803502, -2768013, -3396085, -7638087, -11645435, -10619389, -5879834, -2734795, -2312575, -842116, 2597675, 3587472, 30099, -2975219, 61544, 6972853]
10872F972853M009236j656536m677242m993352m699321l219778N20193M330813
10864c413134M901908K299382k22411j93331J733310K842631J088411k674593
10856F362173n188786m256646j206782J081231J738412K073197K943700L492947
10848G039446K186751j534597n811129o760887k617182K561228K943543o90017
10840b682844j478181K830218N658338J903783l455239k952309J900524L788409
10832E512699R39919k091649k838955k727179j784999J131486L417857J220339
10824B779518l078417k913375K161895N026900J492268l832937m536054m56060
10816c356262L633137L891808K72346l925897m752943j877711P18821M23638k68853
$$ y = [6972853, 10982089, 9325553, 4648311, -345041, -5044362, -8264140, -7743947, -3413134, 1488774, 3788156, 3565745, 3372414, 5105724, 7948355, 9036766, 6362173, 1173387, -3083259, -4290041, -3208810, -1470398, 602799, 3546499, 7039446, 9226197, 7691600, 1880471, -4880416, -7497598, -4936370, -1992827, -2682844, -4161025, -1330807, 4327531, 6231314, 2776075, -176234, 1724290, 5512699, 6452618, 4360969, 1522014, -1205165, -2990164, -1858678, 1559179, 2779518, -298899, -3212274, -1050379, 3976521, 5468789, 1635852, -2900202, -3356262, 276875, 4168683, 4441029, 515132, -4237811, -6115522, -5396701, -4973063, -5241916]
10807e241916J057998J771912l29179q21442M478397R784247N977332m391604
10799A2285745r002676l395922L392965L228908p32270k173822j596802k478164
10791d72038l827409k602611N07026K641986L261240L474683L357779K537782
10783H878438J256309o11025l125928m354620k082544K160312M230370K672616
10775I023928m57060l313395m807316k849453K776432O997627M738567j328120
10767A0781210m359905l377983k859079l681224k575586k1348k5003j876745q98800
10758h894463K257345K295672l07867L09879L672966K789333k382178l369617
10750c628930J583006L467781j229659l358850K422575O739795J019509p178528
$$ y = [-5241916, -4183918, -2412006, -2741185, -3562627, 915770, 10700017, 16677349, 12285745, 3283069, -112853, 3280112, 6509020, 5776750, 3602928, 2006126, -472038, -4299447, -6902058, -6395032, -3753046, -491806, 2982877, 6340656, 8878438, 10134747, 9523722, 6397794, 2043174, -39370, 2120942, 6351312, 9023928, 8566868, 5253473, 446157, -2403296, 373136, 7370763, 12109330, 10781210, 6421305, 3043322, 184243, -3496981, -6072567, -6093915, -6118918, -7995663, -8894463, -6637118, -4341446, -4649313, -4339434, -666468, 2122865, -259313, -3628930, -2045924, 1421857, 192198, -3166652, -744077, 5995718, 7015227, -163301]
10742a63301o207903R98968L063524j250514l392170j81693L355601M359426M693585
10733E275523M049562k8751n303533o163856k129165J622125K163147J325153
10725H10205O43016o20524k465692l681323l902509k721914J271989O769588Q030371
10716D133207J999374n398625n828264K86016M920921L748718N01702M1840K233380
10707F638269L762255K383175j682399o120110p746319n136529k87111L335574
10699d853195M115398L163603K589012L070784K656235q73644n438799n356330
10691i26936N17137M959007J709920m787604n713110r66774K372247K397499L241390
10682B802776M615754J646926m144253n133914p36106J224905j333167j427864
$$ y = [-163301, -6371204, -5372236, -2308712, -3559226, -6951396, -7133089, -3777488, 581938, 5275523, 9325085, 9296334, 3992801, -2171055, -4300220, -2678095, -514948, 810205, 1453221, 832697, -1632995, -5314318, -9216827, -11938741, -10666752, -3897164, 4133207, 6132581, 733956, -5094308, -4808292, 112629, 3861347, 4363049, 4404889, 6638269, 10400524, 12783699, 11101300, 4981190, -2765129, -7901658, -8188769, -4853195, -737797, 2425806, 5014818, 8085602, 10741837, 9868193, 4429394, -926936, -409799, 4549208, 6259128, 1471524, -4241586, -5208360, -2836113, -438614, 2802776, 7418530, 9065456, 4921203, -212711, -948817, 276088, -1057079, -2484943]
10674b484943K866558M037008l41592k118938K106528L702306k201977p076959
10666a512009m319321q89373k959347l183075M869280J1826124O905583l098207
10658G639655m906878j92763K69519l392203k809947J450384K094017L30552K542451
10649C024787N274331L69682p394070n342543N020548Q545306N73930o371300
10641C700671l607552J674639Q68052l079485l675546j069672J800081M432874
10633A044062N481016K423816j903694q72464M582879N096263k650021r403973
10625C797884o536486J826120N766431K800628j724277l264766j716483J111966
10617B061017L348785L416982J238997j163584j371549R43972K861584K29205
$$ y = [-2484943, 381615, 4418623, 4077031, 1958093, 4064621, 7766927, 5564950, -1512009, -5831330, -6720703, -9680050, -12863125, -7993845, 3832279, 10737862, 7639655, 2732777, 2540014, 2809533, -582670, -3392617, -1942233, 151784, 482336, 3024787, 8299118, 8668800, 1274730, -4067813, 952735, 9498041, 10071971, 3700671, 93119, 1767758, 2635810, -443675, -4119221, -5188893, -3388812, 1044062, 6525078, 8948894, 7045200, 6172736, 10755615, 15851878, 13201857, 3797884, -2738602, -912482, 4853949, 7654577, 5930300, 2665534, 949051, 2061017, 5409802, 8826784, 10065781, 8902197, 7530648, 8474620, 11336204, 11565409]
10609A1565409o854451j1313027o414698L989242Q840032M863481M49068J736065
10601F861121L919025J484165k201517k509305j981725l203639j868115M159069
10593D659079P443902K543332l494104k880911o11869m134110q226678m290588
10585h991947K822636K645690k339060j852678L422327M456528J281531J379585
10577B824612L798597J407537l401705j923354L797003L882892q92924q54542
10569H638116L334325J438396n939789o473857K085560P494483M080054O54145
10561A5311433K549574K678519l066836o843782k828317K692712K459346j129415
10553A1823234k516724j083663J535227M203757M217951K25726l061658j405316
$$ y = [11565409, 4710958, -6602069, -13016767, -9027525, -187493, 4675988, 5125056, 6861121, 10780146, 12264311, 10062794, 7553489, 5571764, 2368125, 500010, 4659079, 12102981, 14646313, 11152209, 8271298, 7659429, 3525319, -4701359, -8991947, -6169311, -3523621, -5862681, -7715359, -4293032, 163496, 1445027, 2824612, 6623209, 8030746, 4629041, 2705687, 6502690, 10385582, 9492658, 8638116, 11972441, 13410837, 7471048, 997191, 3082751, 10577234, 14657288, 15311433, 17861007, 20539526, 17472690, 10628908, 7800591, 10493303, 12952649, 11823234, 9306510, 8222847, 9758074, 13961831, 18179782, 18405508, 15343850, 13938534]
10545A3938534M04267l464155p789113m575008J774637K191824K35193M504430
10537G220609R262098K751644r027258r029538K071895O809589N93384l038994
10529G613429J522963M226098Q56867n03576J807051q7506m911870k621090M277119
10520A2179485K954377m667694l952238M181551M164406l592845k618984O678935
10512A5326993O067573m762579n818302M585242N536288n228763n245918Q243375
10504A8703909R957396n119183r644413M705808J0845547o94441k866433J2182570
10496C8070760J3573197n657853p219815J7747539K1517450p344206k513281N9628262
10488A27802053P7989365l1888203j73905252j76197444l4753033P9953468O4243151
$$ y = [13938534, 14342801, 10878646, 3089533, -1485475, 289162, 2480986, 2716179, 7220609, 16482707, 19234351, 10207093, 1177555, 3249450, 10059039, 10652423, 7613429, 9136392, 13362490, 14219357, 13715781, 15522832, 15435326, 10523456, 7902366, 12179485, 15133862, 10466168, 6513930, 10695481, 14859887, 11267042, 8648058, 15326993, 21394566, 16631987, 10813685, 15398927, 20935215, 15706452, 10460534, 18703909, 28661305, 23542122, 13897709, 18603517, 29449064, 28754623, 25888190, 38070760, 51643957, 45986104, 38766289, 56513828, 78031278, 70687072, 68173791, 127802053, 205791418, 173903215, -2037, -176199481, -210952514, -130999046, -66755895]
10481f6755895j473920r849841K1845992K3321079j709102m548783J3148169J3943471
10473a2078830j468491l592127O162348L155638r913091r755718K937321Q058747
10465a6494203M055204M388344P023278J119216o419379k297814N594431J287466
10457a743457q866396p318431K798380M725411j446238k271207K253947J200562
10449a0667429l850323k200708M011032L835291j101330m67097M129243K844000
10441c467321k394443j468542M040581L561406k818729n064399j055351K123515
10433f543283J957108J461956L06623k205995j078559M930031N796287m093620
10425E30548j2131295n163430Q243762J0613170K195005l488330k979494k650454
$$ y = [-66755895, -68229815, -78079656, -56233664, -32912585, -34621687, -39170470, -26022301, -12078830, -13547321, -17139448, -10977100, -7821462, -17734553, -27490271, -24552950, -16494203, -12438999, -8050655, -1027377, 91839, -6327540, -8625354, -3030923, -1743457, -10609853, -17928284, -15129904, -10404493, -11850731, -14121938, -11867991, -10667429, -14517752, -16718460, -12707428, -8872137, -9973467, -10440564, -6311321, -3467321, -5861764, -7330306, -3289725, 271681, -2547048, -7611447, -8666798, -6543283, -4586175, -3124219, -2817596, -5023591, -6102150, -1172119, 4624168, 530548, -11600747, -16764177, -8520415, 2092755, 4287760, 799430, -2180064, -4830518]
10417d830518j988147L179481O526451P43q486079n814914L311764M598773j95385
10408c697831J606682P393598L147738q212175q523519L802885R512917R57989
10400E988284o088632q86497N323400J470905m868498l657966K68463r82223l610971
10391g043735j667654Q37772j043216k747965N57970M015353K242041o13933P52715
10382d710652L118213K232041J321815L308955L224573k277928o180605j991177
10374a954765M027852K263223m655678o633578j972001K260026K628543J971072
10366b065306J497334m33074k508295j605375Q17965P20447j000443l20361J406175
10357c490933r98354n974035n041828L849434J0770177O948432k492129n810146
$$ y = [-4830518, -6818665, -3639184, 2887267, 2888010, -5598069, -11412983, -8101219, -3502446, -3697831, -2091149, 5302449, 8450187, 238012, -8285507, -4482622, 5030295, 5988284, -100348, -986845, 4336555, 5807460, 938962, -2719004, -2450541, -3432764, -7043735, -8711389, -7873617, -8916833, -11664798, -11106828, -7091475, -4849434, -5463367, -4710652, -1592439, 639602, 1961417, 5270372, 8494945, 6217017, 36412, -1954765, 2073087, 4336310, -319368, -6952946, -8924947, -6664921, -4036378, -2065306, -567972, -1001046, -3509341, -5114716, -4296751, -3576304, -4576747, -4897108, -3490933, -4489287, -10463322, -15505150, -11655716, -885539, 6062893, 3570764, -2239382]
10349b239382j044786K852848N10616k744089j041599K243750Q78425l176557
10341c760774l071245J024531K260131o06777p41260M212128O410793K53539p283029
10332a301963o325221J532106O747611N765047L007473J416320o20123l619891
10324F601359n447160n322140l871047l69595M559121N745177j75646p040218
10316e320149n607308K951287P927676L759656l732864o744396l993699J504065
10308i255732O440413P245923K210597m568820o525879k928304J187426L197632
10300b996744M642272M917461J052214m908974o350084k391888N4391k225384
10292h206736l192747J762025P012755N108776j544540m648175k214670K37889
$$ y = [-2239382, -3284168, -431320, 79296, -2664793, -3706392, -1462642, -584217, -3760774, -6832019, -5807488, -3547357, -4154134, -4895394, -683266, 5727527, 5981066, -1301963, -7627184, -6095078, 652533, 6417580, 9425053, 10841373, 10221250, 6601359, 1154199, -4167941, -8038988, -8408583, -3849462, 1895715, 1720069, -5320149, -10927457, -7976170, -48494, 3711162, -21702, -6766098, -10759797, -9255732, -2815319, 4430604, 6641201, 2072381, -4453498, -7381802, -6194376, -2996744, 1645528, 6562989, 7615203, 2706229, -3643855, -6035743, -5981352, -8206736, -11399483, -9637458, -2624703, 2484073, 939533, -3708642, -5923312, -5685423]
10284e685423q32422k646011j602001J500377L198841J946680l48494p89323R95002
10275d262774K415595J549952j49541m22547K25087K70785P49139L131004M881977
10266H388677K039612l948459o958053m403073j36964J661757J044135j90946
10258b503314j082189m50150K509450N401228M429809l0657l690687m656275m878497
10249d951282m897888k702216R63761K045977Q1277m0780L960693P387156N615136
10240G461834Q51402j889927j629679o71991m92990j692957m759289p722843o328709
10231a6875149J41992O174957O482692K661557K62644J380358L189587K429465
10223E848103r91819m051396l435773M95258L177352J690197m44525J378463M417775
$$ y = [-5685423, -6517845, -9163856, -10765857, -9265480, -6066639, -4119959, -4468453, -5257776, -4262774, -1847179, -297227, -446768, -869315, -644228, -373443, 375696, 3506700, 8388677, 10428289, 6479830, -478223, -4881296, -5018260, -3356503, -2312368, -2503314, -3585503, -4035653, -1526203, 3875025, 8304834, 8274177, 4583490, -72785, -4951282, -9849170, -12551386, -11587625, -9541648, -9460371, -9501151, -5540458, 1846698, 7461834, 8313236, 6423309, 4793630, 4121639, 3628649, 1935692, -2823597, -10546440, -16875149, -16733157, -10558200, -4075508, -1413951, -1151307, 229051, 3418638, 5848103, 4856284, 804888, -2630885, -2135627, 1041725, 2731922, 2287397, 3665860, 8083635]
10214H083635K104990m535733p188784l285462K07870q11214q42577M053346P450268
10205E236339K986358l760267l465012K097141L652446m52430l290208k162245
10197H42122j925298m692547n641542j666063L425611N405098N016801L914990
10189D679172J062993l251115m883103j551297K699168K996947O89497M46273
10181B888535K337802J823614k491604n776965l574081J644244L587315N70742
10173A009602k568176j474456J985571L078561R35030j242947j443758p07908
10165d28481m0603Q75893J516146N59018j227899j547037o33045j007672k446129
10156d379809j612339J862249L701468J673987o78998Q0795K065852K027880M32051
$$ y = [8083635, 10188625, 5652892, -1535892, -4821354, -4613484, -5424698, -6267275, -2213929, 5236339, 8222697, 4462430, 997418, 3094559, 6747005, 6294575, 3004367, 842122, -1083176, -5775723, -11417265, -13083328, -9657717, -4252619, 764182, 4679172, 5742165, 2491050, -2392053, -3943350, -1244182, 1752765, 2442262, 2888535, 5226337, 7049951, 4558347, -1218618, -4792699, -3148455, 438860, 1009602, -1558574, -3033030, -1047459, 2031102, 2966132, 1723185, 279427, -428481, -469084, 406809, 1922955, 2481973, 1254074, -292963, -926008, -1933680, -4379809, -5992148, -4129899, -428431, 1245556, 566558, 647353, 2713205, 4741085, 5173136]
10147E173136r14736k308467l704105k977221j93564R72695k35172O33869M428851
10138H75286M219258l206739q693738l146964P095966Q911397K493717m36977
10130H111206L092877L497362l148050p718066m077006O08094q30477l212675
10122c676735O87382O612363O096017N44930k572056k566373l858298n185735
10114c918505j655339M230119M624854n64774k995445M14782L024288M29066k412477
10105A176569l93019L335833L606816J534343P43538M09726j870628m200609l434759
10096I07810j144453p67887j365110m0426J763167P77846j196174j16868J797376
10087F15281j107571o253226l871897O868210J2685167M206889q775967r908212
$$ y = [5173136, 4258400, 1949933, -1754172, -4731393, -4924957, -3952262, -4187434, -3553565, 875286, 5094544, 1887805, -6805933, -9952897, -2856931, 6054466, 8548183, 8111206, 11204083, 14701445, 11553395, 3835329, -241677, 366417, -464060, -3676735, -2989353, 3623010, 9719027, 10263957, 7691901, 5125528, 1267230, -3918505, -5573844, -1343725, 3281129, 2716355, -279090, 135692, 3159980, 3589046, 1176569, 783550, 4119383, 7726199, 9260542, 10004080, 10413806, 8543178, 4342569, 907810, -236643, -1004530, -2369640, -2410066, -646899, 130947, -1065227, -1182095, 615281, -492290, -6745516, -10617413, -3749203, 8935964, 13142853, 4366886, -5541326]
10079e541326P93160P980348L540781l705932l396077J844505L182090o82042
10071D015507m045298m164807l331412k769055p71335L070008O252181O398175
10063D653964L251080j659774n038131l370230K413526N934164K994774j812990
10055G366383j116646M150435N885906J006375m256483m180190j391165j168179
10047F296436k913653k343325P78724K353844N04056j929668j866181N2548R59241
10038A892022m46646k560429k850670p68828J611153K177311J280582N56523J56588
10029A047606q37763j842693j259598N00927J244881M67070k16334k52586n51426
10020a699916n72761J036789K469933K85899l830130l488453K555189O841076
$$ y = [-5541326, -4748166, 3232182, 6772963, 3067031, -329046, 1515459, 4697549, 4015507, -29791, -4194598, -7526010, -10295065, -11066400, -7996392, -1744211, 4653964, 7905044, 6245270, 1207139, -2163091, 250435, 6184599, 9179373, 7366383, 6249737, 10400172, 16286078, 17292453, 13035970, 8855780, 7464615, 6296436, 3382783, 1039458, 1818182, 4172026, 4676082, 2746414, 880233, 932781, 1892022, 1445376, -1115053, -3965723, -4734551, -3123398, -946087, 334495, 891018, 1047606, 209843, -1632850, -2892448, -2391521, -1146640, -679570, -895904, -1148490, -1699916, -2272677, -1235888, 1234045, 1519944, -2310186, -5798639, -3243450, 3597626]
10012C597626L754085j878345k518293M54850J89300l595941m313044L44902M706522
10003G41662L845587k39333l029834l084869j396107P33931J599370L12544j050941
9994a567990K4864J731781M9995m009986m389903J285972P662077Q418476L202617
9985A2407903l867317q629063q191377k217802M805876O518318K251591j906893
9977A171236j498599R76448J327968j82210j035195r21456p86161o46171r65728
9968b559868k763970m249426j740454L663345N610222J897217j552599l58073
9960b053606J184920j384520l608279J29203N046194K475619n014812o260428
9952i485709R28676N911599J480992n774650o071901J36610N082067M967764K593243
$$ y = [3597626, 7351711, 5473366, 2955073, 3409923, 3599223, 3282, -4309762, -3964860, 741662, 4587249, 4347916, 1318082, -1766787, -3162894, -2428963, -829593, -517049, -1567990, -1543126, 188655, 238650, -3771336, -8161239, -6875267, 786810, 9205286, 12407903, 8540586, -88477, -8279854, -10497656, -5691780, 826538, 3078129, 1171236, -327363, 649085, 1977053, 1794843, 759648, -161808, -947969, -1594140, -2559868, -5323838, -9573264, -11313718, -7650373, -2040151, -142934, -1695533, -2053606, -868686, -2253206, -5861485, -5732282, -686088, 1789531, -3225281, -9485709, -8557033, -2645434, -1164442, -6939092, -13010993, -12874383, -7792316, -2824552, -231309]
9943b31309J446814J939085K552902J849524k43350k122918k459757k220163k703372
9934b192544k395505P70747M511380M132633k8289k083151O52771L199451L71138
9925F938631n192088o637435k324625K607768L490234J284794k19196L15930J219760
9916A483773J422154K026456L370579K888274j259062n707807n122074Q1756L872274
9907C056323L385534K178402K620383J236186m221105q737688o682184j50048
9899g314197M769024N989856M622978J060337k582356j781212K477019K008351
9891I249800n000222p519890J069607R235974N047877k185939K858241J2852444
9883B5607892R052942k881103J477571K0061219J7694035k0346206n7416517n1776127
$$ y = [-231309, 1215505, 3154590, 5707492, 7557016, 7313666, 5190748, 2730991, 510828, -2192544, -4588049, -3817302, 694078, 4826711, 4798422, 2715271, 3368042, 6567493, 6938631, 1746543, -4890892, -7215517, -4607749, -1117515, 167279, -51917, 264013, 1483773, 2905927, 4932383, 8302962, 11191236, 9932174, 4224367, -897707, -815951, 3056323, 6441857, 8620259, 11240642, 12476828, 8255723, -481965, -7164149, -7314197, -2545173, 3444683, 8067661, 9127998, 6545642, 4764430, 7241449, 9249800, 4249578, -3270312, -2200705, 7035269, 12083146, 9897207, 12755448, 25607892, 34660834, 31779731, 33257302, 53318521, 71012556, 50666350, -6750167, -58526294]
9875e8526294j2579390J7011776J7906574P791963M159703M274251K494051K220552
9867a5246814M522890L299656k031564l260222K344278O838479M758052L26502
9859A551257j930000l261969m171654j848019K492574K890642j508837m293517
9851a0079523k154088P33887J046150Q59981J468017O41924j395124q79204K196922
9842g561058L045209N33615o79814J322195K418141K31116j742197n82060J507729
9833a507124J482947p69178l930760n597896j968601O583133J1428230N272634
9825A0993385n776575r154114l563183R75666p665r73492N27728j54085k996482
9816a0128817j164775N157354O314007j24695l909021J7667K340049l148531o899465
$$ y = [-58526294, -71105684, -54093908, -36187334, -28395371, -24235668, -19961417, -17467366, -15246814, -10723924, -7424268, -9455832, -12716054, -10371776, -3533297, 1224755, 1551257, -378743, -3640712, -7812366, -9660385, -7167811, -4277169, -5786006, -10079523, -12233611, -11499724, -10453574, -9593593, -8125576, -7483652, -8878776, -9757980, -7561058, -4515849, -3982234, -4662048, -3339853, -921712, -690596, -2432793, -3014853, -1507124, -24177, -793355, -4724115, -10322011, -12290612, -5707479, 5720751, 10993385, 5216810, -3937304, -7500487, -6524821, -6532486, -7505978, -6978250, -7132335, -10128817, -11293592, -6136238, 177769, 53074, -3855947, -3838280, -1498231, -4646762, -11546227]
9807a1546227j13526Q431029O012934l105726n278359P45837M519449K124529
9799A789940n34314n97473j417521l244533k005546K052212L813215J892066m5500
9790A702546m52335j287450k724994k921663k150833j524967L28752L687332M187039
9781a156573n51193m648724k074683K893624K309389j849083j165879M243735
9773a999387N561702M3942m914754m095571j031428K05682R86849K697093K837561
9764B91689R5335k519728k424401o32963J313901K972839L057551P77598j118530
9755A813291R6500J654357m15614l330728j737243J853658M96868m050392l009596
9746f628899L497685M797367k352864o934910j432183N516288L506987k742979
$$ y = [-11546227, -11659753, -3228724, 2784210, -321516, -5599875, -4854038, -334589, 1789940, 1255626, 658153, -759368, -4003901, -6009447, -3957235, -144020, 1748046, 1702546, 1250211, -37239, -2762233, -5683896, -7834729, -9359696, -9030944, -5343612, -1156573, -1707766, -6356490, -8431173, -5537549, -3228160, -5077243, -6243122, -1999387, 3562315, 3606257, -1308497, -5404068, -6435496, -6229814, -5242965, -2545872, 291689, 387024, -2132704, -4557105, -5190068, -3876167, -903328, 2154223, 2931821, 1813291, 1909791, 3564148, 3148534, -182194, -1919437, -65779, 431089, -3619303, -6628899, -3131214, 1666153, -686711, -7621621, -9053804, -3537516, -30529, -2773508]
9738b773508k425621K978014L327383k413641n198448j625839J585385K89880
9730f256395q45806J662137L225761k12955l775747p26343O238705P913914J463684
9721H686955n857427o570169j603030K949346L854025K296585j33130k833093
9713G90062m162125k206929J526534K802326N64815j306482k07627J008763o93662
9704a884325k728941j055301K491184K603214j057320l507988k291609k14217
9696g645303L04228N25175J774833K742827J758667j277311n353786p693872m169256
9687a9033798M842073J0840882O315723l373195n582402J545180O285568J495260
9679C335291m746825k716872L906160N280463J015305j410295P6591M58883k144350
$$ y = [-2773508, -5199129, -2221115, 1106268, -1307373, -6505821, -8131660, -6546275, -6256395, -7102201, -5440064, -2214303, -2427258, -6203005, -6929348, -690643, 7223271, 8686955, 2829528, -3740641, -5343671, -2394325, 1459700, 3756285, 3623155, 790062, -3372063, -5578992, -4052458, -1250132, -685317, -1991799, -2199426, -1190663, -1884325, -4613266, -5668567, -3177383, -574169, -1631489, -5139477, -7431086, -7645303, -7341075, -6815900, -5041067, -2298240, -539573, -1816884, -7170670, -14864542, -19033798, -14191725, -3350843, 2964880, -408315, -5990717, -4445537, 1840031, 3335291, -1411534, -4128406, -222246, 5058217, 6073522, 4663227, 4739818, 5198701, 3054351]
9670C054351l592595j627023N78206J17421j800698k823074k160682P026K372020
9661e875048K345964n50983k661867j280645O85171q9541n77939L451043P957189
9652C403344M930043m201373q680318l819119K431931J925915k470071l257025
9644i736673K91575L102744K580837L74207j508254k015067p03531P87942l03517
9635g129737k899845k061518L006580N933579K705184j011139J501644O510027
9627F554775N289303j471386m226637K87768L847759l61648p469529q467109k639518
9618h656222L026650L698466P96651k334495m317541m983814l756957k22820M362433
9609a2387649O981144N223998L70405l151662k896427j487431k173118l164255
$$ y = [3054351, -538244, -2165267, -1587061, -1469640, -3270338, -6093412, -8254094, -8247068, -5875048, -3529084, -4080067, -6741934, -8022579, -7337408, -7426949, -8004888, -4553845, 3403344, 8333387, 4132014, -4548304, -8367423, -5935492, -4009577, -6479648, -9736673, -9445098, -6342354, -3761517, -3387310, -4895564, -6910631, -7614162, -6826220, -7129737, -10029582, -12091100, -9084520, -3150941, -445757, -1456896, 44748, 6554775, 11844078, 10372692, 6146055, 6433823, 10281582, 9919934, 2450405, -6016704, -8656222, -5629572, -1931106, -1134455, -3468950, -7786491, -12770305, -16527262, -16750082, -12387649, -5406505, -182507, 187898, -2963764, -5860191, -7347622, -9520740, -12684995]
9601a2684995n41419M187989M946841M09699l063318m46603M600411N028327k38805
9592B198127n917776p050124k876464L924836Q815085P980596K281605k700726
9584F655159k834365n4746J120891n37410k905959l959668k696124J052443M993993
9575H34214M989252K67346m347592m425442j531223L17024O27260Q79738K06671
9566b182752k379785m023846j749609J803360J927659m98375o63165K182812M333704
9557a249997M239011L455756J880154j548493m041731j821695K341779J803718
9549E058502l232345n309033j347021L015872K861525L77465q41869q76499j49656
9540d43059K039837L099086j187650p742428p450793Q45268O830174M396068J016092
$$ y = [-12684995, -13226414, -9038425, -4091584, -3681885, -6745203, -7191806, -2591395, 2436932, 2198127, -3719649, -10769773, -13646237, -9721401, -906316, 7074280, 9355885, 6655159, 3820794, 3766048, 4886939, 4349529, 1443570, -2516098, -5212222, -4159779, 834214, 5823466, 6090812, 1743220, -2682222, -4213445, -3896421, -3269161, -2389423, -2182752, -4562537, -8586383, -10335992, -8532632, -6604973, -7103348, -7766513, -5583701, -1249997, 2989014, 6444770, 8324924, 6776431, 2734700, 913005, 3254784, 5058502, 1826157, -3482876, -4829897, -1814025, 1047500, 1424965, 583096, -293403, -443059, 1596778, 4695864, 3508214, -4234214, -11685007, -10839739, -4009565, 386503, 1402595]
9531A402595M115605P837993L527434m640074o486936k582951j472021l866696
9523b165051k832369J764551K274495k475238m420731k72351L216319J739268
9515c171107M61587L483244O069391L748500N77322R85208R14808m281310r209291
9506d21648n735502K833687N554696O26903k410460J282786M153506n98479p039438
9497a753949n479319K286600O021919K878174L58705K752155M283872j02658n360309
9488E885190m432520K55097J514355l62684P71912M933451N420102O63471k859989
9479A1788385j802173r98463l696681n282666j906451K214483K226224P45731
9471C288389J845530K912927J1570l666699k772011P51469J367369j87401P39927
$$ y = [1402595, 5518200, 13356193, 16883627, 12243553, 5756617, 3173666, 1701645, -2165051, -4997420, -3232869, -958374, -3433612, -7854343, -8126694, -4910375, -3171107, -2709520, 773724, 6843115, 10591615, 11168937, 12154145, 13068953, 8787643, -421648, -6157150, -3323463, 2231233, 2858136, 447676, 1730462, 5883968, 5285489, -1753949, -7233268, -4946668, 1075251, 3953425, 4312130, 7064285, 11348157, 11245499, 5885190, 1452670, 1707767, 3222122, 2859438, 3631350, 8564801, 13984903, 14648374, 11788385, 9986212, 8987749, 5291068, 8402, -1898049, 316434, 2542658, 3288389, 5133919, 8046846, 8058416, 4391717, 1619706, 2371175, 3738544, 3551143, 4291070]
9462D291070L012067J372589l369019m748700j364639J073926n94204k711229
9454c038139j751394R03815K826921L689252L213981Q51663j710612k155999j528666
9445A300822k049634k149215O43674L399321J489835k433356j466339L545361
9437B280469M288312j125416m215107J75939N240022K950139l820112o627721
9429h53475l690793R468J461052K006187K516811J550961j479554m453603m532849
9420g465795j308890J879170Q89168l292410l875974K723431R776754Q163608
9412G489062k44728m793938j467606K589403J599536q79179k61577J146518j39552
9403E037939k061507j769420j238965k377148j939701K474175O120143L477564
$$ y = [4291070, 7303137, 8675726, 5306707, 558007, -806632, 267294, -326910, -3038139, -4789533, -3885718, -1058797, 2630455, 5844436, 6696099, 4985487, 2829488, 1300822, -748812, -2898027, -2254353, 1144968, 2634803, 201447, -1264892, 2280469, 6568781, 5443365, 1228258, 1404197, 6644219, 9594358, 5774246, -853475, -4544268, -4534800, -3073748, -1067561, 1449250, 3000211, 1520657, -2932946, -7465795, -8774685, -6895515, -6006347, -9298757, -13174731, -10451300, -674546, 7489062, 7244334, 2450396, 982790, 3572193, 5171729, 4292550, 4030973, 5177491, 5037939, 2976432, 1207012, -31953, -2409101, -4348802, -1874627, 4245516, 7723080]
9395G723080k687453n124420k276460J341577K725642K605725J666462j83235
9387E790918j616468j144586K48778P90913P03353P03466L9125j352783j536193
9378B626523q4837M28240q04709o72779J897116K533828j539110n608123m084167
9369e308018Q32899K938757J205733p39443j359170j360357J91963L672536N256225
9360E331125J869821k541609k351736N13748J07046k822789k215730J964505K964945
9351B819326j193018m244756k194173Q62073Q88954M41943K482329M052219J615195
9342E530092k121130k404047J5236R50451k11177q89799q81068k139450l736751
9333e887643k320727J856730M057127J761912j622228k041010n16315l98955j299707
$$ y = [7723080, 5035627, -88793, -2365253, -1023676, 1701966, 4307691, 5974153, 5790918, 4174450, 3029864, 3278642, 4069555, 4772908, 5476374, 5515499, 4162716, 2626523, 2541686, 2969926, 2165217, 1492438, 3389554, 5923382, 4384272, -1223851, -5308018, -4475119, -1536362, -330629, -1070072, -2429242, -3789599, -3597636, 74900, 5331125, 7200946, 4659337, 2307601, 2821349, 2928395, 105606, -2110124, -145619, 2819326, 1626308, -2618448, -4812621, -3950548, -3061594, -2619651, -137322, 3914897, 5530092, 3408962, 1004915, 1020151, 1970602, 1759425, 869626, -11442, -2150892, -5887643, -8208370, -6351640, -2294513, -532601, -2154829, -4195839, -4712154, -5111109, -6410816]
9324f410816m9297L102900M036385J443698p01915J88744O63427k564520n552477
9315e843871k414389M389721O345824J581672k220831K55227M191603K805667
9307I090623k488618n239716l201616O86601L539237L996200J044623l960592
9299C466742o204294k827827K278380L238232O1509k287155j064770K003245M156006
9290B820068L520252o46310n807346o377765n60688N062588K940228m822155q752866
9281a2623994m431425K830680O086775M496969J748336P53653J577089K241160
9273B679243Q12576j887029k494215J89282K646493J487550j515156k730204k438983
9264c250443k884817k992439m08897K990196L478549K069854K530615L778545
$$ y = [-6410816, -6460113, -3357213, 679172, 2122870, 1420955, 1609699, 2273126, -291394, -5843871, -8258260, -3868539, 2477285, 4058957, 1838126, 2093353, 6284956, 9090623, 6602005, 1362289, -1839327, -1152726, 2386511, 6382711, 7427334, 3466742, -2737552, -5565379, -3286999, -48767, 12742, -2274413, -3339183, -1335938, 2820068, 6340320, 5694010, -113336, -6491101, -7051789, -1989201, 951027, -3871128, -12623994, -17055419, -14224739, -8137964, -3640995, -1892659, -1139006, 438083, 2679243, 3491819, 1604790, -889425, -700143, 1946350, 3433900, 1918744, -811460, -3250443, -6135260, -9127699, -9536596, -6546400, -3067851, -997997, 1532618, 5311163]
9256E311163J302043l783068m702715K54182M180896J811537k887644l469532
9248a983138m50661P11620j911245m564494k951276K989003Q665356Q475996J564474
9239A0545635n984211p204376k341761K254007K825474J425524M25113p43684
9231A201721j890900n27190L273774N069994K235899j967499l557646l168169
9223F69984k848069j547529J763579L819508J316110k530155j461336M214844
9215C396936P192303L567551j477357j430227J970318J640853l898975q028504
9207B932898n821124j268660p33218k867367j324356L815325N007639n99859n481873
9198f340595k683400L734253N321699J622226j152487o02995K13324j92597l66329
$$ y = [5311163, 6613206, 2830138, -1872577, -1618395, 2562501, 4374038, 1486394, -1983138, -2433799, -1722179, -3633424, -8197918, -11149194, -8160191, 505165, 8981161, 10545635, 4561424, -2642952, -4984713, -2730706, 94768, 1520292, 1945405, 1201721, -689179, -1216369, 2057405, 7127399, 9363298, 7395799, 3838153, 669984, -2178085, -3725614, -1962035, 1857473, 3173583, 643428, -817908, 3396936, 10589239, 14156790, 12679433, 11249206, 13219524, 14860377, 10961402, 2932898, -2888226, -4156886, -4890104, -7757471, -9081827, -5266502, -258863, -858722, -6340595, -9023995, -5289742, 31957, 1654183, 501696, -101299, 112025, -80572, -446901]
9189d46901o10741k229939k943839N1349L448039J869829k235114j476430L578841
9180i94906M215324j844681n845309j941581L800411L924452O47963l26059J49684
9171A785298j573678l727783k455471O70593J581902Q46248J318895J865494M093
9162C15591k027208m99452K810969L319867J290558L74294M45605j261066l274188
9153A494970j437831L016760M142153O56640k105379j008825N12653p97965k654128
9144A819048j892110M722j44907j749371j615574J000144L515383L573500J422797
9135E933632j015222k089299j390356L58597J863793J770514n53266l766157m817723
9126c705487k316927Q79091J097130n35854J84176K963075K532537k326684n362963
$$ y = [-446901, -1057642, -3287581, -6231420, -6180071, -2732032, -862203, -3097317, -4573747, -994906, 3220418, 1375737, -4469572, -6411153, -2610742, 1313710, 1961673, 1635614, 1785298, 211620, -3516163, -5971634, -5301041, -3719139, -2872891, -1553996, 311498, 315591, -1711617, -2211069, 599900, 3919767, 5210325, 5584619, 6030224, 4769158, 1494970, 57139, 3073899, 7216052, 7872692, 5767313, 4758488, 5271141, 4473176, 1819048, -73062, -68340, -213247, -1962618, -3578192, -2578048, 937335, 4510835, 5933632, 4918410, 2829111, 1438755, 1797352, 3661145, 5431659, 4878393, 1112236, -3705487, -6022414, -5143323, -4046193, -4582047, -4397871, -1434796, 1097741, -1228943, -6591906]
9117f591906k448598J319857N3842k646683K13221O368218P227412K028255j015802
9108D507816J408614K716917j450579n334847k794754K484579L372576M90731
9100E401053m11510J245944R59521j892535k578320P99472L739715K028881k376407
9091F915814m644415l360468j095999l78713j184955j802523r12069J003813J975180
9082c484335P32264j479044k215845j041563j43578j165666k600515j595853K042671
9073a0951464N008832M128267J1622l719726m400908k414018N42817L525889N732339
9064b536350N528437K303011j444776k510107j524703k099225m525905l970738
9056a0780356K126060P813008M848417n337102j1402280n965594M700107Q700822
$$ y = [-6591906, -9040504, -7720647, -7666805, -10313488, -10100267, -3732049, 3495363, 5523618, 4507816, 5916430, 8633347, 7182768, 1847921, -946833, 1537746, 4910322, 5401053, 4989543, 6235487, 7195008, 5302473, 2724153, 3523625, 7263340, 9292221, 6915814, 2271399, -1089069, -2185068, -2563781, -3748736, -5551259, -6463328, -5459515, -3484335, -2752071, -4231115, -6446960, -7488523, -7632101, -8797767, -11398282, -12994135, -10951464, -5942632, -1814365, -1802743, -5522469, -9923377, -12337395, -11794578, -8268689, -2536350, 2992087, 5295098, 3850322, 1340215, -184488, -2283713, -6809618, -10780356, -8654296, -841288, 4007129, -1329973, -12732253, -18697847, -13997740, -5296918]
9048e296918L348115l050694l201257R79197L517819K706314P93952j225766l832712
9039e261950n352069l003506J874776L943488J096932j927675j73355L926395
9031d876964L858025r49044l520757N70055O097923N327467n41591k963543J114726
9022D116297M583987J212106m538805m436149O77131K513058j395696m258181
9014a526252j419298K464555J507505k335268l404534j020620J309439J963864
9006b460609J428936m52695k496669q22558M947517P751994K174813n802005o325035
8997b056311m16643K549383Q21002J968202P096149O282170m350761j2545196
8989f52005o463144O839390J0720272K068831o442592n778345j030550m45986
$$ y = [-5296918, -1948803, -4999497, -8200754, -7221557, -3703738, -997424, -203472, -1429238, -5261950, -10614019, -13617525, -11742749, -7799261, -6702329, -8630004, -8803359, -4876964, -1018939, -1967983, -5488740, -4918685, 1179238, 6506705, 5965114, 3001571, 4116297, 8700284, 9912390, 5373585, 937436, 1614567, 4127625, 2731929, -1526252, -2945550, -480995, 1026510, -1308758, -4713292, -5733912, -4424473, -2460609, -1031673, -1484368, -3981037, -4803595, 143922, 7895916, 10070729, 4268724, -2056311, -2472954, 76429, 897431, 2865633, 9961782, 16243952, 11893191, -652005, -7115149, -275759, 10444513, 12513344, 6070752, 292407, -738143, -1184129]
8981a184129l189592k995378J422302N010878L586079j332255m882157m268913
8973g833165j189155R28173J210493J380752J881636R65230j243505j277475K360197
8964b816819N454309L531787j058199k125965J197469L175251j7355m854248n567594
8955c081364j700938K067937K218907N312j191666k49526J131052J544768J702723
8946B447205K341233K064146o39419m185386n266100l105901J27888K651689L811959
8937B47314K222314k588628o571201m296960K876267O884752L540093k004957
8929C08994l504222k180736k491289l763454j972499K658463N622137M721758
8921f00848K081130J92768k50481P40748K437788K996035J631245n4767r66062
$$ y = [-1184129, -4373721, -7369099, -5946797, -935919, 2650160, 1317905, -3564252, -7833165, -9022320, -8094147, -6883654, -5502902, -3621266, -2656036, -3899541, -5177016, -2816819, 2637490, 6169277, 5111078, 2985113, 4182582, 7357833, 7340478, 2486230, -3081364, -4782302, -2714365, -495458, -490146, -1681812, -1931338, -800286, 744482, 2447205, 4788438, 6852584, 6213165, 2027779, -3238321, -6344222, -6216334, -3564645, 247314, 2469628, -119000, -6690201, -10987161, -8110894, -1226142, 2313951, 308994, -3195228, -5375964, -7867253, -11630707, -13603206, -10944743, -5322606, -600848, 1480282, 1673050, 1422569, 2163317, 4601105, 7597140, 9228385, 9173618, 8207556]
8912H207556k338263m211105l364779J546954N918857M745904k15376l404087
8904F885661l270616k346365j665492l49162P56960P0049j288565j481273j607441
8895d296244k814186k320455K023736N740858L153063k883416m176565N91078
8887d982131M642473M237731K854522K775755O98830m814956q292144m452209
8879g332129L883851Q973634O714535k41178n653963m947138L56899L568844Q71387
8870F194742l198950k425086J409749J883711r42913j123181J740595J160567
8862D699234m163308o406667r22793N743480N523482r1521m115667l729333o99274
8853d162367K928649M641881J621911m164932n622584k9513N708962M341876j680581
$$ y = [8207556, 5869293, 1658188, -1706591, -159637, 5759220, 10505124, 10289748, 6885661, 3615045, 1268680, -396812, -745974, 10986, 81035, -1207530, -2688803, -4296244, -7110430, -9430885, -7407149, -1666291, 1486772, -1396644, -5573209, -4982131, -339658, 3898073, 6752595, 9528350, 10227180, 5412224, -2879920, -7332129, -3448278, 5525356, 12239891, 11998713, 6344750, 1397612, 1754511, 5323355, 6194742, 2995792, 570706, 1980455, 3864166, 2921253, 1798072, 3538667, 4699234, 535926, -5870741, -6793534, -1050054, 4473428, 4381907, 266240, -3463093, -4162367, -1233718, 3408163, 5030074, 865142, -4757442, -4786955, 922007, 5263883, 3583302]
8844C583302m913678l543203j299929k7343J470462L140394L592820K981709K006324
8835F990858o8766l039365m131206k192699l21673p11591o20785K379673N149896
8826C434342L885344N83092o60132m16365j547365l258951l122121k010904j480121
8817d593181M68590N002869P368520L135100l464408m935084j794841n05825k148411
8808a466671j897708J079799K282908Q61944J113196L486820K620653k912114
8800E168827o586273l411215K819031N636132M088620J119096j751477m204088
8792B878653m799023k389389J774791N042248N076781R46289m792302o301611
8784b563563j032998M998832L987879k275064m456768M93280N101779L076083
$$ y = [3583302, -1330376, -4873579, -6173508, -6200851, -4730389, -1589995, 2002825, 4984534, 6990858, 6922092, 3882727, -248479, -2441178, -2762851, -3474442, -4095227, -1715554, 3434342, 7319686, 7902778, 7242646, 6826281, 5278916, 2019965, -1102156, -3113060, -4593181, -4124591, 878278, 8246798, 11381898, 7917490, 2982406, 1187565, 681740, -1466671, -3364379, -2284580, -1672, 860272, 1973468, 5460288, 8080941, 5168827, -1417446, -4828661, -2009630, 3626502, 7715122, 8834218, 7082741, 2878653, -1920370, -4309759, -2534968, 2507280, 7584061, 8530350, 3738048, -2563563, -3596561, 1402271, 5390150, 3115086, -1341682, -848402, 4253377, 7329460]
8776G329460k057688l694211j367606J080198J624359J69257l346308p149276
8768g411815p509784l573787J101620L997724O220050P639681N240949m82827
8760E221811l623914j672145j23634k961547m751925O07503Q378421Q836516J616811
8751A1527897m487387m697991k823498k584536k263164K14877L077253L921735
8743A885186K804308O68726j590297j919449J026678M338695L359572j638890
8735H934529n442853n158598l063006j370541R03217L978427M906395K055625
8727E743195j603571k731564k179510k304142k471959q75851J077003L10750k508588
8718g544237l038027L72336L566775K027038k438138l540335R30915N603986M628446
$$ y = [7329460, 5271772, 1577561, 209955, 1290153, 2914512, 3083769, -262539, -7411815, -14921599, -18495386, -17393766, -13396042, -7175992, 463689, 5704638, 5221811, 1597897, -74248, -197882, -3159429, -7911354, -7303851, 1074570, 9911086, 11527897, 7040510, 2342519, -480979, -3065515, -5328679, -5113802, -2036549, 1885186, 4689494, 5358220, 3767923, 1848474, 2875152, 7213847, 10573419, 8934529, 3491676, -1666922, -4729928, -6100469, -5197252, -1218825, 3687570, 5743195, 4139624, 1408060, -771450, -3075592, -5547551, -6423402, -5346399, -5035649, -7544237, -10582264, -10209928, -6643153, -4616115, -7054253, -10594588, -9663673, -4059687, 568759]
8709E68759j50930j915044J161559L636752J652191j206740l46061K003444P11669
8700F115599l231737l846169L98220M212101L355864j56626k203375j755390k91217
8691B597270N54025n95552l600071n059321j457155M934379P400817L584566j356936
8682G002022k488100j420627j792342k819924j761014M38337Q10871l64421n20084
8673b915282M46593P02409N36205J488316K333437O02865k187399j689292K317734
8664A635586M758645K437631j699651l249968j637013J263637M169826N494849
8656A3173542K824096l247158p409449n776921j862408j953178n572414n771898
8648a5595788M55597P281421Q029522L828281N63071K35355R0561j076496r78824
$$ y = [568759, 417829, -1497215, -335656, 3301096, 4953287, 3746547, 3400486, 5403930, 6115599, 2883862, -962307, -564087, 3648014, 7003878, 6847252, 4643877, 2888487, 2597270, 3151295, 2555743, -1044328, -6103649, -7560804, -2626425, 4774392, 8358958, 7002022, 4513922, 3093295, 1300953, -1518971, -3279985, -2841648, -2030777, -2395198, -2915282, -2468689, -1766280, -1230075, 258241, 2591678, 3194543, 1007144, -682148, 1635586, 6394231, 8831862, 7132211, 3882243, 2245230, 3508867, 7678693, 13173542, 15997638, 12750480, 5341031, -435890, -2298298, -4251476, -9823890, -15595788, -15140191, -7858770, 170752, 3999033, 4562104, 4797459, 4888020, 3811524, 2832700]
8639B832700J240477K696078J223470j273454k066275j304607k48899J243672
8631D343162K596023Q18334m986248r545345o849693J068591N898749L917397
8623b739030n823n54222J066228J083716l52780o66171J39926K75958K34859J855752
8613C38413M035199L319626q58666m655104m459328r82491K171739K572788Q20083
8604B302259p86863p67723K67486Q60266Q21535J048896J305929j9587l192651
8595A839547n852809n615545k707922Q03759L008937K852573Q26516l69866J695994
8586c518816N164365N278504J054155k976144l559967l119570m352487m842920
8578a0872880j635619K521514L140594J489764J989518M027182L046362j031034
$$ y = [2832700, 4073177, 6769255, 7992725, 6719271, 4652996, 3348389, 3099490, 4343162, 6939185, 7757519, 2771271, -6774074, -13623767, -12555176, -6656427, -2739030, -2744853, -3299075, -2232847, -1149131, -1501911, -2168082, -2028156, -1752198, -1517339, 338413, 4373612, 7693238, 6834572, 2179468, -2279860, -3262351, -1090612, 1482176, 2302259, 1515396, 747673, 1015159, 1875425, 2696960, 3745856, 5051785, 5032198, 1839547, -4013262, -9628807, -12336729, -11532970, -8524033, -5671460, -4844944, -5214810, -3518816, 1645549, 6924053, 7978208, 5002064, 1442097, -1677473, -6029960, -10872880, -12508499, -9986985, -6846391, -5356627, -3367109, 660073, 3706435, 2675401]
8570B675401l298882j975236m67028n74576j32239J249661O82612j667142j294399
8561d801828K611278M193243L3665m494856k996839K460856N102679L174811L88760
8552E671769q16196j015117m25688J120194J703566o61545l998042m394951j780696
8543d596706K01816J24164O12454L217794M944638K343679k699747m265214k3945
8534a41067M734272L256821l240048o321604j906454L754656L649109O75809J773298
8525F234792N008096K342684n489079q038137j545764M565131K519468k528967
8517C068224k793334l09988o70458k012366K00820L482126L078729J243957K069360
8508G357070K166316k884723p500637l559832M495810N010858k222228o099892
$$ y = [2675401, -623481, -2598717, -3065745, -3640321, -3772560, -2522899, -1840287, -3507429, -4801828, -2190550, 2002693, 2036358, -2458498, -5455337, -2994481, 2108198, 5283009, 5671769, 4855573, 3840456, 3414768, 4534962, 6238528, 5576983, 1578941, -2816010, -4596706, -4394890, -4270726, -3658272, -440478, 4504160, 6847839, 4148092, -117122, -141067, 4593205, 7850026, 4609978, -1711626, -3618080, 136576, 3785685, 4461494, 6234792, 11242888, 13585572, 8096493, 58356, -1487408, 3077723, 5597191, 3068224, 274890, -35098, -705556, -2717922, -2517102, 965024, 4043753, 5287710, 7357070, 9523386, 6638663, -861974, -4421806, 74004, 5084862, 2862634, -3237258]
8500c237258k710874J92743j232403q74479L997033O369947K032403k810641k537778
8491h11307o92900j492059k208448l63569L73248k035982k722504J154676M444843
8482d354002L316903J940153L243503K343657l040328n387195q8376M162726q88502
8473A248539p585045m104177N150945O086594k089093o053498J65902P411683
8465B31850O756825L28530n678071q288392n738149K224079R719262R122579J962132
8456A0640645k662449j397741M89127J33062O89241K123565p72827p636520j0071586
8447h465483m568951J533355K088117J039623L440568O266731N198186L026669
8439I558815L684453M157166J41890n313760o459112m036819k647804k475003
$$ y = [-3237258, -5948132, -5755389, -6987792, -7862271, -3865238, 2504709, 4537112, 1726471, -811307, -1504207, -2996266, -5204714, -5568283, -5195035, -7231017, -9953521, -8798845, -4354002, -1037099, 903054, 4146557, 6490214, 3449886, -1937309, -2025685, 2137041, 1248539, -6336506, -10440683, -5289738, 796856, -1292237, -7345735, -7179833, 231850, 6988675, 7317205, 1639134, -6649258, -12387407, -10163328, -444066, 8678513, 10640645, 7978196, 6580455, 7069582, 7202644, 7891885, 10015450, 9242623, 1606103, -8465483, -13034434, -11501079, -9412962, -8373339, -4932771, 1333960, 6532146, 9558815, 13243268, 17400434, 17542324, 12228564, 5769452, 1732633, -915171, -3390174]
8431c390174p12973J551585P86765k403770m055061k827041l97695K325053M900643
8422d222668N338371K775787J15822k9801M04194j296556l477255l096717j059893
8413d548716p4699J07582Q87886J168236L7194n7695K355242L673028P96285k680717
8403A663626j851431J275483J588786j36892M98496K627085J493657k562465m442265
8394A54080l010943j775496j194107J663604N432376M679185o87174l925341j588070
8385b51886J807704J726547j35498k92522J383837L470086N084638M449026K31642
8376A7473574m607378n575131l736152l970322o004797m670119J70402K567457
8368h352466J100047J180939L941812L019234l059088n829617p03157M376724
$$ y = [-3390174, -4103147, -2551562, -1764797, -4168567, -8223628, -11050669, -11448364, -9123311, -4222668, 1115703, 3891490, 4007312, 3977511, 4381705, 3085149, -392106, -3488823, -4548716, -4623415, -4515833, -3627947, -2459711, -2422517, -2480212, -124970, 3548058, 4344343, 1663626, -187805, 1087678, 2676464, 2539572, 3038068, 5665153, 7158810, 4596345, 154080, -2856863, -4632359, -5826466, -4162862, 1269514, 5948699, 5261525, 1336184, -251886, 1555818, 3282365, 3146867, 2854345, 4238182, 7708268, 12792906, 17241932, 17473574, 12866196, 7291065, 3554913, -415409, -6420206, -11090325, -10919923, -8352466, -7252419, -6071480, -2129668, 889566, -2169522, -7999139, -8702296, -4325572]
8360d325572K250738j264405J364932M926821Q48402n868972l612277N685760
8352E427Q387093O49240o218046m031860J568842K900438J521054J901660K580818
8343I264666J63396l835684n697029m757799k139802J567182M431614L515694
8335B512238k73611k252373j002312j25508r86649j55788K843344K333681m081357
8326a188335r337897o374555J423669N844192N406759M145002K759345o85108
8318A993072l613453j445843L238752K873540k647180m441709J331194O216690
8310C505063J973791o122993o469268J697598P195327L269384l242299k845983
8302a039380K869372M807182L57851l818254l023281j018742k293906m237498
$$ y = [-4325572, -2074834, -3339239, -1974307, 2952514, 3800916, -2068056, -5680333, 5427, 8392520, 9041760, 2823714, -1208146, 360696, 3261134, 4782188, 6683848, 9264666, 9428062, 5592378, -104651, -4862450, -7002252, -5435070, -1003456, 2512238, 2238627, -13746, -1016058, -1141566, -2128215, -2284003, 559341, 2893022, -1188335, -10526232, -16900787, -15477118, -9632926, -4226167, -81165, 2678180, 1993072, -1620381, -3066224, 172528, 3046068, 398888, -4042821, -2711627, 3505063, 5478854, -644139, -7113407, -5415809, 1779518, 5048902, 1806603, -1039380, 1829992, 6637174, 6995025, 3176771, 153490, -865252, -3159158, -7396656]
8294g396656k360550J255447J463727p11988J68745L969761M707644J048264j056312
8285A088082J182101K284940j556496m694835q36770N845462O338824L01764m107010
8276E846062k588741P16764J175342o30797k357673l308681k764190J39506L152474
8267f19934K114011k651383n422806k824550J499580K608645R86855K24644R54691
8258c130247J084889M20390J030032L191541M214264K124350j476536l268373
8250D190310j949548P36993K337328K177432J122421l80522k486390m069680k864224
8241a185880J077579M034908K992213k01201j733713j403403j825650l158587
8233a403734k914915r06990J76003j84593O68694L180388L935281J582457k68346
$$ y = [-7396656, -9757206, -8501759, -7038032, -7750020, -7581275, -3611514, 1096130, 2144394, 1088082, 2270183, 4555123, 2998627, -1696208, -2532978, 3312484, 9651308, 9953072, 5846062, 3257321, 3974085, 5149427, 4518630, 2160957, -1147724, -3911914, -3772408, -619934, 1494077, -1157306, -6580112, -9404662, -7905082, -5296437, -4309582, -4084938, -3130247, -2045358, -1624968, -594936, 2596605, 6810869, 8935219, 7458683, 4190310, 2240762, 2977755, 5315083, 7492515, 8614936, 8234414, 5748024, 1678344, -1185880, -108301, 3926607, 6918820, 6717619, 4983906, 3580503, 1754853, -1403734, -4318649, -5225639, -5049636, -5234229, -4565535, -1385147, 2550134, 4132591, 3864245]
8224C864245R15284K122820K24979k242351j420933J206169J754909O20625M47929
8215G493676J3447l155645n936207l163225K599197L387921j256735k994763J072906
8206a939428K820837k804975p653280k870701O111529P854461K947633J475279
8198E941355M964768M301775l283395q299988m482582J259467R03126k375968
8190a071442j946798K94724r86283l576052j854140K172674K100648j184270j183506
8181g234445K150803K336691j449190k384217J883968M872198K449307n03847
8173B121268O05033J933224j514772o419956n751533O64274O039140N261322l34112
8164B603888n189396m164872K616539Q202888N831092j470403l841580J058506
$$ y = [3864245, 4779529, 6902349, 7127328, 4884977, 3464044, 4670213, 6425122, 7045747, 7493676, 7507123, 4351478, -1584729, -4747954, -2148757, 1239164, -17571, -3012334, -1939428, 881409, -1923566, -9576846, -12447547, -6336018, 1518443, 4466076, 5941355, 10906123, 15207898, 11924503, 3624515, -858067, 401400, 1304526, -1071442, -3018240, -2723516, -3709799, -7285851, -9139991, -6967317, -4866669, -6050939, -7234445, -5083642, -2746951, -4196141, -6580358, -4696390, 175808, 2625115, 2121268, 2726301, 4659525, 3144753, -3275203, -9026736, -8362462, -2323322, 2938000, 2603888, -2585508, -6750380, -4133841, 4069047, 9900139, 8429736, 4588156, 5646662]
8156E646662L982505j564565q653974p412157J91464M534205K897883O41679L53520
8147F17222p90970l280144l436644l94294K129556K334090K418746K887663Q82336
8138C367561l658850n608067j578456M472722N789313J082658m075889l650277
8130c859285J953285N825920K519229m483934o588122j757181K813969J829222
8122a746897o80820M80967K642010J197686j127010N18432L174783J065669k824634
8113B700186r83339M684317M777196j738557n415299j897336J896779O26113j289002
8104C361058O44930K727337N81993k934126l475099k271430j822125o08721K447904
8095a348279L914255J541771j155698r07061k8439r89012j148493J720375L796841
$$ y = [5646662, 9629167, 8064602, -589372, -8001529, -7810065, -3275860, -377977, 263702, 617222, -173748, -3453892, -6890536, -7284830, -5155274, -2821184, -402438, 2485225, 3367561, -291289, -5899356, -7477812, -3005090, 2784223, 3866881, -209008, -3859285, -1906000, 3919920, 6439149, 1955215, -4632907, -6390088, -3576119, -1746897, -2427717, -1946750, 695260, 1892946, 765936, 1284368, 4459151, 5524820, 2700186, 1716847, 6401164, 11178360, 9439803, 4024504, 2127168, 4023947, 4650060, 3361058, 4005988, 6733325, 7315318, 4381192, 906093, -1365337, -3187462, -3796183, -1348279, 2565976, 4107747, 2952049, 2044988, 2016549, 1027537, -120956, 1599419, 5396260]
8086E396260R83532l800968m703315j086213L028032M537224K549750k304430
8078D599872o506539n577701l75189K935713J622685l78563k98018o39569k198688
8069f815997q49009M104222O386075L113264N69493L237125N468201J765092k945609
8060A4032857k347366k45075k792620o208892l642549J484223J116634k855326
8052a458114k029530L540364N913553K812070p76532k767256m727685m487239
8044c980369N94262M954610J491671m852425l224172M538108N841385j579479
8036C783591n788007q06403M399517K423900r98844P87512L592090J361873k721230
8027F033999k773727l17754J4979j212095j021404J30111Q02170J859578L023973
$$ y = [5396260, 6379792, 2578824, -2124491, -3210704, -182672, 4354552, 6904302, 4599872, -1906667, -7484368, -7859557, -4923844, -3301159, -3679722, -3977740, -4617309, -6815997, -7665006, -3560784, 2825291, 5938555, 6508048, 9745173, 15213374, 16978466, 14032857, 11685491, 11440416, 8647796, 2438904, -1203645, 280578, 1397212, -1458114, -3487644, 52720, 5966273, 8778343, 8001811, 5234555, 506870, -3980369, -3386107, 1568503, 3060174, -1792251, -5016423, -478315, 5363070, 3783591, -2004416, -2810819, 1588698, 4012598, 3013754, 3801266, 7393356, 8755229, 6033999, 3260272, 2942518, 2957497, 1745402, 723998, 854109, 1656279, 3515857, 6539830]
8018F539830J581657j999247l320367j795137j810176l370659o31386O191146
8010A385661P549186o38891q641544p072278n29571J664109K59883J588438M802227
8001C67220M318583O09104j394474j387556k241073k597028M11684L808873K555181
7992D450514j670242l335113k210320j877154j788354Q65687L642182J892132
7984c0668k168455k039498K258829M364337K242075M33044J243148J518863n91976
7975G229699k509462k275013j060700K17986J713215K007951k66630k673613j995789
7966C87644J08592P7083o98201J314585L851904J687282l475981m549628o07218
7957a903938J953177O65167J94054K336922K265568j771171l906287n60084K988741
$$ y = [6539830, 8121487, 6122240, 2801873, 1006736, -803440, -4174099, -4805485, 1385661, 8934847, 8295956, -345588, -7417866, -7947437, -6283328, -6023445, -4435007, 367220, 4685803, 5294907, 3900433, 2512877, 271804, -2325224, -1913540, 1895333, 4450514, 2780272, -554841, -2765161, -4642315, -6430669, -5564982, -1922800, -30668, -2199123, -4238621, -1979792, 2384545, 4626620, 5059664, 6302812, 7821675, 7229699, 4720237, 2445224, 1384524, 1602510, 3315725, 5323676, 5057046, 2383433, 387644, 496236, 573319, -124882, 1189703, 5041607, 6728889, 3252908, -1296720, -1903938, 49239, 714406, 908460, 3245382, 5510950, 3739779, -166508, -726592, 2262149]
7948B262149J383054k320976k773439r84423p47096j422649m79973Q43841L74158
7939c865354M4883K397545M963478L669001m88827l203249l163358k039838n25217
7930b210936J018795M36160k797870m405147q72309L903649L386111j630315m094667
7921g266529j283973K083351K053499O75665J024891K099538J603891K06592O2437
7912A259362J341903K480645K284886L96068k658119m840524l909329m48130K133049
7903a960189J644222m26369j347423m16147J086199J768137J169526J9182l74529
7894A162609j08787j212364m018420m450044Q80730P429469O593354j523596n961735
$$ y = [2262149, 3645203, 1324227, -1449212, -2433635, -3180731, -4603380, -5083353, -4239512, -3865354, -3820471, -1422926, 3540552, 7209553, 6720726, 3517477, 354119, -1685719, -2210936, -1192141, -755981, -3553851, -7958998, -8831307, -4927658, -1541547, -3171862, -7266529, -8550502, -6467151, -4413652, -3737987, -2713096, -613558, 990333, 1196925, 1259362, 2601265, 5081910, 7366796, 7762864, 5104745, 264221, -3645108, -4093238, -1960189, -315967, -742336, -2089759, -2505906, -1419707, 348430, 1517956, 1537138, 1162609, 1053822, -158542, -4176962, -8627006, -7746276, -316807, 6276547, 4752951, -1208784]
$$ [...]
##END NTUPLES=NMR SPECTRUM
##END=
