##TITLE=31Pdec_SR148
 DMSO-d6, 128 sc
 20.2.2023
##JCAMPDX= 6.0         $$ Bruker NMR JCAMP-DX V2.0
##DATA TYPE= NMR SPECTRUM
##DATA CLASS= NTUPLES
##ORIGIN= UXNMR, Bruker Analytische Messtechnik GmbH
##OWNER= root
$$ XWIN-NMR		Version 3.5
$$ Mon Feb 20 16:37:16 2023 Russian Standard Time (UT+4h)  she@DPX200
##.OBSERVE FREQUENCY= 81.013821
##.OBSERVE NUCLEUS= ^31P
##.ACQUISITION MODE= SIMULTANEOUS
##.ACQUISITION SCHEME= undefined
##.AVERAGES= 128
##.DIGITISER RES= 16
##SPECTROMETER/DATA SYSTEM= spect
##.PULSE SEQUENCE= zgpg30
##.SOLVENT NAME= DMSO
##.SHIFT REFERENCE= (INTERNAL, DMSO, 0, 248.564)
##AUDIT TRAIL= $$ (NUMBER, WHEN, WHO, WHERE, WHAT)
$$ ##TITLE= Audit trail, XWIN-NMR		Version 3.5
$$ ##JCAMPDX= 5.01
$$ ##ORIGIN= Bruker BioSpin GmbH
$$ ##OWNER= she
$$ F:/spectra/data/she/nmr/P31/1/pdata/1/auditp.txt
$$ ##AUDIT TRAIL=  $$ (NUMBER, WHEN, WHO, WHERE, WHAT)
(   1,<2023-02-20 16:36:32.40 +0400>,<she>,<DPX200>,
      <continue with go, POWCHK disabled, PULCHK disabled
       configuration hash MD5:
       00 E9 B6 7A A2 85 ED C7 34 08 36 98 17 FE 4E 26
       data hash MD5: 32K
       02 6F BF 0D F2 F0 FC 8E EB 86 D1 DC F7 C5 24 14>)
(   2,<2023-02-20 16:36:34.96 +0400>,<she>,<DPX200>,
      <Start of raw data processing
       efp BC_mod = 2 LB = 1 FT_mod = 6 PKNL = 1 PHC0 = -11070.2 PHC1 = 373.6127 SI = 64K 
       data hash MD5: 64K
       E5 47 7F 14 2D EA D8 37 07 20 E1 A2 92 6F A3 DD>)
(   3,<2023-02-20 16:36:49.31 +0400>,<she>,<DPX200>,
      <pk PHC0 = -35.81451 PHC1 = 0 
       data hash MD5: 64K
       ED 9D 0B 4A BE AE 40 EA 8D 3A 29 3B AD E6 C7 E7>)
(   4,<2023-02-20 16:36:55.18 +0400>,<she>,<DPX200>,
      <abs ABSG = 5 
       data hash MD5: 64K
       57 A1 6D 3C 8A AE FC 9E 05 6C 5C CE 08 50 71 B4>)
$$ ##END=
$$ 
$$ hash MD5
$$ C8 01 76 46 E9 0E DE 04 9F 1F 87 FC 8B C1 31 12
##$RELAX= 
##$RELAX= 
##$RELAX= 
##$RELAX= 
##$RELAX= 
##$RELAX= 
##$RELAX= 
##$RELAX= 
##$RELAX= 
$$ Bruker specific parameters
$$ --------------------------
##$DU= <F:/spectra>
##$EXPNO= 1
##$NAME= <P31>
##$PROCNO= 1
##$TYPE= <nmr>
##$USER= <she>
##$AMP= (0..31)
100 100 100 100 100 100 100 100 100 100 100 100 100 100 100 100 100 100 
100 100 100 100 100 100 100 100 100 100 100 100 100 100 
##$AQSEQ= 0
##$AQ_mod= 1
##$AUNM= <au_zg>
##$AUTOPOS= <>
##$BF1= 81.014009
##$BF2= 200.13
##$BF3= 200.13
##$BF4= 200.13
##$BF5= 200.13
##$BF6= 200.13
##$BF7= 200.13
##$BF8= 200.13
##$BYTORDA= 1
##$CFDGTYP= 0
##$CFRGTYP= 5
##$CHEMSTR= <none>
##$CNST= (0..31)
1 1 145 1 1 1 1 1 1 1 1 1 1 1 1 1 1 1 1 1 1 1 1 1 1 1 1 1 1 1 1 1 
##$CPDPRG= <waltz16>
##$CPDPRG1= <>
##$CPDPRG2= <waltz16>
##$CPDPRG3= <>
##$CPDPRG4= <mlev>
##$CPDPRG5= <mlev>
##$CPDPRG6= <mlev>
##$CPDPRG7= <mlev>
##$CPDPRG8= <mlev>
##$CPDPRGB= <>
##$CPDPRGT= <>
##$D= (0..31)
0 1 0 0 0 0 0 0 0 0 0 0.03 2e-05 3e-06 0 0 0 0 0 0 0 0 0 0 0 0 0 0 0 0 
0 0 
##$DATE= 1676896414
##$DBL= (0..7)
120 120 120 11 120 120 24 19 
##$DBP= (0..7)
150 150 150 150 150 150 150 150 
##$DBP07= 0
##$DBPNAM0= <>
##$DBPNAM1= <>
$$ [...]
##$SUBNAM3= <"">
##$SUBNAM4= <"">
##$SUBNAM5= <"">
##$SUBNAM6= <"">
##$SUBNAM7= <"">
##$SUBNAM8= <"">
##$SUBNAM9= <"">
##$SW= 501.771253377433
##$SWIBOX= (0..15)
0 1 3 0 0 0 0 0 0 0 0 0 0 0 0 0 
##$SW_h= 40650.406504065
##$TD= 32768
##$TD0= 1
##$TE= 0
##$TE2= 300
##$TE3= 300
##$TEG= 300
##$TL= (0..7)
0 120 53 12 22 120 120 120 
##$TP= (0..7)
150 150 150 150 150 150 150 150 
##$TP07= 0
##$TPNAME0= <>
##$TPNAME1= <>
##$TPNAME2= <>
##$TPNAME3= <>
##$TPNAME4= <>
##$TPNAME5= <>
##$TPNAME6= <>
##$TPNAME7= <>
##$TPOAL= (0..7)
0.5 0.5 0.5 0.5 0.5 0.5 0.5 0.5 
##$TPOFFS= (0..7)
0 0 0 0 0 0 0 0 
##$TUNHIN= 0
##$TUNHOUT= 0
##$TUNXOUT= 0
##$USERA1= <user>
##$USERA2= <user>
##$USERA3= <user>
##$USERA4= <user>
##$USERA5= <user>
##$V9= 5
##$VALIST= <valist>
##$VCLIST= <CCCCCCCCCCCCCCC>
##$VD= 0
##$VDLIST= <DDDDDDDDDDDDDDD>
##$VPLIST= <PPPPPPPPPPPPPPP>
##$VTLIST= <TTTTTTTTTTTTTTT>
##$WBST= 1024
##$WBSW= 4
##$XGAIN= (0..3)
0 0 0 0 
##$XL= 0
##$YL= 0
##$YMAX_a= 4395
##$YMIN_a= -3157
##$ZGOPTNS= <>
##$ZL1= 120
##$ZL2= 120
##$ZL3= 120
##$ZL4= 120
##$ABSF1= 248.5645
##$ABSF2= -253.2056
##$ABSG= 5
##$ABSL= 3
##$ALPHA= 0
##$AQORDER= 0
##$ASSFAC= 0
##$ASSFACI= 0
##$ASSFACX= 0
##$ASSWID= 0
##$AUNMP= <proc_1d>
##$AZFE= 0.1
##$AZFW= 0.5
##$BCFW= 0
##$BC_mod= 2
##$BYTORDP= 0
##$COROFFS= 0
##$CY= -3
##$DATMOD= 1
##$DC= 0
##$DFILT= <>
##$DTYPP= 0
##$F1P= 0
##$F2P= 0
##$FCOR= 1
##$FTSIZE= 65536
##$FT_mod= 6
##$GAMMA= 0
##$GB= 0
##$INTBC= 1
##$INTSCL= 6.047779e-11
##$ISEN= 30
##$LB= 1
##$LEV0= 0
##$LPBIN= 0
##$MAXI= 10000
##$MC2= 0
##$MEAN= 0
##$ME_mod= 0
##$MI= 50
##$NCOEF= 0
##$NC_proc= -9
##$NLEV= 6
##$NOISF1= 182.463
##$NOISF2= 159.3651
##$NSP= 0
##$NTH_PI= 0
##$NZP= 0
##$OFFSET= 248.5645
##$PC= 4
##$PHC0= -11106.01
##$PHC1= 373.6127
##$PH_mod= 1
##$PKNL= yes
##$PPARMOD= 0
##$PSCAL= 0
##$PSIGN= 0
##$REVERSE= no
##$SF= 81.0140089999694
##$SI= 65536
##$SIGF1= 159.3651
##$SIGF2= -187.1042
##$SINO= 113.3802
##$SIOLD= 16384
##$SREGLST= <1H.CDCl3>
##$SSB= 0
##$STSI= 65536
##$STSR= 0
##$SW_p= 40650.406504065
##$SYMM= 0
##$S_DEV= 0
##$TDeff= 32768
##$TDoff= 0
##$TI= <>
##$TILT= no
##$TM1= 0
##$TM2= 0
##$TOPLEV= 0
##$USERP1= <user>
##$USERP2= <user>
##$USERP3= <user>
##$USERP4= <user>
##$USERP5= <user>
##$WDW= 1
##$XDIM= 65536
##$YMAX_p= 461320654
##$YMIN_p= -145366158
$$ End of Bruker specific parameters
$$ ---------------------------------
##NTUPLES= NMR SPECTRUM
##VAR_NAME=  FREQUENCY,     SPECTRUM/REAL,   SPECTRUM/IMAG
##SYMBOL=    X,             R,               I
##VAR_TYPE=  INDEPENDENT,   DEPENDENT,       DEPENDENT
##VAR_FORM=  AFFN,          ASDF,            ASDF
##VAR_DIM=   65536,         65536,           65536
##UNITS=     HZ,            ARBITRARY UNITS, ARBITRARY UNITS
##FACTOR=    0.620285442955139, 1,           1
##FIRST=     20137.2065510682, 0,            0
##LAST=      -20513.1999529968, 0,           0
##MIN=       -20513.1999529968, -145366158,  0
##MAX=       20137.2065510682, 461320654,    0
$$ Real data points
##PAGE= N=1
##DATA TABLE= (X++(R..R)), XYDATA
$$ [...]
$$ plain form
12188 91441 5306839 5678845 9038580 15014198 9918066 -10951501 -28334766 -21481822
12180 -21481822 2277189 16676932 10747058 -2317073 -8286253 -7085784 -3647367 486008
12172 486008 1699998 -6556144 -22742004 -34526038 -32614051 -20417163 -6600868 4782007
12164 4782007 13452533 18780947 19556285 13265605 -3755788 -28236486 -43811562 -34406191
12156 -34406191 -5524120 19130783 25464440 21883843 20115026 16579725 2500228 -17295734
12148 -17295734 -27425296 -19284420 2954948 28795978 46106512 45117474 27992975
12141 27992975 11775754 12097381 24219086 28205073 13585294 -8010213 -16947429 -7681223
12133 -7681223 6074785 6661952 -9185351 -28768635 -40036737 -44831317 -50014414 -50157162
$$ packed form
12188I1441N215398L72006L359735N975618n096132k0869567j7383265O852944
12180b1481822K3759011J4399743n929874j3064131n969180J200469L438417M133375
12172D86008J213990q256142j6185860j1784034J911987J2196888J3816295J1382875
12164D782007Q670526N328414P75338o290680j7021393k4480698j5575076R405371
12156c4406191K8882071K4654903O333657l580597j768817l535301j4079497j9795962
12148a7295734j0129562Q140876K2239368K5841030J7310534r89038j7124499
12141B7992975j6217221L21627J2121705L985987j4619779k1595507q937216R266206
12133g681223J3756008N87167j5847303j9583284j1268102m794580n183097j42748
$$ plain form
12125 -50157162 -31693572 3520124 31864456 33158987 13197619 -7006219 -15907127
12118 -15907127 -16044022 -12836651 -11353925 -17685288 -29259014 -28451705 -2278787 33066792
12110 33066792 45362089 27119588 5957691 7530163 24408690 32808039 26195989
12103 26195989 16735029 12178837 8910226 5247579 5257720 7277248 2268203 -11444070
12095 -11444070 -22169773 -19627948 -8074009 1257171 4400492 4856626 4633022 2425925
12087 2425925 -1861472 -6858296 -11903087 -14473650 -8969777 5074766 16803060 15394769
12079 15394769 6718785 8061141 24081103 38431348 34269381 13981658 -7924234
12072 -7924234 -22757732 -29618970 -27265723 -16389882 -6371799 -6935143 -13180550 -10610667
$$ packed form
12125e0157162J8463590L5213696K8344332J294531j9961368k0203838q900908
12118a5907127j36895L207371J482726o331363j1573726Q07309K6172918L5345579
12110C3066792J2295297j8242501k1161897J572472J6878527Q399349o612050
12103B6195989r460960m556192l268611l662647J0141K019528n009045j3712273
12095a1444070j0725703K541825J1553939R331180L143321M56134k23604k207097
12087B425925m287397m996824n044791k570563N503873J4044543J1728294j408291
12079A5394769q675984J342356J6019962J4350245m161967k0287723k1905892
12072g924234j4833498o861238K353247J0875841J0018083n63344o245407K569883
$$ plain form
12064 -10610667 3336024 14270089 11302808 1694323 -1714331 1314394 2409412 1197085
12056 1197085 6445026 20874853 35074566 40727006 42420215 48380378 52768216 38690199
12048 38690199 3685214 -27720503 -29353176 -7620042 5059956 -6894051 -23104345
12041 -23104345 -19002619 1243900 19022489 32251850 48623412 58599099 44888316
12034 44888316 17126358 5928901 16399019 18377930 -4376982 -25956118 -20309149
12027 -20309149 -4047569 -7395308 -22512612 -17028457 10799491 28708601 22508853
12020 22508853 14829279 22568883 29020996 16678685 1481861 9603876 36106136 52300712
12012 52300712 47065376 37287168 37678952 40748268 32854139 16041775 4871966 8151884
$$ packed form
12064a0610667J3946691J0934065k967281r608485l408654L028725J095018j212327
12056A197085N247941J4429827J4199713N652440J693209N960163M387838j4078017
12048C8690199l5004985l1405717j632673K1733134J2679998j1954007j6210294
12041b3104345M101726K0246519J7778589J3229361J6371562R975687j3710783
12034D4888316k7761958j1197457J0470118J978911k2754912k1579136N646969
12027b0309149J6261580l347739j5117304N484155K7827948J7909110o199748
12020B2508853p679574P739604O452113j2342311j5196824Q122015K6502260J6194576
12012E2300712n235336r778208L91784L069316p894129j6812364j1169809L279918
$$ plain form
12004 8151884 20706102 30397263 28961723 17571808 5086117 748035 6496248 15091203
11996 15091203 15905693 4308312 -12708764 -21065445 -12719133 5481132 19006768 21899398
11988 21899398 21554597 25772321 30504819 25763665 10875222 -2987585 -6432545 -2344577
11980 -2344577 735759 2008235 9366589 26555116 44412059 48671035 34885082 12571894
11972 12571894 -4496169 -9120446 -2961623 7248173 14350102 14975547 11118146 5989419
11964 5989419 -1279180 -13122574 -25644261 -28881931 -18250428 -2014857 6446622 2059774
11956 2059774 -8610635 -15708213 -16106634 -16255023 -24527624 -38456079 -42542668 -25222902
11948 -25222902 3923374 23198422 24927836 21076789 20946751 18397615 8900561 3893818
$$ packed form
12004H151884J2554218R691161j435540j1389915j2485691m338082N748213Q594955
11996A5091203Q14490j1597381j7017076q356681Q346312J8200265J3525636K892630
11988B1899398l44801M217724M732498m741154j4888443j3862807l444960M087968
11980b344577L080336J272476P358354J7188527J7856943M258976j3785953k2313188
11972A2571894j7068063m624277O158823J0209796P101929O25445l857401n128727
11964E989419p268599j1843394j2521687l237670J0631503J6235571Q461479m386848
11956B059774j0670409p097578l98421j48389q272601j3928455m086589J7319766
11948b5222902K9146276J9275048J729414l851047j30038k549136r497054n006743
$$ plain form
11940 3893818 13699013 27071126 25514877 12279572 8583094 21627656 33675356 26944341
11932 26944341 6129039 -9568985 -8269092 4822000 13738211 6858728 -9428258
11925 -9428258 -15062674 -1142358 15503508 13946497 -670662 -5070607 6869551 16469556
11917 16469556 10142513 -2806806 -8691074 -7635716 -4365600 2845257 13620127 20425929
11909 20425929 22123534 27341063 33732431 22292146 -11681752 -40299580 -38010051 -19747892
11901 -19747892 -16761402 -25186569 -12797295 23975049 46139899 27001935 -9250634
11894 -9250634 -22662844 -8392420 9322432 16321472 16135405 9340549 -7041419 -21702115
11886 -21702115 -15868092 8169346 26384187 26681355 23265908 28727320 32344861 21914051
$$ packed form
11940C893818R805195J3372113j556249j3235305l696478J3044562J2047700o731015
11932B6944341k0815302j5698024J299893J3091092Q916211o879483j6286986
11925i428258n634416J3920316J6645866j557011j4617159m399945J1940158R600005
11917A6469556o327043j2949319n884268J055358L270116P210857J0774870O805802
11909B0425929J697605N217529O391368j1440285l3973898k8617828K289529J8262159
11901a9747892K986490q425167J2389274L6772344K2164850j9137964l6252569
11894i250634j3412210J4270424J7714852O999040j86067o794856j6381968j4660696
11886b1702115N834023K4037438J8214841K97168l415447N461412L617541j0430810
$$ plain form
11878 21914051 10299794 17722409 36035402 35127407 5120359 -30022827 -46692354
11871 -46692354 -49204916 -51794741 -50040622 -28913200 7840746 34997141 34312939 13631911
11863 13631911 -5423514 -9851051 -1621033 10935427 21443343 27173745 27866941 25469586
11855 25469586 23888070 25480939 25868831 16264672 -3690264 -19039195 -14686479 3708155
11847 3708155 15636453 13605157 10527094 14570354 14443799 1913678 -7806496 2317008
11839 2317008 20765269 22294456 7311273 702257 11012879 17482778 5750774 -7797957
11831 -7797957 -2406812 14312686 18587382 5025098 -9149877 -10109392 -2017687 4831651
11823 4831651 8570004 14005931 21714465 23840696 12979081 -4745011 -11098944 3323882
$$ packed form
11878B1914051j1614257P422615J8312993r07995l0007048l5143186j6669527
11871d6692354k512562k589825J754119K1127422L6753946K7156395o84202k0681028
11863A3631911j9055425m427537Q230018J2556460J0507916N730402O93196k397355
11855B5469586j581516J592869L87892r604159j9954936j5348931M352716J8394634
11847C708155J1928298k031296l078063M043260j26555j2530121r720174J0123504
11839B317008J8448261J529187j4983183o609016J0310622O469899j1732004j3548731
11831g797957N391145J6719498M274696j3562284j4174975r59515Q091705O849338
11823D831651L738353N435927P708534K126231j0861615j7724092o353933J4422826
$$ plain form
11815 3323882 24206406 29904793 19545848 10841361 10911559 7378261 -6897787 -18976880
11807 -18976880 -16175454 -5819393 -2113501 -5972611 -10868468 -16982086 -25457542 -29242712
11799 -29242712 -24440895 -20446376 -22932222 -18073576 6166609 32399243 31955817 6679299
11791 6679299 -12622609 -9398538 2788826 11000287 21476127 36677318 40152361 22804405
11783 22804405 4202387 5972145 18379679 16731095 1194390 -5135133 5723187
11776 5723187 15941770 11887142 1461239 -6183758 -17086490 -35368402 -46370374
11769 -46370374 -34732513 -9823041 5073338 4775430 5637639 16318975 22184072 6331814
11761 6331814 -25010820 -48057587 -48162659 -33541361 -22907234 -23529239 -23652117 -8581406
$$ packed form
11815C323882K0882524N698387j0358945q704487P0198l533298j4276048j2079093
11807a8976880K801426J0356061L705892l859110m895857o113618q475456l785170
11799b9242712M801817L994519k485846M858646K4240185K6232634m43426k5276518
11791F679299j9301908L224071J2187364Q211461J0475840J5201191L475043j7347956
11783B2804405j8602018J769758J2407534j648584j5536705o329523J0858320
11776E723187J0218583m054628j0425903p644997j0902732j8281912j1001972
11769d6370374J1637861K4909472J4896379k97908Q62209J0681336N865097j5852258
11761F331814l1342634k3046767j05072J4621298J0634127o22005j22878J5070711
$$ plain form
11753 -8581406 16295213 26612829 9845200 -13869616 -16419427 -2109854 -2162730 -26584364
11745 -26584364 -46368646 -36480804 -13912675 -10806205 -25623230 -28923848 -10615632
11738 -10615632 8005279 10730894 7137249 8265156 5874362 -8864913 -23382568 -18959624
11730 -18959624 657436 12427307 3392547 -15141905 -23215006 -14181274 552888
11723 552888 5009588 -4763245 -17864231 -22294146 -17852303 -12080050 -8683872 -7079177
11715 -7079177 -8751856 -14346207 -17431871 -11561910 -1263797 4279681 5066677 6045231
11707 6045231 3885033 -6471330 -15520934 -8021985 12264994 25252304 22265813 11715817
11699 11715817 -2268682 -22599694 -38347286 -29807041 -3348406 7917067 -7112250
$$ packed form
11753h581406K4876619J0317616j6767629k3714816k549811J4309573n2876k4421634
11745b6584364j9784282R887842K2568129L106470j4817025l300618J8308216
11738a0615632J8620911K725615l593645J127907k390794j4739275j4517655M422944
11730a8959624J9617060J1769871r034760j8534452q073101R033732J4734162
11723E52888M456700r772833j3100986m429915M441843N772253L396178J604695
11715g079177j672679n594351l085664N869961J0298113N543478P86996R78554
11707F045231k160198j0356363r049604P498949K0286979J2987310k986491j0549996
11699A1715817j3984499k0331012j5747592Q540245K6458635J1265473j5029317
$$ plain form
11692 -7112250 -16631233 5480022 36172362 35537680 3049203 -28099301 -39018829 -36792671
11684 -36792671 -26772884 -5567870 17971045 23163927 6601384 -8399288 389910
11677 389910 28644236 52877541 55366181 39397061 24277379 24186865 30953058 25308567
11669 25308567 6345865 -4716765 4146927 18510048 22672950 23886616 35318755
11662 35318755 50644734 54082273 43209799 25171258 3925621 -12353446 -8437691
11655 -8437691 13174862 22611985 1738264 -24667140 -24124698 -5178081 1553191 -4804433
11647 -4804433 -1340249 10705992 6777581 -13130040 -18812706 1526770 23266579 25436430
11639 25436430 17426806 15570297 20301513 25590987 27144087 16103745 -10831999 -33088354
$$ packed form
11692g112250r518983K2111255L0692340o34682l2488477l1148504j0919528K226158
11684c6792671J0019787K1205014K3538915N192882j6562543j5000672Q789198
11677C89910K8254326K4233305K488640j5969120j5119682r0514O766193n644491
11669B5308567j8962702j1062630Q863692J4363121M162902J213666J1432139
11662C5318755J5325979L437539j0872474j8038541k1245637j6279067L915755
11655h437691K1612553R437123k0873721k6405404N42442J8946617O731272o357624
11647d804433L464184J2046241l928411j9907621n682666K0339476K1739809K169851
11639B5436430q009624j856509M731216N289474J553100j1040342k6935744k2256355
$$ plain form
11631 -33088354 -26411982 -3718243 -4047303 -35814108 -64233167 -62646129 -42216816 -21084394
11623 -21084394 -267530 15540638 9386904 -15878786 -28680337 -13045285 6467270
11616 6467270 4533235 -8259518 -10121347 -2447888 3754545 11012358 21314061 21834984
11608 21834984 7944344 -1293847 7288154 18316602 16842823 15686592 29141734 43294347
11600 43294347 39798233 27041634 19592557 8842881 -15128453 -33402886 -23995632
11593 -23995632 -1022583 5840907 -3274784 -7185124 -4297907 -8922589 -16515877 -7895200
11585 -7895200 16754946 38541690 48656458 48705803 32140887 -3360254 -33857647 -32891662
11577 -32891662 -11240626 -1066953 -7499123 -9750341 -3292582 -3072560 -7670038 1021343
$$ packed form
11631c3088354O676372K2693739l29060l1766805k8419059J587038K0429313K1132422
11623b1084394K0816864J5808168o153734k5265690j2801551J5635052J9512555
11616F467270j934035j2792753j861829P673459O202433P257813J0301703N20923
11608B1834984j3890640r238191Q582001J1028448j473779j156231J3455142J4152613
11600D3294347l496114j2756599p449077j0749676k3971334j8274433R407254
11593b3995632K2973049O863490r115691l910340K887217m624682p593288Q620677
11585g895200K4650146K1786744J0114768M9345j6564916l5501141l0497393R65985
11577c2891662K1651036J0173673o432170k251218O457759K20022m597478Q691381
$$ plain form
11569 1021343 20822542 28383354 18135794 7535412 1247530 -14216950 -37169474
11562 -37169474 -48923885 -49335750 -55963662 -63298452 -45710257 -10336710 -769738 -30443968
11554 -30443968 -57202120 -48190581 -27074264 -25865727 -30211063 -13079596 8715446
11547 8715446 -1260335 -36159132 -52523729 -33411178 -6175412 2102719 -5929363 -16226612
11539 -16226612 -23945784 -29148127 -31033418 -31811317 -33573312 -30700161 -16802727 3091719
11531 3091719 18775925 29333224 39332515 45344964 39840933 25640333 14047134 10551682
11523 10551682 12288929 15857555 17860787 12849642 1469058 -4712522 2120339 12101256
11515 12101256 11105464 3149618 4785813 19158780 30281299 24783794 7532850 -7499196
$$ packed form
11569A021343J9801199P560812j0247560j0600382o287882j5464480k2952524
11562c7169474j1754411m11865o627912p334790J7588195L5373547R566972k9674230
11554c0443968k6758152R011539K1116317J208537m345336J7131467K1795042
11547H715446r975781l4898797j6364597J9112551K7235766Q278131q032082j0297249
11539a6226612p719172n202343j885291p77899j761995K873151J3897434J9894446
11531C091719J5684206J0557299R999291O012449n504031j4200600j1593199l495452
11523A0551682J737247L568626K003232n011145j1380584o181580O832861R980917
11515A2101256r95792p955846J636195J4372967J1122519n497505j7250944j5032046
$$ plain form
11507 -7499196 -13010774 -11609742 -9403844 -9507960 -9168773 -2393409 13616191 35920589
11499 35920589 59090422 76427754 78914494 62155956 37570767 27354750 41646943
11492 41646943 66033749 75950641 58849974 22117118 -11820300 -18335232 7646088
11485 7646088 39463834 43063786 17947233 -3222296 -1512693 4277839 -6926270 -23617721
11477 -23617721 -25217690 -20799424 -33857695 -58844916 -65600250 -46266078 -27620843
11470 -27620843 -30319709 -40952483 -35299679 -10238651 19614301 43239380 58983092
11463 58983092 67195864 67028456 57668416 39339115 16341288 -2061259 -9992867 -11673115
11455 -11673115 -11981723 -5183378 14766621 36622774 40773445 26192338 12607119 13046168
$$ packed form
11507g499196n511578J401032K205898j04116L39187O775364J6009600K2304398
11499C5920589K3169833J7337332K486740j6758538k4585189j0216017J4292193
11492D1646943K4386806R916892j7100667l6732856l3937418o514932K5981320
11485G646088L1817746L599952k5116553k1169529J709603N790532j1204109j6691451
11477b3617721j599969M418266j3058271k4987221o755334J9334172J8645235
11470b7620843k698866j0632774N652804K5061028K9852952K3625079J5743712
11463E8983092Q212772j67408r360040j8329301k2997827j8402547p931608j680248
11455a1673115l08608O798345J9949999K1856153M150671j4581107j3585219M39049
$$ plain form
11447 13046168 19307740 18511702 8820711 -6779502 -27216729 -46148709 -51670489 -42321171
11439 -42321171 -32396219 -33539755 -41850694 -49477077 -55183949 -55252493 -40279285 -14150352
11431 -14150352 -364938 -11364620 -24693946 -12143064 16274534 23742244 -221304
11424 -221304 -25721840 -27158355 -15895635 -15288396 -24719979 -27682070 -21079841 -14481085
11416 -14481085 -7705408 7813939 25288173 21800086 -10733851 -48910814 -62672292
11409 -62672292 -47327236 -21376001 -1028941 10931549 16180151 15476493 13394129 16021002
11401 16021002 19502660 11206209 -10691267 -27274633 -18953935 8464174 28529432
11394 28529432 24693655 6154585 -8917277 -15964500 -23507491 -37027533 -52276632
$$ packed form
11447A3046168O261572p96038r690991j5600213k0437227j8931980n521780R349318
11439d2321171R924952j143536q310939p626383n706872o8544J4973208K6128933
11431a4150352J3785414j0999682j3329326J2550882K8417598P467710k3963548
11424b21304k5500536j436515J1262720O07239r431583k962091O602229O598756
11416a4481085O775677J5519347J7474234l488087l2533937l8176963j3761478
11409f2672292J5345056K5951235K0347060J1960490N248602p03658k082364K626873
11401A6021002L481658q296451k1897476j6583366Q320698K7418109K0065258
11394B8529432l835777j8539070j5071862p047223p542991j3520042j5249099
$$ plain form
11387 -52276632 -62539126 -65079946 -60148906 -49188081 -35092224 -20626716 -6626143
11380 -6626143 5136081 9551415 4506305 -1956275 1129445 12789093 21502265 23474628
11372 23474628 28676794 43265698 57483720 60882688 59596442 64901524 72009886 67100059
11364 67100059 52064498 43470265 45290088 41255655 20609146 -4969172 -19397909
11357 -19397909 -23475202 -27349300 -32709292 -33780748 -27910091 -15598080 2146761 18409363
11349 18409363 21961243 12962379 6220775 9304208 10659700 2012564 -2674735 10827565
11341 10827565 29027173 27791173 9257766 -2563535 1732649 9777004 14562917 22645764
11333 22645764 33323548 34760705 25550244 16894161 8777877 -11098718 -37706229 -44488261
$$ packed form
11387e2276632j0262494k540820M931040J0960825J4095857J4465508J4000573
11380f626143J1762224M415334n045110o462580L085720J1659648Q713172J972363
11372B3474628N202166J4588904J4218022L398968j286246N305082P108362m909827
11364F7100059j5035561q594233J819823m034433k0646509k5578318j4428737
11357a9397909m077293l874098n359992j071456N870657J2312011J7744841J6262602
11349A8409363L551880q998864o741604L083433J355492q647136m687299J3502300
11341A0827565J8199608j236000j8533407j1821301M296184Q044355M785913Q082847
11333B2645764J0677784J437157r210461q656083q116284j9876595k6607511o782032
$$ plain form
11325 -44488261 -20873832 9653110 22797034 22704551 23092684 21340804 10204674 -3275499
11317 -3275499 -10011779 -13975260 -17281439 -7973638 16839126 33232815 20092296 -7841680
11309 -7841680 -21505387 -18903799 -17936510 -19667244 -9952318 8428929 16699138 11672235
11301 11672235 7076923 3470903 -12829033 -37313440 -44249730 -24762203 -1182193
11294 -1182193 6781651 5271202 4371636 -1967863 -18035494 -29303781 -22031070 -5431720
11286 -5431720 2071524 -2809945 -10888876 -15859806 -14906209 -5764190 5574857 6835270
11278 6835270 -313442 2611139 20844433 31347269 15982553 -7252657 -10057007 2050070
11270 2050070 -274733 -22729999 -40360433 -39083103 -34819858 -42518192 -50943427 -42203081
$$ packed form
11325d4488261K3614429L0526942J3143924r2483L88133j751880j1136130j3480173
11317c275499o736280l963481l306179R307801K4812764J6393689j3140519k7933976
11309g841680j3663707K601588R67289j730734R714926J8381247Q270209n026903
11301A1672235m595312l606020j6299936k4484407o936290J9487527K3580010
11294a182193P963844j510449q99566o339499j6067631j1268287P272711J6599350
11286e431720P503244m881469q078931m970930R53597R142019J1339047J260413
11278F835270p148712K924581J8233294J0502836j5364716k3235210k804350J2107077
11270B050070k324803k2455266j7630434J277330M263245p698334q425235Q740346
$$ plain form
11262 -42203081 -18391733 5449315 21278116 27746026 22396642 9060583 3605753
11255 3605753 16370459 34371270 35841501 18850676 982845 -6811538 -9635118 -11095700
11247 -11095700 -4056471 13676080 28497429 27011419 14061836 3821273 -539972
11240 -539972 -6460674 -15344023 -19262784 -14574452 -7661924 -4069200 -236886 9874930
11232 9874930 24748150 34202236 25986511 -3551020 -39611546 -54930084 -37038833
11225 -37038833 -6877735 3901979 -6840431 -12051352 1865430 15404091 9266069
11218 9266069 -5242980 -7387143 -26669 1520172 -1280297 553490 -3934777 -30832531
11210 -30832531 -62563353 -59720112 -17664036 22303600 29712809 19725548 13935382 1194654
$$ packed form
11262d2203081K3811348K3841048J5828801O467910n349384j3336059n454830
11255C605753J2764706J8000811J470231j6990825j7867831p794383k823580j460582
11247a1095700P039229J7732551J4821349j486010j2949583j0240563m361245
11240e39972n920702q883349l918761M688332O912528L592724L832314J0111816
11232I874930J4873220R454086q215725k9537531l6060526j5318538J7891251
11225c7038833L0161098J0779714j0742410n210921J3916782J3538661o138022
11218I266069j4509049k144163P360474J546841k800469J833787m488267k6897754
11210c0832531l1730822K843241M2056076L9967636P409209r987261n790166j2740728
$$ plain form
11202 1194654 -32154018 -60806839 -50670703 -17041031 -8763653 -34508371 -47081974
11195 -47081974 -13433862 36347987 52650883 32147029 11374758 10165520 12337395
11188 12337395 -195438 -20626175 -30541815 -22387789 -1943856 18648968 24579115
11181 24579115 7806823 -18831764 -27724541 -7978699 16126489 10989433 -24323164
11174 -24323164 -54238408 -46891898 -8814590 24330603 24665886 -4816596 -38880287
11167 -38880287 -55563028 -53101013 -43869562 -34478416 -18656404 5671158 21982050
11160 21982050 13658386 -5791298 -2627546 29424899 53021899 36212782 42718
11153 42718 -9139373 14365323 29727634 12471622 -9823597 -1421025 27499314 36791699
$$ packed form
11202A194654l3348672k8652821J0136136L3629672Q277378k5744718j2573603
11195d7081974L3648112M9781849J6302896k0503854k0772271j209238K171875
11188A2337395j2532833k0430737r915640Q154026K0443933K0592824N930147
11181B4579115j6772292k6638587q892777J9745842K4105188n137056l5312597
11174b4323164k9915244P346510L8077308L3145193L35283k9482482l4063691
11167c8880287j6682741K462015R231451R391146J5822012K4327562J6310892
11160B1982050q323664j9449684L163752L2052445K3597000j6809117l6170064
11153D2718r182091K3504696J5362311j7256012k2295219Q402572K8920339R292385
$$ plain form
11145 36791699 13410827 -14715129 -19349632 -2584141 17190077 29641319 33118608
11138 33118608 25747265 9543144 -3505246 -1858517 10646136 19067604 16048269 8398517
11130 8398517 4054892 461371 -9110029 -22595231 -29796045 -25792832 -17201376 -11753354
11122 -11753354 -6216288 9033830 33984015 54192178 55738409 41135286 25135723
11115 25135723 16186293 8394885 -6224190 -23477118 -30555276 -21378887 -2554719 14949715
11107 14949715 23526580 18585684 220114 -19983093 -22997588 -3080624 20481599
11100 20481599 23069411 3983911 -14292168 -14246543 1169167 20425488 35840424 40674290
11092 40674290 29303053 8616338 -3216397 1210973 8617860 6307824 774605 2594596
$$ packed form
11145C6791699k3380872k8125956m634503J6765491J9774218J2451242L477289
11138C3118608p371343j6204121j3048390J646729J2504653Q421468l019335p649752
11130H398517m343625l593521r571400j3485202p200814M003213Q591456N448022
11122a1753354N537066J5250118K4950185K0208163J546231j4603123j5999563
11115B5135723q949430p791408j4619075j7252928p078158R176389J8824168J7504434
11107A4949715Q576865m940896j8365570k0203207l014495J9916964K3562223
11100B0481599K587812j9085500j8276079M5625J5415710J9256321J5414936M833866
11092D0674290j1371237k0686715j1832735M427370P406887k310036n533219J819991
$$ plain form
11084 2594596 5491845 -1670482 -10848437 -4017798 16283943 26669803 16120525 1435458
11076 1435458 2851520 17875516 27383055 19001365 -1868653 -18665789 -18209544 -3707484
11068 -3707484 6447737 -1286330 -18560009 -25885130 -17791688 -6953790 -4737387 -9517420
11060 -9517420 -15319295 -20849602 -26769344 -31706090 -32655750 -24583312 -3388186 23497141
11052 23497141 36311707 24547594 3510245 -3844304 4562574 13790765 15559422 9678006
11044 9678006 -8200220 -35374614 -46592703 -20999247 17827130 23294735 -9573719
11037 -9573719 -36930035 -30991861 -13310368 -9089803 -8956631 16752 2967000 -11310683
11029 -11310683 -19412212 -218666 23363181 18972781 -165083 2205737 22774466
$$ packed form
11084B594596K897249p162327r177955O830639K0301741J0385860j0549278j4685067
11076A435458J416062J5023996R507539q381690k0870018j6797136M56245J4502060
11068c707484J0155221p734067j7273679p325121Q093442J0837898K216403m780033
11060i517420n801875n530307n919742m936746r49660Q072438K1195126K6885327
11052B3497141J2814566j1764113k1037349p354549Q406878R228191J768657n881416
11044I678006j7878226k7174394j1218089K5593456L8826377N467605l2868454
11037i573719k7356316N938174J7681493M220565J33172Q973383K950248j4277683
11029a1310683q101529J9193546K3581847m390400j9137864K370820K0568729
$$ plain form
11022 22774466 24532888 -1341618 -25141661 -31609900 -39824548 -60684570 -72699744
11015 -72699744 -56358524 -24026912 456595 9990293 8805399 -1200824 -15051246
11008 -15051246 -21144176 -15590666 -9534471 -14241013 -27784976 -40329407 -43719601 -35432059
11000 -35432059 -22421419 -18014261 -24324042 -24970919 -9655967 4368571 -4019912 -24315042
10992 -24315042 -28307495 -12532886 2206957 9161365 20838163 36387574 38599487
10985 38599487 28194478 27067866 39705495 44833928 34567269 26902541 27354705 15359502
10977 15359502 -13306847 -26916633 -4308212 30695039 46326752 44408806 38560565
10970 38560565 21529486 -13408342 -44549554 -50684161 -47400417 -59761580 -77304249
$$ packed form
11022B2774466J758422k5874506k3800043o468239q214648k0860022j2015174
11015g2699744J6341220L2331612K4483507R533698j184894j0006223j3850422
11008a5051246o092930N553510O056195m706542j3543963j2544431l390194Q287542
11000c5432059J3010640M407158o309781o46877J5314952J4024538q388483k0295130
10992b4315042l992453J5774609J4739843O954408J1676798J5549411K211913
10985C8599487j0405009j126612J2637629N128433j0266659p664728M52164j1995203
10977A5359502k8666349j3609786K2608421L5003251J5631713j917946n848241
10970C8560565j7031079l4937828l1141212o134607L283744j2361163j7542669
$$ plain form
10963 -77304249 -72605690 -48894720 -30851081 -19941795 1152360 26578048 30406141
10956 30406141 11625263 -929970 7100330 18271116 15557680 3497037 -8407809
10949 -8407809 -18086903 -21911119 -16182060 -10422930 -17064492 -27372655 -21276464 -845039
10941 -845039 11957965 11164455 12065346 18380862 14895050 -606525 -8538803 -946969
10933 -946969 5074107 -4472 -203353 14913070 26981654 17259658 -1639578 -3828021
10925 -3828021 13956314 33118590 39011545 30389147 12842615 -3196082 -5634398 7042971
10917 7042971 23113694 33024384 37722619 37653805 27595282 9149782 -5504192 -9665748
10909 -9665748 -9341078 -9571343 -7859784 -4803459 -4493333 -1639833 11331273 21926997
$$ packed form
10963g7304249M698559K3710970J8043639J0909286K1094155K5425688L828093
10956C0406141j8780878j2555233Q030300J1170786k713436j2060643j1904846
10949h407809r679094l824216N729059N759130o641562j0308163O096191K0431425
10941h45039J2803004p93510R00891O315516l485812j5501575p932278P591834
10933i46969O021076n078579j98881J5116423J2068584r721996j8899236k188443
10925c828021J7784335J9162276N892955q622398j7546532j6038697k438316J2677369
10917G042971J6070723R910690M698235o8814j0058523j8445500j4653974m161556
10909i665748L24670k30265J711559L056325L10126K853500J2971106J0595724
$$ plain form
10901 21926997 8545250 -20412609 -29655731 -11476128 -3142581 -29099783 -58764158
10894 -58764158 -51664362 -17569468 3162463 -914201 -8902107 -9505326 -9879907 -10651715
10886 -10651715 -5655987 -1456835 -7149465 -11135962 1564570 16219699 6339269 -20486234
10878 -20486234 -31386344 -21419900 -18775350 -32510190 -35550566 -12380982 13337017
10871 13337017 17550696 11045131 14039120 21001028 14581361 -3837489 -19530374 -26699415
10863 -26699415 -26937184 -17708107 651503 16441443 19500892 14046715 8517898 3746916
10855 3746916 317048 3890706 12781884 14501569 5259718 -2609958 -3206145 -7921319
10847 -7921319 -20036773 -20803179 -1971315 8831989 -15873173 -56678275 -69283479
$$ packed form
10901B1926997j3381747k8957859r243122J8179603Q333547k5957202k9664375
10894e8764158P099796L4094894K0731931m076664p987906o03219l74581p71808
10886a0651715M995728M199152n692630l986497J2700532J4655129r880430k6825503
10878b0486234j0900110R966444K644550j3734840l040376K3169584K5717999
10871A3337017M213679o505565K993989O961908o419667j8418850j5692885p169041
10863b6699415k37769R229077J8359610J5789940L059449n454177n528817m770982
10855C746916l429868L573658Q891178J719685r241851p869676n96187m715174
10847g921319j2115454p66406J8831864J0803304k4705162m0805102j2605204
$$ plain form
10840 -69283479 -45873263 -20989971 -17305494 -19816270 -10980159 412311 365341 -5722850
10832 -5722850 -8174822 -13404642 -28622397 -40364016 -30994427 -9031816 -196380 -9530441
10824 -9530441 -14185989 1027552 20294707 20767170 6001566 -1312282 6090623 11279959
10816 11279959 1243013 -12647300 -11683406 3509532 15624153 14310093 4589758 -6314005
10808 -6314005 -18048244 -30992069 -40936402 -44018294 -41257802 -35953400 -30581653 -25878072
10800 -25878072 -19183424 -7388705 3141799 -2728623 -27578823 -49075685 -45269929
10793 -45269929 -25586572 -15269908 -13604248 3419611 35641390 47443891 19456929
10786 19456929 -17687837 -24524391 -4794650 10388035 12099864 16244938 27232143
$$ packed form
10840f9283479K3410216K4883292L684477k510776Q836111J1392470m6970o088191
10832e722850k451972n229820j5217755j1741619R369589K1962611Q835436r334061
10824i530441m655548J5213541J9267155M72463j4765604p313848P402905N189336
10816A1279959j0036946j3890313R63894J5192938J2114621j314060r720335j0903763
10808f314005j1734239j2943825r944333l081892K760492N304402N371747M703581
10800b5878072O694648J1794719J0530504n870422k4850200k1496862L805756
10793d5269929J9683357J0316664J665660J7023859L2221779J1802501k7986962
10786A9456929l7144766o836554J9729741J5182685J711829M145074J0987205
$$ plain form
10779 27232143 30718868 20364895 5472982 -7558375 -18372767 -18817450 231693
10772 231693 28065867 43286433 44294118 47052431 52110968 41727861 15409135 -560441
10764 -560441 8737709 24609280 26036497 20301779 23336858 28918716 20457922 925934
10756 925934 -11580233 -10835847 -4971629 2738787 15634590 27759317 24965107 5298381
10748 5298381 -15434769 -22743819 -18369896 -13001444 -12452257 -14847455 -15788433 -12848999
10740 -12848999 -7680758 -4627957 -5372393 -6430632 -4838414 -3845948 -8644058 -18364670
10732 -18364670 -27209710 -32223237 -34519455 -33099282 -24038775 -9236605 -1412985 -13537375
10724 -13537375 -41914494 -65071250 -64685535 -45660896 -29328997 -27452111 -31332042 -28487482
$$ packed form
10779B7232143L486725j0353973j4891913j3031357j0814392m44683J9049143
10772B31693K7834174J5220566J007685K758313N058537j0383107k6318726j5969576
10764e60441R298150J5871571J427217n734718L035079N581858q460794j9531988
10756I25934j2506167P44386N864218P710416J2895803J2124727k794210j9666726
10748E298381k0733150p309050M373923N368452N49187k395198r40978K939434
10740a2848999N168241L052801p44436j058239J592218R92466m798110r720612
10732a8364670q845040n013527k296218J420173R060507J4802170P823620j2124390
10724a3537375k8377119k3156756L85715J9024639J6331899J876886l879931K844560
$$ plain form
10716 -28487482 -19569359 -12326377 -8644584 -7484203 -12705571 -25983275 -37857888 -38461882
10708 -38461882 -32189970 -28873942 -26510480 -18611791 -12677923 -20579507 -32754600 -25794244
10700 -25794244 543398 17025845 3908428 -24144006 -42061815 -44423428 -39828092
10693 -39828092 -32611058 -24004455 -18151250 -15333678 -11646082 -13037885 -31806600 -59257113
10685 -59257113 -64143925 -34827631 -1518047 4463919 -6927309 -8554577 -3170303 -12619208
10677 -12619208 -31998538 -32876574 -11053249 4582674 -3388426 -18755571 -23032808 -20554245
10669 -20554245 -20095660 -17167845 -10406808 -13982665 -35362495 -57113160 -58991214 -45219550
10661 -45219550 -32376509 -22059303 -5750293 10823783 10672849 -6797041 -20174942
$$ packed form
10716b8487482Q918123P242982L681793J160381n221368j3277704j1874613o03994
10708c8461882O271912L316028K363462P898689N933868p901584j2175093O960356
10700b5794244K6337642J6482447j3117417k8052434j7917809k361613M595336
10693c9828092P217034Q606603N853205K817572L687596j391803j8768715k7450513
10685e9257113m886812K9316294L3309584N981966j1391228j627268N384274r448905
10677a2619208j9379330q78036K1823325J5635923p971100j5367145m277237K478563
10669b0554245M58585K927815O761037l575857k1379830k1750665j878054J3771664
10661d5219550J2843041J0317206J6309010J6574076j50934j7469890j3377901
$$ plain form
10654 -20174942 -13824799 2575298 10380635 8058493 9824716 21599101 29990954 19857272
10646 19857272 -3963185 -20629711 -17530247 -2262856 10972474 17876184 21855860
10639 21855860 23632268 21485052 16522068 9253095 -4160338 -22889264 -33904867 -26049806
10631 -26049806 -9300233 -5861224 -20256783 -31418366 -19823458 7788375 27739221
10624 27739221 26306453 9852866 -7769994 -19609555 -25789003 -24769161 -12052381
10617 -12052381 8945161 21535795 12453422 -7562992 -14272045 -3883312 799330
10610 799330 -13483262 -27585514 -19641196 -657864 2268234 -13574753 -28303758 -33484011
10602 -33484011 -36074846 -32528366 -10693446 19403628 28302596 10613018 -2415801
$$ packed form
10654b0174942O350143J6400097P805337k322142J766223J1774385Q391853j0133682
10646A9857272k3820457j6666526L099464J5267391J3235330O903710L979676
10639B1855860J776408k147216m962984p268973j3413433j8728926j1015603P855061
10631b6049806J6749573L439009j4395559j1161583J1594908K7611833J9950846
10624B7739221j432768j6453587j7622860j1839561o179448J019842J2716780
10617a2052381K0997542J2590634r082373k0016414o709053J0388733M682642
10610G99330j4282592j4102252P944318J8983332K926098j5842987j4729005n180253
10602c3484011k590835L546480K1834920L0097074Q898968j7689578j3028819
$$ plain form
10595 -2415801 12005350 35288060 37163404 17652383 -509369 -5739294 -3523017 835897
10587 835897 6169455 8062859 3025443 -3286688 -2634231 4922584 13737218 20267552
10579 20267552 23061066 22956095 26323382 37084644 43963930 32120886 10664169 6620156
10571 6620156 23077114 28580496 4440465 -21693353 -13325313 22514281 47523523
10564 47523523 43884778 26226358 10640740 -290576 -5501446 -4691048 -9201827 -30920461
10556 -30920461 -60048356 -74287151 -69302541 -59635016 -51310174 -37427800 -22401796
10549 -22401796 -24899225 -48211254 -68295897 -61928141 -32171790 1314582 22778988
10542 22778988 24797535 7994859 -14027876 -21741139 -11373985 -903956 -7462026
$$ packed form
10595b415801J4421151K3282710J875344j9511021j8161752n229925K216277M358914
10587H35897N333558J893404n037416o312131O52457P556815Q814634O530334
10579B0267552K793514j04971L367287J0761262O879286j1843044k1456717m044013
10571F620156J6456958N503382k4140031k6133818Q368040L5839594K5009242
10564D7523523l638745j7658420j5585618j0931316n210870Q10398m510779k1718634
10556c0920461k9127895j4238795M984610R667525Q324842J3882374J5026004
10549b2401796k497429k3312029k0084643O367756K9756351L3486372K1464406
10542B2778988K018547j6802676k2022735p713263J0367154J0470029o558070
$$ plain form
10535 -7462026 -27163648 -43292749 -46061232 -38013150 -26886425 -19172623 -16263903 -13399045
10527 -13399045 -5810242 3686014 7430347 1812922 -11015976 -26179825 -34970006 -27685472
10519 -27685472 -6846207 9826187 10883593 6982234 11535216 16695881 8832351 -1789236
10511 -1789236 6189322 26326849 27822093 762698 -30314430 -44229188 -46259665 -43863024
10503 -43863024 -28509053 1303290 22821922 15175980 -13276288 -39613235 -53362026
10496 -53362026 -56130553 -51465706 -48031817 -55170396 -64430563 -58240484 -48187196 -71471126
10488 -71471126 -125951404 -145366158 -80816459 19129151 61376775 29099865 -5816318
10481 -5816318 8217757 39657643 39398076 16594766 11272700 26249355 31152729 17637788
$$ packed form
10535g462026j9701622j6129101k768483Q048082J1126725P713802K908720K864858
10527a3399045P588803R496256L744333n617425j2828898j5163849q790181P284534
10519b7685472K0839265J6672394J057406l901359M552982N160665p863530j0621587
10511a789236P978558K0137527J495244k7059395l1077128j3914758k030477K396641
10503d3863024J5353971K9812343K1518632p645942k8452268k6336947j3748791
10496e3362026k768527M664847L433889p138579r260167O190079J0053288k3283930
10488g1471126n4480278j9414754O4549699R9945610M2247624l2276910l4916183
10481e816318J4034075L1439886k59567k2803310n322066J4976655M903374j3514941
$$ plain form
10473 17637788 7622372 9353530 3394217 -19305764 -36091297 -25935163 -2972049
10466 -2972049 4164908 -5435004 -6549678 10878279 25188325 15451777 -7990363 -19853890
10458 -19853890 -14148434 -4052821 4309953 15973455 27075155 25059316 13991250
10451 13991250 15917949 36199171 49776223 37725651 17293718 15293065 29039920
10444 29039920 38169625 41277376 51776269 65087590 61075868 39097862 22260259
10437 22260259 22785551 28516661 29153905 30780012 35928982 33197203 18598845 6353055
10429 6353055 5069120 2087224 -13386607 -28260604 -23976953 -4519330 10853466 13548099
10421 13548099 8853850 1272066 -7715188 -12358988 -7371266 2462507 7824384 6846643
$$ packed form
10473A7637788j0015416J731158n959313k2699981j6785533J0156134K2963114
10466b972049P136957r599912j114674J7427957J4310046r736548k3442140j1863527
10458a9853890N705456J0095613Q362774J1663502J1101700k015839j1068066
10451A3991250J926699K0281222J3577052j2050572k0431933k000653J3746855
10444B9039920R129705L107751J0498893J3311321m011722k1978006j6837603
10437B2260259N25292N731110O37244J626107N148970k731779j4598358j2245790
10429F353055j283935k981896j5473831j4873997M283651J9457623J5372796K694633
10421A3548099m694249p581784q987254m643800M987722R833773N361877r77741
$$ plain form
10413 6846643 3267576 -2009880 -8475683 -10979523 -7217271 -5078613 -11943505 -21033149
10405 -21033149 -19940497 -10593197 -9198049 -24581777 -44349997 -46067968 -20700208 14927147
10397 14927147 30656671 13524825 -15063448 -21613615 -319465 21414934 19132958
10390 19132958 -2585003 -25548023 -40596987 -42853765 -22831598 18173631 55534214
10383 55534214 64335916 48255564 29009338 15990100 4768688 -4112605 -8010685
10376 -8010685 -17145868 -41252328 -64581294 -61168927 -34897182 -15610372 -11931305 -69543
10368 -69543 29160859 44760706 19426004 -25184561 -44238227 -25931057 4164888
10361 4164888 24451980 35368743 39851167 33347542 19062284 12587135 21749781 34523686
$$ packed form
10413F846643l579067n277456o465803k503840L762252K138658o864892r089644
10405b1033149J092652R347300J395148j5383728j9768220j717971K5367760L5627355
10397A4927147J5729524j7131846k8588273o550167K1294150K1734399k281976
10390A9132958k1717961k2963020j5048964k256778K0022167M1005229L7360583
10383E5534214Q801702j6080352j9246226j3019238j1221412q881293l898080
10376h010685r135183k4106460k3328966L412367K6271745J9286810L679067J1861762
10368f9543K9230402J5599847k5334702m4610565j9053666J8307170L0095945
10361D164888K0287092J0916763M482424o503625j4285258o475149R162646J2773905
$$ plain form
10353 34523686 34933422 22139325 7729503 1417960 4635080 12016385 14143401 3738191
10345 3738191 -15890122 -31783320 -34564834 -28079758 -22691868 -22127381 -21587336 -17189693
10337 -17189693 -11346758 -7318712 -3831589 394043 704936 -7064470 -14899234 -7873200
10329 -7873200 13814131 28136172 17345301 -5678115 -11351237 8151129 29701198
10322 29701198 30964931 15862152 1485443 -5561202 -7432211 -861614 18219098 39272343
10314 39272343 42622667 23623426 24539 -10059199 -9367427 -13345516 -25014637 -27588090
10306 -27588090 -5985416 29690754 50835482 42312710 19854311 9405678 15998134
10299 15998134 23449863 20217581 10962679 2212142 -7786858 -19701351 -27329006 -28520358
$$ packed form
10353C4523686M09736j2794097j4409822o311543L217120P381305K127016j0405210
10345C738191j9628313j5893198k781514O485076N387890N64487N40045M397643
10337a7189693N842935M028046L487123M225632L10893p769406p834764P026034
10329g873200K1687331J4322041j0790871k3023416n673122J9502366K1550069
10322B9701198J263733j5102779j4376709p046645j871009O570597J9080712K1053245
10314C9272343L350324j8999241k3598887j0083738O91772l978089j1669121k573453
10306b7588090K1602674L5676170K1144728q522772k2458399j0448633O592456
10299A5998134P451729l232282r254902q750537r999000j1914493p627655j191352
$$ plain form
10291 -28520358 -29905059 -33072162 -28566331 -13177363 -511371 -2310987 -11248474 -16284806
10283 -16284806 -22796468 -39051567 -52882984 -44983786 -21166488 -7317858 -11131586
10276 -11131586 -12105583 4656608 26271173 33929720 28870032 22940282 16673428 2586561
10268 2586561 -16613457 -27747196 -24220439 -14014999 -9780572 -15773720 -25287954 -29538296
10260 -29538296 -28578582 -30137745 -35050396 -31203816 -11501957 8531155 6642766 -14251856
10252 -14251856 -27747515 -20304581 -7526186 -6955909 -12614827 -9016642 3516026 12062466
10244 12062466 10175596 908663 -11051114 -18637718 -12709131 3975625 11367311 -4882959
10236 -4882959 -31489150 -43062257 -33920296 -19310198 -10123883 -3958672 560912 -1189523
$$ packed form
10291b8520358j384701l167103M505831J5388968J2665992j799616q937487n036332
10283a6284806o511662j6255099j3831417P899198K3817298J3848630l813728
10276a1131586r73997J6762191K1614565P658547n059688n929750o266854j4086867
10268B586561j9200018j1133739L526757J0205440M234427n993148r514234m250342
10260b9538296R59714j559163m912651L846580J9701859K0033112j888389k0894622
10252a4251856j3495659P442934J2778395N70277n658918L598185J2532668Q546440
10244A2062466j886870r266933j1959777p586604N928587J6684756P391686j6250270
10236d882959k6606191j1573107R141961J4610098R186315O165211M519584j750435
$$ plain form
10228 -1189523 -7825826 -9987978 -4300883 2603024 6498963 10295135 14293642 14129901
10220 14129901 11491662 14558645 23505661 27165591 19008509 5452802 -6780429 -19933312
10212 -19933312 -34638380 -40857625 -29744369 -8816318 3624991 -2443501 -18945597
10205 -18945597 -26516993 -11418558 18825244 38672314 32079391 13243254 6418455
10198 6418455 9283417 -1292162 -25104014 -29451566 1205189 33267763 26732203 -9146104
10190 -9146104 -32172129 -26447437 -13016550 -7757700 -3766315 1619734 -4120256 -22014535
10182 -22014535 -32325085 -25920859 -20802908 -31982469 -46947135 -48473389 -41365994 -36446796
10174 -36446796 -26697561 -3151737 20487060 25317739 18540120 20483947 28767026 24527616
$$ packed form
10228a189523o636303k162152N687095O903907L895939L796172L998507j63741
10220A4129901k638239L066983Q947016L659930q157082j3555707j2233231j3152883
10212a9933312j4705068o219245J1113256K0928051J2441309o068492j6502096
10205a8945597p571396J5098435L0243802J9847070o592923j8836137o824799
10198F418455K864962j0575579k3811852m347552L0656755L2062574o535560l5878307
10190i146104k3026025N724692J3430887N258850L991385N386049n739990j7894279
10182b2014535j0310550O404226N117951j1179561j4964666j526254P107395M919198
10174c6446796R749235K3545824K3638797M830679o777619J943827Q283079m239410
$$ plain form
10166 24527616 9387772 3771111 7437791 -3705709 -32214066 -44506884 -20692233
10159 -20692233 9186673 5203398 -25173175 -39597873 -21572285 671317 -2939431
10152 -2939431 -26449579 -41114793 -31752195 -10359656 529778 -7676553 -21116986
10145 -21116986 -20097710 -4071504 7249118 1576687 -7656294 -739859 19417305 32175492
10137 32175492 28085318 17088722 8828289 1014053 -8934763 -15079822 -13832469 -14023779
10129 -14023779 -26323675 -45999890 -53956164 -36522348 -1649799 27312918 35666241
10122 35666241 32212062 33962538 39062426 29174471 2810975 -11922042 7324973 42485356
10114 42485356 55651922 36406081 7499538 -11455424 -21833375 -28013119 -27130938
$$ packed form
10166B4527616j5139844n616661L666680j1143500k8508357j2292818K3814651
10159b0692233K9878906l983275l0376573j4424698J8025588K2243602l610748
10152b939431k3510148j4665214R362598K1392539J0889434q206331j3440433
10145b1116986J019276J6026206J1320622n672431r232981O916435K0157164J2758187
10137C2175492m090174j0996596q260433p814236r948816o145059J247353j91310
10129a4023779j2299896j9676215p956274J7433816L4872549K8962717Q353323
10122C5666241l454179J750476N099888r887955k6363496j4733017J9247015L5160383
10114D2485356J3166566j9245841k8906543j8954962j0377951o179744Q82181
$$ plain form
10107 -27130938 -22548742 -24528200 -29162130 -18681793 6343677 17153541 -4954726
10100 -4954726 -38837882 -50401540 -35086008 -14851148 -4913036 -3685742 -7013681 -11508901
10092 -11508901 -8445355 6405242 19309908 12452068 -9968105 -25423148 -21817193
10085 -21817193 -7427099 6292444 15153033 15334171 3807142 -10379458 -10957225 3356395
10077 3356395 14393038 8407753 -6959979 -15932508 -14622710 -10938942 -12644730 -21702800
10069 -21702800 -33762721 -38734323 -29165362 -12204655 -5079832 -13835440 -25152254 -25273656
10061 -25273656 -18152775 -16622040 -23448627 -31514981 -37009377 -40292656 -36323705 -17648138
10053 -17648138 10535583 29436746 26867982 11340186 -86896 -2051122 -1060095 189304
$$ packed form
10107b7130938M582196j979458m633930J0480337K5025470J0809864k2108267
10100d954726l3883156j1563658J5315532K0234860R938112J227294l327939m495220
10092a1508901L063546J4850597J2904666o857840k2420173j5455043L605955
10085b1817193J4390094J3719543Q860589J81138j1527029j4186600n77767J4313620
10077C356395J1036643n985285j5367732q972529J309798L683768j705788r058070
10069b1702800j2059921m971602R568961J6960707P124823q755608j1316814j21402
10061b5273656P120881J530735o826587q066354n494396l283279L968951J8675567
10053a7648138K8183721J8901163k568764j5527796j1427082j964226R91027J249399
$$ plain form
10045 189304 6978006 19354082 26019211 18947435 6733348 3225593 6746402 2566883
10037 2566883 -13770087 -28064748 -27112842 -16203215 -9039520 -7781662 -3325044 7416702
10029 7416702 13999491 4229708 -20471888 -43040636 -44900648 -25180444 -5065256 -6970725
10021 -6970725 -29082846 -48422541 -49639224 -39133289 -27580218 -14295036 840120
10014 840120 5108368 -9951570 -28718395 -28992088 -15598186 -15746577 -38775193 -59641126
10006 -59641126 -50343838 -14312419 19482442 27948027 11837042 -10988719 -22479429
9999 -22479429 -16978288 -1780315 13693737 26807721 37220674 39195168 27370996
9992 27370996 8113051 -4931180 -7304046 -7121706 -11107249 -16056545 -16577705 -13827949
$$ packed form
10045A89304O788702J2376076O665129p071776j2214087l507755L520809m179519
10037B566883j6336970j4294661R51906J0909627P163695J257858M456618J0741746
10029G416702O582789r769783k4701596k2568748j860012J9720204K0115188j905469
10021f970725k2112121j9339695j216683J0505935J1553071J3285182J5135156
10014H40120M268248j5059938j8766825k73693J3393902j48391k3028616k0865933
10006e9641126R297288L6031419L3794861Q465585j6110985k2825761j1490710
9999b2479429N501141J5197973J5474052J3113984J0412953J974494j1824172
9992B7370996j9257945j3044231k372866J82340l985543m949296n21160K749756
$$ plain form
9984 -13827949 -13418967 -19365166 -30893015 -40876669 -39247826 -24430968 -9419057 -8774857
9976 -8774857 -21265270 -33521272 -38464778 -39774604 -39403887 -32894732 -19313873 -5625101
9968 -5625101 2115971 4440171 3899323 2030621 1160525 2045825 751976 -4609013 -7253183
9959 -7253183 -1715529 3702914 -2132173 -12695001 -10750156 3578487 9101399 -7254250
9951 -7254250 -32713487 -46629219 -43375483 -30442399 -14820399 1177682 17835248
9944 17835248 35941607 50594393 48443120 22499109 -11039252 -25265373 -13808750
9937 -13808750 4364155 12655452 13053947 11923757 8017285 1585399 -827887 1236692
9929 1236692 -1146776 -10785887 -19649236 -24689989 -32063738 -39820205 -35266666 -18840193
$$ packed form
9984a3827949M08982n946199j1527849r983654J628843J4816858J5011911O44200
9976h774857j2490413j2256002m943506j309826L70717O509155J3580859J3688772
9968e625101P741072K324200n40848j868702q70096Q85300j293849n360989k644170
9959g253183N537654N418443n835087j0562828J944845J4328643N522912j6355649
9951g254250k5459237j3915732L253736J2933084J5622000J5998081J6657566
9944A7835248J8106359J4652786k151273k5944011l3538361j4226121J1456623
9937a3808750J8172905Q291297L98495j130190l906472o431886k413286K064579
9929A236692k383468r639111q863349n040753p373749p756467M553539J6426473
$$ plain form
9921 -18840193 -11935846 -27855383 -49807686 -51204891 -26919756 5633690 25927953
9914 25927953 23744509 5233600 -8879190 -3832716 8255470 4167756 -14489149 -24618689
9906 -24618689 -22149601 -29232596 -53412927 -71257815 -65684658 -49646125 -38530718 -29331364
9898 -29331364 -21590893 -26620000 -41555822 -49863179 -58938848 -90268476 -119387901 -92409836
9890 -92409836 -31315732 -37191715 -124036464 -136326441 56773228 340098958 461320654
9883 461320654 348539659 182555573 133258857 161647289 144035976 72006019 27868798
9876 27868798 35977674 46916930 37433189 33589456 43732759 42463103 23550448 12497391
9868 12497391 21864663 37080391 47890511 56945456 58227934 41343741 16732703 6336988
$$ packed form
9921a8840193O904347j5919537k1952303j397205K4285135L2553446K0294263
9914B5927953k183444j8510909j4112790N046474J2088186m087714j8656905j0129540
9906b4618689K469088p082995k4180331j7844888N573157J6038533J1115407R199354
9898b9331364P740471n029107j4935822q307357r075669l1329628k9119425K6978065
9890i2409836O1094104n875983q6844749j2289977J93099669K83325730J21221696
9883D61320654j12780995j65984086m9296716K8388432j7611313p2029957m4137221
9876B7868798Q108876J0939256r483741l843733J0143303j269656j8912655j1053057
9868A2497391R367272J5215728J0810120R054945J282478j6884193k4611038j0395715
$$ plain form
9860 6336988 10720124 12456101 8162907 10252592 20791546 29340810 32922198 34849345
9852 34849345 30100437 15189631 3916667 8290668 14016551 3057711 -10214749 1089001
9844 1089001 27526546 31866310 6662233 -13191398 -1765144 26314911 44428990
9837 44428990 45452451 34663571 16971981 2292687 1591191 7848958 1209369 -19257902
9829 -19257902 -30073158 -17425753 4844179 19891467 28405190 34363722 32488678 22682191
9821 22682191 16421896 14995240 1670228 -28249977 -49198249 -37794550 -8672125
9814 -8672125 4130642 -8352103 -25115063 -27491121 -15130398 6612035 33608258
9807 33608258 54912104 56109191 37823585 18824723 13462544 14413006 5003857 -17271415
$$ packed form
9860F336988M383136J735977m293194K089685J0538954Q549264L581388J927147
9852C4849345m748908j4910806j1272964M374001N725883j0958840j3272460J1303750
9844A089001K6437545M339764k5204077j9853631J1426254K8080055J8114079
9837D4428990J023461j0788880j7691590j4679294p01496O257767o639589k0467271
9829a9257902j0815256J2647405K2269932J5047288Q513723N958532j875044r806487
9821B2682191o260295j426656j3325012k9920205k0948272J1403699K9122425
9814h672125J2802767j2482745j6762960k376058J2360723K1742433K6996223
9807C3608258K1303846J197087j8285606j8998862n362179R50462r409149k2275272
$$ plain form
9799 -17271415 -37629005 -41868347 -29228872 -6792710 19705113 43031099 50140193
9792 50140193 34055268 9125456 -396993 9207532 17717622 14879640 18128538 40786953
9784 40786953 61673145 52614219 24731347 15691395 33314864 44632338 26863534
9777 26863534 -1824098 -14771531 -11982471 -5481494 5635547 22370272 26511990 1026594
9769 1026594 -38888969 -58467853 -44015964 -13846226 7238361 8763670 -5360454
9762 -5360454 -21099345 -20965140 -1301992 18349037 15798520 -6106727 -24507128 -25887698
9754 -25887698 -16850675 -8185071 -3094593 -1488550 -2745364 -3159056 -1368026 -4411429
9746 -4411429 -15682665 -20212132 57377 35318126 52057554 34964879 6853289
$$ packed form
9799a7271415k0357590m239342J2639475K2436162K6497823K3325986P109094
9792E0140193j6084925k4929812r522449R604525Q510090k837982L248898K2658415
9784D0786953K0886192r058926k7882872r039952J7623469J1317474j7768804
9777B6863534k8687632j2947433K789060O500977J1117041J6734725M141718k5485396
9769A026594l9915563j9578884J4451889L0169738K1084587J525309j4124124
9762e360454j5738891J34205J9663148J9651029k550517k1905247j8400401j380570
9754b5887698R037023Q665604N090478J606043j256814m13692J791030l043403
9746d411429j1271236m529467K0269509L5260749J6739428j7092675k8111590
$$ plain form
9739 6853289 -3510482 2891994 6571848 3530390 7889000 24388409 37275657 31053613
9731 31053613 10181588 -8038067 -13181835 -8784590 -3618244 -889330 3965692 16006940
9723 16006940 31411237 37416217 25198508 2599366 -10257494 -339580 25041872
9716 25041872 45322333 44995931 24517015 -2659546 -19991493 -17609808 1233960 21550865
9708 21550865 28515300 20743385 9664942 4871957 4382052 1680393 -3569758 -7792280
9700 -7792280 -11666912 -17340723 -19931198 -12234273 1750905 9279375 8007849 10891526
9692 10891526 25175842 37671601 31952979 12093251 -4011739 -9843779 -13551563 -17515724
9684 -17515724 -11938390 5520931 18181936 9761011 -12078642 -23230669 -12814802
$$ packed form
9739F853289j0363771O402476L679854l041458M358610J6499409J2887248o222044
9731C1053613k0872025j8219655n143768M397245N166346K728914M855022J2041248
9723A6006940J5404297O004980j2217709k2599142j2856860R917914K5381452
9716B5041872K0280461l26402k0478916k7176561j7331947K381685J8843768K0316905
9708B1550865O964435p771915j1078443m792985m89905k701659n250151m222522
9700g792280l874632n673811k590475P696925J3985178P528470j271526K883677
9692A0891526J4284316J2495759n718622j9859728j6104990n832040l707784l964161
9684a7515724N577334J7459321J2661005q420925k1839653j1152027J0415867
$$ plain form
9677 -12814802 3179244 81316 -27126490 -55755721 -56890304 -26663796 6205912
9670 6205912 9811613 -14794841 -35030642 -25698382 4071168 27839322 33722360 27907899
9662 27907899 16132047 -692216 -14510907 -12094574 5867625 21398697 21852642 14639893
9654 14639893 12063072 12831502 9035638 2002042 -1908271 -5104876 -14080225 -23688552
9646 -23688552 -20512285 -2841805 15168580 21926846 20514554 19641156 22241934 26191479
9638 26191479 27495485 20350536 3402237 -12190096 -12346702 -765432 3166457 -7693369
9630 -7693369 -17339754 -12466342 -3577715 -6170679 -14130260 -10433996 4181432 13456332
9622 13456332 12412355 11387065 12797371 3407524 -24415005 -57898359 -76714467 -71715798
$$ packed form
9677a2814802J5994046l097928k7207806k8629231j134583L0226508L2869708
9670F205912L605701k4606454k0235801R332260K9769550K3768154N883038n814461
9662B7907899j1775852j6824263j3818691K416333J7962199J5531072M53945p212749
9654A4639893k576821P68430l795864p033596l910313l196605q975349r608327
9646b3688552L176267J7670480J8010385O758266j412292q73398K600778L949545
9638B6191479J304006p144949j6948299j5592333j56606J1581270L931889j0859826
9630g693369r646385M873412Q888627k592964p959581L696264J4615428R274900
9622A3456332j043977j025290J410306r389847k7822529l3483354j8816108M998669
$$ plain form
9614 -71715798 -48858953 -23904676 -13190194 -18753938 -23379707 -12145857 4540533
9607 4540533 5952542 -4114369 -835142 20401268 32629429 18279399 -3067171 -5153038
9599 -5153038 7631409 14968410 15857224 23599045 35880763 36334553 22431681 8461941
9591 8461941 1346529 -5556685 -13974359 -16195364 -11427537 -8058902 -6534129 1623240
9583 1623240 13614986 13512164 -2038334 -14352054 -8976626 4715599 11807697 14493019
9575 14493019 21714733 28671346 24230695 11072384 1100613 -4258839 -11593465 -16305126
9567 -16305126 -5903206 14959172 22883351 8339863 -7219490 -1315280 15372238
9560 15372238 14050217 -9452445 -29251550 -27967126 -18010107 -15111583 -11882902 3897885
$$ packed form
9614g1715798K2856845K4954277J0714482n563744m625769J1233850J6686390
9607D540533J412009j0066911L279227K1236410J2228161j4350030k1346570k085867
9599e153038J2784447P337001Q88814P741821J2281718M53790j3902872j3969740
9591H461941p115412o903214q417674k221005M767827L368635J524773Q157369
9583A623240J1991746j02822j5550498j2313720N375428J3692225P092098K685322
9575A4493019P221714O956613m440651j3158311r971771n359452p334626m711661
9567a6305126J0401920K0862378P924179j4543488j5559353N904210J6687518
9560A5372238j322021k3502662j9799105J284424R957019K898524L228681J5780787
$$ plain form
9552 3897885 20024705 13979080 -9544045 -21141504 -8434195 8776421 11087943 3814990
9544 3814990 -1710766 -8456921 -19590568 -24114871 -16244919 -11951598 -23302797 -31190101
9536 -31190101 -11222350 23199844 34643007 15103964 -5590343 -7086229 -3081454
9529 -3081454 -10133524 -20786203 -22191922 -17776467 -13563123 -2571534 18799781 34609440
9521 34609440 29020567 11220251 2893604 8779829 15505547 13031499 2474241 -12110064
9513 -12110064 -26109960 -32417786 -28582492 -22276775 -20612150 -19564686 -12777178 -3468213
9505 -3468213 2634780 8425852 17628300 22944946 15257716 -299166 -10251946 -10959580
9497 -10959580 -8837608 -5751067 3661546 20866673 38238698 43681491 26736284 -11545493
$$ packed form
9552C897885J6126820o045625k3523125j1597459J2707309J7210616K311522p272953
9544C814990n525756o746155j1133647m524303P869952M293321j1351199p887304
9536c1190101J9967751L4422194J1443163j9539043k0694307j495886M004775
9529c081454p052070j0652679j405719M415455M213344J0991589K1371315J5809659
9521C4609440n588873j7800316q326647N886225O725718k474048j0557258j4584305
9513a2110064j3999896o307826L835294O305717J664625J047464O787508R308965
9505c468213O102993N791072R202448N316646p687230j5556882r952780p07634
9497a0959580K121972L086541R412613J7205127J7372025N442793j6945207l8281777
$$ plain form
9489 -11545493 -48366929 -51490919 -14916869 27768107 40495122 26286680 15848840
9482 15848840 23838485 36418523 37162078 24836209 6636964 -8657443 -11915081 -3786706
9474 -3786706 -540300 -13600108 -28399781 -22654685 -566078 13128777 9352383 897170
9466 897170 -4672909 -11444918 -15254837 -7019058 1826127 -10600138 -35246218 -35743554
9458 -35743554 -4642803 20684024 16400418 9038644 26847707 48982065 40470446 11585898
9450 11585898 -1194340 2319977 -11273921 -47797978 -71073163 -56988485 -25997674
9443 -25997674 -9171373 -10220687 -15385378 -17915376 -16802437 -8296161 5509273 11006939
9435 11006939 -593775 -18936126 -27142502 -22986519 -18306007 -20771200 -24263471 -18214078
$$ packed form
9489a1545493l6821436l123990L6574050M2684976J2727015j4208442j0437840
9482A5848840P989645J2580038P43555j2325869j8199245j5294407l257638Q128375
9474c786706L246406j3059808j4799673N745096K2088607J3694855l776394q455213
9466H97170n570079o772009l809919Q235779Q845185j2426265k4646080m97336
9458c5743554L1100751K5326827m283606p361774J7809063K2134358q511619k8884548
9450A1585898j2780238L514317j3593898l6524057k3275185J4084678L0990811
9443b5997674J6826301j049314n164691k529998J112939Q506276J3805434N497666
9435A1006939j1600714j8342351q206376M155983M680512k465193l492271O049393
$$ plain form
9427 -18214078 -3078060 6650298 -1598739 -19975221 -25390710 -6933310 20401078 35183644
9419 35183644 32626868 19819685 411852 -21419333 -31711319 -20047348 2323106
9412 2323106 14492072 12609133 8978195 9398292 9465743 9591454 13774892 15406130 5041015
9403 5041015 -8471198 -6792034 7183504 11427688 1205305 -2304341 11910306 25218918
9395 25218918 19252641 3373593 -3724019 -1577292 -144640 105132 2521112 1067994
9387 1067994 -9305065 -17972971 -10694356 9708592 27765055 34370993 30809031 21607599
9379 21607599 14021167 16501736 27481385 34059068 30331889 25363625 23425423 12088408
9371 12088408 -14766592 -37244107 -33226105 -11013863 3583555 4663049 7661681 18668285
$$ packed form
9427a8214078J5136018R728358q249037j8376482n415489J8457400K7334388J4782566
9419C5183644k556776j2807183j9407833k1831185j0291986J1663971K2370454
9412B323106J2168966j882939l630938M20097O7451J25711M183438J631238j0365115
9403E041015j3512213J679164J3975538M244184j0222383l509646J4214647J3308612
9395B5218918n966277j5879048p097612K146727J432652K49772K415980j453118
9387A067994j0373059q667906P278615K0402948J8056463O605938l561962r201432
9379B1607599p586432K480569J0979649O577683l727179m968264j938202j1337015
9371A2088408k6855000k2477515M018002K2212242J4597418J079494K998632J1006604
$$ plain form
9363 18668285 26688375 25514510 20133288 10505977 -7454143 -21518241 -9251602 25875179
9355 25875179 47514769 30570645 -5674787 -25637984 -23778359 -21690089 -27934967 -26195085
9347 -26195085 -6248626 14874493 14954484 -2322864 -12946248 -4825995 9846108 15696560
9339 15696560 13670735 12018319 9494553 962172 -6805107 -1487026 13295815 19263723
9331 19263723 9313474 -3746021 -9479415 -13771968 -20979328 -18978289 2442347 29870104
9323 29870104 39751433 26871673 5377237 -11724886 -19795169 -15881976 -764870 15471041
9315 15471041 23207871 25417577 29069661 31004630 25253537 16681025 12003229 5010957
9307 5010957 -11507610 -26478350 -23847038 -9726860 -3724333 -6929839 -3566656 6520367
$$ packed form
9363A8668285Q020090j173865n381222r627311j7960120j4064098J2266639L5126781
9355B5875179K1639590j6944124l6245432j9963197J859625K088270o244878J739882
9347b6195085J9946459K1123119P9991j7277348j0623384Q120253J4672103N850452
9339A5696560k025825j652416k523766q532381p767279N318081J4782841N967908
9331A9263723r950249j3059495n733394m292553p207360K001039K1420636K7427757
9323B9870104R881329j2879760k1494436j7102123q070283L913193J5117106J6235911
9315A5471041P736830K209706L652084J934969n751093q572512m677796o992272
9307E010957j6518567j4970740K631312J4120178O002527l205506L363183J0087023
$$ plain form
9299 6520367 5011128 -10610534 -17478619 -2426469 17019948 19579860 8260024 -1912876
9291 -1912876 -6827047 -9762727 -8756968 -921433 10148005 19811664 26090019 25265160
9283 25265160 17493795 16596997 33614096 50035241 35826611 -295460 -13703584 8327679
9275 8327679 20381532 -11789418 -51523939 -41361099 12649438 53449138 54854877
9268 54854877 41915188 34930281 23932295 5764361 -142181 10604522 12739800 -5808761
9260 -5808761 -20050603 -9470199 6630087 2176775 -12117156 -8858018 10139669 20304634
9252 20304634 16423996 16696297 27597210 33273395 23229436 7770132 503316 3237220
9244 3237220 12352603 23300000 24370221 3614902 -29844425 -46442166 -28944824 5792595
$$ packed form
9299F520367j509239j5621662o868085J5052150J9446417K559912j1319836j0172900
9291a912876m914171k935680J005759P835535J1069438R663659O278355q24859
9283B5265160p771365q96798J7017099J6421145j4208630l6122071j3408124K2031263
9275H327679J2053853l2170950l9734521J0162840N4010537M0799700J405739
9268E4854877j2939689o984907j0997986j8167934n906542J0746703K135278j8548561
9260e808761j4241842J0580404J6100286m453312j4293931L259138J8997687J0164965
9252B0304634l880638K72301J0900913N676185j0043959j5459304p266816K733904
9244C237220R115383J0947397J070221k0755319l3459327j6597741J7497342L4737419
$$ plain form
9236 5792595 27429792 25197516 10619945 -3413245 -12911498 -17026222 -15825238 -13755801
9228 -13755801 -14808580 -13879072 -2969147 12814390 16540739 1747860 -15617063 -15335536
9220 -15335536 2620771 20356342 26094008 26490742 32712334 41341926 35935296 7555529
9212 7555529 -30962366 -55359230 -54057888 -37426895 -21664921 -10447557 863782
9205 863782 9722991 8937979 3914617 10845537 31067139 41974864 25486069 -5156674
9197 -5156674 -21082227 -12969200 3690539 12229273 7697199 -9131313 -31549667 -40964059
9189 -40964059 -21009098 17035818 39409434 27772532 -1061693 -19213030 -17859221
9182 -17859221 -6011611 6918353 16281046 18982462 14729915 5031195 -12346656 -37873937
$$ packed form
9236E792595K1637197k232276j4577571j4033190r498253m114724J200984K069437
9228a3755801j052779R29508J0909925J5783537L726349j4792879j7364923K81527
9220a5335536J7956307J7735571N737666L96734O221592Q629592n406630k8379767
9212G555529l8517895k4396864J301342J6630993J5761974J1217364J1311339
9205H63782Q859209p85012n023362O930920K0221602J0907725j6488795l0642743
9197e156674j5925553Q113027J6659739Q538734m532074j6828512k2418354r414392
9189d0964059J9954961L8044916K2373616j1636902k8834225j8151337J353809
9182a7859221J1847610J2929964R362693K701416m252547r698720j7377851k5527281
$$ plain form
9174 -37873937 -56860937 -47744826 -11953949 20334873 25858116 15126963 10497357 12908557
9166 12908557 8933223 -1278284 -5493860 -2859252 -4172766 -10105943 -8460915 5366838
9158 5366838 21315013 30238371 33088577 33027019 30716047 28445018 27202969 19363404
9150 19363404 -3363076 -33611789 -52057370 -49566944 -35394020 -22156246 -13158436
9143 -13158436 -6238985 -274379 4582468 6138190 216038 -11485526 -17427022 -10310637
9135 -10310637 -1142634 -6472458 -24240989 -36404582 -34426061 -27300410 -23525329 -19783506
9127 -19783506 -10457625 3673364 18380867 27525816 22792736 3483850 -16076450 -22000818
9119 -22000818 -19083855 -17894869 -11268781 12894658 40317516 42291965 21562441 13750670
$$ packed form
9174c7873937j8987000R116111L5790877L2288822N523243j0731153m629606K411200
9166A2908557l975334j0211507m215576K634608j313514n933177J645028J3827753
9158E366838J5948175Q923358K850206o1558k310972k271029j242049p839565
9150A9363404k2726480l0248713j8445581K490426J4172924J3237774Q997810
9143a3158436O919451N964606M856847J555722n922152j1701564n941496P116385
9135a0310637R168003n329824j7768531j2163593J978521P125651L775081L741823
9127a9783506R325881J4130989J4707503R144949m733080j9308886j9560300n924368
9119b2000818K916963J188986O626088K4163439K7422858J974449k0729524p811771
$$ plain form
9111 13750670 33230716 50312762 39532469 19820500 21541725 38458590 42516532
9104 42516532 29488723 19205977 20471528 24230246 25543765 26414625 21089272 3354138
9096 3354138 -14311463 -13168135 1153140 4220204 -10048721 -21141637 -13957733 3648046
9088 3648046 20412515 36013025 47256069 41538978 17478468 -4768912 -8372004 -1868875
9080 -1868875 -1903832 -5900608 232109 14168819 16530740 -1274224 -24813257 -37204925
9072 -37204925 -39371821 -41644024 -44316320 -38669635 -24823597 -15928164 -20344343 -29005439
9064 -29005439 -27759725 -15128086 1697215 22072143 48796124 72086916 74226727
9057 74226727 54625011 34212002 27025873 22568728 7337015 -10874270 -15937906 -9439563
$$ packed form
9111A3750670J9480046J7082046j0780293j9711969J721225J6916865M057942
9104D2516532j3027809j0282746J265551L758718J313519Q70860n325353j7735134
9096C354138j7665601J143328J4321275L067064j4268925j1092916P183904J7605779
9088C648046J6764469J5600510J1243044n717091k4060510k2247380l603092O503129
9080a868875l4957l996776O132717J3936710K361921j7804964k3539033j2391668
9072c7204925k166896k272203k672296N646685J3846038Q895433m416179q661096
9064b9005439J245714J2631639J6825301K0374928K6723981K3290792K139811
9057G4226727j9601716k0413009p186129m457145j5231713j8211285n063636O498343
$$ plain form
9049 -9439563 -5267076 -5186779 330835 9320315 6373618 -12988825 -31861055 -32234375
9041 -32234375 -15526120 1959860 6678508 -1886754 -12524408 -12319175 595986 15590922
9033 15590922 23292779 24027266 17844910 -1743605 -32156904 -51785455 -43923467 -22901017
9025 -22901017 -16091726 -25661015 -31246574 -26934471 -27708532 -36481280 -34193285 -13239644
9017 -13239644 5648371 5090596 -3321981 -3452300 -4340610 -22213282 -46856629 -51821306
9009 -51821306 -32899721 -13683268 -12431214 -21454115 -23053544 -13205694 -4148707 -9095061
9001 -9095061 -26574012 -39135671 -31460357 -10337479 2108922 -2533266 -9295425 -4944348
8993 -4944348 2656746 1656295 -2318002 1414380 6268921 -1439518 -16943146 -22454781
$$ packed form
9049i439563M172487Q0297N517614Q989480k946697j9362443j8872230l73320
9041c2234375J6708255J7485980M718648q565262j0637654K05233J2915161J4994936
9033A5590922P701857P34487o182356j9588515l0413299j9628551P861988K1022450
9025b2901017O809291r569289n585559M312103p74061q772748K287995K0953641
9017a3239644J8888015n57775q412577j30319q88310j7872672k4643347m964677
9009e1821306J8921585J9216453J252054r022901j599429R847850R056987m946354
9001i095061j7478951j2561659P675314K1122878J2446401m642188o762159M351077
8993d944348P601094j000451l974297L732382M854541p708439j5503628n511635
$$ plain form
8985 -22454781 -15443160 -11575303 -19043633 -28263058 -29504142 -24006720 -13926184 2943162
8977 2943162 22913289 34517787 33046701 25868198 18717392 8406065 -5701064 -15191595
8969 -15191595 -15193419 -13610337 -19625211 -30063519 -33804099 -23887485 -1255796 25592135
8961 25592135 40456837 29120832 -3100506 -31500401 -37853977 -29435286 -24525617 -26919043
8953 -26919043 -25896469 -16027413 -3584200 6199567 16144361 28204431 36554437 34799925
8945 34799925 25018764 14998243 9272649 6629898 4823401 3832676 3665901 1397671
8937 1397671 -6906790 -20648074 -32807116 -35828371 -29604512 -22146202 -21622708 -28083609
8929 -28083609 -32978569 -26956361 -9464109 8906311 15466412 7728022 -5271354 -14060779
$$ packed form
8985b2454781P011621L867857p468330r219425j241084N497422J0080536J6869346
8977B943162J9970127J1604498j471086p178503p150806j0311327j4107129r490531
8969a5191595j824J583082o014874j0438308l740580R916614K2631689K6847931
8961B5592135J4864702j1336005l2221338k8399895o353576Q418691M909669k393426
8953b6919043J022574R869056J2443213R783767R944794J2060070Q350006j754512
8945C4799925r781161j0020521n725594k642751j806497r90725j66775k268230
8937A397671q304461j3741284j2159042l021255O223859P458310N23494o460901
8929b8083609m894960O022208J7492252J8370420O560101p738390j2999376q789425
$$ plain form
8921 -14060779 -17141283 -17098936 -14102025 -7368297 1405696 10269864 18042854 19771278
8913 19771278 9203832 -7806709 -12299151 3984533 22510204 20956114 5333654
8906 5333654 -253433 8018523 9448008 -4902688 -17451974 -15091939 -10575704 -17384142
8898 -17384142 -24513914 -16756814 -3050959 -940639 -5617525 -502424 10328343 9387765
8890 9387765 1786456 12231132 41434301 56352613 36738720 5042492 -8251475
8883 -8251475 -6880062 -12648213 -23202321 -15516865 13078099 35824856 33786342 19528400
8875 19528400 13413733 14520560 10371281 3295003 7733768 24358335 34821593 26287380
8867 26287380 7693584 -4881765 -7777261 -6028941 -468565 8691107 12550012 3494178
$$ packed form
8921a4060779l080504M2347K996911O733728Q773993Q864168P772990J728424
8913A9771278j0567446j7010541m492442J6283684J8525671j554090j5622460
8906E333654n587087Q271956J429485j4350696j2549286K360035M516235o808438
8898a7384142p129772P757100J3705855K110320m676886N115101J0830767r40578
8890I387765p601309J0444676K9203169J4918312j9613893l1696228j3293967
8883h251475J371413n768151j0554108P685456K8594964K2746757k038514j4257942
8875A9528400o114667J106827m149279p076278M438765J6624567J0463258q534213
8867B6287380j8593796j2575349k895496J748320N560376R159672L858905r055834
$$ plain form
8859 3494178 -8853547 -8797559 -868768 -4670244 -19929598 -20748393 3256559 23813109
8851 23813109 13048136 -13439091 -20194573 -5325896 3063993 -1301507 7725948 40410736
8843 40410736 67327878 61348604 36193539 21577743 21169031 19600039 15524977 20378972
8835 20378972 31580632 32360593 17512211 -624691 -12189249 -18482072 -19835315 -11718192
8827 -11718192 2874152 10483129 2510669 -14273281 -25535101 -22438315 -7642487 6153517
8819 6153517 6386341 -5081512 -13133871 -10797373 -9592371 -18046091 -22135092 -5031757
8811 -5031757 22704465 34670998 25304928 11406960 280699 -15535904 -29826276
8804 -29826276 -20914323 10220610 29050868 12244493 -21110603 -42203702 -51849033
$$ packed form
8859C494178j2347725N5988P928791l801476j5259354q18795K4004952K0556550
8851B3813109j0764973k6487227o755482J4868677Q389889m365500R027455L2684788
8843D0410736K6917142n979274k5155065j4615796m08712j568992m075062M853995
8835B0378972J1201660P79961j4848382j8136902j1564558o292823j353243Q117123
8827a1718192J4592344P608977p972460j6783950j1261820L096786J4795828J3796004
8819F153517K32824j1467853q052359K336498J205002q453720m089001J7103335
8811e031757K7736222J1966533r366070j3897968j1126261j5816603j4290372
8804b9826276Q911953L1134933J8830258j6806375l3355096k1093099r645331
$$ plain form
8797 -51849033 -62013339 -60945711 -31787636 6515928 15036769 -9602850 -30051038
8790 -30051038 -22950122 -5899280 277534 3811233 17198170 26698614 13677934 -9769005
8782 -9769005 -15391464 -1699632 5904700 -2115882 -4522639 13059449 29099073 14449905
8774 14449905 -22595305 -42266486 -23875634 9008073 21370421 9945361 -415997
8767 -415997 3985859 8372561 -5053623 -29290265 -41653829 -33948308 -21053721 -19817700
8759 -19817700 -29591804 -36957571 -32870237 -20877364 -12453627 -17381801 -34876511 -50731812
8751 -50731812 -47039166 -19921866 13814518 32150377 29129700 16444099 5345889
8744 5345889 -5147377 -19095389 -30988313 -31403461 -22166972 -15006966 -13511526 -7290612
$$ packed form
8797e1849033j0164306J067628K9158075L8303564Q520841k4639619k0448188
8790c0051038P100916J7050842O176814L533699J3386937R500444j3020680k3446939
8782i769005n622459J3691832P604332q020582k406757J7582088J6039624j4649168
8774A4449905l7045210j9671181J8390852L2883707J2362348j1425060j0361358
8767d15997M401856M386702j3426184k4236642j2363564P705521J2894587J236021
8759a9817700r774104p365767M087334J1992873Q423737m928174j7494710j5855301
8751e0731812L692646K7117300L3736384J8335859l020677j2685601j1098210
8744E345889j0493266j3948012j1892924m15148R236489P160006J495440O220914
$$ plain form
8736 -7290612 9936786 26035038 24533301 7358484 -7901403 -10185986 -2232572 11856601
8728 11856601 30113391 41169380 27464901 -8977656 -37725748 -32557530 -5513366
8721 -5513366 7943355 -5094814 -20790537 -13424774 10656893 23535889 11557677
8714 11557677 -11311433 -24640563 -24878104 -21819768 -19274699 -11805671 -1641843 -3801446
8706 -3801446 -23098317 -37637837 -24336820 4320192 12897766 -5709661 -18629900
8699 -18629900 -3169990 19213946 19562104 7059718 8028114 17739628 11245292 -5805621
8691 -5805621 599024 35159325 57931583 41795316 11003152 774135 7243995 5261362
8683 5261362 -5669578 -5674970 6512574 10580404 -1224524 -13520375 -14446426 -11732091
$$ packed form
8736g290612J7227398J6098252j501737j7174817j5259887k284583P953414J4089173
8728A1856601J8256790J1055989j3704479l6442557k8748092N168218K7044164
8721e513366J3456721j3038169j5695723P365763K4081667J2878996j1978212
8714A1557677k2869110j3329130k37541L058336K545069P469028J0163828k159603
8706c801446j9296871j4539520J3301017K8657012Q577574j8607427j2920239
8699a8629900J5459910K2383936L48158j2502386R68396R711514o494336j7050913
8691e805621O404645L4560301K2772258j6136267l0792164j0229017O469860j982633
8683E261362j0930940n392J2187544M067830j1804928j2295851r26051K714335
$$ plain form
8675 -11732091 -16581920 -27366916 -34915268 -32446818 -17202298 6660916 24322527 20871383
8667 20871383 -164408 -17771117 -16560418 -1592220 11936504 15476240 10135872 242737
8659 242737 -10753098 -20946796 -29636721 -35952240 -39159261 -41630617 -47377812 -54582557
8651 -54582557 -55548960 -49089794 -45460473 -51281715 -57810373 -54909052 -48212452 -48016063
8643 -48016063 -48769269 -38450100 -23597689 -22366838 -32522992 -30922096 -10412577 7716269
8635 7716269 8900756 7857489 18298655 22986122 437138 -32892970 -37614850 -5372599
8627 -5372599 28920883 31633003 5528291 -23840750 -36827175 -27998572 -3804771 18084651
8619 18084651 20570445 7501498 824308 9790791 16702185 4473697 -14763168 -14973286
$$ packed form
8675a1732091m849829j0784996p548352K468450J5244520K3863214J7661611l451144
8667B0871383k1035791j7606709J210699J4968198J3528724L539736n340368r893135
8659B42737j0995835j0193698q689925o315519l207021k471356n747195p204745
8651e4582557r66403O459166L629321n821242o528658K901321O696600J96389
8643d8016063p53206J0319169J4852411J230851j0156154J600896K0509519J8128846
8635G716269J184487j043267J0441166M687467k2548984l3330108m721880L2242251
8627e372599L4293482K712120k6104712k9369041j2986425Q828603K4193801K1889422
8619A8084651K485794j3068947o677190Q966483O911394j2228488j9236865k10118
$$ plain form
8611 -14973286 7388630 29566756 33012785 22383940 12791857 11054199 13434181 12587334
8603 12587334 2803727 -14990049 -31054501 -35446525 -29505951 -22256386 -15735006 -2666249
8595 -2666249 20246449 46073556 66434510 76457043 69531329 41433649 6096345
8588 6096345 -8070738 9272144 32522850 30032739 3823508 -17182222 -17219666 -7013125
8580 -7013125 607466 5813174 8214923 15519 -16640099 -23154667 -9183957 9451679
8572 9451679 12038549 1176123 -5648319 -3018728 1926620 9328563 25872466 44499115
8564 44499115 45066668 21222311 -8314825 -22023647 -17269422 -4124784 9698441 19217052
8556 19217052 18749455 9780019 5110430 13170840 22304419 13119527 -13649129 -33063704
$$ packed form
8611a4973286K2361916K2178126L446029j0628845r592083j737658K379982q46847
8603A2587334r783607j7793776j6064452m392024N940574P249565O521380J3068757
8595b666249K2912698K5827107K0360954J0022533o925714k8097680l5337304
8588F096345j4167083J7342882K3250706k490111k6209231k1005730l7444J0206541
8580g013125P620591N205708K401749q199404j6655618o514568J3970710J8635636
8572I451679K586870j0862426o824442K629591M945348P401943J6543903J8626649
8564D4499115N67553k3844357k9537136j3708822M754225J3144638J3823225R518611
8556A9217052m67597q969436m669589Q060410R133579r184892k6768656j9414575
$$ plain form
8548 -33063704 -24160222 4916959 25752071 20594682 -867234 -15503223 -12419629 -671746
8540 -671746 6299820 6322162 4813236 2261691 -5119105 -13972120 -14089571 -3623095 5150914
8531 5150914 1617725 -8368675 -11300217 -5239788 -1375759 -7612201 -18830192 -25048057
8523 -25048057 -23184456 -17774273 -13583040 -10821942 -7241030 -3348976 -3523663 -9516441
8515 -9516441 -14398553 -9479597 885620 333449 -16192669 -28342222 -13371380 19775235
8507 19775235 36767212 22434150 1306314 1812067 15414205 12225904 -10138326 -20106976
8499 -20106976 -73531 23919737 17571397 -12999737 -31372590 -23116212 -12544170
8492 -12544170 -23290544 -44893663 -51426695 -37724747 -20590267 -12825224 -13143349 -18475116
$$ packed form
8548c3063704Q903482K9077181K0835112n157389k1461916j4635989L083594J1747883
8540f71746O971566K2342j508926k551545p380796q853015j17451J0466476Q774009
8531E150914l533189r986400k931542O060429L864029o236442j1217991o217865
8523b5048057J863601N410183M191233K761098L580912L892054j74687n992778
8515i516441m882112M918956J0365217n52171j6526118j2149553J4970842L3146615
8507A9775235J6991977j4333062k1127836N05753J3602138l188301k2364230r968650
8499b0106976K0033445K3993268o348340l0571134j8372853Q256378J0572042
8492a2544170j0746374k1603119o533032J3701948J7134480P765043l18125n331767
$$ plain form
8484 -18475116 -29894243 -44436145 -53606436 -53492886 -47328786 -36697734 -20614117 -5353739
8476 -5353739 -2755334 -12817820 -19096618 -9975291 4469225 6947583 -2773184 -9979356
8468 -9979356 -7465021 -3203580 -5282739 -9950785 -7967452 3833942 19691720 28991852
8460 28991852 23321468 5381305 -9297550 -6421760 10443139 23637888 21668945 7825528
8452 7825528 -10964472 -31710110 -47557637 -45688314 -24137121 -2402827 -1782377 -17957702
8444 -17957702 -25294347 -8386760 21373189 42230176 45069336 36056235 24101858 11791545
8436 11791545 -3609643 -22789509 -37825370 -36664991 -19191780 -3937191 -8567147
8429 -8567147 -25944499 -32017034 -17016778 6105467 25601750 43721905 58394317
$$ packed form
8484a8475116j1419127j4541902r170291J13550O164100J0631052J6083617J5260378
8476e353739K598405j0062486o278798R121327J4444516K478358r720767p206172
8468i979356K514335M261441k079159m668046J983333J1801394J5857778R300132
8460B8991852n670384j7940163j4678855K875790J6864899J3194749j968943j3843417
8452G825528j8790000k0745638j5847527J869323K1551193K1734294O20450j6175325
8444a7957702p336645J6907587K9759949K0856987K839160r013101j1954377j2310313
8436A1791545j5401188j9179866j5035861J160379J7473211J5254589m629956
8429h567147j7377352o072535J5000256K3122245J9496283J8120155J4672412
$$ plain form
8422 58394317 54101645 27374235 2928074 2342903 11059829 2799706 -14679165 -11524168
8414 -11524168 10476864 14683607 -11746372 -33658585 -21535265 3498822 6209606
8407 6209606 -7409165 -6896033 7227106 5664801 -15578939 -23709634 -797565 27382627
8399 27382627 31904348 23254336 28865843 45378168 42642532 11891162 -16813296 -13859004
8391 -13859004 11052056 23805839 10896976 -7483174 -9678858 -702300 1985438 -2239593
8383 -2239593 -284312 7514475 5410166 -9353205 -18160632 -11011370 -4374734 -13586094
8375 -13586094 -25911810 -22258398 -10984236 -14208170 -29466533 -33198357 -19591034 -8294188
8367 -8294188 -11782930 -21222428 -29079123 -39923018 -51278912 -48858633 -31766128 -19450726
$$ packed form
8422E8394317m292672k6727410k4446161n85171Q716926q260123j7478871L154997
8414a1524168K2001032M206743k6429979k1912213J2123320K5034087K710784
8407F209606j3618771N13132J4123139j562305k1243740q130695K2912069K8180192
8399B7382627M521721q650012N611507J6512325k735636l0751370k8704458K954292
8391a3859004K4911060J2753783j2908863j8380150k195684Q976558K687738m225031
8383b239593J955281P798787k104309j4763371q807427P149262O636636r211360
8375a3586094j2325716L653412J1274162l223934j5258363l731824J3607323J1296846
8367h294188l488742r439498p856695j0843895j1355894K420279J7092505J2315402
$$ plain form
8359 -19450726 -21007072 -19938579 -4679731 7828137 -508578 -15988124 -11722623 11628497
8351 11628497 27068200 18029992 -5878040 -27180646 -37582383 -37631524 -33205632 -32424289
8343 -32424289 -36564398 -36317564 -24929785 -10269866 -5561691 -13364365 -25740035 -32921929
8335 -32921929 -25474578 645347 31867029 43183636 29346742 16302736 25826413
8328 25826413 43205462 40975823 21887359 11325797 14203702 9726889 -10170648 -26624137
8320 -26624137 -25803812 -19593055 -21769684 -23989321 -11632793 9731708 19901102 10033881
8312 10033881 -8584893 -19114638 -15535943 -6212275 -4123411 -11933961 -18429804 -13960616
8304 -13960616 -4246886 383260 3909154 17794451 36960747 40577496 21427766 -1409943
$$ packed form
8359a9450726j556346J068493J5258848J2507868q336715j5479546M265501K3351120
8351A1628497J5439703r038208k3908032k1302606j0401737m9141M425892P81343
8343c2424289m140109K46834J1387779J4659919M708175p802674j2375670p181894
8335c2921929P447351K6119925L1221682J1316607j3836894j3044006R523677
8328B5826413J7379049k229639j9088464j0561562K877905m476813j9897537j6453489
8320b6624137Q20325O210757k176629k219637J2356528K1364501J0169394r867221
8312A0033881j8618774j0529745L578695R323668K088864p810550o495843M469188
8304a3960616R713730M630146L525894J3885297J9166296L616749j9149730k2837709
$$ plain form
8296 -1409943 -7153422 2266246 11487608 14523037 17006500 22056881 24580210 18066202
8288 18066202 1270321 -19777923 -33113061 -28342640 -7531703 13671444 19299891
8281 19299891 6741833 -13150194 -26888767 -28615996 -22193900 -14609425 -8194034 -1873508
8273 -1873508 1232079 -4664441 -16051997 -18995650 -6968272 7974299 10154224 -486274
8265 -486274 -12579149 -19324169 -20760369 -17605322 -13103159 -13408965 -16221569 -8994146
8257 -8994146 10021732 21526378 11392899 -5898414 -9174022 -2994281 -4858296 -11732877
8249 -11732877 -7456664 4241286 4398228 -7605546 -15279844 -16366963 -20819530 -20818288
8241 -20818288 -418711 24186729 16585254 -19603842 -36336814 -12304458 15202584
$$ packed form
8296a409943n743479R419668R221362L035429K483463N050381K523329o514008
8288A8066202j6795881k1048244j3335138M770421K0810937K1203147N628447
8281A9299891j2558058j9892027j3738573j727229O422096P584475O415391O320526
8273a873508L105587n896520j1387556k943653J2027378J4942571K179925j0640498
8265d86274j2092875o745020j436200L155047M502163l05806k812604P227423
8257h994146J9015878J1504646j0133479j7291313l275608O179741j864015o874581
8249a1732877M276213J1697950J56942j2003774p674298j087119m452567J242
8241b0818288K0399577K4605440p601475l6189096j6732972K4032356K7507042
$$ plain form
8234 15202584 11702829 -4388938 -3969703 167239 -16326475 -36482965 -25054421 13634728
8226 13634728 43761958 52449319 55826913 58205045 46065277 23828018 19382862 45390924
8218 45390924 80374200 95449349 81837494 50060124 18985253 5708552 11063086
8211 11063086 17532579 14290666 15151134 34309566 55915311 52203675 24757475 1726934
8203 1726934 -2574328 427895 954540 4160416 12510732 17235287 13291597 6531028
8195 6531028 3084281 5443346 17717514 39406176 56458910 54644651 38792892 23439953
8187 23439953 10784322 -4003551 -13766813 -8427377 2873058 2991002 -4286865 -1823619
8179 -1823619 8197555 6945064 -7027968 -15453628 -13690717 -17055958 -29050195 -31869397
$$ packed form
8234A5202584l499755j6091767M19235M136942j6493714k0156490J1428544L8689149
8226A3634728L0127230Q687361L377594K378132j2139768k2237259m445156K6008062
8218D5390924L4983276J5075149j3611855l1777370l1074871j3276701N354534
8211A1063086O469493l241913Q60468J9158432K1605745l711636k7446200k3030541
8203A726934m301262L002223N26645L205876Q350316M724555l943690o760569
8195F531028l446747K359065J2274168K1688662J7052734j814259j5851759j5352939
8187B3439953j2655631j4787873r763262N339436J1300435J17944p277867K463246
8179a823619J0021174j252491j3973032q425660J762911l365241j1994237k819202
$$ plain form
8171 -31869397 -16811524 1266166 8619199 9052277 8391191 4613242 -87236 932876
8163 932876 2141911 -8288841 -22662818 -19473692 953102 14348804 11169395 7157654
8155 7157654 8623509 1029797 -16537075 -20734228 -4182852 7868182 898015 -2845869
8147 -2845869 14018078 29157752 17299042 -6573408 -13766390 -7437146 -6819985 -6812588
8139 -6812588 8754033 28414487 26435135 6931178 -963389 12106690 27735086 33638981
8131 33638981 35375722 35694419 30440959 24367886 24577836 19901412 -5366609 -37464706
8123 -37464706 -42376889 -13141110 19473280 29833446 24979536 20929954 16884864 6701481
8115 6701481 -3582762 -4833951 1278971 8512497 15210546 19001143 13852663 993272
$$ packed form
8171c1869397J5057873J8077690P353033M33078o61086l777949m700478J020112
8163I32876J209035j0430752j4373977L189126K0426794J3395702l179409m011741
8155G157654J465855p593712j7566872m197153J6551376J2051034o970167l743884
8147b845869J6863947J5139674j1858710k3872450p192982O329244O17161P397
8139f812588J5566621J9660454j979352j9503957p894567J3070079J5628396N903895
8131C3638981J736741L18697n253460o073073K09950m676424k5268021l2098097
8123c7464706m912183K9235779L2614390J0360166m853910m049582m045090j0183383
8115F701481j0284243j251189O112922P233526O698049L790597n148480j2859391
$$ plain form
8107 993272 -7097177 -1436295 12687467 24830260 30290356 27607068 16115571 2499411
8099 2499411 -414742 10293226 20693695 17438984 5651691 780963 7742756 17817935
8091 17817935 23692998 27152619 30533179 30305688 24890733 21635499 26551089 30835659
8083 30835659 20511074 577723 -6103826 8281489 21168165 12217833 -3784307
8076 -3784307 710932 21744536 31141758 23231150 20109676 27304428 21515029 -4516873
8068 -4516873 -20949277 -6115786 18328175 23285823 15375677 14759578 15303751 1709727
8060 1709727 -13762746 -9748019 3195444 -1539695 -19624542 -23353533 -9476996 116123
8052 116123 2201626 15354659 37193653 39893224 16931160 -3701887 -4933881 -4096446
$$ packed form
8107I93272q090449N660882J4123762J2142793N460096k683288j1491497j3616160
8099B499411k914153J0707968J0400469l254711j1787293m870728O961793J0075179
8091A7817935N875063L459621L380560k27491n414955l255234M915590M284570
8083C0835659j0324585j9933351o681549J4385315J2886676q950332j6002140
8076c784307M495239K1033604R397222p910608l121474P194752n789399k6031902
8068d516873j6432404J4833491K4443961M957648p910146o16099N44173j3594024
8060A709727j5472473M014727J2943463m735139j8084847l728991J3876537R593119
8052A16123K085503J3153033K1838994K699571k2962064k0633047j231994Q37435
$$ plain form
8044 -4096446 -16548786 -28634682 -24561592 -11865642 -2308820 6986199 16608952 14819995
8036 14819995 2294544 1263933 19601673 30459017 11418949 -18188288 -25930489
8029 -25930489 -14164540 -10379281 -22547010 -33611176 -33451055 -28472886 -21767744 -9379187
8021 -9379187 1615268 -6144011 -34376904 -59662173 -58330424 -32752283 -7475163 -3442257
8013 -3442257 -18483728 -31684019 -26991594 -11014939 -3189572 -11308315 -26289801 -38950969
8005 -38950969 -47324767 -46481121 -29761747 -6602669 70809 -14266647 -23852092 -7457769
7997 -7457769 20030711 28370212 12247192 -8296548 -19056858 -23220022 -25941451 -26391285
7989 -26391285 -25577298 -27191688 -28532827 -21193466 -2821244 18163237 29582261 24626924
$$ packed form
8044d096446j2452340j2085896M073090J2695950R556822R295019R622753j788957
8036A4819995j2525451j030611J8337740J0857344j9040068k9607237p742201
8029b5930489J1765949L785259j2167729j1064166J60121M978169O705142J2388557
8021i379187J0994455p759279k8232893k5285269J331749K5578141K5277120M032906
8013c442257j5041471j3200291M692425J5976655P825367q118743j4981486j2661168
8005c8950969q373798Q43646J6719374K3159078O673478j4337456r585445J6394323
7997g457769K7488480Q339501j6123020k0543740j0760310m163164k721429m49834
7989b6391285Q13987j614390j341139P339361J8372222K0984481J1419024m955337
$$ plain form
7981 24626924 8638038 -1335606 7116569 22882837 21877359 1562594 -12664437 -5728519
7973 -5728519 3168798 -6897234 -21683142 -14487189 7572074 12790396 -3733742 -12344857
7965 -12344857 1799903 13894114 -334816 -24991005 -27584558 -7945118 1253282
7958 1253282 -19584505 -51214209 -62173804 -47789595 -30484764 -25518665 -21518422 -2740566
7950 -2740566 20775170 23276806 2199001 -14000936 -5420582 11016186 8426902 -10662379
7942 -10662379 -23069014 -22338789 -22069218 -25908939 -20958208 -4342535 8402337 9908326
7934 9908326 13847223 28576125 37116047 21463289 -5584108 -12981906 8484731 35794115
7926 35794115 43957420 33381324 23394685 27793756 42478192 53369316 51788882 41303813
$$ packed form
7981B4626924j5988886r973644Q452175J5766268j005478k0314765j4227031O935918
7973e728519Q897317j0066032j4785908P195953K2059263N218322j6524138q611115
7965a2344857J4144760J2094211j4228930k4656189k593553J9639440R198400
7958A253282k0837787l1629704j0959595J4384209J7304831M966099M000243J8777856
7950b740566K3515736K501636k1077805j6199937Q580354J6436768k589284j9089281
7942a0662379j2406635P30225K69571l839721M950731J6615673J2744872J505989
7934I908326L938897J4728902Q539922j5652758k7047397p397798K1466637K7309384
7926C5794115Q163305j0576096r986639M399071J4684436J0891124j580434j0485069
$$ plain form
7918 41303813 30239564 19908859 4860431 -14375330 -25774774 -19683930 -4582115
7911 -4582115 95074 -12215565 -27221349 -29637931 -22342592 -16847848 -11467688 5840522
7903 5840522 32449097 46178173 34534533 14765501 10322285 17584966 14486966 -3388069
7895 -3388069 -16770481 -13256116 -2964592 1200461 -528530 -5756355 -17159451 -27982335
7887 -27982335 -19437246 11824455 39238361 37337927 15603522 3179665 9327454 18132387
7879 18132387 15715886 3401577 -12229111 -24193104 -22370150 -3085694 19480787
7872 19480787 26686024 18788952 10544662 6876439 250054 -9575278 -12725370 -8194611
7864 -8194611 -7192990 -13032772 -14540021 -5719376 3053330 857748 -9359246 -19100760
$$ packed form
7918D1303813j1064249j0330705j5048428j9235761j1399444O090844J5101815
7911d582115M677189j2310639j5005784k416582P295339N494744N380160J7308210
7903E840522K6608575J3729076j1643640j9769032m443216P262681l098000j7875035
7895c388069j3382412L514365J0291524M165053j728991n227825j1403096j0822884
7887b7982335Q545089L1261701K7413906j900434k1734405j2423857O147789Q804933
7879A8132387k416501j2314309j5630688j1963993J822954J9284456K2566481
7872A9480787P205237p897072q244290l668223o626385r825332l150092M530759
7864h194611J001621n839782j507249Q820645Q772706k195582j0216994r741514
$$ plain form
7856 -19100760 -25316860 -25800411 -14478438 9541823 34801639 46285594 37630168 13070320
7848 13070320 -15659581 -33307360 -31507992 -18337719 -9410874 -7988790 -3758697 7051690
7840 7051690 12915279 3782321 -14084891 -26851441 -28316666 -20406971 -6747498 7242004
7832 7242004 14327229 12551903 8245853 7222099 7250188 3135911 -5261274 -13991238 -20244714
7823 -20244714 -23267750 -22793754 -19007756 -12994757 -7535514 -8096853 -18692096 -33502939
7815 -33502939 -38900443 -30059638 -19080319 -18795841 -26286835 -32684497 -39771952 -51401104
7807 -51401104 -56466165 -40660403 -12017472 5905716 5800900 980402 -2077821 -11832380
7799 -11832380 -27658881 -31759752 -15123218 8518995 25307225 38993775 54304794
$$ packed form
7856a9100760o216100m83551J1321973K4020261K5259816J1483955q655426k4559848
7848A3070320k8729901j7647779J799368J3170273Q926845J422084M230093J0810387
7840G051690N863589r132958j7867212j2766550j465225P909695J3659473J3989502
7832G242004P085225j775326m306050j023754K8089m114277q397185q729964o253476
7823b0244714l023036M73996L785998O012999N459243n61339j0595243j4810843
7815c3502939n397504Q840805J0979319K84478p490994o397662p087455j1629152
7807e1401104n065061J5805762K8642931J7923188j04816m820498l058223r754559
7799a1832380j5826501m100871J6636534K3642213J6788230J3686550J5311019
$$ plain form
7792 54304794 60659728 47327278 21598631 -962844 -13437203 -16165531 -12452192 -14056455
7784 -14056455 -34342420 -65430134 -79330817 -63670854 -38619071 -25895655 -21313239
7777 -21313239 -13966307 -10583814 -18747644 -25317820 -17292376 -7907927 -14045397 -21811610
7769 -21811610 -6491050 22540705 31090951 11629037 -7464982 -6206613 4467490
7762 4467490 10441797 15714141 25436642 31692557 28313057 21240818 14485171 3498937
7754 3498937 -8517088 -5929712 16310468 40077423 46086208 36907719 28967868 32439198
7746 32439198 46200017 61417109 63838278 44556542 14624469 -3356411 -3610999 -3341178
7738 -3341178 -14823084 -27573448 -27461825 -18185308 -12101588 -12510863 -16304898 -22101173
$$ packed form
7792E4304794O354934j3332450k5728647k2561475j2474359k728328L713339j604263
7784a4056455k0285965l1087714j3900683J5659963K5051783J2723416M582416
7777b1313239P346932L382493q163830o570176Q025444R384449o137470p766213
7769b1811610J5320560K9031755Q550246j9461914j9094019J258369J0674103
7762D467490N974307N272344R722501O255915l379500p072239o755647j0986234
7754C498937j2016025K587376K2240180K3766955O008785r178489p939851L471330
7746C2439198J3760819J5217092K421169j9281736k9932073j7980880k54588K69821
7738c341178j1481906j2750364J11623R276517O083720m09275l794035n796275
$$ plain form
7730 -22101173 -24851207 -15372042 2296309 6130656 -16272187 -46232824 -55913273 -42461061
7722 -42461061 -24249590 -11978004 -2210807 5869537 7201218 4258937 7413038 19672491
7714 19672491 32456527 36769191 29437385 11620470 -8164733 -14281470 -179353 19775432
7706 19775432 27974377 27397804 31630729 37741394 31762786 19326577 24287932 50842810
7698 50842810 72072723 67471782 49402287 37819166 30467953 18269235 11629576 24833018
7690 24833018 44883963 44241507 21889347 5197727 8451032 14743667 7057853 -5563187
7682 -5563187 -6620686 923507 3590068 1156794 2842669 6794428 3089661 -4102650
7674 -4102650 3090461 28193534 48561599 41830057 13810643 -11379209 -21867018 -25354918
$$ packed form
7730b2101173k750034R479165J7668351L834347k2402843k9960637r680449J3452212
7722d2461061J8211471J2271586R767197Q080344J331681k942281L154101J2259453
7714A9672491J2784036M312664p331806j7816915j9785203o116737J4102117J9954785
7706A9775432Q198945n76573M232925O110665n978608j2436209M961355K6554878
7698E0842810K1229913m600941j8069495j1583121p351213j2198718o639659J3203442
7690B4833018K0050945o42456k2352160j6691620L253305O292635p685814j2621040
7682e563187j057499P544193K666561k433274J685875L951759l704767p192311
7674d102650P193111K5103073K0368065o731542k8019414k5189852j0487809l487900
$$ plain form
7666 -25354918 -29099629 -28252126 -18547234 -7869920 -5640675 -7974496 -3907883 7045615
7658 7045615 13786004 9320265 -1636184 -11200782 -15638393 -13115912 -3881510 4428155
7650 4428155 1399390 -11851829 -22453018 -24514614 -26431442 -31923885 -27528305 -3175538
7642 -3175538 25365638 33074733 19350706 6315336 6080297 9464015 7426523 2551899
7634 2551899 -4661210 -19351951 -34700258 -32479356 -12684992 -1501948 -13896983 -28197053
7626 -28197053 -18745339 3581830 9917232 149167 5668 15301263 21234015 2935289
7618 2935289 -21288574 -28762467 -22159591 -16406561 -13938966 -9315716 -5399351 -7620999
7610 -7620999 -9826253 -2006013 11305253 14513678 3006218 -9380105 -7712323 6273797
$$ packed form
7666b5354918l744711Q47503R704892J0677314K229245k333821M066613J0953498
7658G045615O740389m465739j0956449r564598m437611K522481R234402Q309665
7650D428155l028765j3251219j0601189k061596j916828n492443M395580K4352767
7642c175538K8541176P709095j3724027j3035370k35039L383718k037492m874624
7634B551899p213109j4690741j5348307K220902J9794364J1183044j2395035j4300070
7626b8197053R451714K2327169O335402r768065j43499J5295595N932752j8298726
7618B935289k4223863p473893O602876N753030K467595M623250L916365k221648
7610g620999k205254P820240J3311266L208425j1507460j2386323J667782J3986120
$$ plain form
7602 6273797 17409585 14807686 2675808 -7323302 -12012887 -19514856 -34036432 -45297903
7594 -45297903 -41227476 -26215422 -15812836 -15590212 -17372400 -16096882 -17004176 -23416470
7586 -23416470 -29991771 -32527230 -33226130 -31913450 -23788726 -11558904 -8141759 -19521401
7578 -19521401 -34055622 -36103289 -23040229 -4205395 8455230 5550170 -12372899
7571 -12372899 -28170929 -21998599 1799311 15269020 2130536 -21231365 -28942013
7564 -28942013 -15837850 5141760 20745357 21483546 4156427 -16223155 -14096846 10908340
7556 10908340 24302873 3638281 -23422207 -15966922 19189030 36859708 17935398
7549 17935398 -9611212 -15576191 -1886007 14092563 22504019 17996320 -1926186 -24787059
$$ packed form
7602F273797J1135788k601899j2131878r999110m689585p501969j4521576j1261471
7594d5297903M070427J5012054J0402586K22624j782188J275518r07294o412294
7586b3416470o575301k535459o98900J312680Q124724J2229822L417145j1379642
7578a9521401j4534221k047667J3063060J8834834J2660625k905060j7923069
7571a2372899j5798030O172330K3797910J3469709j3138484k3361901p710648
7564b8942013J3104163K0979610J5603597P38189j7327119k0379582K126309K5005186
7556A0908340J3394533k0664592k7060488P455285L5155952J7670678j8924310
7549A7935398k7546610n964979J3690184J5978570Q411456m507699j9922506k2860873
$$ plain form
7541 -24787059 -29482343 -14064143 866282 2779037 769020 2160759 -543873 -8777142
7533 -8777142 -7832149 7830005 20765569 17871402 10704130 11267452 9471372 -3230262
7525 -3230262 -8706709 10702169 35290994 30896132 918787 -17731465 -9708061 170325
$$ packed form
7541b4787059m695284J5418200J4930425J912755k010017J391739k704632q233269
7533h777142R44993J5662154J2935564k894167p167272N63322j796080j2701634
7525c230262n476447J9408878K4588825m394862k9977345j8650252Q023404R878386
$$ [...]
##END NTUPLES=NMR SPECTRUM
##END=
