##TITLE=31Pdec_SR147rek
 CDCl3, 124 sc
 17.10.2022
##JCAMPDX= 6.0         $$ Bruker NMR JCAMP-DX V2.0
##DATA TYPE= NMR SPECTRUM
##DATA CLASS= NTUPLES
##ORIGIN= UXNMR, Bruker Analytische Messtechnik GmbH
##OWNER= root
$$ XWIN-NMR		Version 3.5
$$ Mon Oct 17 16:44:57 2022 Russian Standard Time (UT+4h)  she@DPX200
##.OBSERVE FREQUENCY= 81.013821
##.OBSERVE NUCLEUS= ^31P
##.ACQUISITION MODE= SIMULTANEOUS
##.ACQUISITION SCHEME= undefined
##.AVERAGES= 124
##.DIGITISER RES= 16
##SPECTROMETER/DATA SYSTEM= spect
##.PULSE SEQUENCE= zgpg30
##.SOLVENT NAME= DMSO
##.SHIFT REFERENCE= (INTERNAL, DMSO, 0, 248.564)
##AUDIT TRAIL= $$ (NUMBER, WHEN, WHO, WHERE, WHAT)
$$ ##TITLE= Audit trail, XWIN-NMR		Version 3.5
$$ ##JCAMPDX= 5.01
$$ ##ORIGIN= Bruker BioSpin GmbH
$$ ##OWNER= she
$$ F:/spectra/data/she/nmr/P31/1/pdata/1/auditp.txt
$$ ##AUDIT TRAIL=  $$ (NUMBER, WHEN, WHO, WHERE, WHAT)
(   1,<2022-10-17 16:43:21.51 +0400>,<she>,<DPX200>,
      <continue with go, POWCHK disabled, PULCHK disabled
       configuration hash MD5:
       00 E9 B6 7A A2 85 ED C7 34 08 36 98 17 FE 4E 26
       data hash MD5: 32K
       C2 8B F3 DF DA 38 7A 66 32 1E A0 01 B9 AD F7 F2>)
(   2,<2022-10-17 16:43:59.78 +0400>,<she>,<DPX200>,
      <Start of raw data processing
       efp BC_mod = 2 LB = 1 FT_mod = 6 PKNL = 1 PHC0 = -10258.67 PHC1 = 93.65658 SI = 64K 
       data hash MD5: 64K
       60 DF E7 F5 5D 5D A7 D9 83 09 85 07 F5 7C 5D B4>)
(   3,<2022-10-17 16:44:20.42 +0400>,<she>,<DPX200>,
      <pk PHC0 = -4.148806 PHC1 = 0 
       data hash MD5: 64K
       67 A4 E4 8C 61 AB F4 F3 42 81 D5 C3 3F D4 3E 83>)
(   4,<2022-10-17 16:44:23.43 +0400>,<she>,<DPX200>,
      <abs ABSG = 5 
       data hash MD5: 64K
       21 C8 6A 27 B5 08 2D 3E 65 04 F6 F4 BF 6B EF 5A>)
$$ ##END=
$$ 
$$ hash MD5
$$ 87 6F 11 1E C1 89 74 5C 90 CD 9C CE BD 81 80 B5
##$RELAX= 
##$RELAX= 
##$RELAX= 
##$RELAX= 
##$RELAX= 
##$RELAX= 
##$RELAX= 
##$RELAX= 
##$RELAX= 
$$ Bruker specific parameters
$$ --------------------------
##$DU= <F:/spectra>
##$EXPNO= 1
##$NAME= <P31>
##$PROCNO= 1
##$TYPE= <nmr>
##$USER= <she>
##$AMP= (0..31)
100 100 100 100 100 100 100 100 100 100 100 100 100 100 100 100 100 100 
100 100 100 100 100 100 100 100 100 100 100 100 100 100 
##$AQSEQ= 0
##$AQ_mod= 1
##$AUNM= <au_zg>
##$AUTOPOS= <>
##$BF1= 81.014009
##$BF2= 200.13
##$BF3= 200.13
##$BF4= 200.13
##$BF5= 200.13
##$BF6= 200.13
##$BF7= 200.13
##$BF8= 200.13
##$BYTORDA= 1
##$CFDGTYP= 0
##$CFRGTYP= 5
##$CHEMSTR= <none>
##$CNST= (0..31)
1 1 145 1 1 1 1 1 1 1 1 1 1 1 1 1 1 1 1 1 1 1 1 1 1 1 1 1 1 1 1 1 
##$CPDPRG= <waltz16>
##$CPDPRG1= <>
##$CPDPRG2= <waltz16>
##$CPDPRG3= <>
##$CPDPRG4= <mlev>
##$CPDPRG5= <mlev>
##$CPDPRG6= <mlev>
##$CPDPRG7= <mlev>
##$CPDPRG8= <mlev>
##$CPDPRGB= <>
##$CPDPRGT= <>
##$D= (0..31)
0 1 0 0 0 0 0 0 0 0 0 0.03 2e-05 3e-06 0 0 0 0 0 0 0 0 0 0 0 0 0 0 0 0 
0 0 
##$DATE= 1666010429
##$DBL= (0..7)
120 120 120 11 120 120 24 19 
##$DBP= (0..7)
150 150 150 150 150 150 150 150 
##$DBP07= 0
##$DBPNAM0= <>
##$DBPNAM1= <>
$$ [...]
##$SUBNAM3= <"">
##$SUBNAM4= <"">
##$SUBNAM5= <"">
##$SUBNAM6= <"">
##$SUBNAM7= <"">
##$SUBNAM8= <"">
##$SUBNAM9= <"">
##$SW= 501.771253377433
##$SWIBOX= (0..15)
0 1 3 0 0 0 0 0 0 0 0 0 0 0 0 0 
##$SW_h= 40650.406504065
##$TD= 32768
##$TD0= 1
##$TE= 0
##$TE2= 300
##$TE3= 300
##$TEG= 300
##$TL= (0..7)
0 120 53 12 22 120 120 120 
##$TP= (0..7)
150 150 150 150 150 150 150 150 
##$TP07= 0
##$TPNAME0= <>
##$TPNAME1= <>
##$TPNAME2= <>
##$TPNAME3= <>
##$TPNAME4= <>
##$TPNAME5= <>
##$TPNAME6= <>
##$TPNAME7= <>
##$TPOAL= (0..7)
0.5 0.5 0.5 0.5 0.5 0.5 0.5 0.5 
##$TPOFFS= (0..7)
0 0 0 0 0 0 0 0 
##$TUNHIN= 0
##$TUNHOUT= 0
##$TUNXOUT= 0
##$USERA1= <user>
##$USERA2= <user>
##$USERA3= <user>
##$USERA4= <user>
##$USERA5= <user>
##$V9= 5
##$VALIST= <valist>
##$VCLIST= <CCCCCCCCCCCCCCC>
##$VD= 0
##$VDLIST= <DDDDDDDDDDDDDDD>
##$VPLIST= <PPPPPPPPPPPPPPP>
##$VTLIST= <TTTTTTTTTTTTTTT>
##$WBST= 1024
##$WBSW= 4
##$XGAIN= (0..3)
0 0 0 0 
##$XL= 0
##$YL= 0
##$YMAX_a= 12026
##$YMIN_a= -16584
##$ZGOPTNS= <>
##$ZL1= 120
##$ZL2= 120
##$ZL3= 120
##$ZL4= 120
##$ABSF1= 248.5645
##$ABSF2= -253.2056
##$ABSG= 5
##$ABSL= 3
##$ALPHA= 0
##$AQORDER= 0
##$ASSFAC= 0
##$ASSFACI= 0
##$ASSFACX= 0
##$ASSWID= 0
##$AUNMP= <proc_1d>
##$AZFE= 0.1
##$AZFW= 0.5
##$BCFW= 0
##$BC_mod= 2
##$BYTORDP= 0
##$COROFFS= 0
##$CY= -3
##$DATMOD= 1
##$DC= 0
##$DFILT= <>
##$DTYPP= 0
##$F1P= 0
##$F2P= 0
##$FCOR= 1
##$FTSIZE= 65536
##$FT_mod= 6
##$GAMMA= 0
##$GB= 0
##$INTBC= 1
##$INTSCL= 6.834604e-11
##$ISEN= 30
##$LB= 1
##$LEV0= 0
##$LPBIN= 0
##$MAXI= 10000
##$MC2= 0
##$MEAN= 0
##$ME_mod= 0
##$MI= 50
##$NCOEF= 0
##$NC_proc= -8
##$NLEV= 6
##$NOISF1= 182.463
##$NOISF2= 159.3651
##$NSP= 0
##$NTH_PI= 0
##$NZP= 0
##$OFFSET= 248.5645
##$PC= 4
##$PHC0= -10262.82
##$PHC1= 93.65658
##$PH_mod= 1
##$PKNL= yes
##$PPARMOD= 0
##$PSCAL= 0
##$PSIGN= 0
##$REVERSE= no
##$SF= 81.0140089999694
##$SI= 65536
##$SIGF1= 159.3651
##$SIGF2= -187.1042
##$SINO= 113.3802
##$SIOLD= 16384
##$SREGLST= <1H.CDCl3>
##$SSB= 0
##$STSI= 65536
##$STSR= 0
##$SW_p= 40650.406504065
##$SYMM= 0
##$S_DEV= 0
##$TDeff= 32768
##$TDoff= 0
##$TI= <>
##$TILT= no
##$TM1= 0
##$TM2= 0
##$TOPLEV= 0
##$USERP1= <user>
##$USERP2= <user>
##$USERP3= <user>
##$USERP4= <user>
##$USERP5= <user>
##$WDW= 1
##$XDIM= 65536
##$YMAX_p= 425890346
##$YMIN_p= -107680840
$$ End of Bruker specific parameters
$$ ---------------------------------
##NTUPLES= NMR SPECTRUM
##VAR_NAME=  FREQUENCY,     SPECTRUM/REAL,   SPECTRUM/IMAG
##SYMBOL=    X,             R,               I
##VAR_TYPE=  INDEPENDENT,   DEPENDENT,       DEPENDENT
##VAR_FORM=  AFFN,          ASDF,            ASDF
##VAR_DIM=   65536,         65536,           65536
##UNITS=     HZ,            ARBITRARY UNITS, ARBITRARY UNITS
##FACTOR=    0.620285442955139, 1,           1
##FIRST=     20137.2065510682, 0,            0
##LAST=      -20513.1999529968, 0,           0
##MIN=       -20513.1999529968, -107680840,  0
##MAX=       20137.2065510682, 425890346,    0
$$ Real data points
##PAGE= N=1
##DATA TABLE= (X++(R..R)), XYDATA
$$ [...]
44640 22625567 11215517 -2840356 -11125445 -14003879 -17383579 -23424936 -26105533 -19441940
44632 -19441940 -9274411 -9191836 -21241086 -29124302 -18326517 3755682 18008656 18830298
44624 18830298 16522024 17060290 14591653 6317894 193680 1380783 3165269 -363867
44616 -363867 -2950746 2554236 10001159 8568276 -202966 -6069257 -7285839 -11660949
44608 -11660949 -21101558 -27029884 -23494644 -15373351 -10389618 -10436627 -13565946 -17661242
44600 -17661242 -19029886 -13479854 -2362248 6889416 8556994 3110402 -6153091 -14701659
44592 -14701659 -14723829 -384010 21407789 33807049 29016703 17586328 13228895 15670510
44584 15670510 16012901 12351151 9992306 10125979 9020831 7270202 9692071 15237748
44576 15237748 16149876 9581222 2525282 2186123 7563497 13348117 16391692 15316153
44568 15316153 9311268 1170705 -3153483 -2138060 -1927112 -7762973 -15549025 -16700749
44560 -16700749 -9244309 501461 6178895 7302359 7438349 9983557 15835793 22566744
44552 22566744 25611570 22122979 13714738 4353640 -3374274 -8292507 -8648209 -3384349
44544 -3384349 4701893 10230330 10855742 9454109 9249424 8714554 4032028 -3888273 -8398377
44535 -8398377 -5270544 597328 866547 -4130761 -4388937 5783518 17654189 17980272
44527 17980272 6837235 -1778465 1907699 11529612 14179162 6578910 -3303552 -7447598
44519 -7447598 -4896807 1157661 7812674 12635528 13314789 9847346 5639448 4136946
44511 4136946 4385249 1668118 -6437677 -15858764 -20030326 -17887080 -14745957 -14040610
44503 -14040610 -12010742 -3991593 7255486 14592287 16068662 15788408 16087852 15063720
44495 15063720 12175110 9983542 9019856 6766600 3065325 458494 -2089166 -8685044
44487 -8685044 -17741691 -21630208 -18053218 -13166593 -9554808 -1376177 12068338 18951182
44479 18951182 11414670 203870 52490 7564045 8169809 124040 -4777913 -2378672
44471 -2378672 -656736 -1680651 3281584 15218791 20223303 9788320 -5149858 -10945134
44463 -10945134 -10575630 -13915511 -17908929 -11519783 3624111 12222027 5820975 -6716723
44455 -6716723 -11796435 -6090624 3697449 9775948 8956922 3624586 -435042 530183
44447 530183 4251277 6122614 6205438 8792936 14772864 18680051 15408771 7044084 359934
44438 359934 -1268317 -899870 -2661698 -5325812 -3369134 5362753 15114081 17303310
44430 17303310 9754925 -522186 -3747729 3631174 14966846 18249577 7950081 -6734338
44422 -6734338 -9760887 2720939 16238992 15842490 4697427 -2822430 -2041369 -1310134
44414 -1310134 -6178299 -12059082 -14137994 -13678454 -11533367 -5649209 1193738 1339161
44406 1339161 -5100181 -7277338 848153 11156392 13830946 10047736 5424386 618837
44398 618837 -3041357 1458336 14996778 23753214 15432731 -1611613 -8549281 -1472096
44390 -1472096 6297265 4735616 -2982416 -10114376 -13336755 -9677374 1728064 13122375
44382 13122375 13895331 5029821 -1468986 868191 6403322 8941468 9511550 9319914
44374 9319914 4952097 -3960396 -10170086 -7958295 -1240899 2728859 3100743 3720590
44366 3720590 5110619 3501367 -2733637 -8870894 -7271253 4236508 17294285 19448815
44358 19448815 8212590 -4573955 -6197583 2535822 10955225 12653462 9886897 7227005
44350 7227005 7622059 12175397 17466707 16236203 7052501 -1219921 -1768833 -284291
44342 -284291 -3427648 -4493719 5264064 16948142 13580138 -2777016 -12707060 -9436242
44334 -9436242 -7095260 -14254482 -19540731 -13078780 -4049234 -3873518 -6606040 -822574
44326 -822574 10056188 14421234 11534004 9481722 9630814 6935046 2685264 4301886
44318 4301886 12675490 19246917 16439827 5172337 -7134946 -11857532 -5147837 7306027
44310 7306027 14455995 11728180 4814831 288852 -1087208 37791 4113773 7666797
44302 7666797 4965450 -1680052 -3475971 -763667 -4529807 -16563865 -22377986 -12978425
44294 -12978425 354297 4485102 3837447 7330920 8991996 -836314 -14828961 -18121753
44286 -18121753 -11793621 -8630084 -10550109 -8585234 -1845620 1746353 1818591 5193924
44278 5193924 10208631 8420317 1675381 659652 5885262 6540179 -550515 -6803801
44270 -6803801 -8058929 -8977827 -9806938 -5073056 2459781 3195292 -1408488 297980 8165900
44261 8165900 7876387 -3912429 -11220142 -4119664 5383267 3679601 -3866574 -4692818
44253 -4692818 1683698 8048971 12201946 14639460 13488854 10621478 12193275 15431462
44245 15431462 7997693 -10389044 -20453918 -9691231 7693978 11331479 2452208
44238 2452208 -4541424 -6590133 -10353913 -15132305 -15461409 -13994402 -14874588 -11193459
44230 -11193459 3288999 16836067 13956354 1691726 171839 9851619 11489275 -443126
44222 -443126 -8480697 -1893887 6919931 5557459 1465346 5794413 13181765 12407671
44214 12407671 6097728 5161086 10549244 13469829 9746448 3612966 -251293 -766121
44206 -766121 1144848 2813261 1460936 -1117197 -524177 987846 -4922209 -18643789
44198 -18643789 -28439742 -26906929 -22058132 -22976550 -23672720 -13452665 3468358 12823258
44190 12823258 11124883 7383869 5368702 -1065085 -13089846 -21413208 -20535074 -16467612
44182 -16467612 -13788502 -5954844 12205723 30397287 32660405 18404927 4013579
44175 4013579 3324158 13396831 20619638 15849592 2068049 -9735292 -11162206 -4564437
44167 -4564437 -406012 -5235608 -14063103 -17066895 -11760993 -4720396 -2336146 -4101262
44159 -4101262 -5205937 -2009309 5805982 15170588 20587490 18168142 10362439 4453669
44151 4453669 4825030 8535131 9788259 6709266 1997394 -1176919 -1512262 919799
44143 919799 4586010 5965057 2024987 -5360304 -9533337 -6080881 1052332 3613310
44135 3613310 -217317 -3016660 967968 5759472 718668 -13332612 -22939443 -19568023
44127 -19568023 -10829867 -8573934 -11940163 -10554287 -1247074 7712692 8779917 3172693
44119 3172693 -4398012 -11395413 -15562734 -14250940 -9081462 -6036133 -7742269 -10003375
44111 -10003375 -8301796 -3238898 2335265 6451286 6404981 60319 -8432443 -10387944
44103 -10387944 -3732262 3265782 3109560 -1895776 -5636108 -6864350 -6970122 -5134801
44095 -5134801 -1316026 1189752 1240304 2252887 4456630 2083710 -5710530 -9621835
44087 -9621835 -4259212 1012691 -3782439 -11486528 -7372949 8316186 21268018 23900129
44079 23900129 21475405 18737131 14683585 11376597 13929755 18931189 15744403 3325861
44071 3325861 -6086077 -4946840 -1048340 -3965848 -10266483 -9742835 -209692 10464585
44063 10464585 13667085 7858683 8715 -314750 7625072 12180092 3878774 -9465919
44055 -9465919 -12171536 -3007338 4515670 3752232 2117337 4278947 3752815 -2842557
44047 -2842557 -7494056 -4690921 -1061065 -2635790 -4111184 228573 5884517 7791168
44039 7791168 9904737 15317310 17470901 12101440 7599808 11486548 16386715 12573187
44031 12573187 5164914 4289809 6616958 3025135 -2366597 815762 7591858 2863448
44023 2863448 -12061629 -17646595 -4592739 12890141 18335685 12890298 6276523 555020
44015 555020 -6955920 -13014426 -11427395 -3425729 2575466 732681 -6727307 -12650963
44007 -12650963 -11405313 -3653373 4117746 6176968 3518656 1591723 3411135 7546881
43999 7546881 11313869 12720476 10802330 7287671 6280933 9286833 12650874 12654657 10178076
43990 10178076 7554588 4783515 1995539 767473 -618718 -7165233 -17818180 -23099791
43982 -23099791 -17991171 -9772661 -6049347 -3365910 3235061 8148180 4511423 -2051815
43974 -2051815 -2463495 -424876 -4730462 -11050366 -8396226 -32080 638960 -6263316
43966 -6263316 -7026598 958124 4594808 -859179 -3457389 2562080 5342328 -2593147
43958 -2593147 -9185723 -3646569 3172022 -3824942 -17515679 -17831102 -1335150 15311337
43950 15311337 18695285 10876117 -407944 -10030874 -12956900 -5601628 6548991 11273354
43942 11273354 3785743 -6783310 -8236252 945575 10994925 11850243 3372116 -4722454
43934 -4722454 -3357927 5472794 11054225 7467677 1181499 2470927 12019319 19717476
43926 19717476 16165943 3042649 -8284628 -8170863 1218010 8546301 6794280 840751
43918 840751 -1086197 1100468 2196687 1979469 4121170 6784970 3925223 -3717651
43910 -3717651 -8167327 -6159103 -2800648 -1698669 -600686 703401 -2319418 -9753311
43902 -9753311 -13802193 -9017829 1023388 10233174 15428227 12994463 164055 -16061863
43894 -16061863 -21355392 -11586825 586254 2382066 -4358234 -10618519 -12791046 -10790299
43886 -10790299 -3267769 6306359 7101116 -5367395 -19140520 -19345495 -7430794 1924859
43878 1924859 -261560 -8953370 -13086855 -6550465 5842678 10636010 -542003 -17944758
43870 -17944758 -23124998 -13329343 -4368095 -5512370 -7410505 -3001968 -2549305 -13414897
43862 -13414897 -20816198 -8294010 13809092 21472124 11499017 1901045 2228144 4669456
43854 4669456 3344656 2031427 1159926 -4673754 -13575380 -16816007 -14548580 -15584602
43846 -15584602 -19906401 -17814151 -9121192 -6194943 -13133760 -17975768 -11851049 -1410917
43838 -1410917 4361851 6219365 6753320 3265393 -3975951 -7499859 -3648696 1889032
43830 1889032 4578162 6588266 7870543 3961607 -2699986 -2726119 3329263 2548753 -8569652
43821 -8569652 -15111607 -6399846 6816950 9848282 5816360 6512842 12582980 16911589
43813 16911589 18476251 18739524 12391815 -3959819 -20478428 -25171505 -20544206 -16713690
43805 -16713690 -14656459 -9685121 -4682152 -4848401 -4960769 2409552 10638122 7435710
43797 7435710 -3963811 -8977781 -4829416 -1971339 -3222418 -96911 8192692 10482209
43789 10482209 3085770 -3087099 -753212 3504097 3699733 4706010 10292163 13961374
43781 13961374 10349390 4747137 3412594 4727325 6762012 12164042 18140501 14130876
43773 14130876 -1199046 -12878282 -10233855 -2501386 -1680242 -2448863 5004348 13296970
43765 13296970 8803136 -2728418 -3154674 7806701 11203893 -68157 -9924687 -5780349
43757 -5780349 1931576 -2173841 -15050091 -22656312 -21160737 -18074110 -17960113 -18243191
43749 -18243191 -16326134 -12079070 -5235988 2876547 7359669 5592741 2478500 3886427
43741 3886427 7519253 6645590 750696 -4257685 -5294688 -4897835 -4861417 -3288967 814948
43732 814948 4926699 6630517 6501031 6396797 7640685 11099318 16006357 18405952 13967297
43723 13967297 3482156 -6379580 -8486381 -627941 13282060 25462566 29212843 24514391
43715 24514391 18194912 16558233 19202626 21979527 23009281 21967204 16616005 6258200
43707 6258200 -2721105 -1952273 7210227 13505095 9770428 1802684 39496 6771632
43699 6771632 15372435 19043841 16435534 10496026 5203595 2706614 1632031 -975846
43691 -975846 -5058239 -6792883 -3892819 458828 1195213 -2311969 -5498992 -3746356
43683 -3746356 2793929 9108550 9835206 4696708 -839092 -1696839 600260 82847 -5461149
43674 -5461149 -10987389 -9604221 -35324 11273872 14619794 5503841 -9105077 -15402069
43666 -15402069 -7234142 6362457 12302211 8894101 3975521 1152146 -2510871 -6233710
43658 -6233710 -4594354 768862 66827 -8797092 -13944113 -6651746 4488913 6069194
43650 6069194 -792737 -4451745 -1010341 3034064 3936600 4882049 6652574 4472256
43642 4472256 -3000513 -9177796 -7652018 -44718 6922529 9124633 8202032 8681249
43634 8681249 11961758 12913348 5710792 -5684244 -8889847 810528 12313790 13549691
43626 13549691 8386153 9376684 18432679 26032975 27042071 25076114 21730586 14316328
43618 14316328 6135177 6367182 15428342 21597803 17620053 10408313 7816689 5732769
43610 5732769 -2690254 -12462363 -11933257 757922 14972368 19934027 13702918 1474422
43602 1474422 -9502002 -14174361 -13127143 -11383353 -11852373 -12136749 -9310302 -4057662
43594 -4057662 2008308 8481006 12928880 11040505 3893235 -555597 1838518 4842316
43586 4842316 1937624 -2691025 -1016128 5615947 9305104 8651718 8911808 10110752
43578 10110752 5656900 -5288905 -13516568 -11727691 -3518122 3593471 7638932 10197147
43570 10197147 10849707 9360673 9108049 12457449 15815198 15048172 13092936 15466595
43562 15466595 19749090 17316861 6402849 -4214582 -7696620 -8493466 -13930953 -21808136
43554 -21808136 -23672218 -17693016 -10376816 -5913415 -1666022 4244967 8425100 8675714
43546 8675714 8391226 9886375 9201295 3441487 -1738223 588917 7117716 8220255
43538 8220255 2106373 -2878129 -526040 5878486 10103884 10734289 10039920 9765889 10263375
43529 10263375 10585795 8615970 4130169 1024592 2406922 4974713 3927212 1962217
43521 1962217 5914431 14788923 19678603 16814605 12101253 10609666 10525679 10497744 13361684
43512 13361684 17937196 16671825 7639864 33757 745997 4200122 3327616 1267473
43504 1267473 2058326 -940936 -13620640 -24922109 -18292018 3196492 19076587 19001316
43496 19001316 12513157 9118071 4857154 -4728674 -12695602 -11993630 -8149625 -9396233
43488 -9396233 -11728191 -5877479 5435223 9841237 4047504 -1286794 2348002 9833725
43480 9833725 11621923 7471131 4897716 7684286 12053528 13178118 10364819 5345470
43472 5345470 -344330 -4815457 -6109048 -5200366 -5863664 -8881474 -9189745 -2569112 7182718
43463 7182718 12747612 13331447 13962091 15321226 12169610 3753314 -2516813 -2004343 386124
43454 386124 386699 3501761 15056786 27390571 28665472 21479206 19996931 28123590 33126478
43445 33126478 24865507 10313168 2323222 2425407 2877010 114052 -2533449 -2798135
43437 -2798135 -2067230 -197764 5709717 15564148 23452857 23099979 14754269 5130863
43429 5130863 687863 1760761 4090113 5546757 8385154 13147203 14299997 7162856
43421 7162856 -2965721 -5599366 689585 5823444 1873913 -7717692 -15587529 -20066310
43413 -20066310 -22519318 -21394073 -15396631 -8069578 -2716131 3258253 12086396 17744100
43405 17744100 13006608 2167614 -2865506 736953 3172079 -3100571 -13570858 -19947125
43397 -19947125 -20208386 -15924521 -6892501 5215645 13225211 11608904 4380639 -68541
43389 -68541 389207 1518293 546993 -2076066 -6620768 -12755240 -15227373 -8459804 3682676
43380 3682676 9905578 5470272 -2229641 -4892159 -3732099 -4424884 -7337314 -8791380
43372 -8791380 -8384693 -8690402 -9558082 -8754022 -7711585 -11031365 -19295669 -26538869 -26427001
43363 -26427001 -18668794 -8690112 -2572397 -1928951 -2228953 2590671 12148349 18520068
43355 18520068 15700150 7245767 731667 -2056138 -3979039 -5006975 -3701204 -4389131
43347 -4389131 -13002881 -24735147 -26221315 -14112258 -1968698 -2236370 -9600518 -10831211
43339 -10831211 -4729885 -1530542 -5563157 -9848278 -8595085 -5170760 -4391248 -4630429
43331 -4630429 -2420640 291275 -1230009 -7267514 -13421060 -16325921 -16006949 -12988721
43323 -12988721 -6447464 3435609 12917668 16506619 12187893 4492885 1067919 5039934
43315 5039934 11168986 11168929 3649152 -2531997 2813053 18306482 29820477 25505554 10534724
43306 10534724 1440760 5043321 10236085 5204742 -4678369 -5436566 3695642 9562337
43298 9562337 6051290 2358393 5834336 9013715 2534535 -8236530 -10570014 -3136794
43290 -3136794 3488135 2652060 -1984401 -5187265 -6166295 -4917772 -446721 4984871
43282 4984871 5726809 -277685 -7902858 -10054686 -4366529 5373109 12208931 11135149
43274 11135149 3658982 -3594933 -6341050 -6224126 -5407345 -2351676 3215975 6339914
43266 6339914 3775519 433460 1700558 3141596 -3362540 -15298593 -20855368 -14831824
43258 -14831824 -4740299 319473 -564739 -3382578 -5704212 -7198738 -7996673 -8281364
43250 -8281364 -7012195 -2221552 4248103 5796433 227252 -4411862 -755602 5457171
43242 5457171 3954605 -2576924 -2187214 6350591 11245175 6952186 1600765 1260557
43234 1260557 717474 -3736532 -5439393 -27023 4274969 -644531 -8657368 -8875388
43226 -8875388 -2595383 106720 -3826705 -8240439 -8673802 -6707872 -4998141 -4868596
43218 -4868596 -7314492 -11025716 -11635326 -7416941 -2574179 -749827 498909 4280868
43210 4280868 8327501 9540227 9817003 12033137 14850178 16382256 17680695 17911294
43202 17911294 12976336 4740980 3657201 14401402 26656820 29334448 26233372 26700481
43194 26700481 28291353 22426744 12036733 8367014 12451723 14664935 12423170 13657433
43186 13657433 20835910 25242089 20783220 11817324 3843988 -2301522 -3593504 5496638
43178 5496638 20560224 25506815 11117363 -12511105 -28745232 -32301574 -27903043 -18847448
43170 -18847448 -5910878 6844520 13937214 15074471 14425327 14498011 14689990 14298295
43162 14298295 13405438 11727814 8791749 4506363 -683316 -4425780 -2547006 5540122
43154 5540122 12813345 11802879 5392351 3756892 10101333 17037109 18710557 18227065
43146 18227065 19601861 20245872 16592708 10930562 7189273 4711953 995202 -3444483
43138 -3444483 -6784356 -8460011 -7259556 -1910341 3657293 1636082 -9302401 -20394003
43130 -20394003 -22779392 -15555224 -2040038 13616285 23078695 17940714 3712881 -909513
43122 -909513 12076739 26362344 22498066 4006990 -10558696 -14038312 -13584894 -12301401
43114 -12301401 -5906086 2793380 3710461 -2886753 -4187093 4337183 10315379 4423854
43106 4423854 -3769382 -405575 11377529 16384675 8693853 -2303250 -5354025 937846
43098 937846 9200036 10863965 3611645 -5297586 -5433024 4030294 11608734 7610334
43090 7610334 -3078361 -7752185 -2266602 5806891 8911596 7709815 6791813 7525874
43082 7525874 7593288 5032937 864773 -1652637 -233750 3553013 5602518 4079584
43074 4079584 1241326 -304691 -633566 -227408 2466023 8377489 14561261 16439007
43066 16439007 12416519 4578125 -3730021 -9435706 -10680402 -7884706 -2481985 5425977
43058 5425977 14739736 18865036 10239981 -7446292 -18428606 -12432346 2111790 9622632
43050 9622632 7672185 6787266 12775483 19788732 21440055 19082228 16487457 14391024
43042 14391024 13432130 15491911 18876463 18395095 12900473 6351474 -594063 -11663936
43034 -11663936 -24185309 -26967438 -15753467 -2445582 -450975 -7621279 -12854203 -13262080
43026 -13262080 -13895188 -15360776 -14170784 -12711657 -15927829 -19052342 -12356487 668162
43018 668162 4312469 -5764057 -13819766 -6651012 6914500 9414960 -1206077 -12433548
43010 -12433548 -16337335 -16209414 -16380444 -15654589 -11434832 -3908640 3859390 6375007
43002 6375007 -512136 -11988808 -15761576 -7584199 543218 -3738802 -14827787 -17905514
42994 -17905514 -11535220 -7794046 -11466181 -14004430 -9804281 -3775995 1339141 10785520
42986 10785520 24338286 30495014 23112070 12287336 8731795 8286671 3741933 1543819
42978 1543819 11336465 25884883 28505439 17747068 8337026 7894882 8902458 6074851
42970 6074851 5433613 9824861 9595743 -2576187 -17508043 -20612611 -11114148 -947285
42962 -947285 1627273 -861136 -2282916 -497575 1915711 804106 -4781432 -9595234
42954 -9595234 -7219664 705619 5286255 2290794 -2984109 -5493697 -7351345 -10257268
42946 -10257268 -9527082 -3237295 308991 -5812468 -13812334 -10716563 2365357 12076107
42938 12076107 11804297 6961063 2262067 -3349102 -7868736 -5544214 1241648 1784883
42930 1784883 -5868954 -9618520 -2317902 5463444 1703268 -7956164 -9956379 -4615420
42922 -4615420 -3769414 -9983754 -13116139 -8581700 -5346118 -11064061 -20038359 -22557465
42914 -22557465 -18457576 -14090602 -10982511 -5290891 3489266 10148284 10769368 7580627
42906 7580627 5033201 3515082 -595921 -8564230 -14919699 -12193770 -792368 9066826
42898 9066826 8646158 1911911 594841 8285147 15101313 10534041 -2892411 -12651085
42890 -12651085 -10494179 -32234 8786049 9429440 3098740 -3994822 -6440038 -3372572
42882 -3372572 2786358 10038517 17484970 22829109 22635445 16832037 10195122 6593189
42874 6593189 3884133 -1860828 -8543583 -9463559 -3262785 2544347 892550 -5831437
42866 -5831437 -10356920 -11150797 -12223251 -13099012 -7065076 6942352 17609301 13720315
42858 13720315 -98575 -8494901 -5579007 -1232233 -5215511 -13705623 -17063870 -14150047
42850 -14150047 -11040072 -9265774 -4068023 5817267 14024924 14470038 8838866 3948494
42842 3948494 4369090 9090247 13539135 13944929 10711675 7352245 5715835 4288169
42834 4288169 2354451 2445045 5873762 9376031 9985969 9565104 9804635 7260753 428273
42825 428273 -2315908 8178218 25945141 33756505 24505424 9257255 1492521 2787985
42817 2787985 7753541 13228173 16362906 12186151 1244988 -6292632 -2252081 7930670
42809 7930670 12300297 7479325 -32641 -4172024 -3802360 569786 7496022 13182625
42801 13182625 15034041 15368985 17295793 19699446 21046885 23937763 29183030 29570569
42793 29570569 18638965 3446929 -1658852 5408897 10789269 3226192 -11881827 -21048527
42785 -21048527 -18854849 -10620078 -3281225 1186649 4628043 8349410 10399509 7414219
42777 7414219 50886 -5312081 -3335257 3255278 7044667 4967077 -149362 -5505227
42769 -5505227 -10633233 -14557902 -15747764 -14240517 -9236072 2803775 20531868 30975332
42761 30975332 21556123 -21687 -9843260 3009119 21498024 22472627 5274501 -10808998
42753 -10808998 -11941888 -2253334 6296472 6584265 -1050780 -10446264 -12555380 -3328272
42745 -3328272 9950013 15830374 13064435 11401552 16181229 19408672 11256100 -4745192
42737 -4745192 -14841418 -11411710 -63809 9075317 11161084 6879452 -816570 -6798210
42729 -6798210 -5489761 2418615 7953384 4033255 -4157612 -4957516 4416957 14951386
42721 14951386 18661937 16943303 13943632 9315525 2060898 -4921664 -9599767 -14555799
42713 -14555799 -20472551 -21913793 -16308708 -10829666 -11758465 -13152226 -7120336 -199002
42705 -199002 -5256571 -19005563 -23470826 -12156781 639941 2164661 -1588389 264770
42697 264770 4987613 3527357 -2336279 -3156048 2452515 7095247 7517259 7847530 10330290
42688 10330290 11485211 8072357 229444 -11263875 -24534959 -33426943 -31135004 -18548580
42680 -18548580 -4725840 1954731 544897 -3477274 -2731148 6670702 20055191 26177290
42672 26177290 18802684 4797297 -3946874 -4663736 -4083553 -6449428 -8733950 -8337123
42664 -8337123 -7775766 -8511868 -6426311 1467641 9657741 9336805 140527 -8266796 -7764413
42655 -7764413 -1567541 566467 -4511063 -9257166 -5897074 3166554 9387907 9509453
42647 9509453 7028902 3799716 -2004160 -8425058 -8586576 -1054498 5713729 4641543
42639 4641543 -99095 -345763 4328688 8844112 11787403 14752262 16255678 14413785
42631 14413785 12981689 16461533 21090329 19126663 11029540 4948298 4559961 5921377
42623 5921377 6410137 7638911 8221892 3158828 -6186294 -9870694 -2044770 10292795
42615 10292795 15873364 11833772 4166029 6259 2876563 11256981 18324533 16745674
42607 16745674 6875074 -2879903 -5849615 -3453414 -161744 2721449 5205479 5415387
42599 5415387 2396108 -1331520 -3699285 -6619175 -12366256 -19322062 -24365634 -26762322
42591 -26762322 -26893424 -23948635 -17782241 -10804358 -5938607 -4960378 -9393522 -18654781
42583 -18654781 -26241719 -23969865 -13083672 -4848533 -5672227 -8195645 -3496422 4212620
42575 4212620 4257900 -3111607 -6840405 -2121452 3110913 1406399 -3208770 -2358874 4563788
42566 4563788 10948330 12201248 9512964 6247648 4700624 5586147 7288752 5756028
42558 5756028 -1867632 -12663149 -19048512 -15996530 -6447793 1774768 4316600 4036882
42550 4036882 5711284 8947080 9183269 5301288 2350475 4629075 8908321 7998443
42542 7998443 -28458 -9585792 -14585452 -14573642 -12776934 -10671766 -7029507 -1696635
42534 -1696635 2177321 1143956 -3881861 -7575070 -5746684 -223631 3008535 254892
42526 254892 -6572086 -12893124 -15950455 -15820449 -13650377 -10371815 -6772240 -3924345
42518 -3924345 -3213462 -5445547 -9421224 -12208317 -12068828 -10445638 -9489596 -8424405 -4650955
42509 -4650955 1950653 8535433 13214389 16648984 19318060 20271441 19562515 18770910 17593739
42500 17593739 13106871 4740617 -2847665 -5042006 -3538838 -3848214 -7293992 -9030458
42492 -9030458 -4723729 3493242 9663120 11517937 12757452 16462547 18332532 11013005
42484 11013005 -3601990 -11975954 -4719834 8211531 6630023 -14291353 -35489340
42477 -35489340 -35512235 -14837194 6720871 12673203 3719746 -8299463 -13137686 -8640022
42469 -8640022 -367162 3232484 -1553223 -9659886 -12982226 -10090625 -7095271 -8280553
42461 -8280553 -9536717 -3684007 9413146 20937248 21783325 11793866 -587204 -7427163
42453 -7427163 -8643873 -9539683 -12656216 -14717248 -11881898 -5596474 -1689152 -4392011
42445 -4392011 -11816429 -16900092 -13427355 -2371260 8441838 12301250 9739621 5008359
42437 5008359 -248056 -5390301 -6110570 1049703 10211958 10882002 2944339 -1697759
42429 -1697759 4003986 12389116 13509169 8870797 4946411 552589 -8600653 -17495666
42421 -17495666 -16125953 -5338023 2885440 2489290 573982 4119390 8588645 6104924
42413 6104924 -895123 -1965532 6600614 15481963 13126333 224474 -10231189 -8312116
42405 -8312116 984292 5636337 3771246 4449762 10243795 10186625 -2800791 -17208683
42397 -17208683 -17457031 -7142331 -3838638 -12675773 -19593134 -12975046 1049096 9566624
42389 9566624 8360092 1022011 -7960063 -13182636 -9613087 -265709 4417578 504674
42381 504674 -3642668 -1530901 355067 -5623222 -13422064 -12104401 -4228983 -2065953
42373 -2065953 -7052134 -6637338 5911143 20347267 23449981 15305036 5069855 -2764146
42365 -2764146 -9867024 -15459392 -14754129 -6620387 3121032 8144273 7703707 4358835
42357 4358835 -1004172 -8458373 -15047246 -15807625 -9781722 -2216388 897884 -1066376
42349 -1066376 -3757348 -2713905 2803571 8702607 8519143 614763 -6431093 -1433306
42341 -1433306 13511017 21744189 12674023 -3078497 -8186086 -2506619 -114253 -5684697
42333 -5684697 -9064049 -4610177 -150252 -1003231 468111 10305817 19937045 18542838
42325 18542838 9019279 570911 -5930245 -12919428 -14510366 -4787548 7338827 7460833
42317 7460833 -2075930 -4876720 4163738 11744664 7480107 -2362317 -8269798 -11570402
42309 -11570402 -16709041 -19620112 -13822275 -2091213 6738348 9066629 7961471 6517219
42301 6517219 5763835 6772862 9619991 11692057 10635021 7407158 4109581 1287510
42293 1287510 -763253 -1444776 -2648558 -8084016 -17323791 -24622245 -26317556 -25049211
42285 -25049211 -23790064 -20707637 -13827784 -5972928 -408879 4099778 8970705 10893343
42277 10893343 7088253 1751223 590383 1644830 -1219508 -7055140 -7701324 305452
42269 305452 10135660 13217880 8950787 3569347 2272849 4622263 6410170 4735119
42261 4735119 917891 -2251438 -5156252 -9766173 -13244272 -8959195 3036535 12591627
42253 12591627 12110709 7336649 7976696 11947026 8991927 -1586962 -7898796 -2136021
42245 -2136021 9384232 16672587 18298670 18130217 16847281 13131083 8693299 5930590
42237 5930590 3478926 -814414 -5178333 -7033169 -8293685 -12326293 -17353573 -18343015
42229 -18343015 -14894491 -12069390 -12748706 -13593444 -10301760 -3824761 871817 1025528
42221 1025528 -583702 1148127 7111251 11451264 7470502 -3677463 -12880532 -13152711
42213 -13152711 -7159228 -2329628 -1233758 -787234 425705 -961926 -7582568 -15939941
42205 -15939941 -18900442 -12932422 -1922829 6234160 7111612 3956898 3712970 9088463
42197 9088463 16488240 21710578 24078312 23471884 17839710 7724197 -200277 340163
42189 340163 6840612 11614777 12418508 13089205 14037472 10060521 101724 -8187437 -8520592
42180 -8520592 -5147256 -6154112 -11583935 -14815872 -13447285 -11575354 -11275808 -8686966
42172 -8686966 -996194 7682653 11050208 8715580 6515177 9809984 18166849 25567610
42164 25567610 24765357 13274572 -2978305 -13249274 -11587234 -2626274 3745849 2785334
42156 2785334 -1931660 -4691703 -3555278 417135 5892375 10540660 10519837 4712588
42148 4712588 -1918685 -3513809 -1209385 -903913 -3089108 -1536520 5251447 8357483
42140 8357483 262903 -12873127 -18667656 -15012384 -10093910 -7693593 -3546658 2090872
42132 2090872 224788 -12321254 -23862751 -22281265 -11666776 -4723153 -3634742 45425
42124 45425 8682568 14104018 11428754 6384080 4816880 4154985 908931 -1000337 3430544
42115 3430544 10917766 14378078 13582163 14015344 16725407 16470295 10319836 2141192 -2844606
42106 -2844606 -3319657 -329322 4977232 9822199 10057946 5456287 2108417 5385938
42098 5385938 11450819 10096236 -2781679 -18727671 -25234175 -19304556 -9942072 -7301959
42090 -7301959 -11866048 -15538602 -11817571 -2759699 4350238 5880041 5855746 10216609
42082 10216609 17952429 20867204 13835036 2364263 -4039318 -4105294 -4462871 -7397804
42074 -7397804 -6874822 158374 6540989 5534594 2472116 7064336 17911371 24322981
42066 24322981 21861036 16171138 11406950 5088614 -3466795 -9201485 -9423731 -7745817
42058 -7745817 -6583617 -4009051 -1486744 -5047602 -13426818 -15240154 -5927189 2023417
42050 2023417 -3714485 -15628251 -16407578 -3556133 9349471 13424836 12966050 13222081
42042 13222081 12749737 10392262 8383901 4982385 -5395393 -20039217 -25840231 -15813940
42034 -15813940 -16883 6986717 3631162 -550590 449883 3897087 5419205 4784063
42026 4784063 4724869 8015707 15512290 24580999 30045604 28301049 19956577 8600670
42018 8600670 -978412 -4188644 -277343 5168061 5428480 595343 -3826103 -5312438
42010 -5312438 -5290845 -2729852 4546089 11424643 9027219 109443 -653658 11505884
42002 11505884 20944577 13459655 -1472101 -4555948 4271778 7955495 1096332 -2378011
41994 -2378011 5693272 12453955 3889714 -12736948 -19322261 -12599671 -5976863 -8256148
41986 -8256148 -13212701 -12373892 -7997884 -7890822 -13202553 -17471503 -15700758 -9777653
41978 -9777653 -5228166 -5554797 -9633949 -12457745 -8855275 981578 9845277 10349299
41970 10349299 3669975 -2167689 -3561507 -5789362 -13143507 -20301839 -20063708 -15687131
41962 -15687131 -16398024 -21726898 -20927494 -10651584 -2747824 -7697885 -18111307 -17841869
41954 -17841869 -3407150 12734661 18733430 14858205 8105268 2822434 -445589 -1542181
41946 -1542181 234256 4865229 10722957 14636496 13709027 8322263 2330012 -734731
41938 -734731 -130919 3692546 9787949 14516603 12957398 5149586 -3004511 -7568011
41930 -7568011 -10412903 -12406493 -9717742 -2603334 -830074 -11337069 -25031218 -25953037
41922 -25953037 -11628827 5024593 12978328 13145618 11475532 11039453 12158889 13199603
41914 13199603 10774509 5295648 4375452 12796993 22084874 20807471 12945890 12479699
41906 12479699 20107844 21612345 12779260 8400222 17819638 27322493 19762151 -100573
41898 -100573 -14040090 -15329722 -10633294 -3606276 7474025 18545262 21370097 16724942
41890 16724942 13439527 13208129 7922267 -5741190 -19635616 -25316464 -23128564 -17099064
41882 -17099064 -9132398 -1932383 128714 -2207605 -1719753 5146032 12063641 11405647
41874 11405647 4247002 -3160354 -8556137 -13275739 -15636093 -11810374 -3275003 2751334
41866 2751334 2316121 -341381 196362 2331806 983668 -2813985 -2491735 2912661 5519595
41857 5519595 982170 -2750967 2894812 11869160 11447662 3421145 3152772 14813737
41849 14813737 22489498 13751200 -1335587 -6486904 -3441519 -4835495 -10350697 -7545125
41841 -7545125 5755873 16567287 15435886 5703204 -7308875 -21450913 -29152168 -20008551
41833 -20008551 773884 11138181 -309601 -17450283 -19063430 -7820412 -2448858
41826 -2448858 -7792681 -9441548 2328927 17967725 22103955 11810158 -3088813 -11282978
41818 -11282978 -7746702 4501581 16449597 19948069 15251671 9915192 9462799 11972292
41810 11972292 12584303 9835907 5724977 2418546 1463394 4543211 12093717 20989190
41802 20989190 25557379 22416640 14283904 7794868 6806933 8957068 9927253 9075638
41794 9075638 7868105 4567905 -4066592 -15162806 -19621059 -12701081 -557639 7078222
41786 7078222 7219476 3545171 -61606 -1907889 -1772225 -1927849 -5908412 -12665275 -15990643
41777 -15990643 -13944871 -13493444 -19557133 -25300434 -22436747 -16328204 -18740199 -27857254
41769 -27857254 -29670427 -20572906 -13597849 -16684408 -19061395 -9153958 5407835 8521707
41761 8521707 -803666 -8645750 -5984920 3716194 14114118 21105787 19435309 6489544
41753 6489544 -9134918 -13802654 -6007890 2302768 3594149 3199002 6350791 8229691
41745 8229691 3898396 -1184265 772292 7787352 12126997 11101995 6295119 -2612958
41737 -2612958 -14531215 -21537936 -16214831 -2758640 7175223 8584707 6300598 5868449
41729 5868449 8322505 12434137 15083424 11043960 -281315 -9735332 -8107172 531164
41721 531164 3939191 -990256 -5860510 -5536633 -4431058 -6160550 -7364177 -5157709
41713 -5157709 -1537375 2684090 8785099 11871219 2865784 -15594285 -25929244 -16305410
41705 -16305410 3612923 15232771 12042232 1092175 -8401690 -9766078 18053 14566795
41697 14566795 19995959 11551108 1532271 1462386 4840755 16854 -7606843 -2526622
41689 -2526622 15330025 28885063 28097683 20752510 16862324 16127474 14747239 12588538
41681 12588538 8970164 1599517 -6251170 -7242728 -2096925 25118 -3050940 -2057528
41673 -2057528 7311810 15113690 12291054 5046552 4299519 8623408 8344330 1210594
41665 1210594 -6557236 -11229475 -13306958 -10359122 1521917 18471074 29746093 30147108
41657 30147108 25097766 21099104 17121360 9295320 -252671 -4825697 -2583401 434150
41649 434150 -1148774 -3771174 420648 11444678 19514278 17381440 9750598 6490739
41641 6490739 10671969 18161011 24822806 27699549 22910754 10663160 -51924 -733896
41633 -733896 4108044 3187893 -4039977 -7385883 -3711316 -1650336 -5228787 -6014892 1688310
41624 1688310 9366327 6834762 -2691073 -9158536 -10131340 -9959720 -10765450 -12646571 -17021151
41615 -17021151 -21557654 -17914001 -3673763 9226187 8464594 -453328 -874742 12441501
41607 12441501 27853236 32904559 26246233 13683081 1451987 -5301680 -4828680 -1528206
41599 -1528206 -1583792 -5578961 -9343698 -10342116 -8532033 -3630115 2766998 5348799 1852273
41590 1852273 -1532143 1227824 5521800 3089461 -3466492 -3855578 3127578 7287711
41582 7287711 2957760 -3281343 -4032927 -1099561 229536 -470798 -720011 -112811 158865
41573 158865 -1291877 -6292974 -13607078 -15244884 -4010232 13835991 22235603 15263767
41565 15263767 5141373 5332326 13359196 17186218 12389882 4727602 -573101 -3501153
41557 -3501153 -4222422 -881919 5894797 11007829 9814739 3425132 -2048440 -1399793
41549 -1399793 4131126 7756908 5397939 2188651 6829465 18980178 27416014 23613059
41541 23613059 12786207 6976145 10087276 15011669 14416036 8959954 3802732 1263357
41533 1263357 -378644 -2870675 -5483452 -6230226 -4004653 492250 4849929 6211814
41525 6211814 4118174 2306864 5303408 11925559 15067314 10923156 5645643 7781936
41517 7781936 15722430 19461176 15190096 10371316 11540606 14959803 14740391 13354934
41509 13354934 16490625 22174010 23393880 18940246 13629977 9288149 3496584 -2959604
41501 -2959604 -5077687 -1245611 4320278 7921521 9706913 9753729 6515612 1144826
41493 1144826 -1291552 2478940 9546218 13516553 10188142 1062381 -7142560 -8176042
41485 -8176042 -3301719 324023 252346 2037141 7548143 7442122 -5654956 -22049053
41477 -22049053 -25212079 -15034763 -7975015 -13026611 -20330660 -17889718 -8259536 -1616993
41469 -1616993 -432160 934748 5882668 11686483 14324341 13194122 11687950 13836086
41461 13836086 18676344 19596988 13383090 7348413 10366423 18393177 18384341 7560140
41453 7560140 -1333678 2296006 12819768 17357827 11942073 2937135 -2741222 -3431858
41445 -3431858 -1576962 -162017 1393855 7584996 19201949 27381525 22753633 9800502
41437 9800502 2752641 6256862 10475680 8032209 4746051 8332466 16347184 21880337
41429 21880337 23044288 20754240 15045863 9465206 10668231 17199344 17500105 6572242
41421 6572242 -4417242 -4187995 1728260 1107972 -5344663 -7558495 -4763129 -6786587
41413 -6786587 -17282873 -27550811 -28912352 -22406338 -14156308 -8002881 -4744847 -3713390
41405 -3713390 -3589360 -4445331 -8220913 -14580289 -18857317 -17696715 -13787999 -11016069
41397 -11016069 -8341590 -3231964 2163169 3666040 1509257 -594281 -504055 2087606
41389 2087606 7174325 12080567 11283216 3231650 -5980584 -9935113 -9193046 -7569798
41381 -7569798 -6013042 -4739822 -6253265 -10768618 -13181565 -9700034 -3028859 3075513
41373 3075513 8345435 10967672 6205508 -3821091 -7726897 -223116 8597489 8434235
41365 8434235 4440995 6767943 13020458 14487080 12881692 15963094 21323025 19984343
41357 19984343 13160666 10067707 10779461 6706117 -2309230 -6677432 -3368882 1546994
41349 1546994 7448027 19720949 32815390 30191494 8442805 -13363547 -17702768 -10093068
41341 -10093068 -6893213 -11384049 -12868438 -3933756 10659273 20019318 17106238 5312880
41333 5312880 -3108858 201632 8310901 7580049 -2219219 -6653095 2102925 14320903
41325 14320903 18485483 16988979 18036542 21019089 19763219 14268583 9713778 7595743
41317 7595743 5963156 5339153 6882867 7076059 1531131 -7055918 -11170200 -8565075
41309 -8565075 -4817058 -5131120 -7608302 -6226019 1460339 11028063 15384903 11465216
41301 11465216 1846595 -9340743 -18729107 -21763799 -14678829 -2198813 3221915 -3430649
41293 -3430649 -11059142 -7660250 1201688 788387 -9405611 -14700065 -7739800 2269666
41285 2269666 5774131 4953300 4603035 3102245 -870981 -2859623 -865783 -236314 -3682087
41276 -3682087 -4998840 75050 4720304 846786 -8203114 -12592269 -8981912 -2007012
41268 -2007012 3150387 4167444 1460229 -841369 2332329 9922629 14754961 12792081
41260 12792081 7189552 2066636 -889471 960301 8870557 15759781 12464518 3182394
41252 3182394 2083992 10756180 13492106 1800600 -11344812 -11703828 -4320767 -1575759
41244 -1575759 -3017715 -1134493 3239043 6211699 12446434 25625744 34945270 28113317
41236 28113317 12446545 5841912 10290301 11786435 5126271 1167340 7471240 17174055
41228 17174055 21233462 19864942 18079161 19093411 24111413 30536247 30706274 21103976
41220 21103976 10955785 11299608 17720772 16377132 5953140 -537889 3098088 7803340
41212 7803340 5721896 1878261 3761182 10060225 15748159 19703273 22123499 21729180
41204 21729180 19468774 18375869 17696292 14505116 11737830 15176483 21638484 21412793
41196 21412793 14434391 11481831 15650253 16389572 8462882 3094665 10225745 21220070
41188 21220070 21615359 12746463 7456425 9460402 10234128 4813769 -999019 -554419
41180 -554419 4895694 9454770 9273921 4768204 -240640 -1354919 1913703 5392736
41172 5392736 6013045 6200031 9859642 16077942 19753185 17387076 10730577 6061510
41164 6061510 9731621 21296982 31458454 31513067 24650008 21677719 25346167 27282812
41156 27282812 22741240 18761376 22166385 27988434 27442763 20826799 14244959 8756679
41148 8756679 1671021 -4872146 -5471159 -130457 5611027 7631672 4561539 -4642463
41140 -4642463 -17384185 -24622808 -19525960 -7340082 958698 2930128 4268825 6299312
41132 6299312 4558005 113590 790259 7670058 10727372 3476449 -6708424 -9796310
41124 -9796310 -7616714 -9096545 -15661388 -19814684 -16264111 -7285259 2261964 9274111
41116 9274111 11940168 10047616 6112697 2612717 -1195775 -6201377 -9202067 -6985502
41108 -6985502 -3209213 -4665580 -10658914 -13074772 -8450922 -2892318 -2093392 -3310906
41100 -3310906 -1559515 2393903 5553746 8629671 12123617 11295871 2245215 -10723750
41092 -10723750 -20960797 -28588723 -35407655 -35209348 -20853766 587025 12242941 8131172
41084 8131172 -1865969 -8562496 -12050909 -11689493 -3126549 8443209 7637635 -8442430
41076 -8442430 -21002304 -15639730 -4607658 -7262410 -19528744 -22323380 -13074587 -7098350
41068 -7098350 -9904579 -10017451 -1774357 4953672 3600186 1643974 4797152 6323835
41060 6323835 1542382 -973875 6249203 15330563 14697910 6142454 -851249 -4037710
41052 -4037710 -6306838 -5356054 1997293 9248638 6492233 -3742922 -7855509 607247
41044 607247 12820408 16813201 11042010 3212324 225678 2474706 6326280 9688375
41036 9688375 13589246 17855947 18269700 12275614 5603678 6565476 13799078 17240301
41028 17240301 12530910 6107089 3472078 1725112 -1746292 -2624543 1529941 4241273
41020 4241273 94658 -5217415 -3720292 1640983 1927977 -3901992 -9210658 -10850920
41012 -10850920 -11492603 -12423108 -11283504 -6179596 2476867 11733411 14865160 6477373
41004 6477373 -6888858 -9597793 2801114 15146634 13558276 5214923 5277469 13065061
40996 13065061 16487857 13399760 11191784 9288170 654852 -10492340 -11295404 -1857808
40988 -1857808 3984331 2258946 4711711 16116864 24178489 19823351 10755348 5926794
40980 5926794 2625602 -1131771 2137322 13464751 18843417 11512213 7572513 20831563
40972 20831563 35364677 26194751 -877112 -15380624 -6039278 6419311 3837108
40965 3837108 -5278197 -5247731 2621711 8263102 10949853 14881357 16386669 10036226
40957 10036226 1835272 2364591 8892489 7245860 -7058977 -20301032 -17503209 -684025
40949 -684025 15043368 19237598 14561590 9452976 8083732 9050606 10220078 11276565
40941 11276565 12177064 12199079 11309593 10189257 7951196 2489577 -5070031 -9098577 -5872341
40932 -5872341 797966 4350250 4505813 6530331 11518709 13242792 7328311 -877392
40924 -877392 -1882403 6430620 16641963 20548202 16900328 10141286 4345624 412908
40916 412908 -1758566 -1019454 3248632 7986072 8206208 3516252 394861 4726768 13344744
40907 13344744 17172605 13058012 8061673 9951684 17139419 21452807 18678331 12513499
40899 12513499 8675825 8451814 8780802 6864111 3967264 4890273 12510906 22180560
40891 22180560 24357681 15769996 5470551 4739097 11846836 13428138 2902104 -9143851
40883 -9143851 -8138537 5426161 17052699 16637937 8766607 4045344 6671103 13220655
40875 13220655 18731617 20317311 18023972 15443881 17018464 22090053 24484151 20721119
40867 20721119 14943863 11672006 7697605 -2305868 -14401930 -17678400 -8599678 4364402
40859 4364402 12830170 18104435 24259412 27963700 22827152 11419246 5092029 10329093
40851 10329093 20505842 23968124 17187761 6793460 141293 -2182817 -3187188 -2096940
40843 -2096940 5050041 16847551 23998685 20116403 11778792 10900765 18033903 21685283
40835 21685283 16088467 10106960 12431011 16482576 10419174 -2636894 -6821576 4082959
40827 4082959 18060674 21658519 15177421 6176612 -2615009 -10969460 -14005818 -7575613
40819 -7575613 2552127 6598796 4670021 5518441 11287655 13428301 7141911 1081353
40811 1081353 6297302 21037703 33301650 35349476 29412412 21104055 13945562 10438678
40803 10438678 12228565 16765641 17813659 12230290 4460211 2259657 8637174 18881122
40795 18881122 25174348 24235677 20632523 21197955 25659540 26080509 18255375 9650677
40787 9650677 10210645 17775493 20601916 14347917 7616750 7985859 11680279 12743535
40779 12743535 14170526 21267591 29695904 30378085 23631510 18368334 18028160 17261439
40771 17261439 13594568 12589909 18092182 25567933 29486670 30610258 31544389 31289170
40763 31289170 29214591 28739148 31124322 30334866 20997543 8681477 5301498 14757652
40755 14757652 28309236 34431543 29821925 20806040 16333892 19148192 22816006 19468192
40747 19468192 10980094 8066434 16133118 27351365 30906211 26223623 20725713 18818363
40739 18818363 19433508 21120050 22864944 22270305 19111931 18060186 21631226 23974994
40731 23974994 19298849 12843633 14019519 21361460 25294734 24343535 25981327 30919206
40723 30919206 30693570 24663474 25208372 38515863 52452116 53396519 45320423 41085611
40715 41085611 42579094 41787761 36588886 32900634 33043701 33063505 31469715 31346082 33373962
40706 33373962 34650661 34656780 35138797 34213400 28222785 19964123 17460483 22957064 29859143
40697 29859143 32518262 32816740 34445571 35998469 33171932 24813500 14723389 9290737
40689 9290737 13067839 23757210 32488532 32712130 27559840 24332346 24039774 22438453
40681 22438453 19535197 20144529 24907458 28737719 29563675 30845600 33222124 31641989
40673 31641989 24548658 18621933 19329986 22709190 22141140 18589614 18087667 22174110
40665 22174110 26658002 28494282 29161286 31366228 35374290 38836776 39248767 36972423
40657 36972423 35316341 36097573 36740949 34750641 32637707 33532151 34620401 32196793
40649 32196793 31123871 39425127 53540387 60469451 57248546 56301356 66073285 78068022
40641 78068022 81220282 78930877 81908029 92115861 103850823 113748364 119834628 117860608
40633 117860608 109506360 107105530 117749119 129321169 126736554 116486873 118269954
40626 118269954 135507119 152851236 162684689 173629664 188344656 193408990 181461314
40619 181461314 166334603 162743223 164042589 155226106 138324916 128294584 128903116 129376747
40611 129376747 124419578 122357764 129372852 137131150 133198206 117970854 104731669 104254251
40603 104254251 113415094 120140865 118124675 113587180 115014853 119204469 114476940 98354348
40595 98354348 83575851 81920664 89251837 93452541 91512935 90297605 94025000 100159542
40587 100159542 106265927 112117430 114959601 111059039 103475041 101028052 107317022 116760889
40579 116760889 123182395 125842664 124836060 117891184 106302681 98086862 99404250 106555764
40571 106555764 111581555 112423501 112301804 112394769 111791532 112752374 118512166 125881153 127794962
40562 127794962 125362028 129710208 146680628 165400660 169435306 156809609 141476227
40555 141476227 135177310 135497792 134181184 129914246 127081490 126483391 124852859 122360630
40547 122360630 123107066 126604001 125503312 116026722 105907402 105997425 116005352 124756826
40539 124756826 124678611 119829523 117373044 117108734 114691987 111276876 112507275 118270084
40531 118270084 120684651 114756435 105331763 99911168 99494424 101150655 105176657 113381228
40523 113381228 123079609 129628477 133403312 137527860 140155799 137040483 131296120 131241310
40515 131241310 137157514 140140369 137218900 136918955 144250187 151123548 150396093 149354049
40507 149354049 157219054 167146062 165668098 156006944 155543191 169605045 183741375 186572974
40499 186572974 185734182 192339891 200791926 196141650 176431011 156410248 149552193 154898122
40491 154898122 163425699 170842940 179507706 190297676 198262903 198957886 195953197 196743634
40483 196743634 201345792 201417764 193229840 184499109 182846159 183838838 178677386 169328810
40475 169328810 166471230 174338471 186361783 194436769 194244531 183720943 166281328 154189756
40467 154189756 157678378 170609602 177567018 174827852 172150601 173677740 171903618 163851368
40459 163851368 157964566 158563559 157601852 150083437 144510601 148130023 153779240 152746921
40451 152746921 150113360 154641770 162283052 163448692 160044896 161228686 166563721 167115738
40443 167115738 161320038 157420501 160382998 166444761 170610448 171279696 167943037 161194138
40435 161194138 153619725 145062812 130784347 110812349 95671616 93866814 98328132
40428 98328132 95501209 84494322 76627433 78293720 84838009 90212493 92727660 91775847
40420 91775847 87879566 85494310 87816987 90251730 86616474 78935919 72701008 66656647
40412 66656647 57964834 53520686 62803659 80602614 89993556 83398510 69357681 58181206
40404 58181206 52553118 52630111 57879677 62142317 58574913 51112577 49689453 53686245
40396 53686245 53335775 48408765 50035249 60683576 68448997 67016433 65548866 71125942
40388 71125942 76956665 77840549 82034073 94845457 103991469 97074224 83387651 81231708
40380 81231708 90473461 95279705 90198407 85555442 87157808 88160018 85238260 87568916
40372 87568916 101496574 116889870 118522333 105458523 90677593 84306297 84660157 85020869
40364 85020869 82187028 76314561 67863931 59203370 56165141 62083602 70657322 71133728
40356 71133728 62615805 56781394 62165099 72094370 75044587 71451779 70654680 74511155
40348 74511155 75831080 73298529 75791304 87593223 99235700 99702814 91254204 85426229
40340 85426229 88073253 94122202 95723828 91833153 89356219 95003616 105931956 111732432
40332 111732432 108379262 105205480 112200016 125461712 133678951 134557557 134378760 135117738
40324 135117738 134582427 136582720 146315677 156755931 156043459 149264088 154712277 174759084
40316 174759084 189650539 187520671 181539332 186634448 197232055 202027443 205006120 215398940
40308 215398940 229491087 239631651 251222592 273485718 301238425 322312188 336062394
40301 336062394 348400591 355574063 350549685 339989851 336074775 334250474 317592315
40294 317592315 282960008 245773417 217882578 196665990 178051807 164968953 158479468
40287 158479468 152643335 142714254 130117793 118020841 109614572 108939130 114292429 114376832
40279 114376832 101988442 86939961 82245033 83201603 77326907 70073366 78386726 98950623
40271 98950623 107532829 95892356 85812462 95686188 114119286 121000527 117030229 115333049
40263 115333049 117346760 115417071 110794908 111980568 119909808 128697155 137342342 148996331
40255 148996331 162503787 175240601 190018272 208959520 225419895 233055286 238636331
40248 238636331 254186375 279416610 303492398 322017241 340429740 361093887 378279076
40241 378279076 387300723 389882062 389839180 391112066 398980091 414102202 425890346 421641624
40233 421641624 402751657 382188247 365525108 345945973 320412535 298037388 285818920
40226 285818920 276558110 259718155 236557871 215198552 196954277 178374287 163017143
40219 163017143 158858940 163441561 162816975 149440527 132608864 125189258 126347736 125208614
40211 125208614 118093981 112772051 114647653 117216024 111399988 99330267 92009964 94793432
40203 94793432 101793993 105579871 106226877 107651184 110372920 113556555 120948520 137267970
40195 137267970 158463056 172917163 175898918 177356288 189811940 211575982 228446907
40188 228446907 231521932 226751067 224770130 226880411 225625097 216252975 202427716 190687528
40180 190687528 182929603 175591965 164729519 151009671 139347383 132548759 126122114
40173 126122114 113117675 95050745 82813053 83145675 89391915 91687460 91754082 98729042
40165 98729042 112609400 122648909 123518819 122504267 126389087 130470686 127161762 118538450
40157 118538450 112899612 113317112 116098646 117040118 113600458 104705628 94168100 90553292
40149 90553292 97589247 108210342 114242492 118067337 127263801 140873486 149528967 147930386
40141 147930386 139327920 128417993 117697782 110844171 111627145 117676730 121485787 118987089
40133 118987089 112043033 102677734 91476700 82111610 79864437 83426080 84923543 81029603
40125 81029603 77836840 81029699 86834086 87538343 82051098 76067715 74289904 77176678
40117 77176678 84095486 94950690 107739111 117768096 122100055 124409385 132657753 149759001
40109 149759001 168104534 177081833 175905380 174505566 180827963 192775591 205131784
40102 205131784 218132855 234263609 251799680 267704671 283202400 300529944 317444288
40095 317444288 330498638 340084500 346808072 347991368 344666545 346020028 357201225 367588350
40087 367588350 362691559 344504634 327419467 315744038 299662422 274932261 252103948
40080 252103948 240846281 236632851 229382664 216335134 200265008 182484984 163688826
40073 163688826 146290598 131547847 118873647 109719502 106020092 103962813 97371403
40066 97371403 88550659 86316143 91115507 92763260 86489490 79714021 77423701 72748709
40058 72748709 60264160 47996022 46020613 51486201 55277415 56151824 57322023 55751206
40050 55751206 47611553 40089666 44203043 56882080 62790370 55504460 45937662 46218635
40042 46218635 54050410 58046620 52481575 41344797 31093569 24302204 19845892 16164552
40034 16164552 13274253 12258283 13619727 16694937 20392123 23839055 26877226 30698522
40026 30698522 36655175 43297520 47078139 47962351 50250566 53753076 49405468 31576512
40018 31576512 11066991 5202447 15500183 26110245 25759514 19725860 16443095 14055715
40010 14055715 7520841 -83409 -2076999 1668880 6447407 10268411 13606458 15451651
40002 15451651 14987323 14136685 14530651 15086193 14992076 14905445 13514210 8241388 804120
39993 804120 -4014595 -5813289 -7147907 -4615756 7859378 24854737 31137224 22367344
39985 22367344 11723283 9445219 8674056 727593 -7804737 -5396780 5994461 15235822
39977 15235822 18379493 19576639 20779145 20458533 18505601 14879032 8339894 1989601
39969 1989601 2253172 6849268 4495936 -6201569 -10482833 -30318 12109376 12488169
39961 12488169 9277978 16445423 28139213 28765596 19420082 13264150 11409802 5176301
39953 5176301 -2374965 310908 10611092 14305732 10410337 11839670 20531727 23839234
39945 23839234 18337891 15349073 18137881 15175486 2963951 -5004911 -971869 4259137
39937 4259137 1256275 -2635242 1049692 6568112 6358350 5119483 9360278 14673516
39929 14673516 15044977 14168805 16330174 16033728 7929454 -1700560 -3939975 -10241
39921 -10241 3848033 5866482 4898496 -3039563 -14958850 -17752110 -5659524 8548092
39913 8548092 11334050 8109391 12159761 21994810 24659561 16738835 7733422 4962677
39905 4962677 7475419 13028474 19795185 22723152 18598617 13204494 13906636 17450190
39897 17450190 15165701 7907358 4692886 7666950 9815033 7875692 6428636 7637610
39889 7637610 7586001 5753013 8314865 17414771 25062720 23237908 14798628 9595528
39881 9595528 13210879 22641356 29862400 27639089 15817229 4191558 4882183 18561563
39873 18561563 31737991 31458303 19851438 9596973 6921094 5126248 -3805983 -16542322
39865 -16542322 -21464889 -11991203 7261943 26087825 35737498 31586406 15975387 323903
39857 323903 -2833547 5730697 11739116 6509801 -1215415 73746 6385605 6454945 2195583
39848 2195583 5455500 16035296 19518403 9754163 -1861994 -4795710 -2778746 -1731251
39840 -1731251 1966297 11170072 17505443 13136299 4823908 4660637 12787097 19830863
39832 19830863 21306318 19602356 16413720 12969942 13464221 18671685 20292396 11310030
39824 11310030 -1973460 -8093335 -6501832 -4617083 -2529972 6444720 20999160 30696729
39816 30696729 31420440 30507117 33271639 34596220 28603134 18415076 10620738 5691650
39808 5691650 -652477 -9684884 -17344444 -18432247 -11631197 -1499890 4882823 4946303
39800 4946303 2734933 2016813 917791 -2519713 -3953767 947301 6870136 4508782
39792 4508782 -4830390 -9662530 -4856416 1482573 1516534 -186833 5348314 16576521
39784 16576521 22426863 17306403 8688565 7547689 14736164 20481165 17086419 8428900
39776 8428900 4104417 6662340 9798330 8807939 6329659 5684763 5322101 4134561 5887332
39767 5887332 12202756 16668772 13622478 8444658 10134679 16524754 17056723 9696603
39759 9696603 4731453 9917780 21329304 32332176 42578674 52132423 53913960 40778182
39751 40778182 17825557 95214 -3099407 3144143 7937304 8086139 9196471 14784160
39743 14784160 19977822 19191445 15551310 16004818 18881905 15191035 3855534 -3932026
39735 -3932026 -574280 6596345 7565069 5520227 10181705 20708964 27314096 27419818
39727 27419818 27910128 31417503 32456525 29125118 26989267 27348955 22504553 8917286
39719 8917286 -3948379 -5645029 967053 5372511 4494068 3794914 6048910 7508281
39711 7508281 5557178 3443708 5151549 9635958 12588711 11775369 8513757 4740105
39703 4740105 666428 -3788385 -6441965 -4170812 2395270 7961094 8667305 7370735
39695 7370735 9896429 17241773 24878114 28980595 29359153 26191601 18388660 7152221
39687 7152221 -2020299 -3664556 2181609 10018857 13698376 10984034 4685892 21757
39679 21757 306551 4794323 10214089 13183193 11304212 4667622 -2065900 -1433038 10054928
39670 10054928 27196419 39540438 39394216 26996581 10129765 -1214761 -2750281
39663 -2750281 737628 2245511 1641866 3310559 6128996 3710424 -4175779 -9369040
39655 -9369040 -8036148 -6704178 -10379094 -13538728 -9913721 -2864089 2055390 6589661
39647 6589661 12541812 13653024 6401332 1077030 7966721 18588774 16884337 5565891
39639 5565891 3650734 17591863 31960969 32074627 20894154 9213624 2628308 2826084
39631 2826084 9077051 13649416 7786292 -3560667 -5665727 3211771 7532742 -1145502
39623 -1145502 -11233034 -11445231 -8350404 -11189429 -13438155 -5469060 5219384 4312927
39615 4312927 -5400471 -8196141 -370765 5688765 1996090 -5678709 -10610690 -13792641
39607 -13792641 -16481303 -15460487 -10139521 -5593105 -4626705 -4121403 -2311067 -2504848
39599 -2504848 -6173881 -8873091 -6917327 -2807786 -372589 951121 3469595 6635914
39591 6635914 8422771 8458932 7217110 4646769 1739900 914027 2762522 4638669 4248236
39582 4248236 2425566 532449 -2623158 -8737185 -16024625 -19588425 -15876626 -6043148
39574 -6043148 4669863 10548436 9385436 3587345 -3051051 -9361491 -16199114 -22152207
39566 -22152207 -23016076 -17703655 -12131550 -12838674 -17026744 -14342391 -1307023 10922128
39558 10922128 8999806 -4921643 -15178988 -12165010 -2202862 3926365 3904927 872968
39550 872968 -4311155 -10526208 -12666250 -9290165 -8814068 -18010666 -28436679 -26231166
39542 -26231166 -13440792 -6333277 -11611521 -17888653 -14765076 -7492531 -5603969 -7548820
39534 -7548820 -5568166 1603444 9656846 16907213 23539265 26800678 24362239 19490203
39526 19490203 16585820 14336682 9051967 2275031 -472745 3042019 9809954 14937231
39518 14937231 14005907 5328005 -6680962 -13549162 -11501693 -5245246 -866019 738920
39510 738920 1053830 99785 -1220399 -300550 2287139 2860976 2619146 8092446 19301317
39501 19301317 26008590 22160785 15544907 14910060 15763793 9305501 -1639601 -7829824
39493 -7829824 -9486059 -13342010 -16622704 -8748609 9686603 23071581 20570992 9766084
39485 9766084 5021549 9620106 15477589 16111603 13957697 15394214 21648151 26376525
39477 26376525 23385703 15448073 10992000 11632745 9884006 2268316 -3454855 -264274
39469 -264274 6619603 8551458 7107923 9053801 13271886 13891599 12333093 14371175
39461 14371175 17806750 14959704 6068403 -1006000 -3131825 -3034674 -289493 6442601
39453 6442601 10113000 2259262 -11247753 -15979886 -10430240 -5848711 -4242561 4229042
39445 4229042 17942163 19197278 2762321 -10552752 -3199926 12395871 13351762 -128107
39437 -128107 -9356814 -6480911 -2882 3956179 7250918 8272827 2147880 -6701989
39429 -6701989 -7192223 1208288 7232765 6030456 5450245 10522308 14539093 11640960
39421 11640960 7310536 8679077 12831610 12889496 9471787 7927152 8445391 6888197
39413 6888197 3091244 929910 686018 -2111053 -8980757 -14585344 -13098626 -5737965
39405 -5737965 830671 2605071 1988802 2635162 3148961 -560293 -6950451 -7757748 1668225
39396 1668225 14653347 20876606 19575021 18588063 20451066 17323666 3442728 -13686074
39388 -13686074 -20848110 -14705624 -3505058 5066980 10473620 13135174 9669988 -541478
39380 -541478 -9057005 -5943032 7196125 17990750 18124483 11952917 8160185 8267470
39372 8267470 7917987 5465313 2877734 -216916 -6374250 -13487717 -14774708 -8481280
39364 -8481280 -1967408 -1648082 -3270370 1810004 13150663 20921745 19165594 12882470
39356 12882470 9745685 10338138 10578789 9696018 10296970 12271050 12213619 9177801 6250744
39347 6250744 5204894 3830115 557224 -2112788 -1467225 1529742 5260292 10808653
39339 10808653 18043303 21540620 16333230 6397833 1432394 5176649 12219291 16389114
39331 16389114 16627355 14120392 9898908 6841809 8126706 11744227 12215337 9314028
39323 9314028 8457715 10502271 9139822 1928110 -4611444 -5966815 -6949219 -11285564
39315 -11285564 -12840533 -6507808 63345 -2763826 -9909780 -8514024 1866004 9261972
39307 9261972 8180391 5270262 5471321 5325230 2841934 2537077 6517743 10072786 10103840
39298 10103840 9545144 10217497 9907304 9591696 14042818 20983406 19400592 5050426
39290 5050426 -10389430 -12777996 -2216907 9787987 14346961 10510259 1863770 -5741706
39282 -5741706 -6743623 -1789360 1470304 -2525964 -10199429 -13834802 -10297394 -2389309
39274 -2389309 4721710 6558522 2932581 -449255 1290480 4112899 500974 -7435205
39266 -7435205 -9632892 -3884284 838220 -490450 -2324652 -1439727 -3696261 -10989856
39258 -10989856 -13922913 -6733467 1622562 1415141 -3428873 -5609955 -8131194 -14850424
39250 -14850424 -18027195 -10778759 -3099061 -8156708 -19364240 -19683059 -9144051 -3176200
39242 -3176200 -5436484 -3412948 6769700 11818894 4091925 -4647036 -1382944 9757868
39234 9757868 16307209 14093144 7451882 2133862 4218107 16525649 30190690 29979907
39226 29979907 14678780 1853796 4537079 13532087 12712041 2542707 -3965459 -2430912
39218 -2430912 -771217 -3889075 -6960188 -5394214 -2101922 -1424613 -1704164 2188359
39210 2188359 11182134 19565900 20691236 14732556 9043923 9073070 11366699 9578240
39202 9578240 4800807 3270306 5252072 4990789 2416521 5097799 15263191 24214136
39194 24214136 24741318 20890281 19647063 20659698 20723231 21156536 23267108 22943149 17652935
39185 17652935 12916117 13426990 13393642 5376813 -5718398 -8231689 -1036923 5288079
39177 5288079 4146801 41199 -1120672 -399260 -2061152 -7395342 -14109995 -17654718
39169 -17654718 -13263060 -1507382 8896636 9577338 3676353 2609529 10895484 19612192
39161 19612192 16721524 438555 -18547998 -25936829 -16001474 2185740 12404513
39154 12404513 7875024 -2770574 -8691706 -10023424 -12291410 -14725156 -13762125 -12773474
39146 -12773474 -16149090 -17157772 -6085777 10164628 12636454 -2167491 -15107319
39139 -15107319 -11606634 -1166974 710020 -3064746 525038 10412962 12141563 281210
39131 281210 -14192113 -19695279 -15693670 -7053326 2614663 8684821 5706444 -5000275
39123 -5000275 -13942087 -14258570 -9604128 -7545055 -9292403 -10407025 -8629477 -5828231
39115 -5828231 -3042351 1541110 8151056 12364987 10069084 4933202 6542256 17952776
39107 17952776 28096577 22649174 2812924 -13337632 -11606893 1826044 9842883
39100 9842883 5810714 -1467230 -2066210 3238825 6053599 89632 -12509138 -20847258
39092 -20847258 -13486599 7195997 21707486 13763156 -6776443 -12895910 4751393
39085 4751393 24546627 22886853 5003142 -5318295 1164428 11755820 14622840 12414552
39077 12414552 10353732 5945942 -1890962 -5428412 -194347 4215406 -2635971 -13647788
39069 -13647788 -12568926 1174147 10269997 4476252 -5608377 -5776263 2564339 9742379
39061 9742379 14700584 21613832 25577489 17195972 1016816 -5905901 2015533 10065538
39053 10065538 5707822 -2538682 36327 10373498 13496708 7205244 4209526 9433148
39045 9433148 11660859 3118124 -6864750 -6801505 -626531 994859 -927086 2878287
39037 2878287 11984067 15254741 8157619 -809443 -4002701 -4830786 -9044826 -13889276
39029 -13889276 -12659625 -5210591 2272947 4966378 1880376 -6235493 -15795349 -19293665
39021 -19293665 -11764538 1364825 8023595 2520709 -8598366 -14567404 -11034085 -1978333
39013 -1978333 5240909 5029748 -2833077 -12058059 -14701592 -9769819 -4758968 -5791236
39005 -5791236 -8959447 -6147232 2363124 7731251 5870207 3851925 8951942 16943387
38997 16943387 17656291 9097418 -711547 -4558581 -2081047 4215119 11461976 14340917
38989 14340917 8680932 -289298 -1357481 7004571 12697928 7551401 19125 1202772
38981 1202772 6073456 1832753 -9333732 -11658996 -771409 8489506 4952115 -1994934
38973 -1994934 1938939 13801858 19034457 12983345 4129302 -1375137 -5683681 -8924428
38965 -8924428 -4793354 8241186 19397486 16524801 1366768 -11928936 -12709117 -3967979
38957 -3967979 3654451 4333661 1057459 -1320809 -3147948 -7872984 -15163469 -20348138
38949 -20348138 -20961528 -19631740 -18758330 -16435043 -10953026 -6134600 -7616542 -14943524
38941 -14943524 -21182719 -20305892 -12575066 -3286579 1819799 1180656 -498646 3430229
38933 3430229 12921883 19568938 16794529 8779598 4621348 6101667 7223196 4482167
38925 4482167 467554 -3277842 -9508045 -18399858 -23688677 -20433277 -12596371 -7951819
38917 -7951819 -7974643 -7601925 -3565216 2036019 6519698 10257398 13685353 14324333 10334673
38908 10334673 5595084 7043689 15749946 23825422 22964671 14063252 4821312 -767866
38900 -767866 -5363625 -10400577 -11644059 -6290964 310522 467063 -5722881 -11003426
38892 -11003426 -10315986 -5044667 980959 5343767 7465978 8841229 11952579 15893679
38884 15893679 15551737 9529126 5589319 11386655 22067217 25914053 22099828 22640461
38876 22640461 33597391 44025825 40098296 23406581 7742084 2001792 3748878
38869 3748878 7235579 10194148 12450622 13766404 14946790 17799469 22538793 27011820
38861 27011820 29040245 28202884 25181945 20449611 13917581 5888657 -1246566 -3102534
38853 -3102534 2875537 13558002 22103486 24144462 20475705 14293709 8467331 5024819
38845 5024819 3842249 1749596 -3544240 -8827285 -9152030 -6438811 -8622236 -18176288
38837 -18176288 -26829730 -25175739 -13616895 -260736 8919304 14243094 18668599 23030480
38829 23030480 24552072 19820912 10526425 4328112 6093448 10426268 9130250 4266576
38821 4266576 4936581 11372202 13432268 7588225 3270544 6421915 8657437 1983225
38813 1983225 -5977836 -3190094 7780937 14336988 12502670 9256663 9964830 14573698
38805 14573698 22621586 30629009 28423197 11253731 -7011242 -7405912 7558282 15571575
38797 15571575 4866975 -11457651 -15776212 -7395334 2564230 6522748 3400875 -4934124
38789 -4934124 -13090315 -14628745 -10414119 -8354142 -11354393 -12974445 -8285180 -420658
38781 -420658 7279499 15876205 22983190 21103342 10441480 3020876 6108974 11405642
38773 11405642 9385292 4066593 2872705 1957911 -4873924 -10908274 -5842163 4822007
38765 4822007 5852519 -4719262 -14363162 -16829005 -18020286 -19865145 -14934040 -2075510
38757 -2075510 7383950 6383538 2764198 5103656 9047405 7487992 5062995 10858203
38749 10858203 22454642 28763559 25871109 19766150 14660675 8411351 227531 -5741296
38741 -5741296 -7120111 -7311408 -10048129 -14732572 -19459550 -24027765 -27119975 -24841445
38733 -24841445 -16147327 -6758165 -3043543 -3481269 -832065 7501002 15956881 18627368
38725 18627368 16175060 12705990 9572373 5676681 1121509 -3273607 -7934989 -12065029
38717 -12065029 -11563134 -4538624 2913627 2792442 -3564818 -7203599 -4698102 -1641032
38709 -1641032 -1380897 696385 7224694 11565525 7308680 -989236 -3798117 838901
38701 838901 6872593 8280179 2291216 -10040796 -20736897 -19142731 -6764557 -239168
38693 -239168 -9486089 -20708586 -14709318 4246336 15081602 12437695 12581711 24218469
38685 24218469 33384104 26110482 9951472 1256395 2685558 5213996 3981895 1128807
38677 1128807 -953415 -174533 5528960 11646245 7720447 -7526115 -19989870 -18301901
38669 -18301901 -9539102 -6271787 -7198174 -4272347 -772030 -5216021 -12521672 -10223079
38661 -10223079 -1827889 -3931446 -17662321 -23328374 -10834322 3249996 904319 -10317466
38653 -10317466 -10834693 911992 9119157 6089867 -44457 -2792299 -6767471 -15145138
38645 -15145138 -20090299 -13856421 -1994967 3396807 303478 -1677904 3749278 10831930
38637 10831930 11197429 6367695 4838117 9009455 11999217 8354111 1391128 -3438868
38629 -3438868 -6830912 -11874283 -16142570 -14483496 -8014025 -3398301 -3019439 -2083376
38621 -2083376 3204402 9830740 12311742 9025175 2714061 -2324652 -2934884 181808
38613 181808 2679567 2207736 1866777 4017695 4188714 -1632724 -6660618 -795777 11923104
38604 11923104 15763754 6270974 -2111929 1952111 9480565 6573048 -3194064 -5844987
38596 -5844987 -198580 1961603 -2461024 -1819503 10909699 25430331 27673309 17612012
38588 17612012 6425665 1309326 -78477 -2667487 -7008374 -9162107 -5492967 1979706
38580 1979706 5832212 1962512 -3213083 -236497 8625626 10356331 227607 -8948148
38572 -8948148 -3856954 10092257 16921087 13381393 11510185 17702309 22614633 17512419
38564 17512419 9292727 9309336 14791130 13803485 5595701 2660692 10841697 19579957
38556 19579957 17542641 8307881 2714851 2802241 2673241 842888 1715560 6328246 10683818
38547 10683818 13208207 15709283 16560331 11206415 863330 -7202858 -9928341 -10968877
38539 -10968877 -10985995 -5114492 5436770 9310355 306755 -11232965 -11609718 -2030745
38531 -2030745 6625371 12097981 20969190 32200180 34084206 21053247 3071397 -6655885
38523 -6655885 -5440866 1949068 12020996 21398113 23276600 14218560 2477958 1358072
38515 1358072 13209514 25653658 25371035 11507473 -6204404 -18501288 -22658322 -20517072
38507 -20517072 -15302579 -10820183 -10388944 -14425687 -19884489 -22906431 -21453999 -15694186
38499 -15694186 -7741041 -1158113 1939698 3861323 7890346 10854946 4786004 -10173571
38491 -10173571 -20655781 -15294117 -805329 6497414 2652571 -1773836 -977145 -1833829
38483 -1833829 -8733851 -13906096 -10880038 -6528367 -9448720 -15116972 -14289848 -9633473
38475 -9633473 -11107740 -18369628 -20390406 -11702934 1672826 12074112 16252877 12274869
38467 12274869 418105 -12485172 -18881026 -21007908 -26630035 -34612060 -35135428 -25231088
38459 -25231088 -13405818 -6540043 -2424012 1841358 4309565 4769090 6871987 9473287
38451 9473287 6015297 -2323039 -3498705 8133621 21043927 21807491 13101872 6720220
38443 6720220 5275696 1938344 -5425246 -10795466 -9955019 -5422907 -1302746 527262
38435 527262 -405494 -2246182 45823 9177927 19583122 21807660 12881839 -1002799
38427 -1002799 -11356558 -14210357 -11867253 -10720006 -15326167 -22356843 -23535658 -16892964
38419 -16892964 -10314311 -10080719 -11427886 -6613268 2337174 6720818 3962136 -1040658
38411 -1040658 -5689864 -11610874 -16313871 -12517448 141840 10087761 6824061 -4895621
38403 -4895621 -10468035 -3959648 5134828 5578113 -842630 -4136285 -3020404 -7684080
38395 -7684080 -22269423 -33505654 -26038340 -4356482 11938775 13712663 11146742 15044578
38387 15044578 21669785 22130016 16477152 10231456 4414181 -2467518 -8005404 -9271961
38379 -9271961 -8329362 -8026651 -7139227 -5495120 -7681391 -14601042 -17901284 -11261939 -1173206
38370 -1173206 2754968 2186100 4171052 6656867 2949671 -2683176 1807486 17057740
38362 17057740 28896789 26531169 14171541 2780746 -467204 6770111 21521494
38355 21521494 33404599 32016867 19915943 11036820 13556684 21124474 23207240 17163827
38347 17163827 7547650 -222247 -2818081 -714289 1318958 -454166 -3130754 -1548513
38339 -1548513 3342483 6258973 5471034 2446126 -2822546 -8014169 -4780657 9883579
38331 9883579 22741529 18952962 5165160 1490404 10705366 14553237 4561120 -3823329
38323 -3823329 2588762 12512853 8081366 -8329616 -19985991 -19275723 -11647261 -3266739
38315 -3266739 2516895 1937397 -4479337 -8463164 -4663767 740745 840160 -25805 4388616
38306 4388616 8634370 4305628 -3685293 -3913914 2413838 3995162 -720580 -1406599
38298 -1406599 5374831 9496318 3232810 -7547536 -12995845 -11255097 -6232926 -531414
38290 -531414 4758728 7870863 7333943 2728005 -5459016 -13593000 -14966692 -7667329
38282 -7667329 -4428 -1262258 -9180127 -14468484 -15565866 -18801322 -24129793 -22233225
38274 -22233225 -9376540 4545691 8427032 3619238 -413752 698169 2784063 501849
38266 501849 -5675670 -9360864 -4627394 6318613 13777627 12127228 7814197 10220134
38258 10220134 17498965 19647426 14233343 9137257 8502457 6175838 -3067139 -14650831
38250 -14650831 -21626079 -23524543 -22467021 -17458359 -8955053 -3138749 -4317963 -7407760
38242 -7407760 -5330751 -579836 -1494612 -8651368 -13186960 -9745503 -4193085 -5157580
38234 -5157580 -12215774 -16708813 -12984596 -5189021 -1643242 -4427888 -7474411 -5440341
38226 -5440341 -1050257 -483529 -3725408 -4357178 1158258 8698788 12167772 9974872
38218 9974872 4338947 -2119009 -7081222 -9062225 -9375007 -10965940 -13788583 -14440601
38210 -14440601 -12038580 -10737450 -13736308 -18167458 -19449255 -18171332 -18740828 -22632502
38202 -22632502 -26675321 -27436695 -24130528 -17403837 -8364216 321594 4549081 1760152
38194 1760152 -6191918 -13712703 -15774616 -12443358 -8814177 -9116917 -11066226 -8267886
38186 -8267886 853075 8821631 6408858 -6207537 -17996549 -18020985 -6664068 5717574
38178 5717574 10641524 9028022 6047120 2816031 -2129034 -5842999 -2859635 5191974
38170 5191974 9208513 4841409 -1605595 -3667464 -4180231 -7990032 -11470909 -7904521
38162 -7904521 647681 5952356 5985481 6101948 9165290 12863303 15897156 18491914 17679732
38153 17679732 11003401 4229648 5560335 12232695 13633417 8405360 6105256 9243627
38145 9243627 7408231 -4478557 -14896069 -12124676 -1664025 3555338 2505592 3885748
38137 3885748 9767739 13281224 10840191 6927377 6774956 11104438 17449082 21539992
38129 21539992 19399617 12723660 8864704 10625504 10827600 3316775 -5847023 -6464798
38121 -6464798 620062 5589156 4113237 346083 -2679572 -5867113 -7795910 -5233746
38113 -5233746 -622283 -258148 -3838304 -4287075 373558 3511032 934231 -2641720
38105 -2641720 -2197337 -514263 -2472449 -6079201 -4640838 4097504 14426647 17526593
38097 17526593 9142394 -5724192 -15966276 -14789500 -6375596 523932 3503794 6478798
38089 6478798 10929427 13702249 13113706 10762683 6968947 835285 -4503265 -3531312
38081 -3531312 2972881 7103484 3978924 -2394890 -5194567 -1957422 5364438 12581122
38073 12581122 15002157 12227210 10741117 15397924 19723907 13663028 412108 -5973989
38065 -5973989 -1661637 1168784 -5299420 -11315313 -5517628 6706243 11629508 5870876
38057 5870876 -4239859 -15018216 -25301425 -29271927 -22139379 -10539935 -5812802 -8198854
38049 -8198854 -7974629 -987747 7157264 11419819 11454352 5984635 -5967126 -17434884
38041 -17434884 -18013261 -8377918 -665763 -2013554 -7282712 -10658660 -13793566 -17666030
38033 -17666030 -16476684 -6940342 3529963 5165879 -2364055 -11740387 -16730091 -14802540
38025 -14802540 -6731830 1497393 1934709 -5168869 -9982423 -6610952 -1102211 171484
38017 171484 2165118 11590160 21778529 19254218 3405486 -11733469 -15607123 -10998575
38009 -10998575 -4603389 2255758 9943665 15615890 16797912 14686176 10580672 3889666
38001 3889666 -3617220 -6823803 -3734761 1874885 7147349 13805722 21187810 21976057
37993 21976057 11692742 -1878615 -6852916 -2883747 -466801 -4858787 -9481303 -7944753
37985 -7944753 -4270466 -5121444 -7837379 -4660977 3435192 6305982 -368851 -7562959
37977 -7562959 -4889815 5694586 14299745 17204932 18735352 20406192 17164677 7225455
37969 7225455 -1604509 -837203 7561400 14276589 14429670 11121999 8494729 6474766
37961 6474766 3124566 -1500243 -5333764 -6385028 -4177683 -107271 3651852 6066299
37953 6066299 7338149 7239082 5605339 4731135 7672109 12710217 13586702 7854134 1010781
37944 1010781 -813264 2027771 6597100 13097898 21024878 24653875 20062631 13087284
37936 13087284 11900501 14364231 11996797 4716622 1176422 4256918 6761186 3500926
37928 3500926 -1974887 -5214670 -6169507 -4063052 3218101 10992579 9129030 -3371460
37920 -3371460 -14430841 -14998957 -9824311 -6192251 -2037104 6474538 14558286 15797717
37912 15797717 12693072 11225129 11278355 10759273 11722731 13196052 6447075 -11005314
37904 -11005314 -24669545 -20170047 -4689307 3583640 2028457 2726285 8477373 8836091
37896 8836091 1009927 -3759739 969283 7766938 10466386 13343177 18649935 19170329
37888 19170329 11425278 4061165 4365932 7054000 4937397 789363 9137 954441
37880 954441 1326694 4788988 11689419 12366202 778633 -12922342 -15359123 -9412050
37872 -9412050 -8494529 -15682547 -20991687 -17576746 -9479477 -3436659 -1879089 -3881604
37864 -3881604 -5922197 -2983723 4545705 7712840 29379 -11388448 -13992957 -6430569
37856 -6430569 1954913 5964854 8825839 12307190 12807361 8788661 3700240 -62306
37848 -62306 -2822468 -2662673 3206365 11054959 12949577 8443586 5800751 8969277 11985485
37839 11985485 10776917 12061761 22829719 36320524 37752661 23385254 6138035
37832 6138035 -483646 1266320 -1366899 -11662148 -16433709 -3759392 17993966 28625211
37824 28625211 22640916 15561628 19708092 25837075 18698145 1877483 -6429119 1082374
37816 1082374 12472626 13771104 3991239 -8218582 -14208256 -10327845 -541928 5370109
37808 5370109 2356908 -2587107 -522314 5363024 5639631 1750415 4494912 15557023
37800 15557023 24049792 23804478 20869963 19787978 15642721 6114929 -712412 1068635
37792 1068635 4763181 2050418 -3812876 -4571520 48086 4455638 6738345 8314853
37784 8314853 8769511 7638024 6725187 5406612 -423035 -9594273 -13434717 -8713107
37776 -8713107 -4515696 -8053191 -11993625 -6359484 4115651 6777782 447422 -4536222
37768 -4536222 -3091678 -186361 311191 689024 2981924 6468471 11246380 16121921
37760 16121921 14626927 2518385 -12299131 -17691954 -14042972 -11589730 -11474514 -3555713
37752 -3555713 13425258 23831690 15801156 -545641 -6002346 3064933 13357536 14532738
37744 14532738 10206446 8745418 11418924 13317153 11676953 9056134 8966505 11221163
37736 11221163 12721542 11366143 7303022 1260064 -5309194 -8558985 -5108709 1879232
37728 1879232 4076119 -1711573 -9005614 -10867008 -8896617 -8521236 -10110942 -10521594
37720 -10521594 -9121950 -5918829 1848671 13536582 19457833 10604448 -7953215 -21847074
37712 -21847074 -23812677 -17322690 -7085070 3649776 8493649 3000461 -5109439 -2587246
37704 -2587246 10728069 21104788 20608310 15705144 13301229 10962824 6270661 3783795
37696 3783795 5661412 6005212 2005929 560960 5499034 8058285 94082 -11331405
37688 -11331405 -13201181 -4222977 6691929 13960772 17233359 14891399 6663348 -333025
37680 -333025 1566932 9410468 13975525 13123084 12213373 13290004 12933297 10079889 7639541
37671 7639541 6371269 4259998 1828631 1790094 3814217 5001624 4319844 1813558 -3689899
37662 -3689899 -10446132 -11197898 -1952968 9858899 13613737 8773854 2181444 -3837952
37654 -3837952 -10785579 -14609577 -8743717 3986796 13394262 16217678 18051777 20624139
37646 20624139 18303427 9349969 207767 -4364896 -6170486 -6164776 -1828894 5106985
37638 5106985 7944258 5520569 4079488 5183774 2016401 -7322320 -13102736 -7551581
37630 -7551581 3335965 9088537 8905346 9031732 11631962 13477373 11840503 6460313
37622 6460313 -491596 -3215251 3079390 13246944 15617456 8468160 4108265 10634548
37614 10634548 19331484 18773199 12428071 11089502 14632919 14048619 8001540 4818025
37606 4818025 8560454 13649539 14126422 9919942 3155073 -4602166 -10409977 -10859431
37598 -10859431 -5789697 2051081 9424344 11977207 5768791 -5836163 -12122102 -8215599
37590 -8215599 -2754040 -4683174 -8588366 -3703055 7320705 11481158 5396521 -785104
37582 -785104 23092 3714396 5825076 8994166 15250452 20245794 20186634 17420014 15098746
37573 15098746 12629884 9804600 9311868 11761305 13610364 12911386 12130160 13034071 13828712
37564 13828712 13356135 13195504 13771749 12886765 9390584 4363682 -1136488 -5110970 -3215701
37555 -3215701 5556128 13949688 14790685 11985762 14102373 19383944 18735378 12480394
37547 12480394 10381997 13719124 12256985 3130734 -2299940 2736690 8945073 7182352
37539 7182352 2974138 3968631 4970633 -1031141 -6313035 1701576 18964341 27712401
37531 27712401 19671497 4945512 -2413944 845842 7228969 7498883 -51049 -6702650
37523 -6702650 -2979234 7645985 12154881 7268954 4310699 9913888 15460161 14679203
37515 14679203 17105683 30019219 40270496 32474535 15389603 9572187 15750135 17939599
37507 17939599 13891243 17327871 28829225 30349214 16301976 7104556 19403625 41043308
37499 41043308 50075785 44869673 40062491 42012380 43353305 37638002 27657090 20711403
37491 20711403 22491236 32998706 44014428 44851384 34354165 22120918 15353523 11738158
37483 11738158 8216048 7545210 11079246 13973760 13706377 15040580 20280689 23249986
37475 23249986 19981585 16602489 18544072 20705400 17754749 15692217 21662217 29038511
37467 29038511 25593492 12631379 3480242 4663636 9886264 12206864 11748034 10444206
37459 10444206 8024097 5143472 4208072 5794331 8344930 10513684 10231075 4671746
37451 4671746 -4162875 -8270896 -4128606 579194 -1947546 -7191803 -6336308 -1821496
37443 -1821496 -3317132 -10977603 -15159203 -12236496 -8497857 -7325087 -4380174 1840915
37435 1840915 5583802 3829782 1620934 3767915 9134401 15503153 21491344 21634716
37427 21634716 9927915 -7937652 -16376132 -9639360 -441817 -2562958 -13512323 -21427265
37419 -21427265 -20795980 -13180311 14078 15678779 25291554 22912680 13912896 7933229
37411 7933229 6532203 5198176 3452042 4247249 6409391 6434730 5355655 5279081 2036131
37402 2036131 -8658062 -19739696 -19087485 -7602452 625262 -1615034 -6005854 -4293647
37394 -4293647 -1062220 -3653878 -8771634 -8759251 -5298246 -6914900 -15382982 -22838189
37386 -22838189 -21662042 -11507986 2042675 10850141 8695517 -1917967 -9621594 -6558179
37378 -6558179 1629601 4499641 2137439 2891411 7862630 9053374 4418129 2965878
37370 2965878 9732297 16052087 12792002 5303655 5362657 13169897 17797089 13639724
37362 13639724 6691505 3990330 5168840 6512128 6718510 5716015 2600010 -2240036
37354 -2240036 -5968177 -6328128 -3746709 311734 4804615 8654837 11103626 12427348
37346 12427348 12458199 9803391 5124087 2916872 6134066 11248838 13249303 12830636
37338 12830636 12657920 9588470 -554965 -11557641 -10612522 4282723 20145809 25739123
37330 25739123 23698100 21595578 19984389 16189371 12720902 13748111 17787784 21031140
37322 21031140 24029846 28324062 30080170 24414675 14077847 7591993 9962380 19683387
37314 19683387 32465053 43178114 46802111 42545608 35108975 28283948 20834257 12521388
37306 12521388 8886064 13937396 22696994 28007006 30774079 35968342 42151939 43458381
37298 43458381 39404645 34140625 27803419 17430796 5580992 -630733 591052 4031251
37290 4031251 5486731 4872255 2430990 -1063436 -1660892 2904912 7526862 6491195
37282 6491195 2929974 2387690 963270 -7655275 -16142631 -10343109 7024539 16300254
37274 16300254 9022844 -394451 1260154 6341646 2429104 -5631128 -4912058 3579854
37266 3579854 8142897 6466604 6800119 10881420 10712963 4245402 1319895 8818640
37258 8818640 19122173 20023639 11121174 4048112 7661155 17415678 20809901 11624823
37250 11624823 -3878248 -15636837 -20987253 -23164400 -22024855 -14349816 -3284673 1999004
37242 1999004 -691531 -2737335 1154245 3725853 -2607326 -11919756 -12504000 -3266362
37234 -3266362 6966395 12534529 13836668 10519141 2433808 -3928910 -580305 9686018
37226 9686018 15420472 12002074 6079236 3204945 806054 -3184268 -4205157 593800
37218 593800 5419471 4167989 67088 -361234 1452953 -501690 -4537410 -2197003
37210 -2197003 7147094 11901967 3715308 -9472680 -13742167 -8964698 -8602646 -19312164
37202 -19312164 -30762174 -30779552 -22566552 -18618589 -22403450 -25539129 -21181150 -11004489
37194 -11004489 647933 10491822 13881690 8341138 1076510 2955674 12410157 16129837
37186 16129837 9569222 4176395 7227530 7965103 -3981037 -17444764 -13517887 5316588
37178 5316588 17336275 11982804 1646978 84613 3811399 1974666 -5976342 -11305606
37170 -11305606 -9014182 -2544341 2086321 2166345 -583130 -2555482 -2648144 -3609813 -7039539
37161 -7039539 -9291790 -6689080 -2679140 -3600337 -8205358 -8452864 -1461872 6122356
37153 6122356 7662755 4620935 2707208 4661723 9060357 12456154 11329245 5577480
37145 5577480 556734 1513147 6114959 7594157 4975828 3605925 4959537 3912583
37137 3912583 -917003 -1942252 6605851 18045236 20042540 9704118 -3598466 -9751882
37129 -9751882 -8036272 -5224118 -6255500 -8770587 -7509629 -2914777 -1528467 -5797955
37121 -5797955 -8133578 -803090 11280036 15509272 8871715 1901764 3411139 9274274
37113 9274274 10696498 7028187 4109056 3811242 2200043 -2396003 -5261149 -1876983
37105 -1876983 3974362 2904066 -7695562 -17559723 -15277240 -4682228 -981599 -8501365
37097 -8501365 -13147567 -4240432 6959303 3394104 -10725951 -15593536 -5722488 3536759
37089 3536759 1084352 -5501613 -6125196 -3474272 -3979176 -5917826 -5551457 -5137427 -6482810
37080 -6482810 -5623915 -1689784 -1727225 -8546016 -13221987 -8691037 -1556345 -623027 -2940603
37071 -2940603 -2261753 -2374385 -9121024 -16697993 -15828211 -9546196 -6556701 -4387714 4807726
37062 4807726 15391919 13060503 -1458175 -10835669 -6305877 1413996 1343028 -2288622
37054 -2288622 -1279860 2042619 919814 -3557962 -4912764 -617327 7316631 16076404
37046 16076404 21456894 19089142 11240681 6942324 10207954 13475582 8544294 -763548
37038 -763548 -3731773 2243593 8491784 6525755 -2218801 -8989124 -7618659 -857001
37030 -857001 3330226 2002765 1298847 7017899 14144148 12735609 3560175 -1175914
37022 -1175914 4436563 10282929 4223760 -10796105 -21190111 -20114555 -12537687 -5098700
37014 -5098700 1015306 6494687 9975235 10473211 9904374 10470346 11451188 10592203 7804598
37005 7804598 5890602 7190944 10115055 10298535 6030018 1045967 -252289 852522
36997 852522 -665171 -5656621 -9465913 -9698241 -10169719 -13764351 -15836950 -10273367 35345
36988 35345 5031644 361550 -7004643 -8571033 -5592638 -5998451 -11683827 -14650800 -8128535
36979 -8128535 2857697 7360071 3532380 1123390 6934838 14276204 12555630 3218383
36971 3218383 -1614738 4375463 14174130 18116421 15570589 12380851 11615556 11665209 10795836
36962 10795836 8827053 5127163 -1253227 -9163131 -15496676 -18101173 -16980835 -12780603
36954 -12780603 -6107759 988005 4820158 3556814 594873 1813139 8014214 12429302
36946 12429302 8690363 -399433 -6278515 -5894501 -4018110 -4196616 -4623961 -5226632 -10495091
36937 -10495091 -20055356 -24514401 -18612797 -11559429 -14252736 -21877534 -21322215 -12046222
36929 -12046222 -5421457 -4476854 55436 10979717 17618881 13906365 9420150 13039526
36921 13039526 17288683 10530992 -3603495 -11190799 -7431646 -119395 3200202 1921738
36913 1921738 -1743347 -5437840 -6814375 -7294742 -12544638 -22914042 -28117736 -19744844
36905 -19744844 -4904038 2209714 -741592 -4066221 -2544362 -379654 303104 3653496
36897 3653496 9608953 9834930 -426489 -14049493 -20992828 -20201726 -18052068 -19073523
36889 -19073523 -21876432 -21367244 -13221657 666299 11006403 10058601 1661106 -3737269
36881 -3737269 -4069003 -7545262 -17641836 -25354837 -21573805 -9617678 1158005 8288962
36873 8288962 15160720 21104342 20708667 12026805 -572432 -11337895 -16569774 -14457012
36865 -14457012 -6240484 2982579 8508927 10584164 11877056 12424243 11119706 10185214
36857 10185214 12654977 16011617 14177439 6842062 1343300 2751186 6553543 5026304
36849 5026304 -1906191 -6614146 -3796801 3554203 9144083 10788771 10150664 7367878
36841 7367878 497445 -9066811 -14980754 -12886973 -6439415 -2855544 -4329597 -8023921
36833 -8023921 -12912917 -20563500 -28603631 -30035534 -22453437 -13151594 -10735777 -14805816
36825 -14805816 -18235704 -17390692 -15484408 -16505102 -19573789 -19861200 -13524344 -2136119
36817 -2136119 7243089 8283380 2318716 -3710808 -6580333 -9173334 -12125550 -10326835
36809 -10326835 -2835196 761144 -7515676 -20295586 -23710196 -17571126 -14916539 -21074633
36801 -21074633 -25941293 -21257916 -13485129 -11601175 -11862458 -5342908 5695893 10786921
36793 10786921 7899922 5686497 8902304 12016197 10040773 6895076 8196384 11915605
36785 11915605 11564786 5065886 -3936640 -11101064 -14269487 -13549727 -11582462 -11787811
36777 -11787811 -13770452 -12716650 -6053720 1946183 5788659 6501511 8835545 11890555
36769 11890555 8530557 -4085499 -17969319 -21913575 -13962014 -3371506 -258922 -5129865
36761 -5129865 -9513144 -6485649 863714 3238009 -2770544 -9640498 -8353720 -69191
36753 -69191 5987182 4891044 670600 -1797975 -3158129 -4945982 -4569684 -270568 3216708
36744 3216708 858687 -3225514 -476316 8096960 11295625 3947569 -4506251 -3584785
36736 -3584785 2648328 2323757 -5422555 -8853424 -1485948 8581856 11513189 9440828
36728 9440828 10200431 13428026 12164663 5572949 349933 -498374 -852753 -1739886 1624371
36719 1624371 8560180 8632076 -3157679 -14888730 -12582948 -1455196 849706 -9393306
36711 -9393306 -16900892 -11354589 -2201560 -2113365 -7546073 -6794174 515077 4534881 2102882
36702 2102882 583307 5183913 12226374 15983695 14490197 8211413 463119 -834548
36694 -834548 9576428 23825312 26193106 11798956 -7090880 -16083859 -12986134 -4701408
36686 -4701408 2157837 3874240 860557 849868 12681209 31417893 38619126 25390642
36678 25390642 6884478 3610146 15049979 23875293 21389228 14557005 9319395 2145121
36670 2145121 -8461900 -14852991 -10995808 -1728079 4532969 5855600 5051712 4008216
36662 4008216 4075744 6620060 9441595 7941168 2626668 -1001579 -2774615 -9495204
36654 -9495204 -21365575 -26362293 -16833140 -3858366 -3617655 -14142918 -18425496 -9672241
36646 -9672241 -629712 -4414760 -16552595 -22692404 -17785718 -9883168 -6878309 -6521825
36638 -6521825 -2111137 5820237 9160434 4741972 1155928 6498037 13075562 5304952
36630 5304952 -16265394 -31671502 -28199194 -17800843 -17624374 -24632197 -24484781 -17069576
36622 -17069576 -14457403 -17548918 -15341953 -7875539 -8499756 -18236076 -19294835 -4414913
36614 -4414913 7065303 -2371166 -20175154 -22701862 -10577284 -3916993 -9019538 -12151469
36606 -12151469 -5654504 633897 -1982072 -8390649 -11822989 -14090032 -16196070 -11365837
36598 -11365837 3008579 15679939 13943070 368138 -11073295 -11721794 -4365581 3657794
36590 3657794 6833050 3443181 -2701947 -3814696 3593304 12735709 12836860 888107
36582 888107 -15814404 -27821513 -31078640 -27065894 -19130346 -10296020 -3175410 432385
36574 432385 1564241 4879437 13953648 24430615 26027130 15016266 926884 -4491558
36566 -4491558 -1699560 -14756 -2661855 -4153832 -1898942 -375589 -1670581 -1129527
36558 -1129527 3862286 8713280 9234089 7199634 4654169 345552 -4053088 -2452206
36550 -2452206 5609428 11495342 9990864 7020946 8094956 8067513 1366544 -6189944
36542 -6189944 -6977597 -5632166 -10401959 -15759109 -8513062 10552738 25555644 26779772
36534 26779772 20245518 14425581 9864170 5293755 2858022 2827370 2246946 2075061 6111083
36525 6111083 9776311 1314595 -20024777 -37633119 -37482184 -25952457 -18837174 -19498511
36517 -19498511 -18202467 -9089199 2459214 8582501 7187531 1168766 -4712942 -5682042
36509 -5682042 -203287 7727425 11938818 9574200 2226615 -6228051 -11414240 -11082262
36501 -11082262 -8080682 -7659930 -9972648 -9334536 -3351075 2302326 2169043 -850570
36493 -850570 -915036 1445069 1778967 446806 1952987 6985416 11687939 14410167 16964980
36484 16964980 18835647 16310035 9376966 4586397 7741460 16058657 20337620 14624208
36476 14624208 2576060 -6376354 -7551356 -6276927 -9934012 -16045369 -14307778 -2192009
36468 -2192009 8595394 6565728 -4286690 -10966659 -9250437 -6269845 -7161885 -8601320
36460 -8601320 -6711269 -3118557 -473073 1381862 2028959 -462931 -3982805 -2180793
36452 -2180793 5837329 11305762 6946811 -2046557 -4708049 840456 6346372 6225496
36444 6225496 3845556 3447494 2777347 -1574171 -5898238 -2933126 6818726 13219137
36436 13219137 8620680 -1740687 -5715530 439966 7336345 4682854 -5406854 -11283986
36428 -11283986 -6850554 753744 441505 -8916136 -17640351 -17637950 -11257044 -5692275 -2476364
36419 -2476364 2203927 8085810 8977835 3038697 -1747933 1528500 6968062 3443155
36411 3443155 -7845352 -12900237 -3630771 11585333 19635899 17377730 9863205 1360553
36403 1360553 -4543540 -1555936 13039146 30339140 36558065 28694387 17316434 12664388
36395 12664388 13384537 11001392 1489956 -10127913 -14846855 -8107947 5660026 16695969
36387 16695969 18889179 14458667 9332470 6207847 3687338 -264373 -6161993 -12137845
36379 -12137845 -13812704 -8224053 665514 4950486 3521966 3992147 10123957 14139875
36371 14139875 7948846 -3928381 -10667687 -9605473 -5674276 -776093 5804452 9086127
36363 9086127 2163630 -11522629 -20073608 -18508022 -13217804 -10421426 -9708303 -10250677
36355 -10250677 -13476955 -17141775 -15947504 -10737833 -8440090 -10684416 -11502048 -8318872
36347 -8318872 -5333122 -3748546 219562 4498989 778983 -9973105 -14409939 -6360100
36339 -6360100 2772652 1692438 -4681800 -6795135 -6250605 -7704104 -5834520 4753304
36331 4753304 14938763 12364989 1618211 -2661258 1489900 3881842 2697486 6937822
36323 6937822 17640035 23391378 18433379 11110765 9418061 10281405 8492403 5768899
36315 5768899 5537114 7477454 11460163 18231437 22678931 16222503 795593 -9083560
36307 -9083560 -4537082 5522424 7385721 804371 -3411730 624479 7714841 9450585
36299 9450585 3147083 -6360582 -11627678 -10268315 -7102460 -6170835 -3996650 2880848
36291 2880848 7445044 -76232 -15215444 -22631631 -17976192 -12969315 -15063006 -16674791
36283 -16674791 -11550756 -7188705 -10328933 -12807432 -5014105 6711861 10414733 8119054
36275 8119054 9885532 14409109 11768728 2168180 -4152942 -4617054 -6474847 -10893862
36267 -10893862 -10328273 -4476012 -4102339 -13578426 -22144897 -19323399 -8967293 -1110842
36259 -1110842 1708888 2865530 3027482 273548 -5057020 -10522520 -13658396 -11847483
36251 -11847483 -4564923 3033491 4525167 1215806 -118197 942669 -2026785 -9188242
36243 -9188242 -11807745 -7002205 -3621418 -6654064 -7380310 1033647 8672979 2873451
36235 2873451 -10397463 -14329142 -6756840 -2354493 -9313775 -18440909 -18959315 -12828996
36227 -12828996 -7711210 -5263353 -2910913 -221156 2859479 8894078 18019629 23928042
36219 23928042 20606175 10860664 3057304 581086 -853403 -5337494 -10249942 -9705578
36211 -9705578 -2838747 4266773 6137014 5203033 7932415 14318403 16846004 11909154
36203 11909154 5803672 4465802 3481357 -3853572 -13400332 -15472819 -10865518 -9869235
36195 -9869235 -15029802 -17281241 -12346077 -8625937 -12664673 -17940880 -16556172 -12437792
36187 -12437792 -12541743 -12756245 -4910414 7001902 10455027 2388015 -8204745 -14951265
36179 -14951265 -19505687 -21480661 -15438383 -2051961 8222291 8333289 3285135 251113
36171 251113 -1709438 -5257439 -5736967 2223556 13705246 18558013 15304713 11391931
36163 11391931 10642104 9118801 4164981 -618865 -1878781 -1237920 -540760 1476148
36155 1476148 4001297 1498883 -8326450 -18173902 -18897409 -10997511 -2429817 2820387
36147 2820387 6864001 9372519 5231999 -6606823 -18402712 -21725080 -16020034 -6323307
36139 -6323307 2453686 5506566 -1361807 -14979523 -23315756 -18474459 -8210383 -6292341
36131 -6292341 -13331847 -16581987 -8888235 2094128 6300655 3952644 1468985 2165929
36123 2165929 6161204 13093914 19126905 16580301 2910811 -13501483 -21818340 -19846390
36115 -19846390 -12641109 -4517452 2492040 6429267 7133523 6736664 4359274 -4291339
36107 -4291339 -17067206 -22380563 -14038362 -2457718 -1033943 -6960281 -7560775 -1374988
36099 -1374988 1324764 -2315153 -3122053 3489796 10135207 10687594 8388129 5906635
36091 5906635 -440259 -10049717 -13077121 -4434625 6813372 10786665 10889667 14943984
36083 14943984 19842038 16331943 4357852 -7258280 -13686308 -16811370 -17057455 -12261774
36075 -12261774 -4606171 -154078 -328667 -403935 2632548 6382775 7945288 7522002 6502647
36066 6502647 6347068 9545266 17041083 24082408 23249091 13351787 2014668 -2484311
36058 -2484311 157821 3336072 1865784 -2409767 -3501601 1083669 7029739 8242259
36050 8242259 3514405 -3526334 -9078311 -10916820 -7678263 -529974 6063794 9470101
36042 9470101 12435824 16571006 16270868 7064556 -3631341 -4819155 1224917 2995320
36034 2995320 -408281 1297548 8973469 10333273 1887187 -3565987 36739 -112155
36026 -112155 -12353502 -22737525 -17061096 -5305537 -4379302 -9204300 -3626046 8776789
36018 8776789 9321074 -4339816 -15249494 -15288591 -13825973 -15839478 -12477463 860539
36010 860539 14340814 17793654 11469807 -699998 -15026148 -23187553 -18085324 -6912404
36002 -6912404 -3911033 -8854002 -8778539 -1955496 -844538 -7893309 -9543528 -1516726
35994 -1516726 689119 -12725572 -28359172 -30111622 -21324073 -13673682 -8353256 -1558997
35986 -1558997 3872507 5236013 7346604 11987341 11504826 3282562 -2530898 -909697
35978 -909697 -3083851 -16527586 -28399239 -24619437 -12253228 -6157342 -5772918 -2967634
35970 -2967634 -769387 -4425218 -4779331 7410356 19244986 11238017 -10531636 -21296241
35962 -21296241 -13388035 -2074175 2674121 6467227 11184303 8491118 -2442430 -10519266
35954 -10519266 -11356623 -12913655 -18200177 -19802914 -16214034 -16039612 -20384016 -18324276
35946 -18324276 -6610975 2748673 2190536 6070 3600290 6473121 1670234 -5143332
35938 -5143332 -6027819 -2482290 2092171 9706143 18382920 17683120 4504649 -7232888
35930 -7232888 -4031084 8787194 16541316 14854198 9930784 7277598 10012192 20349923
35922 20349923 32484237 31844088 12619254 -10598440 -19508884 -14051865 -6824509 -2568414
35914 -2568414 3528788 11739208 16076836 15331500 13775265 11335676 4035402 -5556900
35906 -5556900 -8627377 -2411661 6189769 10746776 11892516 12663529 13824305 15270690
35898 15270690 16910003 17315678 15628139 14274952 15539013 16756336 13809396 8044378
35890 8044378 4548334 4732575 5766421 6107050 6186194 4712234 79927 -4882465 -5057827
35881 -5057827 -161702 5006555 7518977 8844232 9915252 8251976 1969772 -5845464
35873 -5845464 -8736883 -3011006 7454192 13563423 10658678 4762958 4654672 8575930
35865 8575930 6165818 -5321098 -15967741 -18109530 -16267364 -15560379 -10572397 3442488
35857 3442488 16284913 13479018 -2388617 -14136544 -12824051 -6279399 -4382526 -6622807
35849 -6622807 -6283305 1147468 14580986 25531672 21783769 1795760 -17333651 -17899162
35841 -17899162 -5718947 -2371432 -13683905 -22763499 -18020306 -9928092 -10773288 -14325092
35833 -14325092 -9573332 -1838191 -3250945 -10411916 -9632765 -717146 2663556 -3086084
35825 -3086084 -4717208 5267649 14364742 8325431 -6807866 -13199982 -6556581 -265672
$$ [...]
##END NTUPLES=NMR SPECTRUM
##END=
