##TITLE=31Pdec_SR147_x TFA
 DMSO-d6, 128 sc
 21.2.2023
##JCAMPDX= 6.0         $$ Bruker NMR JCAMP-DX V2.0
##DATA TYPE= NMR SPECTRUM
##DATA CLASS= NTUPLES
##ORIGIN= UXNMR, Bruker Analytische Messtechnik GmbH
##OWNER= root
$$ XWIN-NMR		Version 3.5
$$ Tue Feb 21 13:47:57 2023 Russian Standard Time (UT+4h)  she@DPX200
##.OBSERVE FREQUENCY= 81.013821
##.OBSERVE NUCLEUS= ^31P
##.ACQUISITION MODE= SIMULTANEOUS
##.ACQUISITION SCHEME= undefined
##.AVERAGES= 24
##.DIGITISER RES= 16
##SPECTROMETER/DATA SYSTEM= spect
##.PULSE SEQUENCE= zgpg30
##.SOLVENT NAME= DMSO
##.SHIFT REFERENCE= (INTERNAL, DMSO, 0, 248.564)
##AUDIT TRAIL= $$ (NUMBER, WHEN, WHO, WHERE, WHAT)
$$ ##TITLE= Audit trail, XWIN-NMR		Version 3.5
$$ ##JCAMPDX= 5.01
$$ ##ORIGIN= Bruker BioSpin GmbH
$$ ##OWNER= she
$$ F:/spectra/data/she/nmr/P31/1/pdata/1/auditp.txt
$$ ##AUDIT TRAIL=  $$ (NUMBER, WHEN, WHO, WHERE, WHAT)
(   1,<2023-02-21 13:45:56.17 +0400>,<she>,<DPX200>,
      <created by zg, POWCHK disabled, PULCHK disabled
       configuration hash MD5:
       00 E9 B6 7A A2 85 ED C7 34 08 36 98 17 FE 4E 26
       data hash MD5: 32K
       96 38 5D AF 6A BB DC 98 FE 5E F1 7C A7 AB 85 1A>)
(   2,<2023-02-21 13:45:58.54 +0400>,<she>,<DPX200>,
      <Start of raw data processing
       efp BC_mod = 2 LB = 1 FT_mod = 6 PKNL = 1 PHC0 = -11098.01 PHC1 = 373.6127 SI = 64K 
       data hash MD5: 64K
       B5 8E 43 39 4D 2B 31 FA 0F 74 CD E3 98 EE 53 1C>)
(   3,<2023-02-21 13:46:17.68 +0400>,<she>,<DPX200>,
      <pk PHC0 = 225.977 PHC1 = -574.5999 
       data hash MD5: 64K
       2B 58 FB 40 80 6C 8A F1 74 A7 9F CA C5 0F A7 25>)
(   4,<2023-02-21 13:46:23.23 +0400>,<she>,<DPX200>,
      <abs ABSG = 5 
       data hash MD5: 64K
       FA CC 65 5A 35 85 B1 53 07 CE 0B 02 0D 1F F1 E9>)
$$ ##END=
$$ 
$$ hash MD5
$$ 38 F8 63 5D 3C B1 29 C8 00 63 69 78 1C 98 DA 03
##$RELAX= 
##$RELAX= 
##$RELAX= 
##$RELAX= 
##$RELAX= 
##$RELAX= 
##$RELAX= 
##$RELAX= 
##$RELAX= 
$$ Bruker specific parameters
$$ --------------------------
##$DU= <F:/spectra>
##$EXPNO= 1
##$NAME= <P31>
##$PROCNO= 1
##$TYPE= <nmr>
##$USER= <she>
##$AMP= (0..31)
100 100 100 100 100 100 100 100 100 100 100 100 100 100 100 100 100 100 
100 100 100 100 100 100 100 100 100 100 100 100 100 100 
##$AQSEQ= 0
##$AQ_mod= 1
##$AUNM= <au_zg>
##$AUTOPOS= <>
##$BF1= 81.014009
##$BF2= 200.13
##$BF3= 200.13
##$BF4= 200.13
##$BF5= 200.13
##$BF6= 200.13
##$BF7= 200.13
##$BF8= 200.13
##$BYTORDA= 1
##$CFDGTYP= 0
##$CFRGTYP= 5
##$CHEMSTR= <none>
##$CNST= (0..31)
1 1 145 1 1 1 1 1 1 1 1 1 1 1 1 1 1 1 1 1 1 1 1 1 1 1 1 1 1 1 1 1 
##$CPDPRG= <waltz16>
##$CPDPRG1= <>
##$CPDPRG2= <waltz16>
##$CPDPRG3= <>
##$CPDPRG4= <mlev>
##$CPDPRG5= <mlev>
##$CPDPRG6= <mlev>
##$CPDPRG7= <mlev>
##$CPDPRG8= <mlev>
##$CPDPRGB= <>
##$CPDPRGT= <>
##$D= (0..31)
0 1 0 0 0 0 0 0 0 0 0 0.03 2e-05 3e-06 0 0 0 0 0 0 0 0 0 0 0 0 0 0 0 0 
0 0 
##$DATE= 1676972755
##$DBL= (0..7)
120 120 120 11 120 120 24 19 
##$DBP= (0..7)
150 150 150 150 150 150 150 150 
##$DBP07= 0
##$DBPNAM0= <>
##$DBPNAM1= <>
$$ [...]
##$SUBNAM3= <"">
##$SUBNAM4= <"">
##$SUBNAM5= <"">
##$SUBNAM6= <"">
##$SUBNAM7= <"">
##$SUBNAM8= <"">
##$SUBNAM9= <"">
##$SW= 501.771253377433
##$SWIBOX= (0..15)
0 1 3 0 0 0 0 0 0 0 0 0 0 0 0 0 
##$SW_h= 40650.406504065
##$TD= 32768
##$TD0= 1
##$TE= 0
##$TE2= 300
##$TE3= 300
##$TEG= 300
##$TL= (0..7)
0 120 53 12 22 120 120 120 
##$TP= (0..7)
150 150 150 150 150 150 150 150 
##$TP07= 0
##$TPNAME0= <>
##$TPNAME1= <>
##$TPNAME2= <>
##$TPNAME3= <>
##$TPNAME4= <>
##$TPNAME5= <>
##$TPNAME6= <>
##$TPNAME7= <>
##$TPOAL= (0..7)
0.5 0.5 0.5 0.5 0.5 0.5 0.5 0.5 
##$TPOFFS= (0..7)
0 0 0 0 0 0 0 0 
##$TUNHIN= 0
##$TUNHOUT= 0
##$TUNXOUT= 0
##$USERA1= <user>
##$USERA2= <user>
##$USERA3= <user>
##$USERA4= <user>
##$USERA5= <user>
##$V9= 5
##$VALIST= <valist>
##$VCLIST= <CCCCCCCCCCCCCCC>
##$VD= 0
##$VDLIST= <DDDDDDDDDDDDDDD>
##$VPLIST= <PPPPPPPPPPPPPPP>
##$VTLIST= <TTTTTTTTTTTTTTT>
##$WBST= 1024
##$WBSW= 4
##$XGAIN= (0..3)
0 0 0 0 
##$XL= 0
##$YL= 0
##$YMAX_a= 2486
##$YMIN_a= -2777
##$ZGOPTNS= <>
##$ZL1= 120
##$ZL2= 120
##$ZL3= 120
##$ZL4= 120
##$ABSF1= 248.5645
##$ABSF2= -253.2056
##$ABSG= 5
##$ABSL= 3
##$ALPHA= 0
##$AQORDER= 0
##$ASSFAC= 0
##$ASSFACI= 0
##$ASSFACX= 0
##$ASSWID= 0
##$AUNMP= <proc_1d>
##$AZFE= 0.1
##$AZFW= 0.5
##$BCFW= 0
##$BC_mod= 2
##$BYTORDP= 0
##$COROFFS= 0
##$CY= -3
##$DATMOD= 1
##$DC= 0
##$DFILT= <>
##$DTYPP= 0
##$F1P= 0
##$F2P= 0
##$FCOR= 1
##$FTSIZE= 65536
##$FT_mod= 6
##$GAMMA= 0
##$GB= 0
##$INTBC= 1
##$INTSCL= 6.047779e-11
##$ISEN= 30
##$LB= 1
##$LEV0= 0
##$LPBIN= 0
##$MAXI= 10000
##$MC2= 0
##$MEAN= 0
##$ME_mod= 0
##$MI= 50
##$NCOEF= 0
##$NC_proc= -7
##$NLEV= 6
##$NOISF1= 182.463
##$NOISF2= 159.3651
##$NSP= 0
##$NTH_PI= 0
##$NZP= 0
##$OFFSET= 248.5645
##$PC= 4
##$PHC0= -10872.03
##$PHC1= -200.9872
##$PH_mod= 1
##$PKNL= yes
##$PPARMOD= 0
##$PSCAL= 0
##$PSIGN= 0
##$REVERSE= no
##$SF= 81.0140089999694
##$SI= 65536
##$SIGF1= 159.3651
##$SIGF2= -187.1042
##$SINO= 113.3802
##$SIOLD= 16384
##$SREGLST= <1H.CDCl3>
##$SSB= 0
##$STSI= 65536
##$STSR= 0
##$SW_p= 40650.406504065
##$SYMM= 0
##$S_DEV= 0
##$TDeff= 32768
##$TDoff= 0
##$TI= <>
##$TILT= no
##$TM1= 0
##$TM2= 0
##$TOPLEV= 0
##$USERP1= <user>
##$USERP2= <user>
##$USERP3= <user>
##$USERP4= <user>
##$USERP5= <user>
##$WDW= 1
##$XDIM= 65536
##$YMAX_p= 362597087
##$YMIN_p= -26660057
$$ End of Bruker specific parameters
$$ ---------------------------------
##NTUPLES= NMR SPECTRUM
##VAR_NAME=  FREQUENCY,     SPECTRUM/REAL,   SPECTRUM/IMAG
##SYMBOL=    X,             R,               I
##VAR_TYPE=  INDEPENDENT,   DEPENDENT,       DEPENDENT
##VAR_FORM=  AFFN,          ASDF,            ASDF
##VAR_DIM=   65536,         65536,           65536
##UNITS=     HZ,            ARBITRARY UNITS, ARBITRARY UNITS
##FACTOR=    0.620285442955139, 1,           1
##FIRST=     20137.2065510682, 0,            0
##LAST=      -20513.1999529968, 0,           0
##MIN=       -20513.1999529968, -26660057,   0
##MAX=       20137.2065510682, 362597087,    0
$$ Real data points
##PAGE= N=1
##DATA TABLE= (X++(R..R)), XYDATA
$$ [...]
41154A823100j1511j330533j990882q86701J094925J830154M52637j459287j879163
$$ 1823100 1811589 481056 -1509826 -2396527 -1301602 528552 981189 -478098 -2357261
41145b357261q90051n3172K49116J015471K139187J898324j47221j691590p26672
$$ -2357261 -3247312 -3300484 -3051368 -2035897 103290 2001614 1854393 162803 -563869
41136e63869J350699J667932P6152q63899J9249Q13565k60144j957229j916013
$$ -563869 786830 2454762 2530914 1667015 1686264 2499829 2239685 282456 -1633557
41127a633557j96873R82602N54238k51939j91315K95762L19898P4184J41246K78418
$$ -1633557 -1830430 -847828 -293590 -545529 -736844 -441082 -121184 -47000 94246 372664
41117C72664J1618k38362K30322J053835J143628K04857r65814j549994j307057
$$ 372664 384282 145920 376242 1430077 2573705 2778562 1812748 262754 -1044303
41108a044303l39785Q84441J410211N39899j230115k559568k501062j101090P97578
$$ -1044303 -1384088 -499647 910564 1450463 220348 -2339220 -4840282 -5941372 -5143794
41099e143794J971339J683279O19829J75673M03991l2747j227087j234760O73710
$$ -5143794 -3172455 -1489176 -869347 -693674 -289683 -322430 -1549517 -2784277 -2110567
41090b110567K040940P79901j177628q31752Q11742M59060j506845j300533J700621
$$ -2110567 -69627 710274 -467354 -1299106 -487364 -28304 -1535149 -2835682 -1135061
41081a135061L327774J127382j692090j302184J142109J890748Q7247k096884
$$ -1135061 2192713 3320095 1628005 325821 1467930 3358678 3445925 1349041
41073A349041l005482k461940o19030J681850K555830J229374n18646q29495k81722
$$ 1349041 -1656441 -4118381 -4737411 -3055561 -499731 729643 210997 -618498 -900220
41064i00220j82463j12907O32629R17462l02427j399782l42585J573990J363548
$$ -900220 -1082683 -1195590 -562961 354501 52074 -1347708 -1690293 -116303 1247245
41055A247245q83572j940975j20449K672869L785901K516194j61977k566160k933448
$$ 1247245 363673 -1577302 -1697751 975118 4761019 7277213 7115236 4549076 1615628
41046A615628r60553J207868J168803o92329j918618j368719j29575N91671O29039
$$ 1615628 655075 1862943 3031746 2339417 420799 -947920 -1077495 -485824 143215
41037A43215J37808n59459o46617J63573Q18153N79534M48653J159425J223880
$$ 143215 281023 -278436 -925053 -761480 56673 636207 1084860 2244285 3468165
41028C468165n32582k014542p51583J430222O85879k387500l150687k87299J964373
$$ 3468165 2935583 921041 169458 1599680 2285559 -101941 -3252628 -3539927 -1575554
41019a575554N79074j660467j012305J392097J958797M05546m26392P59497K320633
$$ -1575554 -996480 -2656947 -3669252 -2277155 -318358 87188 -339204 420293 2740926
41010B740926K434518R59710j119755k428240j856756J25495J406293O39265j039894
$$ 2740926 5175444 6135154 5015399 2587159 730403 855898 2262191 2901456 1861562
41001A861562j736569j214857m44480J25281M66565K00765n81398o38364P48689
$$ 1861562 124993 -1089864 -1534344 -1409063 -942498 -741733 -1323131 -1961495 -1212806
40992a212806K196274J854593p539j520044j722739j113391k74006N06994O85021
$$ -1212806 983468 2838061 2830522 1310478 -412261 -1525652 -1799658 -1292664 -607643
40983f07643P6658l01358M88306J511808J079451n47822j359208n98810K74111
$$ -607643 -530985 -832343 -344037 1167771 2247222 1699400 340192 -258618 15493
40974A5493Q3098m11214k22851J16887j84801m68201K08786J026832M26361j111018
$$ 15493 98591 -312623 -535474 -418587 -603388 -1071589 -862803 164029 590390 -520628
40964e20628j346017K79175J501199O02249q94208o66539O64846O94955n81371
$$ -520628 -1866645 -1587470 -86271 515978 -378230 -1044769 -379923 315032 -266339
40955b66339p41095O47754Q09406j575288l417813j524013K202997L086933K61760
$$ -266339 -1007434 -359680 449726 -1125562 -4543375 -6067388 -3864391 -777458 -515698
40946e15698k343627j608852J151716K854761K460657R63734n68976j557053j589941
$$ -515698 -2859325 -4468177 -3316461 -461700 1998957 2962691 2393715 836662 -753279
40937g53279p27669L25910Q68138O59488j87525j101043j088813J68770J513226
$$ -753279 -1480948 -1155038 -286900 372588 185063 -915980 -2004793 -1836023 -322797
40928c22797J608027P04667L2040n4537l6860Q307J06578m29700j765042k326706
$$ -322797 1285230 1989897 2021937 1967400 1930540 1938847 2045425 1615725 -149317 -2476023
40918b476023r03633R65950J192161O72539J456184K335791M63655k863315k996799
$$ -2476023 -3379656 -2413706 -1221545 -549006 907178 3242969 3706624 843309 -2153490
40909b153490N22588K390099l09243l358707k180687J108677J830542L50415L21174
$$ -2153490 -1630902 759197 449954 -2908753 -5089440 -3980763 -2150221 -1799806 -1478632
40900a478632J715821J303863r01565j266181J067919K397684L68663k459071
$$ -1478632 237189 1541052 639487 -626694 441225 2838909 3207572 748501
40892G48501k793724j091185K18838M28888K55711k81618j369653j875053n09098
$$ 748501 -2045223 -3136408 -2917570 -2488682 -2232971 -2514589 -3884242 -5759295 -6268393
40883f268393J787385K448883O10576j469224j130664J228681K606314J351934
$$ -6268393 -4481008 -2032125 -1421549 -2890773 -4021437 -2792756 -186442 1165492
40875A165492p53112j299971o83342p34492r92855N30040K886570K325969j632555
$$ 1165492 412380 -887591 -1570933 -2305425 -3298280 -2768240 118330 2444299 811744
40866H11744m003061j101884L469087L487609j067847m165325k151483K052636
$$ 811744 -3191317 -4293201 -824114 2663495 1595648 -2569677 -4721160 -2668524
40858b668524L735196J991882o37823j679636n79301J385840K129094O78347j629164
$$ -2668524 1066672 3058554 2420731 741095 161794 1547634 3676728 4355075 2725911
40849B725911k690521k002835m73065J216318K478901K125352n1776j817579j030444
$$ 2725911 35390 -1967445 -2440510 -1224192 1254709 3380061 3328285 1510706 480262
40840D80262J011344J337500j95561j124927o97904n92202j221764r29858L90279
$$ 480262 1491606 2829106 2633545 1508618 810714 218512 -1003252 -1933110 -1542831
40831a542831M50688j295510k018519P0929K569150K441217L84897q38896o23600
$$ -1542831 -1092143 -2387653 -4406172 -4335243 -1766093 675124 1060021 221125 -402475
40822d02475m97632j042053j225655l67476R60217J732484J181553o58460k348702
$$ -402475 -900107 -1942160 -3167815 -3535291 -2575074 -842590 338963 -319497 -2668199
40813b668199j986777L57059K192882J539571p06977k203231j895337m51778R80752
$$ -2668199 -4654976 -4297917 -2105035 -565464 -1272441 -3475672 -5371009 -5822787 -4842035
40804d842035J545604J089143M74017O18233J012297N14324l45319J06017J459920
$$ -4842035 -3296431 -2207288 -1733271 -1115038 -102741 411583 66264 172281 1632201
40795A632201J105090j537941l296961j662942J339893K083420L94307r22368
$$ 1632201 2737291 1199350 -2097611 -3760553 -2420660 -337240 57067 -865301
40787h65301m02346Q94362J822977K223494J754691n9230k364125l278155k053292
$$ -865301 -1267647 -373285 1449692 3673186 5427877 5368647 3004522 -273633 -2326925
40778b326925J21818J536663J403279K06858o16639J20346J708134J849383m38847
$$ -2326925 -2205107 -668444 734835 941693 325054 445400 2153534 4002917 3564070
40769C564070l071812l249676r50387J164824J042282n64454j171472N68102L027172
$$ 3564070 492258 -2757418 -3707805 -2542981 -1500699 -2065153 -3236625 -2668523 358649
40760C58649L047934o4218k927929k249885L38413N55206j825019k541220J46296
$$ 358649 3406583 3342365 414436 -1835449 -1497036 -941830 -2766849 -5308069 -5161773
40751e161773K519133J558813k95060K51715J789912J263824m58403m81463R25241
$$ -5161773 -2642640 -1083827 -1378887 -1127172 662740 1926564 1468161 986698 1911939
40742A911939J389719Q21118N38418q6317j799891k348180J4122J986289k56237
$$ 1911939 3301658 4122776 4661194 4574877 2774986 426806 440928 2427217 2170980
40733B170980l836400k903902J575112K964296k27517k335814m37126J497159
$$ 2170980 -1665420 -4569322 -2994210 -29914 -257431 -2593245 -3030371 -1533212
40725a533212O63705J10230J872334K438418m60075k784218j041864J327690O6371
$$ -1533212 -869507 -759277 1113057 3551475 3091400 307182 -734682 593008 659379
40716F59379k279276j070003K071076K229162l65712j435370k11899L65335l11435
$$ 659379 -1619897 -2689900 -618824 1610338 1244626 -190744 -402643 -37308 -348743
40707c48743j83539O44424K46852o34192L07059K003405J435925n90833n62815
$$ -348743 -532282 112142 358994 -275198 31861 2035266 3471191 2880358 2317543
40698B317543J177860P86371j871912k338598Q74039L443386J966502j301489
$$ 2317543 3495403 4281774 2409862 71264 945303 4388689 6355191 5053702
40690E053702k694480j957440n93570Q84934J854315J015761j059747j784135
$$ 5053702 2359222 401782 -191788 693146 2547461 3563222 2503475 719340
40682G19340n51305J46324j015341k083014j454556k71853L38357J019666J700316
$$ 719340 168035 314359 -700982 -2783996 -4238552 -4510405 -4172048 -3152382 -1452066
40673a452066R83589m43153J88681K524076K404409j158831l195234m44570K924073
$$ -1452066 -468477 -911630 -722949 1801127 4205536 3046705 -148529 -593099 2330974
40664B330974J847417j504003j649394J239937K340436L03955j607785j746936
$$ 2330974 4178391 2674388 1024994 2264931 4605367 4909322 3301537 1554601
40656A554601j802537k270925j386456P13804J308338k97608j344844r1994J564131
$$ 1554601 -247936 -2518861 -3905317 -3191513 -1883175 -2180783 -3525627 -3617621 -2053490
40647b053490J306602l93507j500209q58730J232729L173210K825151O4058j999780
$$ -2053490 -746888 -1140395 -2640604 -3499334 -2266605 906605 3731756 3795814 1796034
40638A796034p86336J608579J229642j482300k293312n2282J557660K11819j520305
$$ 1796034 1009698 2618277 3847919 2365619 72307 20025 1577685 1789504 269199
40629B69199q36410R63392J365272O41849J74223m78000j856268k283382m47882
$$ 269199 -567211 396181 1761453 2403302 2577525 2099525 243257 -2040125 -2488007
40620b488007J526800R08509j086218r90865J402135K726390J280146o73050o73702
$$ -2488007 -961207 -52698 -1138916 -2129781 -727646 1998744 3278890 2605840 1932138
40611A932138N28845P37321l77808j334741j218383n53716j36110p6493r0532
$$ 1932138 2460983 3198304 2820496 1485755 267372 -286344 -422454 -498947 -589479
40602e89479m3660Q9822M40997R72315J078741R1836j489981j942421l24393J836042
$$ -589479 -633139 -543317 -102320 869995 1948736 2040572 550591 -1391830 -1716223 119819
40592A19819K002594j88435k371286k431790r38654R5615k7850k37658L47233
$$ 119819 2122413 1933978 -437308 -2869098 -3807752 -3712137 -3739987 -3977645 -3630412
40583c630412J073143P52945m70568r74470K69154J944411J756523l21912j539626
$$ -3630412 -2557269 -1804324 -2274892 -3249362 -2980208 -1035797 720726 398814 -1140812
40574a140812o905K439217K622693M48715j110154k76409J367779J421986l87633
$$ -1140812 -1147717 1291500 3914193 4362908 3252754 2976345 4344124 5766110 5378477
40565E378477k545897l623815k982460p49909J938927L357767K632226N21995
$$ 5378477 2832580 -791235 -3773695 -4523604 -2584677 773090 3405316 3927311
40557C927311j437082k197311j723198q78150o68960j041853q07724O10638K077216
$$ 3927311 2490229 292918 -1430280 -2308430 -2977390 -4019243 -4826967 -4216329 -2139113
40548b139113K287848J510272O53284k24040r87532n06916J215593J592462r83952
$$ -2139113 148735 1659007 2312291 2088251 1100719 593803 1809396 3401858 2417906
40539B417906l590173k494545O62484R77779j793138k736287L3562K337385J172145
$$ 2417906 -1172267 -3666812 -3004328 -2026549 -3819687 -6555974 -6522412 -4185027 -3012882
40530c012882m71841O93178K608037K048799L31798J96755M69977j092289k511527
$$ -3012882 -3484723 -2791545 -183508 1865291 2197089 2393844 2863821 1771532 -739995
40521g39995o53540K521043K506596l17296j598047n28010m15691j833191j461621
$$ -739995 -1393535 1127508 3634104 3316808 1718761 1190751 775060 -1058131 -2519752
40512b519752J245597K338195K81831j027335J032067L105175J435966j992430
$$ -2519752 -1274155 1064040 1345871 318536 1350603 4455778 5891744 3899314
40504C899314k923983j291371r9989j66833k9202M35029J09549n41616j31342
$$ 3899314 975331 -316040 -416029 -582862 -612064 -177035 -67486 -609102 -740444
40495g40444P59979L97502q12960p58805P52831J540806N05153q27834p61323
$$ -740444 19535 417037 -395923 -1154728 -401897 1138909 1644062 816228 54905
40486E4905M24964J327893J024121m69199k125199k270851k73837K185528K796232
$$ 54905 479869 1807762 2831883 2362684 237485 -2033366 -2307203 -121675 2674557
40477B674557J455404J32682J13801Q44390J356418J224722J24369j861453l369338
$$ 2674557 4129961 4262643 4376444 5220834 6577252 7801974 7926343 6064890 2695552
40468B695552k935982j262602m61682q02007m35441J009913J219378q80892k494986
$$ 2695552 -240430 -1503032 -1964714 -2766721 -3202162 -2192249 -972871 -1853763 -4348749
40459d348749p72987K521515L235905Q42950j058445k99500J056148N00051j140592
$$ -4348749 -5121736 -2600221 635684 1478634 420189 120689 1176837 1676888 536296
40450E36296j569392o79250r5338j74862K53174J444260K004315R09318j097475
$$ 536296 -1033096 -1712346 -1807684 -1982546 -1729372 -285112 1719203 2628521 1531046
40441A531046k522307k577162j354922N21497K001366K097089Q47028n62848j021115
$$ 1531046 -991261 -3568423 -4923345 -4401848 -2400482 -303393 543635 -19213 -1040328
40432a040328n83970p5044J18795L82012R67908J248547M15355j140202j932688
$$ -1040328 -1624298 -1699342 -1580547 -1198535 -230627 1017920 1433275 293073 -1639615
40423a639615j294839l59504k60179k27930R66001K302512J561978q06735j570552
$$ -1639615 -2934454 -3293958 -3554137 -3782067 -2816066 -513554 1048424 241689 -1328863
40414a328863M75086K238189Q11987k047456k540351k98959J668519J521570J74748
$$ -1328863 -853777 1384412 2196399 148943 -2391408 -2690367 -1021848 499722 674470
40405F74470j077906j705149j050337R22594K199893Q25678j689569j969269K88925
$$ 674470 -403436 -2108585 -3158922 -2236328 -36435 789243 -900326 -2869595 -2580670
40396b580670K112176K031222J499480J148077l23909k351921j822412J664120
$$ -2580670 -468494 1562728 3062208 4210285 3886376 1534455 -287957 1376163
40388A376163L712214J221680k677349l120604l49130J558379R07726l60694n98084
$$ 1376163 5088377 6310057 3632708 512104 162974 1721353 2629079 2268385 1670301
40379A670301k51260r9755k85265q51466j410268r59567M26372R66754j44723
$$ 1670301 1419041 1319286 1034021 182555 -1227713 -2187280 -1760908 -794154 -938877
40370i38877j094021l54634P68167P74421Q46443K154788K649858L34863k241475
$$ -938877 -2032898 -2387532 -1619365 -844944 1499 2156287 4806145 5141008 2899533
40361B899533j302597J635257J624165j718367l430567j166148J304084M55808
$$ 2899533 1596936 3232193 4856358 3137991 -292576 -1458724 -154640 301168
40353C01168j756143j866532m13775o3743p52151k72855J593647K701176J861373
$$ 301168 -1454975 -3321507 -3735282 -3799025 -4551176 -4824031 -3230384 -529208 1332165
40344A332165J09010j269042k006446j983335p39151J452318K995778K396695
$$ 1332165 1441175 172133 -1834313 -3817648 -4556799 -3104481 -108703 2287992
40336B287992J38721j565486j244345J40051O72610J42009r4422L49678L94772
$$ 2287992 2426713 861227 -383118 -243067 429543 571552 477130 826808 1221580
40327A221580j76731j53529N38754K22779j254487j440998N04683J522682m80177
$$ 1221580 1044849 891320 1430074 1652853 398366 -1042632 -537949 984733 504556
40318E04556k381692m61265L064659K980539q15853l385290k546402j246278j529952
$$ 504556 -1877136 -2338401 726258 3706797 2890944 -494346 -3040748 -4287026 -5816978
40309e816978j339628R77000L355417L408488J748980J5286j419631k143551j105134
$$ -5816978 -7156606 -6179606 -2824189 584299 2333279 2348565 928934 -1214617 -2319751
40300b319751J020761J683349K18325j004765n51646K2178l86665k58536J228225
$$ -2319751 -1298990 384359 602684 -402081 -953727 -931549 -1318214 -1576750 -348525
40291c48525J910697K20625j710906j270694O10381J364457P53831K63125J77234
$$ -348525 1562172 1782797 71891 -1198803 -588422 776035 1529866 1792991 1970225
40282A970225j56715m38848p6867L30224L1515m73284n94540q35630j385080j147341
$$ 1970225 1813510 1374662 1297795 1628019 1659534 1186250 591710 -243920 -1629000 -2776341
40272b776341K97080J444910J136815L63312L12623M79924K58761L66249R75931
$$ -2776341 -2479261 -1034351 102464 465776 778399 1258323 1517084 1883333 2859264
40263B859264N95688j253262k420716j356607J78412M699r46692o38558M35558
$$ 2859264 3454952 2201690 -219026 -1575633 -1397221 -1392522 -2339214 -2977772 -2542214
40254b542214N35159N6139O05699J805973J939458J004273M23266L09688m21501
$$ -2542214 -2007055 -1950916 -1345217 460756 2400214 3404487 3827753 4137441 3715940
40245C715940j586067j695937l09757J331460J858475P89866j340101k841205
$$ 3715940 2129873 433936 124179 1455639 3314114 4103980 2763879 -77326
40237g7326j966638P24758K424056J581675k36661j046287r14602m66468N75787
$$ -77326 -2043964 -1319206 1104850 2686525 2449864 1403577 488975 22507 598294
40228E98294J646087Q39989j680648k603733l56113J853450R75841q89353l06850
$$ 598294 2244381 3084370 1403722 -1200011 -1556124 297326 1273167 383814 76964
40219G6964J418514O60458j966319k532463l16423J497295J319494P69797P26068
$$ 76964 1495478 2155936 189617 -2342846 -2659269 -1161974 157520 927317 1653385
40210A653385J02960r82460q14168M74182O29922q22493j673423o98066P43243
$$ 1653385 1756345 773885 -40283 433899 1063821 241328 -1432095 -2130161 -1386918
40201a386918J307629J077112R6392j634632k580806j098479J440381K057963
$$ -1386918 -79289 997823 1094215 -540417 -3121223 -4219702 -2779321 -721358
40193g21358P36116J77900R19865N77519j362919k049307m1058K005126J391581
$$ -721358 14758 192658 1112523 1690042 327123 -1722184 -1763242 241884 1633465
40184A633465p46743j630136o73578O35720J022952L20667n70313j26161J868112
$$ 1633465 886722 -743414 -1416992 -781272 241680 562347 -7966 -134127 1733985
40175A733985L046416J304580j561579k014007k12418L89339j000471j248482
$$ 1733985 4780401 6084981 4523402 2509395 2296977 2686316 1685845 437363
40167D37363J002300K726191J505848p91942j659540j712993k181524j910798
$$ 437363 1439663 4165854 5671702 4879760 3220220 1507227 -674297 -2585095
40159b585095N9696J654461P81002q91470l73800J992212L311740K380889M75098
$$ -2585095 -2525399 -870938 -89936 -981406 -1355206 637006 3948746 6329635 6804733
40150F804733j115711j916281j508146j79218M09808q27726k538750k734265j525448
$$ 6804733 5689022 3772741 2264595 2085377 2495185 1667459 -871291 -3605556 -5131004
40141e131004l42023M77258J329408J562222L12477j353040j323964N01751J841574
$$ -5131004 -5473027 -4995769 -3666361 -2104139 -1791662 -3144702 -4468666 -3966915 -2125341
40132b125341J005170j061890k121957j227876M40978J095386M95254K04982J300486
$$ -2125341 -1120171 -2182061 -4304018 -5531894 -5090916 -3995530 -3500276 -3295294 -1994808
40123a994808K552405K093459L05627p63758o34516q40363j916090k336970j255138
$$ -1994808 557597 2651056 2956683 2192925 1558409 718046 -1198044 -3535014 -4790152
40114d790152m3333M6431j87932M19591J469574J978000J857002J413718P37416
$$ -4790152 -4833485 -4787054 -4974986 -4555395 -3085821 -1107821 749181 2162899 2900315
40105B900315K78011N09564N96570p01033k473156k413416n91186L87469k65699
$$ 2900315 3178326 3687890 4284460 3583427 1110271 -1303145 -1894331 -1506862 -1772561
40096a772561l24624J056637J465784k31464j255882L29717J765858R5206k555025
$$ -1772561 -2097185 -1040548 425236 193772 -1062110 -732393 1033465 1128671 -1426354
40087a426354k385042j72862M90136n39702l36556J424889K115613J292597J393849
$$ -1426354 -3811396 -3984258 -3494122 -4033824 -4370380 -2945491 -829878 462719 1856568
40078A856568K739446K379045p45863l454436k969816o68730P50716J038357J181072
$$ 1856568 4596014 6975059 6229196 2774760 -195056 -863786 -113070 925287 2106359
40069B106359Q10699o54551j849315r85768J143681J819585j9174k404441k813609
$$ 2106359 2917058 2262507 413192 -572576 571105 2390690 2371516 -32925 -2846534
40060b846534j003898J051846J547852O29943k54494l15951o6347q1304j27036
$$ -2846534 -3850432 -2798586 -1250734 -620791 -875285 -1191236 -1257583 -1338887 -1465923
40051a465923M0478M025m23886n25675J83360R30098P78067J3359n14024o09407
$$ -1465923 -1425445 -1421420 -1845306 -2370981 -2187621 -1257523 -479456 -466097 -980121 -1589528
40041a589528l21896O45195J908402J959387L07055j072154l50859J080238N08722
$$ -1589528 -1911424 -1266229 642173 2601560 2908615 1836461 1485602 2565840 3074562
40032C074562j745436k543872n55295J907899K291081Q20199p55474j525114j417420
$$ 3074562 1329126 -1214746 -1770041 137858 2428939 3249138 2493664 968550 -448870
40023d48870m08054J009371J635916R54147r4191n30894o28029q85265p22494
$$ -448870 -856924 152447 1788363 2742510 2648319 2117425 1489396 604131 -118363
40014a18363M81946J676735J099136r85634k079443p14577J362586J591538K93027
$$ -118363 363583 2040318 3139454 2153820 74377 -640200 722386 2313924 2606951
40005B606951k8543J070463R97750j511724l590913k158034J216271K479998J027309
$$ 2606951 2578408 3648871 4646621 3134897 -456016 -2614050 -1397779 1082219 2109528
39996B109528j44279K43088L46954m71769k86333J095733Q75076j464354j992035
$$ 2109528 1965249 2208337 2555291 2083522 1797189 2892922 3767998 2303644 311609
39987C11609J291864L977148J514586l310246m351624j284120Q37678k2729q60330
$$ 311609 1603473 5580621 7095207 3784961 -566663 -1850783 -1013105 -1035834 -1896164
39978a896164p340L01939r78462j243358R40858K812320J832345k88225p54302
$$ -1896164 -1903504 -1601565 -2580027 -3823385 -2882527 -70207 1762138 1473913 719611
39969G19611j22209o08470j914384j726646N21614K774930K984044J145678j040534
$$ 719611 597402 -11068 -1925452 -3652098 -3130484 -355554 2628490 3774168 2733634
39960B733634j710915m34236J286656J600950L43433j293527k546593l083922
$$ 2733634 1022719 588483 1875139 3476089 3819522 2525995 -20598 -3104520
39952c104520j961616J091323L651915K734977o79028k206754o2261K447658J870590
$$ -3104520 -5066136 -3974813 -322898 2412079 1733051 -473703 -535964 1911694 3782284
39943C782284p40015k146076j574801o27222j47408L72871J092255J468351J192743
$$ 3782284 3042269 896193 -678608 -1305830 -1453238 -1080367 11888 1480239 2672982
39934B672982L10630r63314j845933j472488l72798l8188m72848o0890J395949
$$ 2672982 2983612 2020298 174365 -1298123 -1670921 -1709109 -2181957 -2242847 -846898
39925h46898J835485L30646j157612j074681p50285j424112j404438Q69722L129881
$$ -846898 988587 1319233 161621 -913060 -1663345 -3087457 -4491895 -3622173 -492292
39916d92292K209045p55571j809904j62915J067990O9392j260070p96438Q66655
$$ -492292 1716753 961182 -848722 -1011637 56353 125745 -1134325 -1930763 -1064108
39907a064108J970211J845826P69234o18269j206045m29776L87126m56795k145947
$$ -1064108 906103 2751929 3521163 2902894 1696849 1267073 1654199 1197404 -948543
39898i48543k147559j13077J450640R85256p2015M0135R38082J404636J159283
$$ -948543 -3096102 -3209179 -1758539 -773283 -845298 -805163 132919 1537555 2696838
39889B696838K50063j331298k385985j070826J949382L200352R70944j981107
$$ 2696838 2946901 1615603 -770382 -1841208 108174 3308526 4279470 2298363
39881B298363k299599m98488Q06356J088602J382852J251763k08215j375627K5358
$$ 2298363 -1236 -499724 306632 1395234 2778086 4029849 3821634 2446007 2471365
39872B471365K370922J512790k706182n297354l026313J053484K227015L91773
$$ 2471365 4842287 6355077 3648895 -1648459 -4674772 -3621288 -1394273 -1002500
39864a002500j067010n42237P11458J485365J660561R63136p03752j967879j360339
$$ -1002500 -2069510 -2611747 -1900289 -414924 1245637 2208773 1505021 -462858 -1823197
39855a823197J97905M98029n35725r06501n2708L70202k27897q7981J575138K478431
$$ -1823197 -1625292 -1127263 -1662988 -2569489 -2622197 -2251995 -2479892 -2567873 -992735 1485696
39845A485696N78775k337625k848009o82955J190462R97442K18382O68382J545290
$$ 1485696 2064471 -273154 -3121163 -3804118 -2613656 -1616214 -1397832 -729450 815840
39836H15840P78846j641038l199858j891545J130146K630708J028741j610610
$$ 815840 1594686 -46352 -3246210 -5137755 -4007609 -1376901 -348160 -1958770
39828a958770j993656L09043K347831J672929n61031j405434q4927J414630J448522
$$ -1958770 -3952426 -3643383 -1295552 377377 -183654 -1589088 -1674015 -259385 1189137
39819A189137O90518N23471Q74159P19350q3465p52845j081996j649914k311955
$$ 1189137 1879655 2403126 3277285 3996635 3913170 3160325 2078329 428415 -1883540
39810a883540j807110K57746K067526J678346o1627m51001J100752K060796O10037
$$ -1883540 -3690650 -3432904 -1365378 312968 251341 -199660 901092 2961888 3571925
39801C571925j452059j349279N73441J602385O72129p56148j494375j824208j763323
$$ 3571925 2119866 770587 1344028 2946413 3618542 2862394 1368019 -456189 -2219512
39792b219512o42816R30350J017886o67672j712371k32505K429459L522013K127226
$$ -2219512 -2862328 -1931978 -914092 -1581764 -3294135 -3526640 -1097181 2424832 4552058
39783D552058m68192k432724k546850r40008O35322N63790l18876m890J035640
$$ 4552058 4083866 1651142 -895708 -1835716 -1200394 -636604 -955480 -960370 75270
39774G5270L51803j729391j566485J764318L800070J130907k951860l242004k23206
$$ 75270 427073 -1302318 -2868803 -1104485 2695585 3826492 874632 -2367372 -2590578
39765b590578J752667J664008J864171K282378M70926k643763k911101J35755
$$ -2590578 -837911 826097 2690268 4972646 5443572 2799809 -111292 24463
39757B4463J963708L26052j306713j3950J746982Q61404j084066j082979j8505
$$ 24463 1988171 2314223 1007510 993560 2740542 3601946 2517880 1434901 1416396
39748A416396m46911j580964q95861R43273J149040j40207j35542J529696K029047
$$ 1416396 969485 -611479 -1507340 -564067 584973 444766 309224 1838920 3867967
39739C867967J09850j903873j833865m48774N78647J005402J055708L10156j008839
$$ 3867967 3977817 2073944 240079 -208695 369952 1375354 2431062 2741218 1732379
39730A732379j435229m46193K48741p76428k082877j189656J669605L541705K532696
$$ 1732379 297150 -149043 99698 -676730 -2759607 -3949263 -2279658 1262047 3794743
39721C794743j9394j586667j380628m83508J8558j5431l14994o52769p03818k19873
$$ 3794743 3775349 2188682 808054 324546 343104 327673 12679 -640090 -1343908 -1563781
39711a563781M69001P20289M66016J88954n4327o65190j303743q59110O85715
$$ -1563781 -1094780 -374491 91525 280479 226152 -439038 -1742781 -2601891 -1916176
39702a916176J622333R31926J64864J195924K955946K639588p70j977635j276812
$$ -1916176 -293843 638083 802947 1998871 4954817 7594405 7593635 5616000 4339188
39693D339188M60691O94624l69097o78504J78324M50330q64465k310973j943159
$$ 4339188 4799879 5494503 5125406 4446902 4625226 5075556 4211091 1900118 -43041
39684d3041n8378J116048L49995j041468j202375m37687n24493j598218j671632
$$ -43041 -101419 1014629 1364624 323156 -879219 -1316906 -1841399 -3439617 -5111249
39675e111249J18262J804032J563012O12386J051164K198644J694735m82357j842013
$$ -5111249 -4992987 -3188955 -1625943 -1013557 37607 2236251 3930986 3448629 1606616
39666A606616j077453N80145J722738K029921J123807j178453l135640k367910
$$ 1606616 529163 1109308 2832046 4861967 5985774 4807321 1671681 -696229
39658f96229M45367J840718M15054j329907j104844L2621K54533j5820K58496
$$ -696229 -250862 1589856 2004910 675003 -429841 -397220 -142687 -158507 99989
39649I9989L51739n91524j312057k58140J571463J827446L2234k166593l170829
$$ 99989 451728 -139796 -1451853 -1709993 -138530 1688916 1721150 -445443 -3616272
39640c616272k419379j63571K358877L451435K816361J871587J422689N97937
$$ -3616272 -6035651 -6199222 -3840345 -388910 2427451 4299038 5721727 6319664
39632F319664r45215j741513q43632N18058J109252J456728J822062Q45410j622676
$$ 6319664 5374449 3632936 2789304 3307362 4416614 5873342 7695404 8540814 6918138
39623F918138k809984r00307J576442J327519p21847j484845r55023j368979k339546
$$ 6918138 4108154 3207847 4784289 6111808 5389961 3905116 2950093 1581114 -758432
39614g58432j269521J612243K900229J252814p27060p56172K11753M40438J4431
$$ -758432 -2027953 -415710 2484519 3737333 3010273 2254101 2465854 2906292 2920723
39605B920723k56845l70584n04139n16751o28424j063016j003435K91635J573227
$$ 2920723 2663878 2293294 1789155 1272404 643980 -419036 -1422471 -1130836 442391
39596D42391R90333q04379j349251j04338J012515Q26917J07193m36544p52569
$$ 442391 1432724 628345 -720906 -825244 187271 1014188 1121381 684837 -67732
39587f7732j68593J640512K611689N42920k628251k598261P90975K918589J322556
$$ -67732 -236325 1404187 4015876 4558796 1930545 -667716 123259 3041848 4364404
39578D364404r61368p74397N41039M00243o91513r75153p27861q36494n23049
$$ 4364404 3403036 2628639 3169678 3569921 2878408 1903255 1175394 338900 -184149
39569a84149P80798J486768L20399j335389j814450j600697j273639J84532K539321
$$ -184149 596649 2083417 2403816 1068427 -746023 -2346720 -3620359 -3435827 -896506
39560h96506K870022J02102k122328p72652J439288O19960j526236p99475J868730
$$ -896506 1973516 2075618 -46710 -819362 619926 1239886 -286350 -1085825 782905
39551G82905K034547k09126m18564J918623K055251j558383l831608r04579L810853
$$ 782905 2817452 2608326 2189762 4108385 6163636 4605253 773645 -130934 3679919
39542C679919N007332K697793K71379j239045k823553l830293k774593n89742
$$ 3679919 8687251 11385044 11656423 10417378 7593825 3763532 988939 399197
39534C99197L52466k52899q05852o67547m03723N1578J070530J761051R66397
$$ 399197 751663 498764 -307088 -974635 -1378358 -1326780 -256250 1504801 2471198
39525B471198n81150j092104l03624N48919Q16611P21592J57184r25790j490980
$$ 2471198 1890048 797944 494320 1043239 1859850 2581442 2738626 1812836 321856
39516C21856p16379K09983l15808j393696o99662J610686K649324R35129j557759
$$ 321856 -394523 -184540 -500348 -1894044 -2593706 -983020 1666304 2601433 1043674
39507A043674k358315j487380m23335J73158M45189M28642M12332J102097K255604
$$ 1043674 -1314641 -2802021 -3225356 -3052198 -2607009 -2178367 -1766035 -663938 1591666
39498A591666K206307P2356k390263k616665n05712J513185J603961M84690J4657
$$ 1591666 3797973 3870329 1480066 -1136599 -1642311 -129126 1474835 1959525 1974182
39489A974182P93461J761334J757504Q47560k5300l50889n01416p93000p77956
$$ 1974182 2767643 4528977 6286481 7134041 7108741 6757852 6256436 5463436 4685480
39480D685480p2825O59844N34470n4473L6763O98503N01762r97442k293889k024717
$$ 4685480 4612655 5272499 5806969 5752496 5789259 6487762 6989524 5992082 3698193 1673476
39470A673476q08525k7967J78837N34188J000165Q27597j26258j142216j478878
$$ 1673476 864951 836984 1015821 1550009 2550174 3377771 3251513 2109297 630419
39461F30419q40540M72362J319205N25701j279250j821918l74890O13203r91103
$$ 630419 -210121 262241 1581446 2107147 827897 -994021 -1368911 -755708 -1746811
39452a746811l105085j809585K712516N681719L827797o96740l657995l603669
$$ -1746811 -4851896 -6661481 -3948965 1732754 5560551 4863811 1205816 -2397853
39444b397853j858567J69422J603954J573533K85512l56528Q00005K015237J074046
$$ -2397853 -4256420 -4086998 -2483044 -909511 -623999 -980527 -180522 1834715 2908761
39435B908761j005042j241384O42313J645689P0279j975856j860063m2468J248507
$$ 2908761 1903719 662335 1304648 2950337 3020616 1044760 -815303 -857771 390736
39426C90736J336176J137183Q86550q4976j537646k099216j162151K50471Q83857
$$ 390736 1726912 2864095 3750645 3665669 2128023 28807 -1133344 -882873 984
39417I84N94398K162l83718l74101j11678j29827p49858j253312n15993J158935
$$ 984 595382 597544 213826 -160275 -271953 -401780 -1151638 -2404950 -2920943 -1762008
39407a762008J820820K90698j942632k333579m33511J697259K196493J397713
$$ -1762008 58812 349510 -1593122 -3926701 -4360212 -2662953 -466460 931253
39399I31253P90539R31239J075120M38250p93566j648337j328837q9503Q62385
$$ 931253 1721792 2653031 3728151 4166401 3372835 1724498 395661 306158 1168543
39390A168543O17090l94011j053126j063857j028300j067621m70998Q70507J756557
$$ 1168543 1785633 1391622 338496 -725361 -1753661 -2821282 -3292280 -2421773 -665216
39381f65216J219692J0165l85755K91939R92866R03791K51957k62457j96978L02326
$$ -665216 554476 564641 178886 470825 1463691 2367482 2619439 2356982 2160004 2462330
39371B462330M84870l02755j517956j676592k72675J302681J511542N93829j07361
$$ 2462330 2947200 2644445 1126489 -550103 -822778 479903 1991445 2585274 2477913
39362B477913L7077P47177J587760J813075M38320k129823l484714j938509R37953
$$ 2477913 2514990 3262167 4849927 6663002 7101322 4971499 1486785 -451724 486229
39353D86229K298490J733933R50968O08828N3135l71886K88011J102755M07656
$$ 486229 2784719 4518652 5469620 6078448 6131583 5759697 6047708 7150463 7558119
39344G558119m51785J656130N786834O460927J249992m879600n873120k272884
$$ 7558119 7106334 8762464 14549298 21010225 22260217 17380617 11507497 9234613
39336I234613R37976J747136K097034K789029K062748m22722k076293j110224
$$ 9234613 10172589 11919725 14016759 16805788 18868536 18445814 16369521 15259297
39328A5259297R20723J614837P07220o68346j958076k945449k680008l32520L008292
$$ 15259297 16180020 17794857 18502077 17833731 15875655 12930206 10250198 9917678 12925970
39319A2925970M595270K711305j147698l465247k502956l28654j47059k147159
$$ 12925970 17521240 20232545 19084847 15619600 13116644 12787990 12640931 10493772
39311A0493772l570795k744876r88524r5713j18548n12930j265319j734422o78118
$$ 10493772 6922977 4178101 3189577 3093864 2975316 2462386 1197067 -537355 -1215473
39302a215473J199921J268560p96935j720035J58983J632680j28928k338360j082041
$$ -1215473 -15552 1253008 456073 -1263962 -1104979 527701 398773 -1939587 -3021628
39293c021628J673108J177508j715027j706266J743792L175096K66592k396036
$$ -3021628 -1348520 -171012 -1886039 -3592305 -1848513 1326583 1593175 -802861
39285h02861j243454O62715l02254j904080n29365J944333J259672j785815k577497
$$ -802861 -2046315 -1383600 -1685854 -3589934 -4119299 -2174966 -915294 -2701109 -5278606
39276e278606j61487J717384R45022k42109L16365J404130J086045p0493k15370
$$ -5278606 -5440093 -3722709 -2777687 -3019796 -2703431 -1299301 -213256 -283749 -499119
39267d99119Q79584J613553P18707j072328j553456L91834K705196J988732j802972
$$ -499119 380465 1994018 2712725 1640397 86941 478775 3183971 5172703 3369731
39258C369731m329577k273959J872407L014857M09540j694393l09929K451217
$$ 3369731 -959846 -3233805 -1361398 1653459 2062999 368606 58677 2509894
39250B509894K768431N0454k920710l460159j425839J096760J850399N36637r75609
$$ 2509894 5278325 5328779 2408069 -1052090 -2477929 -1381169 469230 1005867 30258
39241C0258r43565K15403R46289Q27575M79054q1772j162608j873458r72082P80409
$$ 30258 -913307 -697904 248385 1075960 1555014 1473242 310634 -1562824 -2534906 -1754497
39231a754497J244416J07945p44014m75490m33319j161804r56567R48559K204421
$$ -1754497 -510081 -402136 -1146150 -1621640 -2054959 -3216763 -4173330 -3224771 -1020350
39222a020350P53672j462860j116310J326268K231053L63035j383816n27528J535252
$$ -1020350 -266678 -1729538 -2845848 -1519580 711473 1074508 -309308 -836836 698416
39213F98416K089728J036847L14549N91648N50581q21864k733136l524825k318324
$$ 698416 2788144 3824991 4139540 4731188 5281769 4459905 1726769 -1798056 -4116380
39204d116380K06094K129435J792498l19890j646350l68370K251601L364019K001346
$$ -4116380 -3910286 -1780851 11647 -308243 -1954593 -2322963 -71362 3292657 5294003
39195E294003j75647j386117j483950j042588k91244L76683K21619o00600p80701
$$ 5294003 5118356 3732239 2248289 1205701 914457 1291140 1512759 912159 131458
39186A31458J62708P94032r3902j322954r75633N40041J021263j54806j194260
$$ 131458 294166 1088198 994296 -328658 -1304291 -764250 257013 102207 -1092053
39177a092053p35503L12504N29117L6464k42009j93210j89869J9672Q26252J607549
$$ -1092053 -1827556 -1515052 -985935 -949471 -1191480 -1384690 -1574559 -1554887 -728635 878914
39167H78914J293624K2048q15936l92040M96304N67099k81242r66752o87682J06902
$$ 878914 2172538 2194586 1378650 986610 1482914 2050013 1768771 802019 114337 221239
39157B21239L26198m77501j645862k089716j261860L37651J407020R38570m91256
$$ 221239 547437 69936 -1575926 -3665642 -4927502 -4589851 -3182831 -2244261 -2735517
39148b735517r52775N51361K439429K368799M81026p77098k48568M59074j52541
$$ -2735517 -3688292 -3136931 -697502 1671297 2152323 1375225 1126657 1585731 1433190
39139A433190j166559j183496o48014m16646K15977J753639K383717N33495j658929
$$ 1433190 266631 -916865 -1564879 -1981525 -1765548 -11909 2371808 2905303 1246374
39130A246374q54567K070920K859939K83787k128793j706448k30784k11286r33432
$$ 1246374 391807 2462727 5322666 5606453 3477660 1771212 1540428 1329142 395710
39121C95710n73115M62608R08096J202396K055208K221709L87377k086188k859038
$$ 395710 -177405 285203 1193299 2395695 4450903 6672612 7059989 4973801 2114763
39112B114763j933211q90610j3497J220521J825878M56148j666787j924113k95764
$$ 2114763 181552 -709058 -722555 497966 2323844 2779992 1113205 -810908 -1106672
39103a106672O59251K1039j68483J388113K786451J633916j451180l506832k561223
$$ -1106672 -447421 -426382 -594865 793248 3579699 5213615 3762435 255603 -2305620
39094b305620N30197K944281K287207j056304l871292l346104k95817J971617
$$ -2305620 -1775423 1168858 3456065 2399761 -1471531 -4817635 -5113452 -3141835
39086c141835J818392P58130O94295J471333J836896J346869L82972o71415j422409
$$ -3141835 -1323443 -565313 128982 1600315 3437211 4784080 5167052 4495637 3073228
39077C073228j421618q14201l90609n06553n79847n0186P43344R42342K1795j638748
$$ 3073228 1651610 837409 446800 -59753 -639600 -689786 53558 995900 1017695 -621053
39067f21053k543151j061351K257669M066675J791101k447726l804044r37300
$$ -621053 -3164204 -4225555 -1967886 2098789 3889890 1442164 -2361880 -3299180
39059c299180K266599K206072J70238m97970L95605M04178j001250j539860P9228
$$ -3299180 -1032581 1173491 1343729 845759 1241364 1645542 644292 -895568 -816340
39050h16340K068612K174314O21268o48148o37043j43838l16255j057645j084143
$$ -816340 1252272 3426586 4047854 3399706 2762663 2618825 2302570 1244925 160782
39041A60782L09375J724748Q62766k228353m333045k840947O22297K237412J107795
$$ 160782 470157 2194905 3057671 829318 -3503727 -6344674 -5722377 -3484965 -2377170
39032b377170m1819O31633J556019P53947r71638j597450r12558r1118M69889
$$ -2377170 -2418989 -1787356 -231337 522610 -449028 -2046478 -2959036 -3050154 -2580265
39023b580265R48930Q26742j37656n97222M97896J563813N35683j279317o83913
$$ -2580265 -1631335 -804593 -942249 -1539471 -1041575 522238 1057921 -221396 -905309
39014i05309K058656K922710J46941k928246k905340j056328m00574p27498J12994
$$ -905309 1153347 4076057 4222998 1294752 -1610588 -2666916 -3067490 -3794988 -3681994
39005c681994J738151J757120K1921j110428o78048j90436n79122r20762o89479
$$ -3681994 -1943843 -186723 -164802 -1275230 -1953278 -2143714 -2722836 -3643598 -4333077
38996d333077o45253q01762J1717J712083K424811J398195K82773L97001Q37977
$$ -4333077 -4978330 -5780092 -5768375 -4056292 -1631481 -233286 49487 446488 1284465
38987A284465O03829N03388J287526J685072K78854j916951k687281j627137k56249
$$ 1284465 1888294 2391682 3679208 5364280 5643134 3726183 1038902 -588235 -844484
38978h44484L03581L03822L53670N59133N25859l01390j848059k832268k025552
$$ -844484 -540903 -237081 116589 675722 1201581 900191 -947868 -3780136 -5805688
38969e805688k53792L96843k44963l8985J830466L080515J791183m08652p88648
$$ -5805688 -6059480 -5662637 -5907600 -5946585 -4116119 -1035604 755579 346927 -441721
38960d41721M16338Q42243j24071q20534k41729P38827J043519N60702l16166
$$ -441721 -25383 816860 692789 -127745 -369474 369353 1412872 1973574 1657408
38951A657408r73054o61011N33229J314591Q66035N7490k07460n94708j686282
$$ 1657408 684354 23343 556572 1871163 2737198 2794688 2587228 1992520 306238
38942C06238k160139q17613Q24178N94022o68554n11831P52832N72584j014810
$$ 306238 -1853901 -2671514 -1847336 -1253314 -1921868 -2433699 -1680867 -1108283 -2123093
38933b123093r54280J481646K728607L41105k814002k620620K58741J702684L20182
$$ -2123093 -3077373 -1595727 1132880 1473985 -1340017 -3960637 -3701896 -1999212 -1679030
38924a679030j100141l75728R59468N83450q34395q76183O38543J301315j0055
$$ -1679030 -2779171 -3154899 -2195431 -1611981 -2446376 -3322559 -2684016 -1382701 -1392756
38915a392756j108499K26808K485212K212431r40868l484644k804989k23842J621169
$$ -1392756 -2501255 -2274447 210765 2423196 1482328 -2002316 -4807305 -5031147 -3409978
38906c409978K165085K174359J692447P26542L60451J065826J273929k51576k000595
$$ -3409978 -1244893 929466 2621913 3348455 3708906 4774732 6048661 5797085 3796490
38897C796490j969233r05715o83077q33369J61430J277076L26123j665535j456124
$$ 3796490 1827257 921542 238465 -594904 -433474 843602 1169725 -495810 -1951934
38888a951934R46005J873631j74024k221431j705913m6606N42385N62450J258536
$$ -1951934 -1005929 867702 693678 -1527753 -3233666 -3280272 -2737887 -2175437 -916901
38879i16901J819971J072365k6329O7952R46762J203651N60412n30846j868497
$$ -916901 903070 1975435 1949106 2017058 2963820 4167471 4727883 4197037 2328540
38870B328540k646610j464994J151582K199488J49980k386677k196209K4573J212779
$$ 2328540 -318070 -1783064 -631482 1568006 1717986 -668691 -2864900 -2840327 -1627548
38861a627548N85644q1760O5570Q6615m35526p70177p95048j166332j564523p77861
$$ -1627548 -1041904 -1123664 -1058094 -971479 -1407005 -2177182 -2972230 -4138562 -5703085 -6480946
38851f480946J126631K475095K289737J444155J022752Q10022P5079j032407j577410
$$ -6480946 -5354315 -2879220 -589483 854672 1877424 2687446 2762525 1730118 152708
38842A52708j000420J80937Q25515M03912l10055k47479L74150L82394l83576
$$ 152708 -847712 -666775 158740 562652 252597 5118 379268 761662 378086
38833C78086p00755M2211Q56007Q41158M71852L11424j14448j033913j409892
$$ 378086 -322669 -280458 575549 1416707 1888559 2199983 2085535 1051622 -358270
38824c58270n50929M90383N19871J6134q3780j55429q14864j270565n55182O24557
$$ -358270 -909199 -418816 101055 117189 33409 -122020 -936884 -2207449 -2762631 -2138074
38814b138074J075955J116727J498001J483608K28673r48254k21338J500735J648012
$$ -2138074 -1062119 54608 1552609 3036217 3264890 2316636 2095298 3596033 5244045
38805E244045p3236j470636j428722j017879r91615q08195l88342l26866j31355
$$ 5244045 5170809 3700173 2271451 1253572 261957 -546238 -934580 -1261446 -1392801
38796a392801J137844K289357J077681j628517k103695O50542K926923J707712
$$ -1392801 -254957 2034400 3112081 1483564 -620131 30411 2957334 4665046
38788D665046j095486k117135j409180r88369r06052r1730N82920m07656j899026
$$ 4665046 3569560 1452425 43245 -945124 -1851176 -1942906 -1359986 -1767642 -3666668
38779c666668j388029Q01246J965985J387327R32120J187124M81501j423695k041028
$$ -3666668 -5054697 -4253451 -2287466 -900139 31981 1219105 1700606 276911 -1764117
38770a764117j26272J901368J532790j16053m37255N99582J013220K76913l28166
$$ -1764117 -1890389 10979 1543769 1427716 990461 1590043 2603263 2880176 2552010
38761B552010k78522l61491p21620m30813O61012J282594M38178j363226k810758
$$ 2552010 2273488 1911997 1190377 759564 1420576 2703170 3141348 1778122 -1032636
38752a032636k818336r93358J782395L426300K637235O93348j26605L06546J89607
$$ -1032636 -3850972 -4844330 -3061935 364365 3001600 3694948 3568343 3874889 4064496
38743D064496r12008j255610K3896J350392J290375N88053K33607m28168j836233
$$ 4064496 3152488 1896878 1920774 3271166 4561541 5149594 5383201 4955033 3118800
38734C118800k369786o94209J476699J477109m41378j782532j476085l54796J137279
$$ 3118800 749014 54805 1531504 3008613 2567235 784703 -691382 -1046178 91101
38725I1101K780028K817575j65338l710178l574103Q2698K413829R23151j184118
$$ 91101 2871129 5688704 5523366 1813188 -1760915 -1678217 735612 1658763 474645
38716D74645o04962J095980J086986K72859P85573J278166o16230k953625j789387
$$ 474645 -130317 965663 2052649 2325508 3111081 4389247 3773017 819392 -969995
38707i69995J832109K579177q47078l317738j114554K516323K731056K55075q15160
$$ -969995 862114 3441291 2594213 -723525 -1838079 678244 3409300 3664375 2849215
38698B849215J13658j1212k070626l152686j275977J672144K900039K112238O48054
$$ 2849215 2962873 2951661 881035 -2271651 -3547628 -1875484 1024555 3136793 3784847
38689C784847p58271j830313j827568m23448J235993J622983N43311j020393k119811
$$ 3784847 3026576 1196263 -631305 -1054753 181240 1804223 2347534 1327141 -792670
38680g92670k152992q17763J251748K502165K120826J030082L13048l80572j562833
$$ -792670 -2945662 -3763425 -2511677 -9512 2111314 3141396 3454444 3073872 1511039
38671A511039k136017q62235J061451J235424k56142q46857M61273J555536O50595
$$ 1511039 -624978 -1487213 -425762 809662 553520 -293337 167936 1723472 2374067
38662B374067j033069j384216k73058J119169K071751J973617P4452k673682l403321
$$ 2374067 1340998 -43218 -316276 802893 2874644 4848261 4922713 2249031 -1154290
38653a154290j074186J332332Q16460j137939j080057Q00144J313534q2839m26209
$$ -1154290 -2228476 -896144 -79684 -1217623 -2297680 -1497536 -184002 -266841 -693050
38644f93050J416142K507532N72677k242003k607113p28535O34597M42483K12376
$$ -693050 723092 3230624 3803301 1561298 -1045815 -1774350 -1139753 -697270 -484894
38635d84894J076009K043055J563229k69119j679060j264848K57629R23239J67979
$$ -484894 591115 2634170 4197399 3928280 2249220 984372 1242001 2165240 2333219
38626B333219m99862l7888M92533J31476O7638J292420J931722M5305k209706
$$ 2333219 1833357 1795469 2288002 2419478 2487116 3779536 5711258 5756563 3546857
38617C546857j175437K103336K829913j6296k027713p02932O35581r41080k550267
$$ 3546857 2371420 4474756 7304669 7288373 5260660 4557728 5193309 4252229 1701962
38608A701962n26365K739880K171146j809286l781165j454277J631960K103310
$$ 1701962 1175597 3915477 6086623 4277337 496172 -958105 673855 2777165
38600B777165J115270J120291J626839N92181j775764k946766j390788J464943
$$ 2777165 3892435 5012726 6639565 7231746 5455982 2509216 1118428 2583371
38592B583371K811679J485758q51226j687935o17025L79493k91574j804714k257485
$$ 2583371 5395050 6880808 6029582 4341647 3724622 4104115 3812541 2007827 -249658
38583b49658j094755O45799J773937J800432R67399J71621L04967J093565J228063
$$ -249658 -1344413 -698614 1075323 2875755 3843154 4014775 4319742 5413307 6641370
38574F641370J24851j221862j634658j147067m79150L0682M23855P77396J235690
$$ 6641370 6766221 5544359 3909701 2762634 2283484 2314166 2738021 3515417 4751107
38565D751107J715384J543826K98184j112770j350670m68725M13990Q86700J197567
$$ 4751107 6466491 8010317 8308501 7195731 5845061 5376336 5790326 6677026 7874593
38556G874593R93788P743n68516M00130J679323J326422l6063m24942r9425n79624
$$ 7874593 8868381 8876124 8307608 8707738 10387061 11713483 11677420 11252478 11153053 10573429
38546A0573429j019846L08923J728699K76462k332332j547991K101236L283289
$$ 10573429 9553583 9862506 11591205 11867667 9535335 7987344 10088580 13371869
38538A3371869Q19687n39970J183707K150924P34428P88623L597776M639262K516003
$$ 13371869 14191556 13651586 14835293 16986217 17720645 18509268 22107044 26746306 29262309
38529B9262309K696269P385808J0669467R717329J0927630J7499471K2340303
$$ 29262309 31958578 39344386 50013853 59731182 70658812 88158283 110498586
38522A10498586K3677588L4511100N9574749P3411904M5096320j6714242o6211997
$$ 110498586 134176174 168687274 228262023 301673927 346770247 330056005 263844008
38515B63844008p2478372m9794238k9611649k1952391j7165601j0395006o470238
$$ 263844008 191365636 141571398 111959749 90007358 72841757 62446751 55976513
38508E5976513o735948o145216k713841k1373l42595j907433k601866j797139
$$ 55976513 49240565 43095349 40381508 40360135 40017540 38110107 35508241 33711102
38500C3711102N24446L244022M301592L573197L394979N160516Q348237J2876272
$$ 33711102 34235548 37479570 41781162 45354359 48749338 53909854 62258091 75134363
38492G5134363J8400544K2793396K7342692L9948317O1729875P2185090M5062810
$$ 75134363 93534907 116328303 143670995 183619312 245349187 317534277 362597087
38485C62597087j4764260o6381336p6145712n3599617l1939796k5246834k2426968
$$ 362597087 347832827 281451491 205305779 151706162 119766366 94519532 72092564
38478G2092564j4913442q630391q288728q333441m518223j262878k229294l803085
$$ 72092564 57179122 48548731 40260003 31926562 27408339 26145461 23916167 20113082
38470B0113082k704568j542661k493885k892671j083604o7295j612492k611215
$$ 20113082 17408514 15865853 13371968 10479297 9395693 9328398 7715906 5104691
38462E104691p37237J478161J286475k12126j135982j554635j213984R80465L530186
$$ 5104691 4367454 5845615 7132090 6919964 5783982 4229347 3015363 3995828 7526014
38453G526014K985870m30883k470365j431906k13238n50953n47253M79036K05361
$$ 7526014 10511884 10081001 7610636 6178730 5965492 5414539 4867286 5346322 5551683
38444E551683j637792j906195M8661O84288j023759j044395K290088M168769Q88892
$$ 5551683 3913891 2007696 2056357 2740645 1716886 672491 2962579 7131348 8020240
38435H020240l569815l509176N6088K036200J134086J8322q8315k82668q51066
$$ 8020240 4450425 941249 997337 3033537 4167623 4185945 4097630 3814962 2963896
38426B963896j117904j325559j729020j238059N00235J493685M28482p14383K41176
$$ 2963896 1845992 520433 -1208587 -2446646 -1946411 -452726 -24244 -738627 -497451
38417d97451J943176J753391k804q63385K2890J420250K084099J407112n86136
$$ -497451 1445725 3199116 3196312 2332927 2355817 3776067 5860166 7267278 6681142
38408F681142k371290j925187P8926N64549j044402j443608R83353K877834J215141
$$ 6681142 4309852 2384665 2463591 3028140 1983738 540130 1523483 4401317 5616458
38399E616458j561808j542638M16939P41739q14094j586344q67679r8019N40580
$$ 5616458 4054650 2512012 2928951 3670690 2856596 1270252 402573 304554 845134
38390H45134J618106J733850m79638k633375j336788J922441K334711p98769k937953
$$ 845134 2463240 4197090 3717452 1084077 -252711 1669730 4004441 3205672 267719
38381B67719j376007J076161J037301p07776j513931q75469P6512P98288J075312
$$ 267719 -1108288 -32127 1005174 297398 -1216533 -2092002 -2015490 -1217202 -141890
38372a41890L37063j076749j532360m70994L59446m47254j539175q42024J079538
$$ -141890 195173 -881576 -2413936 -2884930 -2525484 -2972738 -4511913 -5353937 -4274399
38363d274399J773634O27028k17627Q86137K578072K421016M26765r84595n21094
$$ -4274399 -2500765 -1873737 -2091364 -1205227 1372845 3793861 4220626 3236031 2714937
38354B714937K81943k09358j004465l48458R33217N89398j038189j245045M27506
$$ 2714937 2996880 2787522 1783057 1434599 2367816 2957214 1919025 673980 1101486
38345A101486J081869q08725k686535j913684J97991Q20204j16325p61749p23463
$$ 1101486 2183355 1374630 -1311905 -3225589 -3027598 -2207394 -2323719 -3085468 -3808931
38336c808931q29223q05539J50992J433839J952143J972574J970282J056560j107463
$$ -3808931 -4638154 -5443693 -5292701 -3858862 -1906719 65855 2036137 3092697 1985234
38327A985234k398144j011513J209459J217086o43456j552119o31830P47351J964425
$$ 1985234 -412910 -1424423 -214964 1002122 358666 -1193453 -1825283 -1077932 886493
38318H86493K969243K222498j178493m103791k617793J573137K635779r17296
$$ 886493 3855736 6078234 4899741 795950 -1821843 -248706 2387073 1469777
38310A469777m056414k793304O63113K253111J483875J28521r94977j430333k38521
$$ 1469777 -2586637 -5379941 -4716828 -2463717 -979842 -851321 -1846298 -3276631 -3515152
38301c515152J850729K110148j65411j967228j031187Q19359J103008N32265P23052
$$ -3515152 -1664423 445725 280314 -1686914 -2718101 -1898742 -795734 -263469 459583
38292D59583Q63939k10707j123931m40794K62012o97121j425443L19736K320216
$$ 459583 1323522 1112815 -11116 -451910 -189898 -887019 -2312462 -1992726 327490
38283C27490J025914j972024j937256J027598J719002j619271m121638j919608
$$ 327490 1353404 -618620 -2555876 -1528278 190724 -1428547 -5550185 -7469793
38275g469793J993044K870607J292423R76749K156256J777792p16709k190372
$$ -7469793 -5476749 -2606142 -1313719 -336970 1819286 3597078 2880369 689997
38267F89997p55827J537339J990636O63448p23541j289976j066028j26456R32322
$$ 689997 -65830 1471509 3462145 4125593 3402052 2112076 1046048 919592 1851914
38258A851914Q62637m66258j244463k60981P49753n58957l042816l016913L07002
$$ 1851914 2714551 2248293 1003830 742849 1492602 933645 -2109171 -5126084 -4819082
38249d819082L146685K317640l95127j264550q7513L55504p34836j141089L31513
$$ -4819082 -1672397 645243 250116 -1014434 -1101947 -746443 -1481279 -2622368 -2290855
38240b290855J897053J774782N87844l87039j149053j800526j458911L5871J003372
$$ -2290855 -393802 1380980 1968824 1581785 432732 -1367794 -2826705 -2790834 -1787462
38231a787462K44437r03180n62718Q63795J676589J577192J444569J281338M41964
$$ -1787462 -1543025 -2446205 -3008923 -2145128 -468539 1108653 2553222 3834560 4276524
38222D276524o04598p41936k33493m84581j792438k868808k631985j203925P28628
$$ 4276524 3671926 2929990 2696497 2211916 419478 -2449330 -5081315 -6285240 -5556612
38213e556612K311005K554428J284565j82200n12285p6429N2101Q9471Q30411
$$ -5556612 -3245607 -691179 593386 411186 -101099 -177528 -125427 -35956 794455
38204G94455J584549R31945o82837j265040k68993P49891O90943J44116j95737
$$ 794455 2379004 3310949 2628112 1363072 1094079 1843970 2534913 2679029 2483292
38195B483292l88485k28912O30374J249711K48221j610357k100234j220614j324501
$$ 2483292 2094807 1865895 2496269 3745980 3994201 2383844 283610 -937004 -2261505
38186b261505k728315k542395L89038K775435J835285m1311P90238K980874K333639
$$ -2261505 -4989820 -7532215 -7143177 -4367742 -2532457 -2573768 -1783530 1197344 3530983
38177C530983r77418k290445P7196J977012r2546l481930l342839L16009K927673
$$ 3530983 2553565 263120 340316 2317328 2224782 -1257148 -4599987 -4283978 -1356305
38168a356305J854819n66149r18911P47427J703700O72316o53263l62567Q89152
$$ -1356305 498514 -67635 -986546 -239119 1464581 2136897 1483634 1121067 2010219
38159B010219J008959l29408j240826n31775N96464N48912l71468q69187p01488
$$ 2010219 3019178 2689770 1448944 917169 1513633 2062545 1691077 821890 120402
38150A20402m06602M1059P09994O83137o36442j847835j196167N58296J126909
$$ 120402 -286200 -245141 464853 1147990 511548 -1336287 -2532454 -1974158 -847249
38141h47249L01091O1364R27761R84753o01414j778085q29275Q52082J098947
$$ -847249 -546158 -484794 442967 1427720 826306 -951779 -1781054 -928972 169975
38132A69975K73938J21652O55279M62186o17240j240591p48235J11219N36895
$$ 169975 443913 565565 1220844 1683030 1065790 -174801 -923036 -811817 -274922
38123b74922M02278j90656q92475r27829o1586O61970K94083m48153l07911M02493
$$ -274922 127356 -63300 -955775 -1883604 -1945190 -1283220 -989137 -1437290 -1745201 -1342708
38113a342708M12863k39995l86049N3483J0636m65321m407J500433K178259J015901
$$ -1342708 -929845 -1169840 -1555889 -1502406 -1491770 -1957091 -1961498 -461065 1717194 2733095
38103B733095m27589m11311M63063O17095L4665l36264o67539j648280k358751
$$ 2733095 2305506 1894195 2357258 2974353 3009018 2672754 2005215 356935 -2001816
38094b001816j059872J722278L076771J500796r32907j393238P6666J212235Q44239
$$ -2001816 -3061688 -1339410 1737361 3238157 2305250 912012 988678 2200913 3045152
38085C045152j88438j003249j673653k102281j638104m31740L23504L10948P74201
$$ 3045152 2856714 1853465 179812 -1922469 -3560573 -3992313 -3668809 -3357861 -2583660
38076b583660K173213K702097Q82234j625734k077514p25759j73786r20889o80800
$$ -2583660 -410447 2291650 3173884 1548150 -529364 -1255123 -1428909 -2349798 -3030598
38067c030598J246291K201189M58387j561728q93100J283772J526504n91904k167195
$$ -3030598 -1784307 416882 875269 -686459 -1579559 -295787 1230717 638813 -1528382
38058a528382j383954N78461J954246K152736J015571j263120l115863k668711
$$ -1528382 -2912336 -2333875 -379629 1773107 2788678 1525558 -1590305 -4259016
38050d259016k96323J716929K229941K007786J496672L07400q45899m77261P15917
$$ -4259016 -4555339 -2838410 -608469 1399317 2895989 3203389 2357490 1880229 2596146
38041B596146J21793k458928l740392j840159O99733R79063N0234L41895J194838
$$ 2596146 2717939 259011 -3481381 -5321540 -4621807 -3642744 -3592510 -3250615 -2055777
38032b055777M55953j149128j044222O45846J330837N16010M49392J824213K348394
$$ -2055777 -1599824 -2748952 -3793174 -3147328 -1816491 -1300481 -851089 973124 3321518
38023C321518O75705j263806j353139k59295K95715K11457K55675K17649n05718
$$ 3321518 3997223 2733417 1380278 1120983 1416698 1628155 1883830 2101479 1595761
38014A595761j578046k285746k425552j700520L67075K796624L074323L95807
$$ 1595761 17715 -2268031 -4693583 -6394103 -6027028 -3230404 -156081 239726
38006B39726k423758k312616j36336P82063l73944j118582J30786J779815J884931
$$ 239726 -2184032 -4496648 -4632984 -3850921 -4224865 -5343447 -5212661 -3432846 -1547915
37997a547915R43808L94783J37515n62875r60299J14373J582615R16258k000659
$$ -1547915 -604107 -209324 -71809 -634684 -1594983 -1480610 102005 1018263 -982396
37988i82396l953879k471177P90473K272093J072385n04278m63198O96683J424559
$$ -982396 -4936275 -7407452 -6616979 -4344886 -3272501 -3776779 -4239977 -3543294 -2118735
37979b118735J077768l8302j238368j527649l29675J335433J680972O93336K96878
$$ -2118735 -1040967 -1079269 -2317637 -3845286 -4174961 -2839528 -1158556 -465220 -168342
37970a68342J212771J555048N769j511163n95740J580710J792580l38691j935434
$$ -168342 1044429 2599477 2605246 1094083 498343 2079053 3871633 3532942 1597508
37961A597508j378981k87160l28640q26896p61342p34900j287088j223968M11481
$$ 1597508 218527 -68633 -397273 -1224169 -1985511 -2720411 -4007499 -5231467 -4819986
37952d819986K169595K078764P29348L67844J387268J791123L10776j667664j990971
$$ -4819986 -2650391 -571627 157721 525565 1912833 3703956 4014732 2347068 356097
37943C56097n22519Q26933N62811o07445q32846L09025J202458N99962m49533
$$ 356097 -166422 660511 1223322 615877 -216969 92056 1294514 1894476 1444943
37934A444943l07765N49500M31341n56057q31538m98555j192136k322367j012339
$$ 1444943 1137178 1686678 2118019 1561962 730424 231869 -960267 -3282634 -4294973
37925d294973K713602M372840J402579k178869j313230K381092L107393k59116
$$ -4294973 -1581371 2791469 4194048 2015179 701949 3083041 6190434 5931318
37917E931318k978455k100364k06683j73849p36129K86888J824931J588286n1527
$$ 5931318 2952863 852499 645816 471967 -264162 22726 1847657 3435943 3384416
37908C384416j061510j107477j369282k009099k054080j196433L1956J295035
$$ 3384416 2322906 1215429 -153853 -2162952 -4217032 -5413465 -5381509 -4086474
37900d086474K240104K033731N73345o23197k61970P24004O07857l75990n22658
$$ -4086474 -1846370 187361 760706 137509 -124461 599543 1207400 831410 308752
37891C08752M77021J079514L94283n65750n82910J67922P95194R26373O49579
$$ 308752 785773 1865287 2259570 1693820 1110910 1278832 2074026 3000399 3649978
37882C649978l272q48913j287886q62372O5406O26414M63461J11783J38797J69312
$$ 3649978 3646706 2797793 1509907 647535 712941 1339355 1802816 1914599 2053396 2222708
37872B222708n97831j816648j923780l83268R87425L41978j271033j290070L40805
$$ 2222708 1624877 -191771 -2115551 -2498819 -1511394 -1169416 -2440449 -3730519 -3389714
37863c389714J047879k7004l77331J684995L782288K848327p9596j373058j37650
$$ -3389714 -2341835 -2368839 -2746170 -1061175 2721113 5569440 5489844 4116786 3979136
37854C979136J001230K24517j265416j828044j650179j452764r59509Q2234Q15412
$$ 3979136 4980366 5204883 3939467 2111423 461244 -991520 -1951029 -1868795 -1053383
37845a053383N03324j47305o9657M38192J69416j127737k228938j804690J07582
$$ -1053383 -550059 -697364 -767021 -328829 -159413 -1287150 -3516088 -5320778 -5213196
37836e213196K028033K367559R97766n71716q40439O2478Q18292O68414K4509
$$ -5213196 -3185163 -817604 180162 -391554 -1231993 -1169515 -351223 317191 341700
37827C41700m86617o93766n00551K80587J328914J731802J047482M6361j94281
$$ 341700 -144917 -838683 -1339234 -1058647 270267 2002069 3049551 3095912 2901631
37818B901631K25014J02827j066269j999866j179129P10692J238420l30086j593671
$$ 2901631 3126645 3229472 2163203 163337 -1015792 -305100 933320 603234 -990437
37809i90437m36679J573089J563573Q4309J46997J749695J428327j618255l242803
$$ -990437 -1427116 145973 1709546 1793855 1940852 3690547 5118874 3500619 257816
37800B57816p39572K360031J637116j194805j336913J112440J624279j027598
$$ 257816 -481756 1878275 3515391 2320586 983673 2096113 3720392 2692794
37792B692794l015257k065478o91307j107213j399555N87037K995681K739656
$$ 2692794 -322463 -2387941 -3079248 -4186461 -5586016 -4998979 -2003298 736358
37784G36358L67549q50443L85778K033433J699470n14769k208566j319278J231131
$$ 736358 1103907 253464 639242 2672675 4372145 3857376 1648810 329532 1560663
37775A560663K094872k92946l105867k709135J61754J676453P33420p9797N87676
$$ 1560663 3655535 3362589 256722 -2452413 -2290659 -614206 119214 39417 627093
37766F27093R35177o7320p00707O6116O98982L36144M71977J591621J598935l44624
$$ 627093 1562270 1494950 794243 860359 1559341 1895485 2367462 3959083 5558018 5213394
37756E213394j889838j599842j316686j994310j252109J718326L014458J0879
$$ 5213394 3323556 1723714 407028 -1587282 -2839391 -1121065 1893393 1904272
37748A904272l288331j917286K096785L017277L61531j366954n51096L4443p19911
$$ 1904272 -1384059 -3301345 -1204560 1812717 2174248 807294 256198 290641 -429270
37739d29270n51395J163281J847691L78250j034230q46409k89138l84151l56791
$$ -429270 -980665 182616 2030307 2408557 1374327 527918 238780 -145371 -502162
37730e02162n5463o63293j979526k028497l14256J285016J511093R72438J71873
$$ -502162 -557625 -1220918 -3200444 -5228941 -5543197 -4258181 -2747088 -1774650 -1602777
37721a602777q47924q85801J163739L404568K767223j53881j760728j012117k60580
$$ -1602777 -2450701 -3336502 -2172763 1231805 3999028 3845147 2084419 1072302 811722
37712H11722l80921K85826J481424N91883j968784k089670J224151L373576J228102
$$ 811722 430801 716627 2198051 2789934 821150 -1268520 -44369 3329207 4557309
37703D557309k042476k426243r74317n49246o52348L19674R93058l80320j854873
$$ 4557309 2514833 88590 -885727 -1434973 -2087321 -1767647 -774589 -1154909 -3009782
37694c009782o78624J794934K206339N33002n63151l30542j65881l79530j45003
$$ -3009782 -3688406 -1893472 312867 845869 282718 -47824 -213705 -593235 -738238
37685g38238K27132l6912j78492P74546J860408J751061R55421J93254j342214
$$ -738238 -511106 -548018 -726510 48036 1908444 3659505 4614926 4808180 3465966
37676C465966l551170l819877j012888J578435R83474m44411Q70227L233100K554016
$$ 3465966 -85204 -3905081 -4917969 -3339534 -2356060 -2800471 -1930244 1302856 3856872
37667C856872k90799r06280Q90330R95373j445918k609507q99788N36739l00567
$$ 3856872 3566073 2659793 3550123 4545496 3099578 490071 -409717 127022 -173545
37658a73545j182309l69055M30590L940P8510J426543J641635n71753k593479
$$ -173545 -1355854 -1724909 -1294319 -1290379 -1211869 214674 1856309 1284556 -1308923
37649a308923k075146n57522j86062l6651J320166K474106J583141j61794n15241
$$ -1308923 -3384069 -3941591 -4127653 -4164304 -2844138 -370032 1213109 1051315 536074
37640E36074K43573M36134q501j75171k06191m77394l42898L01206P9098j266427
$$ 536074 779647 1215781 1207280 1032109 825918 348524 5626 306832 385930 -880497
37630h80497j583993J13517J297688k2078j412233K27732L077316K779393p33767
$$ -880497 -2464490 -2350973 -1053285 -1075363 -2487596 -2259864 817452 3596845 2863078
37621B863078l102301j957158M90023J547155J134609J05069j331712k482393
$$ 2863078 -239223 -2196381 -1706358 -159203 975406 1080475 -251237 -2733630
37613b733630k068201k97227R82818Q67101K59516j01811l56032q6971J355389
$$ -2733630 -4801831 -5099058 -4116240 -3249139 -2989623 -3091434 -3447466 -3534437 -2179048
37604b179048K762923K033769j40384n41197J526007K648353O02020j921623j610185
$$ -2179048 583875 2617644 2477260 1936063 3462070 6110423 6712443 4790820 3180635
37595C180635J86268O3549j496103j140427J126638J444208j375381l221457q41614
$$ 3180635 3366903 3430452 1934349 793922 1920560 3364768 1989387 -1232070 -2073684
37586b073684K879018L076301L9199j691995l54010J037771J43915j124255l13469
$$ -2073684 805334 3881635 3920834 2228839 1874829 2912600 3056515 1932260 1618791
37577A618791J299090Q97891j234569k296354j343455j37697K32866O93356J615670
$$ 1618791 2917881 3815772 2581203 284849 -1058606 -1196303 -963437 -270081 1345589
37568A345589J608646N6415j365329j214012m65121n06733o52408L00079J412392
$$ 1345589 2954235 3010650 1645321 431309 -33812 -540545 -1192953 -892874 519518
37559E19518R41948m99154p04085N00351R78458j44141j143505o33402M56721
$$ 519518 1461466 962312 258227 758578 1737036 1592895 449390 -184012 272709
37550B72709Q94289J014358J180113L78650j696193k801047r07172K103743K296353
$$ 272709 1166998 2181356 3361469 3740119 2043926 -757121 -1664293 439450 2735803
37541B735803q22290l362806k311886O55446J947541P32434r34601j349652n48065
$$ 2735803 1913513 -1449293 -3761179 -3105733 -1158192 -425758 -1360359 -2710011 -3258076
37532c258076P88963J818499J300588j058514l035656j865855J698771L550637
$$ -3258076 -2469113 -650614 649974 -408540 -3444196 -5310051 -3611280 -60643
37524f0643J586118j242056j109054J236533J905855j83742j975144j154979O53818
$$ -60643 1525475 283419 -825635 410898 2316753 2133011 157867 -997112 -343294
37515c43294R19797K2627m342R81891J282005L09401o94911r06164r61433j311816
$$ -343294 576503 599130 594788 1576679 2858684 3168085 2473174 1567010 605577 -706239
37505g06239j169217j7J115165Q29582l26988m17952J175416K492427J200275
$$ -706239 -1875456 -1875473 -760308 69274 -257714 -675666 499750 2992177 4192452
37496D192452k192527m235978k298981J962149M027640J778403j832976k504055
$$ 4192452 1999925 -2236053 -4535034 -2572885 1454755 3233158 1400182 -1103873
37488a103873q1494J602356L50527j350850k76019K449642K749133m49910l412365
$$ -1103873 -1185367 416989 767516 -583334 -859353 1590289 4339422 3889512 477147
37479D77147k584031P63944K541685J223787p88778q92112N09775J108009j28993
$$ 477147 -2106884 -1342940 1198745 2422532 1633754 741642 1251417 2359426 2230433
37470B230433j748128j548701Q44175L241613L067214M52360j629393j052353
$$ 2230433 482305 -1066396 -222221 3019392 6086606 6538966 4909573 3857220
37462C857220O02302L72923j625182k371038o51930J071525O33523n62953l27376
$$ 3857220 4459522 4832445 3207263 836225 184295 1255820 1889343 1326390 999014
37453I99014L72296p40703k635651j831545J936019M383654K443487j399663k714984
$$ 999014 1371310 630607 -2005044 -3836589 -1900570 2483084 4926571 3526908 811924
37444H11924j131163L648r10287j594365K04107L019782L469189O72267k744599
$$ 811924 -319239 -315591 -1225878 -2820243 -2616136 403646 3872835 4545102 1800503
37435A800503l881722k480847l24325J108636J523889J101888J75459m75867j85895
$$ 1800503 -2081219 -4562066 -4886391 -3777755 -2253866 -1151978 -976519 -1452386 -1638281
37426a638281N35359N78719J05092M59719J662911J700798l73543k257785j392630
$$ -1638281 -1102922 -524203 -419111 40608 1703519 3404317 3030774 772989 -619641
37417f19641J016186J592044j09427j119861l4245P03489j025172l224672k573816
$$ -619641 396545 1988589 1879162 759301 725056 1428545 403373 -2821299 -5395115
37408e395115N79841K594095J369770j316675k378015q30422J572608K283548
$$ -5395115 -4815274 -2221179 -851409 -2168084 -4546099 -5376521 -3803913 -1520365
37400a520365N82135j367060p76316J998049L338062J142848j890846j826685
$$ -1520365 -938230 -2305290 -3081606 -1083557 2254505 3397353 1506507 -320178
37392c20178Q88686K139308Q8970k604723l023589j575897j40913Q49644J655262
$$ -320178 568508 2707816 2796786 192063 -2831526 -4407423 -4548336 -3698692 -2043430
37383b043430J527814P60j358705o98202J307222K346018J642698L60130o60461
$$ -2043430 -515616 -514856 -1873561 -2571763 -1264541 1081477 2724175 3084305 2423844
37374B423844j455764j510982j50906J439646J060844r35011j436602P70503K625191
$$ 2423844 968080 -542902 -693808 745838 1806682 871671 -564931 205572 2830763
37365B830763J173329j784686k351483m76798L09217j171868j930991q790K055063
$$ 2830763 4004092 2219406 -132077 -608875 -299658 -1471526 -3402517 -3411307 -1356244
37356a356244J296652q21564q50753R63749J190839r31582k032123o2982K226916
$$ -1356244 -59592 -881156 -1731909 -768160 422679 -508903 -2541026 -2604008 -377092
37347c77092J549467p81706j096299P47631J363277n18880k109882j271725J81806
$$ -377092 1172375 390669 -705630 42001 1405278 886398 -1223484 -2495209 -2313403
37338b313403p4230r02157n4720J474229R84938j017114j269413Q46506K141634
$$ -2313403 -2387633 -3289790 -3344510 -1870281 -885343 -1902457 -3171870 -2325364 -183730
37329a83730P66683j066817j139159o45394j245722j697352m23906J009035M47045
$$ -183730 582953 -483864 -1623023 -2268417 -3514139 -5211491 -5635397 -4626362 -4179317
37320d179317p14303K64981K473575K655045P73968k9604J016754J208855n56155
$$ -4179317 -4893620 -4628639 -2155064 499981 1273949 1244345 2261099 3469954 2913799
37311B913799j861469j203934l62764o54578o02118N88314Q47457r12843k098962
$$ 2913799 1052330 -151604 -514368 -1168946 -1771064 -1182750 -335293 -1248136 -3347098
37302c347098n30028J697992J660044L10019K35828R48752K63562j269749j285908
$$ -3347098 -3877126 -2179134 -519090 -209071 26757 975509 1239071 -30678 -1316586
37293a316586O3936N01234k68817m42030K38326K31873m61557j35852J156416
$$ -1316586 -1252650 -751416 -1020233 -1462263 -1223937 -992064 -1453621 -1589473 -433057
37284d33057J216437n38458j803428q48638J095746J914246J200920p9494j047428
$$ -433057 783380 244922 -1558506 -2407144 -1311398 602848 1803768 1724274 676846
37275F76846j341223j113703q58023n94163K60400J457056J546403J62235q23395
$$ 676846 -664377 -1778080 -2636103 -3230266 -2969866 -1512810 33593 195828 -627567
37266f27567m2243J164222J161475O10622L57711p82166l080576l462686j09375
$$ -627567 -669810 494412 1655887 2266509 2624220 1842054 -1238522 -4701208 -4810583
37257d810583L043632J492430k205451j985293J859801L208097L27689j745375
$$ -4810583 -1766951 -274521 -2479972 -4465265 -2605464 602633 930322 -815053
37249h15053k41136J182922k03827j418935K02822K090292J451367L1079p9055
$$ -815053 -1056189 126733 -77094 -1496029 -1293207 797085 2248452 2279531 2200476
37240B200476m46597k008143j750338J605449L365716j94310m808456m226459
$$ 2200476 1753879 -254264 -2004602 -399153 2966563 2772253 -2036203 -6262662
37232f262662J26431J983147K14551q14450N55287J460341O51053L28552J319487
$$ -6262662 -6136231 -4153084 -3938533 -4752983 -4197696 -2737355 -2086302 -1757750 -438263
37223d38263J656576P14120J91956L61874l53668j504354o45704J934455K731997
$$ -438263 1218313 1932433 2124389 2486263 2132595 628241 -17463 1916992 4648989
37214D648989M70329j810503j539053n1116L35306l10536p45061p03236l77538
$$ 4648989 5119318 3308815 1769762 1718646 2053952 1743416 998355 295119 -82419
37205h2419K94656Q02789L20097o25997o16536K53017N30390R8190L06703J199774
$$ -82419 212237 1015026 1335123 709126 92590 345607 875997 974187 1280890 2480664
37195B480664J209929N9165o49067l10993j99370p91708q46439J6543M01523j99699
$$ 2480664 3690593 3749758 3100691 2789698 2590328 1798620 952181 968724 1370247 1170548
37185A170548l39332O53925J288663N32703m61359o11765o82823j309589j375573
$$ 1170548 831216 1485141 2773804 3306507 2845148 2233383 1550560 240971 -1134602
37176a134602j06333J092966P88711p6473R6390P63327K86837j102451j556649
$$ -1134602 -1240935 -147969 640742 564269 660659 1423986 1710823 608372 -948277
37167i48277m99835O54193P76488M13659M47529O00970J12140p50197q45188J29823
$$ -948277 -1448112 -793919 -17431 396228 843757 1444727 1556867 806670 -38518 91305
37157I1305R52601M93225n63214o11625M87727J191984N91006m51745r39982j098947
$$ 91305 1043906 1537131 973917 362292 850019 2042003 2633009 2181264 1241282 142335
37147A42335j359888j364049q45276k23569M26438J519755K412830J659441k77420
$$ 142335 -1217553 -2581602 -3426878 -3650447 -3224009 -1704254 708576 2368017 2090597
37138B090597r06609L93939J004106o05505k055050j073441N45031K06932r11893
$$ 2090597 1183988 1577927 2582033 1976528 -78522 -1151963 -606932 -400000 -1311893
37129a311893l74787P49304k0599j539736q46177J249056J374544l04662l75318
$$ -1311893 -1686680 -937376 -957975 -2497711 -3343888 -2094832 -720288 -1024950 -1400268
37120a400268J541481K054371J49111j042735J01579J014612k54794j706340j026239
$$ -1400268 141213 2195584 2344695 1301960 1403539 2418151 2163357 457017 -569222
37111e69222Q16997J671557J147472j50226j801455k720151j573013R23413K364318
$$ -569222 247775 1919332 3066804 2916578 1115123 -1605028 -3178041 -2254628 109690
37102A09690J826762M24822j085780k410611k014713J002230L759596K554203
$$ 109690 1936452 2361274 1275494 -1135117 -3149830 -2147600 1611996 4166199
37094D166199j229943k761583j164258p6752p43984n48792Q12168K58801j943206
$$ 4166199 2936256 174673 -989585 -1066337 -1810321 -2359113 -1546945 -1288144 -3231350
37085c231350j244718K842910M422102P64205k630998j043415J866454R30036
$$ -3231350 -4476068 -1633158 2788944 3553149 922151 -121264 1745190 2675226
37077B675226j869188j853308R4188L15570n27335K90976J514918N47068p91799
$$ 2675226 806038 -1047270 -953082 -637512 -1164847 -873871 641047 1188115 396316
37068C96316N01549K343235J009523j680465j422597N48697k49018k836549k047834
$$ 396316 897865 3241100 4250623 2570158 1147561 1696258 1447240 -1389309 -3437143
37059c437143K061681L754799J043344j587830j033459M80146Q50890J278389
$$ -3437143 -1375462 2379337 3422681 1834851 801392 1281538 2132428 3410817
37051C410817J992814O27400k636567l501305j9569L758434L546513N54989j364813
$$ 3410817 5403631 6031031 3394464 -106841 -126410 3632024 7178537 7733526 6368713
37042F368713j192460n72374n27951p85713q68385l69871O06395Q81094k52656
$$ 6368713 5176253 4603879 4075928 3290215 2421830 2051959 2658354 3539448 3286792
37033C286792j220864k92934J087064K53375j924376k104070j60983N52556q86495
$$ 3286792 2065928 1772994 2860058 3113433 1189057 -915013 -1075996 -523440 -1409935
37024a409935j384833O95096K912900L200992K704624K307658N32080k724123
$$ -1409935 -2794768 -2099672 813228 4014220 6718844 9026502 9558582 6834459
37016F834459m289411k385723J75364L23993p89276n49851P15388J173629R25859
$$ 6834459 2545048 159325 334689 658682 -130594 -680445 34943 1208572 2134431
37007B134431R82939Q65962L6958k86019N51221O77599j011544j906135L75221
$$ 2134431 3117370 3983332 4020290 3734271 4285492 4963091 3951547 2045412 2420633
36998B420633L055738J582583l022489m868635j572808K449649K557569L9971
$$ 2420633 5476371 7058954 4036465 -832170 -2404978 44671 2602240 2642211
36990B642211q32215O89569J559681J53099j520487j287391J07019P74958O85214
$$ 2642211 1809996 2499565 4059246 4212345 2691858 1404467 1511486 2286444 2971658
36981B971658R29798J222896N68830j58596Q71599K890574L030210J121550N23048
$$ 2971658 3901456 5124352 5693182 5534586 6406185 9296759 12326969 13448519 13971567
36972A3971567K568417L868942J836651n78297O22935M126905N766592N074967
$$ 13971567 16539984 20408926 22245577 21667280 22290215 26417120 32183712 37258679
36964C7258679M619079M528265K871890L93065n15651r21165l814349p707444
$$ 37258679 41877758 46406023 49277913 49670978 49155327 48234162 44419813 36712369
36956C6712369p837782m259968k378511m034806m564286j222662J721227J3045
$$ 36712369 28874587 24614619 22236108 18201302 13637016 12414354 14135581 14148626
36948A4148626l768608m733422k838917j199576n70487L06458J338706J606797
$$ 14148626 10380018 5646596 2807679 1608103 1037616 1344074 2682780 4289577
36940D289577J200795K7064k614701n161508m006771Q20362M045728K360321o87920
$$ 4289577 5490372 5517436 2902735 -2258773 -6265544 -5445182 -1399454 960867 272947
36931B72947o45667J019601M97657j532643j729894p6357R37421R88414J180007
$$ 272947 -372720 646881 1144538 -388105 -2117999 -2194356 -1256935 -268521 911486
36922I11486P32200j089815j953828R819J972411O05612j895199j421284P63265
$$ 911486 1643686 553871 -1399957 -1390138 582273 1187885 -707314 -2128598 -1365333
36913a365333N45793j138791M1837L235266K990335j259297l720505j682509O04377
$$ -1365333 -819540 -1958331 -1916494 1318772 4309107 3049810 -670695 -2353204 -1748827
36904a748827j57206j103234P34451K874938J992406l96313j051931l69544n79836
$$ -1748827 -1906033 -3009267 -2274816 600122 2592528 2196215 1144284 774740 194904
36895A94904j274187n89228R76773J297714q750j463031j902885r85420J102028
$$ 194904 -1079283 -1668511 -691738 605976 597226 -865805 -2768690 -3754110 -2652082
36886b652082K938018K560261K64386j202573n78242J03787p47485j369700J77062
$$ -2652082 285936 2846197 3110583 1908010 1329768 1433555 686070 -683630 -506568
36877e06568K258669K001385k25222j604476j159075m78384o59999r82807n81876
$$ -506568 1752101 3753486 3528264 1923788 764713 286329 -373670 -1356477 -1938353
36868a938353M17504J430447J739382O33072j512516k811764j898194Q8280R18734
$$ -1938353 -1520849 -90402 1648980 2282052 769536 -2042228 -3940422 -3852142 -2933408
36859b933408K56949k38353M53329J520010J897352J659764J299349O34924p12120
$$ -2933408 -2676459 -2914812 -2461483 -941473 955879 2615643 3914992 4549916 3837796
36850C837796k195936k612747j656079m81486j26555J3814R71215J859125P33503
$$ 3837796 1641860 -970887 -2626966 -3108452 -3235007 -3221193 -2249978 -390853 342650
36841C42650j775462k188332Q36607L617604K284142j330437k230301L16538K131178
$$ 342650 -1432812 -3621144 -2784537 833067 3117209 1786772 -443529 -126991 2004187
36832B004187J010523k30790R44320K542882J671600o99315j707484j194602j114200
$$ 2004187 3014710 2783920 3728240 6271122 7942722 7243407 5535923 4341321 3227121
36823C227121j665223j221300L33390J091483K41623o14570o9917Q25875J48085
$$ 3227121 1561898 340598 673988 1765471 2007094 1392524 1322607 2148482 2296567
36814B296567j800137k361412J5737L043086K805020j010563l920264k202161
$$ 2296567 496430 -1864982 -1849245 1193841 3998861 2988298 -931966 -3134127
36806c134127J917737L177708M95860j978273j151064J131712J703715N38173
$$ -3134127 -1216390 1961318 2457178 478905 -672159 459553 2163268 2701441
36798B701441l80714l99342k69188l78962p01346j325813j729619q31204J138233
$$ 2701441 2320727 1921385 1652197 1273235 571889 -753924 -2483543 -3314747 -2176514
36789b176514K369380K082572J530324J371797M31792j451084k052612m15712
$$ -2176514 192866 2275438 3805762 5177559 5609351 4158267 2105655 1689943
36781A689943Q01787n25653j978046l10018K791693K958501J05223j455751Q7451
$$ 1689943 2491730 1966077 -11969 -321987 2469706 5428207 5533430 4077679 4165130
36772D165130J540136K48290j801305j520969N40844J450368J14371j894720k694720
$$ 4165130 5705266 5953556 4152251 2631282 3172126 4622494 4736865 2842145 147425
36763A47425j636618P13591K807051K941253R29113j508507k677368k559024j945672
$$ 147425 -1489193 -775602 2031449 4972702 5901815 4393308 1715940 -843084 -2788756
36754b788756r40251O09499J912501J838461N97717l37928j80059K79548J35993
$$ -2788756 -3729007 -3119508 -1207007 631454 1229171 891243 711184 990732 1126725
36745A126725j66151K62552R18902L10175j608411k744025j489724R71515K212064
$$ 1126725 960574 1223126 2142028 2452203 843792 -1900233 -3389957 -2418442 -206378
36736b06378J694536Q94495P40555O42405M6936o94984j246614j622507j486546
$$ -206378 1488158 2382653 3123208 3765613 3812549 3117565 1870951 248444 -1238102
36727a238102n88277J70636j38258m81197P26043K343201J623794j016425j902891
$$ -1238102 -1826379 -1655743 -1794001 -2275198 -1549155 794046 2417840 1401415 -501476
36718e01476M2319J211594p39549k707248j226815J569402J350280j388933k388710
$$ -501476 -459157 752437 12888 -2694360 -3921175 -2351773 -1001493 -2390426 -4779136
36709d779136m14549J643483J926106J468701R36880l24473j579653r50991R39545
$$ -4779136 -5193685 -3550202 -1624096 -155395 781485 457012 -1122641 -2073632 -1134087
36700a134087J239655m39832j262375j00524N71248p12051j616416j33590J711482
$$ -1134087 105568 -334264 -1596639 -1697163 -1125915 -1837966 -3454382 -3587972 -1876490
36691a876490J151058p32778q27155J084814K223082J047686r10657j534413o76748
$$ -1876490 -725432 -1458210 -2285365 -1200551 1022531 2070217 1159560 -374853 -1051601
36682a051601K05711J14720k61741M75504K161699K615342M81779k358861k966659
$$ -1051601 -845890 -731170 -992911 -517407 1644292 4259634 4741413 2382552 -584107
36673e84107j246353M87912J226972J744450J687033k85641k949384k871163K98231
$$ -584107 -1830460 -1342548 -115576 1628874 3315907 3030266 80882 -2790281 -2492050
36664b492050K447683Q83814j750825j891517k59471M15784K65778J290762L218162
$$ -2492050 -44367 839447 -911378 -2802895 -3062366 -2646582 -2380804 -1090042 2128120
36655B128120L851241K561853N13141j610417l394162l416705j126368J063454
$$ 2128120 5979361 8541214 9054355 7443938 4049776 633071 -493297 570157
36647E70157O26658j068051q49592J022863J442992j12185q16167M19889J142640
$$ 570157 1196815 128764 -720828 302035 1745027 1632842 816675 1236564 2379204
36638B379204j43117j408071r22668l53758j511065k644635j105196J916717K610105
$$ 2379204 2236087 828016 -94652 -448410 -1959475 -4604110 -5709306 -3792589 -1182484
36629a182484O6564k341200j617821J062614K401884J412799J82108N07335J402632
$$ -1182484 -1115920 -3457120 -5074941 -4012327 -1610443 -197644 -15536 491799 1894431
36620A894431Q38562j011458j892782q08011N55674M95438l01794l97323j47393
$$ 1894431 2732993 1721535 -171247 -979258 -423584 71854 -229940 -627263 -774656
36611g74656o55317j266099m67116J262764J978271J459885J287039J559848M04462
$$ -774656 -1429973 -2696072 -3163188 -1900424 77847 1537732 2824771 4384619 4789081
36602D789081k377228l913290k136454J061336K368679J153027p03492j640152
$$ 4789081 2411853 -1501437 -3637891 -2576555 -207876 945151 241659 -1398493
36594a398493j296508K12289K013095K421189R54986m97944k74786M15569m01920
$$ -1398493 -2695001 -2482712 -469617 1951572 2906558 2408614 2133828 2549397 2147477
36585B147477j807776j285782Q34777J525947l9476j115472k1125J158533M52432
$$ 2147477 339701 -946081 -111304 1414643 1375167 259695 238570 1397103 1849535
36576A849535m99264L16072J131330p25995l479354k896346Q13290K794088R81570
$$ 1849535 1350271 1666343 2797673 2071678 -1407676 -4304022 -3490732 -696644 284926
36567B84926r33704R6935J590363L13798j791262r42434J707651J741736j141747
$$ 284926 -648778 -551843 1038520 1352318 -438944 -1381378 326273 2068009 926262
36558I26262k599427o94476J362931P14351j139536j615812p59617L15271J567340
$$ 926262 -1673165 -2367641 -1004710 -290359 -1429895 -3045707 -3805324 -3490053 -1922713
36549a922713K561368J761741o16179j851942q91876k27706j270167j353639J373761
$$ -1922713 638655 2400396 1784217 -67725 -959601 -1187307 -2457474 -3811113 -2437352
36540b437352L555460J555110j979446j722843J879014L383907R27603j640725
$$ -2437352 1118108 2673218 693772 -1029071 849943 4233850 5161453 3520728
36532C520728j569638p15816r57863j052846p4386K72623q75243j379456J57350
$$ 3520728 1951090 1235274 277411 -775435 -849821 -577198 -1452441 -2831897 -2674547
36523b674547J686621J209099M1165N1900L98207k18987n54037Q45520K338200
$$ -2674547 -987926 221173 262338 314238 712445 493458 -60579 784941 3123141
36514C123141J473745q75219j834996r78250l70341p13451m19626J319765K957728
$$ 3123141 4596886 3721667 1886671 908421 538080 -175371 -594997 724768 3682496
36505C682496K705755P53611j074174j127693N51957K115599J828076K72893m62236
$$ 3682496 6388251 7141862 6067688 4939995 5491952 7607551 9435627 9708520 9246284
36496I246284J37128O10081N36932J390749L325903L974534K270763P59609J904023
$$ 9246284 9383412 9993493 10530425 11921174 15247077 19221611 21492374 22251983 24156006
36487B4156006M845120Q236391J2784678J7206801J5296546L039126j2975433
$$ 24156006 29001126 37237517 50022195 67228996 82525542 85564668 72589235
36480G2589235k0767307j6926164r626768o807109p275432n903563k126907Q14777
$$ 72589235 51821928 34895764 25268996 18461887 11186455 5282892 3155985 3970762
36472C970762J473520P86781p43294k744096l312825j032078K171221K979403
$$ 3970762 5444282 6231063 5487769 2743673 -569152 -1601230 569991 3549394
36464C549394R56865j394627k197763j627144l62828J124139J901999J141043
$$ 3549394 4506259 3111632 913869 -713275 -1076103 48036 1950035 3091078
36456C091078n27578j568646j371260n04591L32321N20192n25658k253377k681498
$$ 3091078 2563500 994854 -376406 -880997 -548676 -28484 -554142 -2807519 -5489017
36447e489017q20538J415100J553766Q7557n01185L19228P13689m5781m34126
$$ -5489017 -6309555 -4894455 -3340689 -3253132 -3754317 -3435089 -2721400 -2767181 -3201307
36438c201307L87163J073118O45447J96623N65704M69834j071408k252832r22169
$$ -3201307 -2814144 -1741026 -1095579 -898956 -333252 136582 -934826 -3187658 -4109827
36429d109827J631839K083735p8695j792577q68039J201580J809160O73942n80605
$$ -4109827 -2477988 -394253 -472948 -2265525 -3133564 -1931984 -122824 551118 -29487
36420b9487r03773n05750J5129N3842p15529j399804k00407K976047N159362L488689
$$ -29487 -933260 -1439010 -1423881 -1370039 -2085568 -3485372 -3685779 -709732 4449630 7938319
36410G938319o51709k847429j283125J026176O27150j737435k758214j573181
$$ 7938319 7286610 4439181 3156056 4182232 4809382 3071947 313733 -1259448
36402a259448o32861j508318k255276l63327L096553M361429J891354j566631
$$ -1259448 -1892309 -3400627 -5655903 -6019230 -2922677 1438752 3330106 1763475
36394A763475k670576j635162j040261j549697j268090O14591K190856J946678
$$ 1763475 -907101 -2542263 -3582524 -5132221 -6400311 -5785720 -3594864 -1648186
36386a648186J190688J589640K202397J279359m71771j098541q05910j196540
$$ -1648186 -457498 1132142 3334539 4613898 4142127 3043586 2237676 1041136
36378A041136j848944r54685R11537J247406O2389K8774J449230J224295j583862
$$ 1041136 -807808 -1762493 -850956 396450 458839 487613 1936843 3161138 1577276
36369A577276l388237j799403K55026m82163j985975n40884K708299L511113J217879
$$ 1577276 -1810961 -3610364 -3355338 -3837501 -5823476 -6364360 -3656061 -144948 1072931
36360A072931q99711j154535q71036p52660o1993O43765j7923r64310K13212K631679
$$ 1072931 173220 -981315 -1852351 -2605011 -2667004 -2023239 -2041162 -3005472 -2792260 -160581
36350a60581K762702J86873j558606p84683O0219o66890r53799O29552J887838
$$ -160581 2602121 2788994 1230388 445705 505924 -160966 -1114765 -485213 1402625
36341A402625Q92003o03526n67936l38055j625854k716873j310439J028005J084572
$$ 1402625 2294628 1691102 1123166 785111 -840743 -3557616 -4868055 -3840050 -2755478
36332b755478p84223j357488L48060K067951K014059O89005q07264j724836j147558
$$ -2755478 -3539701 -4897189 -4549129 -2481178 -467119 221886 -585378 -2310214 -3457772
36323c457772J055620K912338K231669k75695j817226j292302j65911L13892N55737
$$ -3457772 -2402152 510186 2741855 2466160 648934 -643368 -809279 -495387 60350
36314F0350R97414J036755K56307o72802r12609m39984J05442j0465r33560j605684
$$ 60350 1057764 2094519 2350826 1678024 765415 325431 430873 420408 -513152 -2118836
36304b118836o34777J488617K282585O13491j233757o42484J363479J546592q04754
$$ -2118836 -2753613 -1264996 1017589 1631080 397323 -245161 1118318 2664910 1860156
36295A860156l004949k758865o59967J297076J894572J118926j26711n57159J66989
$$ 1860156 -1144793 -3903658 -4563625 -3266549 -1371977 -253051 -379762 -936921 -769932
36286g69932Q79811O27343J07088J27343r0619j193031j687078k37878J251800
$$ -769932 109879 737222 844310 971653 881034 -311997 -1999075 -2236953 -985153
36277i85153J05922k344702k213506Q06427K817064J872399N74375J031506J351222
$$ -985153 -879231 -3223933 -5437439 -4631012 -1813948 58451 632826 1664332 3015554
36268C015554l42587j985879r72043J218682J423882j8786k38245J108569J500264
$$ 3015554 2672967 687088 -284955 933727 2357609 2338823 2100578 3209147 4709411
36259D709411L7531j208455q24695p8202l39858q67016m34502N66012R96637P54933
$$ 4709411 4746942 3538487 2713792 2635590 2295732 1428716 994214 1560226 2556863 3311796
36249C311796M58425J41693o15523j659213k230583j842124o86762O71058J638543
$$ 3311796 3770221 3911914 3296391 1637178 -593405 -2435529 -3122291 -2451233 -812690
36240h12690J774277R90359l33893j479693j682902n94372J198297K265732J526108
$$ -812690 961587 1951946 1618053 138360 -1544542 -2138914 -940617 1325115 2851223
36231B851223m81504j959664j791268p37491k48718m30974n5608J314821K285988
$$ 2851223 2369719 410055 -1381213 -2118704 -2367422 -2798396 -2854004 -1539183 746805
36222G46805J529597p3521n36097K91491N52596n60629j432921p06389L97203
$$ 746805 2276402 2202881 1666784 1958275 2510871 1950242 517321 -189068 208135
36213B08135J27588p67618l16206J139907J295926k33105j073156Q8958J316071
$$ 208135 335723 -431895 -748101 391806 1687732 1454627 381471 470429 1786500
36204A786500N21455j223037j440194Q395J076992P51826k2086m86740j056221
$$ 1786500 2307955 1084918 -355276 -346881 730111 1481937 1459851 973111 -83110
36195h3110j689101j155282R18094K574623J703000q58344k103995q99689N02243
$$ -83110 -1772211 -2927493 -2009399 565224 2268224 1409880 -694115 -1593804 -1091561
36186a091561n4428j202269j16880K705415L437718L37577l346269l599695q68086
$$ -1091561 -1145989 -2348258 -2465138 240277 3677995 4015572 669303 -2930392 -3798478
36177c798478J299721J534285J609520K449445K378006L24653j811906j771711
$$ -3798478 -2498757 -964472 645048 3094493 5472499 5797152 3985246 2213535
36169B213535l03039l692j528685k699709j471747J341521K846900J370261j423724
$$ 2213535 1910496 1906804 378119 -2321590 -3793337 -2451816 395084 1765345 341621
36160C41621k274746l34770J595874P84884j550312j911893M48948K513011J827934
$$ 341621 -1933125 -2267895 -672021 112863 -1437449 -3349342 -2900394 -387383 1440551
36151A440551l73043j330918k50392J498343K273684J245928j160997l050274
$$ 1440551 1067508 -263410 -513802 984541 3258225 4504153 3343156 292882
36143B92882k570465l95747Q31775K69607O4452J536986K502419O48026k238582
$$ 292882 -2277583 -2673330 -1841555 -1571948 -1507496 29490 2531909 3179935 941353
36134I41353k364457N83482K989249K290366k17538k003929k400496k093197j307332
$$ 941353 -1423104 -839622 2149627 4439993 4222455 2218526 -181970 -2275167 -3582499
36125c582499P9876J449556J698554N59596q74746j148548k0762J117768Q90670
$$ -3582499 -3502623 -2053067 -354513 205083 -669663 -1818211 -1838973 -721205 169465
36116A69465j25821j28381J085177J528067Q4719j455379r31544R42489J781506
$$ 169465 43644 -84737 1000440 2528507 2613226 1157847 226303 1168792 2950298
36107B950298R98909r0629r40506k041023k709635j326109J647690L315052K103554
$$ 2950298 3949207 3858578 2918072 877049 -1832586 -3158695 -1511005 1804047 3907601
36098C907601p8328o91260J21395N49427O3656m24606n63316r52387j706348k033940
$$ 3907601 3829273 3138013 3259408 3808835 3872491 3447885 2884569 1932182 225834 -1808106
36088a808106j436616l87320L95328P01291O91278N09687K71812J84163M42521
$$ -1808106 -3244722 -3632042 -3236714 -2535423 -1844145 -1334458 -1062646 -878483 -435962
36079d35962R25957J005961q76j750710k531923r51532J838236K721983L15871
$$ -435962 489995 1495956 1495080 -255630 -2787553 -3739085 -1900849 821134 1137005
36070A137005k739370k603673Q28302L494193K319130p52313j467116R01814K734550
$$ 1137005 -1602365 -4206038 -3377736 116457 2435587 1683274 216158 1117972 3852522
36061C852522J309513j519960k293702p06265Q00149J042988R93800R85233l4393
$$ 3852522 5162035 3642075 1348373 642108 1442257 2485245 3479045 4464278 4429885
36052D429885j801498k008611K83085K629689K356876J08088j535470j587931
$$ 4429885 2628387 619776 902861 3532550 5889426 5997514 4462044 2874113
36044B874113r28925k42695K64917r214j154351j636634j43599K013251K388703
$$ 2874113 1945188 1702493 1967410 1958196 803845 -832789 -976388 1036863 3425566
36035C425566Q23181p16690j230309j290745r45379K86282J288569J44169k359761
$$ 3425566 4248747 3532057 2301748 1011003 65624 351906 1640475 1784644 -575117
36026e75117k900303l69530K265679K311448R35710M66820N43813m00305j629311
$$ -575117 -3475420 -3844950 -1579271 732177 1667887 2134707 2678520 2278215 648904
36017F48904j180053M69452R03458k34011o76110N58056J399363Q3009j902599
$$ 648904 -531149 -61697 841761 607750 -68360 489696 1889059 1972068 69469
36008F9469k006615l68191O63341J74244k56281N53657J318703L38380j507217
$$ 69469 -1937146 -2305337 -1641996 -1467752 -1724033 -1170376 148327 486707 -1020510
35999a020510j584340P77939L095338K927357R10786n91686q67533j155707j910110
$$ -1020510 -2604850 -1826911 1268427 4195784 5106570 4514884 3647351 2491644 581534
35990E81534j770344O6353K000511J843260k72710k061976j954886o88822J42501
$$ 581534 -1188810 -1122457 878054 2721314 2448604 386628 -1568258 -2257080 -2114579
35981b114579J70905K14599O62118Q94377N16291K42954P61200J313942O38279
$$ -2114579 -1943674 -1729075 -1066957 -172580 343711 586665 1347865 2661807 3300086
35972C300086q62814j358536l01299O40142R3865j055248j284388n95677K57985
$$ 3300086 2437272 1078736 777437 1417579 1511444 456196 -828192 -1423869 -1165884
35963a165884J270778K242478J801850m36780k017498o65514J752779J512467
$$ -1165884 104894 2347372 4149222 3712442 1694944 1029430 2782209 4294676
35955D294676j116813j996390M25233K621753J453791j360320k510595j915730
$$ 4294676 3177863 1181473 1606706 4228459 5682250 4321930 1811335 -104395
35947a04395j487042j371132n98861Q4443o40788j571524l35198K382093L166136
$$ -104395 -1591437 -2962569 -3561430 -3476987 -4117775 -5689299 -6024497 -3642404 -476268
35938d76268Q77604j612002j718727n61951l92300p13677N49653K997584L606773
$$ -476268 401336 -1210666 -2929393 -3491344 -3883644 -4597321 -4047668 -1050084 2556689
35929B556689J012391k281029l185291j899735o84345O9759J814685L980910L461312
$$ 2556689 3569080 1288051 -1897240 -3796975 -4481320 -4411561 -2596876 1384034 4845346
35920D845346n10558l910850l050666J14324J219501K38496N81466K336821J780686
$$ 4845346 4334788 423938 -2626728 -2512404 -1292903 -1054407 -472941 1863880 3644566
35911C644566j607853l125649k36674K876215J725729j516267j928415K30777
$$ 3644566 2036713 -1088936 -1325610 1550605 3276334 1760067 -168348 62429
35903F2429N93618j844936l386445j612576J549116L281166L063175J772189K60786
$$ 62429 656047 -1188889 -4575334 -6187910 -4638794 -1357628 1705547 3477736 3738522
35894C738522o38237p08886r36370j741336j538536N96834K143746L40416k808414
$$ 3738522 3100285 2391399 1455029 -286307 -1824843 -1228009 915737 1256153 -1552261
35885a552261k761662O19522K747297J373558n42157l28178M29262l74625j439309
$$ -1552261 -4313923 -3694401 -947104 426454 -115703 -443881 -14619 -389244 -1828553
35876a828553p02991R44424J413674P30917J53710j05932j32889P17298K009964
$$ -1828553 -2531544 -1587120 -173446 557471 711181 605249 472360 1189658 3199622
35867C199622J556119j161226l093795j788631O75620R20652n03426o50266N36712
$$ 3199622 4755741 3594515 500720 -1287911 -612291 308361 -195065 -845331 -308619
35858c08619N09480q94296q95297J321609K847062J460464j106727j922021p27840
$$ -308619 200861 -693435 -1588732 -267123 2579939 4040403 2933676 1011655 283815
35849B83815N46423O20628k66223j278091j542409n25436J154852J815569M28623
$$ 283815 830238 1450866 1184643 -93448 -1635857 -2161293 -1006441 809128 1237751
35840A237751k000711l261550k021622R62487L392658L306852R53879j277378
$$ 1237751 -762960 -4024510 -6046132 -5083645 -1690987 1615865 2569744 1292366
35832A292366j355225J19146Q19234k73656j701899j653799l92911J97543p11280
$$ 1292366 -62859 56287 875521 601865 -1100034 -2753833 -3146744 -2949201 -3660481
35823c660481j518418j88519K581725L453772O22805l144343l481202p6351K919296
$$ -3660481 -5178899 -5367418 -2785693 668079 1290884 -1853459 -5334661 -5411012 -2491716
$$ [...]
##END NTUPLES=NMR SPECTRUM
##END=
