##TITLE=31Pdec_SR147_k3
 CDCl3, 24 sc
 14.11.2022
##JCAMPDX= 6.0         $$ Bruker NMR JCAMP-DX V2.0
##DATA TYPE= NMR SPECTRUM
##DATA CLASS= NTUPLES
##ORIGIN= UXNMR, Bruker Analytische Messtechnik GmbH
##OWNER= root
$$ XWIN-NMR		Version 3.5
$$ Mon Nov 14 15:58:41 2022 Russian Standard Time (UT+4h)  she@DPX200
##.OBSERVE FREQUENCY= 81.013821
##.OBSERVE NUCLEUS= ^31P
##.ACQUISITION MODE= SIMULTANEOUS
##.ACQUISITION SCHEME= undefined
##.AVERAGES= 24
##.DIGITISER RES= 16
##SPECTROMETER/DATA SYSTEM= spect
##.PULSE SEQUENCE= zgpg30
##.SOLVENT NAME= CDCl3
##.SHIFT REFERENCE= (INTERNAL, CDCl3, 0, 248.564)
##AUDIT TRAIL= $$ (NUMBER, WHEN, WHO, WHERE, WHAT)
$$ ##TITLE= Audit trail, XWIN-NMR		Version 3.5
$$ ##JCAMPDX= 5.01
$$ ##ORIGIN= Bruker BioSpin GmbH
$$ ##OWNER= she
$$ F:/spectra/data/she/nmr/P31/1/pdata/1/auditp.txt
$$ ##AUDIT TRAIL=  $$ (NUMBER, WHEN, WHO, WHERE, WHAT)
(   1,<2022-11-14 15:57:45.26 +0400>,<she>,<DPX200>,
      <created by zg, POWCHK disabled, PULCHK disabled
       configuration hash MD5:
       00 E9 B6 7A A2 85 ED C7 34 08 36 98 17 FE 4E 26
       data hash MD5: 32K
       A8 F1 7A 09 BB 71 AC E3 C9 5A 09 64 B9 CD 26 25>)
(   2,<2022-11-14 15:57:52.73 +0400>,<she>,<DPX200>,
      <Start of raw data processing
       efp BC_mod = 2 LB = 1 FT_mod = 6 PKNL = 1 PHC0 = -10238.19 PHC1 = 50.6559 SI = 64K 
       data hash MD5: 64K
       1B DE 24 5E 21 67 83 67 59 E7 D0 97 87 B9 04 A0>)
(   3,<2022-11-14 15:58:07.75 +0400>,<she>,<DPX200>,
      <pk PHC0 = -41.45113 PHC1 = 0 
       data hash MD5: 64K
       30 4C D9 40 4B D9 D1 32 FB C8 EF D4 CB 85 6F 73>)
$$ ##END=
$$ 
$$ hash MD5
$$ 12 E6 3E BF 55 A2 DB 24 9E 6B 0B C0 7F B0 21 A1
##$RELAX= 
##$RELAX= 
##$RELAX= 
##$RELAX= 
##$RELAX= 
##$RELAX= 
##$RELAX= 
##$RELAX= 
##$RELAX= 
$$ Bruker specific parameters
$$ --------------------------
##$DU= <F:/spectra>
##$EXPNO= 1
##$NAME= <P31>
##$PROCNO= 1
##$TYPE= <nmr>
##$USER= <she>
##$AMP= (0..31)
100 100 100 100 100 100 100 100 100 100 100 100 100 100 100 100 100 100 
100 100 100 100 100 100 100 100 100 100 100 100 100 100 
##$AQSEQ= 0
##$AQ_mod= 1
##$AUNM= <au_zg>
##$AUTOPOS= <>
##$BF1= 81.014009
##$BF2= 200.13
##$BF3= 200.13
##$BF4= 200.13
##$BF5= 200.13
##$BF6= 200.13
##$BF7= 200.13
##$BF8= 200.13
##$BYTORDA= 1
##$CFDGTYP= 0
##$CFRGTYP= 5
##$CHEMSTR= <none>
##$CNST= (0..31)
1 1 145 1 1 1 1 1 1 1 1 1 1 1 1 1 1 1 1 1 1 1 1 1 1 1 1 1 1 1 1 1 
##$CPDPRG= <waltz16>
##$CPDPRG1= <>
##$CPDPRG2= <waltz16>
##$CPDPRG3= <>
##$CPDPRG4= <mlev>
##$CPDPRG5= <mlev>
##$CPDPRG6= <mlev>
##$CPDPRG7= <mlev>
##$CPDPRG8= <mlev>
##$CPDPRGB= <>
##$CPDPRGT= <>
##$D= (0..31)
0 1 0 0 0 0 0 0 0 0 0 0.03 2e-05 3e-06 0 0 0 0 0 0 0 0 0 0 0 0 0 0 0 0 
0 0 
##$DATE= 1668427064
##$DBL= (0..7)
120 120 120 11 120 120 24 19 
##$DBP= (0..7)
150 150 150 150 150 150 150 150 
##$DBP07= 0
##$DBPNAM0= <>
##$DBPNAM1= <>
##$DBPNAM2= <>
##$DBPNAM3= <>
##$DBPNAM4= <>
##$DBPNAM5= <>
##$DBPNAM6= <>
##$DBPNAM7= <>
##$DBPOAL= (0..7)
0.5 0.5 0.5 0.5 0.5 0.5 0.5 0.5 
##$DBPOFFS= (0..7)
$$ [...]
##$SUBNAM2= <"">
##$SUBNAM3= <"">
##$SUBNAM4= <"">
##$SUBNAM5= <"">
##$SUBNAM6= <"">
##$SUBNAM7= <"">
##$SUBNAM8= <"">
##$SUBNAM9= <"">
##$SW= 501.771253377433
##$SWIBOX= (0..15)
0 1 3 0 0 0 0 0 0 0 0 0 0 0 0 0 
##$SW_h= 40650.406504065
##$TD= 32768
##$TD0= 1
##$TE= 0
##$TE2= 300
##$TE3= 300
##$TEG= 300
##$TL= (0..7)
0 120 53 12 22 120 120 120 
##$TP= (0..7)
150 150 150 150 150 150 150 150 
##$TP07= 0
##$TPNAME0= <>
##$TPNAME1= <>
##$TPNAME2= <>
##$TPNAME3= <>
##$TPNAME4= <>
##$TPNAME5= <>
##$TPNAME6= <>
##$TPNAME7= <>
##$TPOAL= (0..7)
0.5 0.5 0.5 0.5 0.5 0.5 0.5 0.5 
##$TPOFFS= (0..7)
0 0 0 0 0 0 0 0 
##$TUNHIN= 0
##$TUNHOUT= 0
##$TUNXOUT= 0
##$USERA1= <user>
##$USERA2= <user>
##$USERA3= <user>
##$USERA4= <user>
##$USERA5= <user>
##$V9= 5
##$VALIST= <valist>
##$VCLIST= <CCCCCCCCCCCCCCC>
##$VD= 0
##$VDLIST= <DDDDDDDDDDDDDDD>
##$VPLIST= <PPPPPPPPPPPPPPP>
##$VTLIST= <TTTTTTTTTTTTTTT>
##$WBST= 1024
##$WBSW= 4
##$XGAIN= (0..3)
0 0 0 0 
##$XL= 0
##$YL= 0
##$YMAX_a= 1803
##$YMIN_a= -1629
##$ZGOPTNS= <>
##$ZL1= 120
##$ZL2= 120
##$ZL3= 120
##$ZL4= 120
##$ABSF1= 0
##$ABSF2= 0
##$ABSG= 0
##$ABSL= 0
##$ALPHA= 0
##$AQORDER= 0
##$ASSFAC= 0
##$ASSFACI= 0
##$ASSFACX= 0
##$ASSWID= 0
##$AUNMP= <proc_1d>
##$AZFE= 0.1
##$AZFW= 0.5
##$BCFW= 0
##$BC_mod= 2
##$BYTORDP= 0
##$COROFFS= 0
##$CY= -3
##$DATMOD= 1
##$DC= 0
##$DFILT= <>
##$DTYPP= 0
##$F1P= 0
##$F2P= 0
##$FCOR= 1
##$FTSIZE= 65536
##$FT_mod= 6
##$GAMMA= 0
##$GB= 0
##$INTBC= 1
##$INTSCL= 6.047779e-11
##$ISEN= 30
##$LB= 1
##$LEV0= 0
##$LPBIN= 0
##$MAXI= 10000
##$MC2= 0
##$MEAN= 0
##$ME_mod= 0
##$MI= 50
##$NCOEF= 0
##$NC_proc= -8
##$NLEV= 6
##$NOISF1= 182.463
##$NOISF2= 159.3651
##$NSP= 0
##$NTH_PI= 0
##$NZP= 0
##$OFFSET= 248.5645
##$PC= 4
##$PHC0= -10279.64
##$PHC1= 50.6559
##$PH_mod= 1
##$PKNL= yes
##$PPARMOD= 0
##$PSCAL= 0
##$PSIGN= 0
##$REVERSE= no
##$SF= 81.0140089999694
##$SI= 65536
##$SIGF1= 159.3651
##$SIGF2= -187.1042
##$SINO= 113.3802
##$SIOLD= 16384
##$SREGLST= <1H.CDCl3>
##$SSB= 0
##$STSI= 65536
##$STSR= 0
##$SW_p= 40650.406504065
##$SYMM= 0
##$S_DEV= 0
##$TDeff= 32768
##$TDoff= 0
##$TI= <>
##$TILT= no
##$TM1= 0
##$TM2= 0
##$TOPLEV= 0
##$USERP1= <user>
##$USERP2= <user>
##$USERP3= <user>
##$USERP4= <user>
##$USERP5= <user>
##$WDW= 1
##$XDIM= 65536
##$YMAX_p= 205264524
##$YMIN_p= -227607910
$$ End of Bruker specific parameters
$$ ---------------------------------
##NTUPLES= NMR SPECTRUM
##VAR_NAME=  FREQUENCY,     SPECTRUM/REAL,   SPECTRUM/IMAG
##SYMBOL=    X,             R,               I
##VAR_TYPE=  INDEPENDENT,   DEPENDENT,       DEPENDENT
##VAR_FORM=  AFFN,          ASDF,            ASDF
##VAR_DIM=   65536,         65536,           65536
##UNITS=     HZ,            ARBITRARY UNITS, ARBITRARY UNITS
##FACTOR=    0.620285442955139, 1,           1
##FIRST=     20137.2065510682, 0,            0
##LAST=      -20513.1999529968, 0,           0
##MIN=       -20513.1999529968, -227607910,  0
##MAX=       20137.2065510682, 205264524,    0
$$ Real data points
##PAGE= N=1
##DATA TABLE= (X++(R..R)), XYDATA
$$ [...]
##PAGE= N=2
##DATA TABLE= (X++(I..I)), XYDATA
$$ plain form
13035 -6580126 -5283630 1651279 7492182 6093903 1558216 1156989 3458317 2117451
13027 2117451 -2135248 -2986795 -74914 945118 -668172 162484 3556304 3251831 -1683143
13018 -1683143 -3684601 841072 5143512 3456256 257113 1641674 4718352 3449430
13010 3449430 -451979 -1044311 919744 -668662 -6227620 -8782250 -4231252 2814213
13002 2814213 5376716 2302518 -1626239 -1419658 3143565 6935004 4372978 -3730453
12994 -3730453 -9801210 -8089718 -1567170 2834995 3675205 4973764 7708366 7335288
12986 7335288 1669521 -3801828 -2540526 3747733 6946810 3108699 -2970862 -4819758
12978 -4819758 -2293178 187420 836244 1761296 3625100 3710342 860670 -1547697 -340463
$$ packed form
13035f580126J296496O934909N840903j398279m535687m01227K301328j340866
13027B117451m252699q51547K911881J020032j613290Q30656L393820l04473m934974
13018a683143k001458M525673M302440j687256l199143J384561L076678j268922
13010C449430l901409n92332J964055j588406n558958k554630M550998P045465
13002B814213K562503l074198l928757K06581M563223L791439k562026q103431
12994c730453o070757J711492O522548M402165Q40210J298559K734602l73078
12986G335288n665767n471349J261302O288259L199077l838111o079561j848896
12978d819758K526580K480598O48824R25052J863804Q5242k849672k408367J207234
$$ plain form
12969 -340463 2677792 3916383 3547065 3999203 4627095 2310413 -3092488 -7893847 -9298972
12960 -9298972 -7668893 -4235156 -26452 2934691 2927444 1412764 1493242 3329175 4170002
12951 4170002 2935915 1594753 2018958 4394391 8069847 10857306 9121980 2825346
12943 2825346 -1552498 1119962 5630953 2687105 -6622450 -11452275 -7314954 -2117043
12935 -2117043 -3026901 -6579564 -6807164 -4780996 -3723978 -1941165 2163076 4162064
12927 4162064 344467 -4692795 -4807326 -2115020 -2229984 -4019110 -2712359 251635
12919 251635 -220633 -2730450 -1267146 3809208 6006721 3867615 2688568 4123939
12911 4123939 3112784 -2536728 -7718881 -8284489 -6450700 -4625487 -845587 5385477
$$ packed form
12969c40463L018255J238591l69318M52138O27892k316682n402901m801359j405125
12960i298972J630079L433737M208704K961143p247j514680Q0478J835933Q40827
12951D170002j234087j341162M24205K375433L675456K787459j735326o296634
12943B825346m377844K672460M510991k943848r309555m829825M137321N197911
12935b117043r09858l552663k27600K026168J057018J782813M104241J998988
12927D162064l817597n037262j14531K692306j14964j789126J306751K963994
12919B51635m72268k509817J463304N076354K197513k139106j179047J435371
12911D123939j011155n649512n182153n65608J833789J825213L779900O231064
$$ plain form
12903 5385477 9036737 6634110 2630392 3194507 7034353 7808913 3618911 -920763
12895 -920763 -1406575 1506686 4169749 4175127 1942175 -580661 -2139364 -2881081 -2751150
12886 -2751150 -683010 2957129 4844651 2719719 -315309 401510 3663848 3826671
12878 3826671 53392 -1652978 2239042 7067462 7342120 5102277 5635372 7876627
12870 7876627 5381846 -3366120 -11148519 -10591460 -3285807 2414115 1435655 -2854292
12862 -2854292 -4055834 -1160704 791116 -1992645 -7225676 -10345216 -10240041 -8583736
12854 -8583736 -5929960 -2184027 642503 431561 -998917 -145193 2271353 2317264 -107184
12845 -107184 -450318 3048512 6221347 5467607 2758428 1334330 566625 -1386310 -3108826
$$ packed form
12903E385477L651260k402627m003718N64115L839846P74560m190002m539674
12895i20763m85812K913261K663063N378k232952k522836j558703p41717J29931
12886b751150K068140L640139J887522k124932l035028P16819L262338J62823
12878C826671l773279j706370L892020M828420K74658k239843N33095K241255
12870G876627k494781q747966p782399N57059P305653N699922r78460m289947
12862b854292j201542K895130J951820k783761n233031l119540J05175J656305
12854h583736K653776L745933K826530k10942j430478Q53724K416546M5911k424448
12845a07184l43134L498830L172835p53740k709179j424098p67705j952935j722516
$$ plain form
12836 -3108826 -1998237 1267182 3639228 3593497 1606849 -1517584 -4342771 -4541443 -1563843
12827 -1563843 1647254 1833306 -616492 -2446182 -1164505 3139648 7963679 9511459
12819 9511459 5941798 647599 -340227 4268654 8997141 8694013 4617572 1095157
12811 1095157 -840388 -3142799 -6012042 -6741942 -2690206 6157903 16212721 21081436
12803 21081436 16304615 5133812 -3353004 -4068136 -972221 -428710 -3427623 -7379142
12795 -7379142 -11380724 -15184734 -16278129 -13214694 -9626347 -9782764 -11790217 -10261308
12787 -10261308 -4550390 684904 2323118 1228238 -1593421 -6079629 -10045906 -9963353
12779 -9963353 -6056077 -2830554 -3328275 -5863000 -7194852 -6077243 -3018712 856750
$$ packed form
12836c108826J110589L265419K372046m5731j986648l124433k825187j98672K977600
12827a563843L211097J86052k449798j829690J281677M304153M824031J547780
12819I511459l569661n294199r87826M608881M728487l03128m076441l522415
12811A095157j935545k302411k869243p29900M051736Q848109J0054818M868715
12803B1081436m776821j1170803q486816p15132L095915N43511k998913l951519
12795g379142m001582l804010j093395L063435L588347j56417k007453J528909
12787a0261308N710918N235294J638214j094880k821659m486208l966277Q2553
12779i963353L907276L225523m97721k534725j331852J117609L058531L875462
$$ plain form
12771 856750 4042765 5666240 6340607 6584750 5559359 3351195 2602323 4902228 7455204
12762 7455204 6960759 5060074 5725893 8647992 9816306 7782317 4763986 2239729
12754 2239729 17892 -1013543 90159 1232250 -125450 -2299776 -2318852 -1837143 -3919730
12745 -3919730 -5683867 -2131149 3365761 1817170 -6845365 -11755993 -6907163 504621
12737 504621 2485561 2018351 5409314 10298147 9985344 5085828 2387391 4447914 7381270
12728 7381270 7568829 4902131 747974 -2512278 -1606849 3562288 7866609 6967392 3080081
12719 3080081 954719 1248939 2280709 4758517 9198702 11701317 8540376 2853325
12711 2853325 734931 2491163 3680467 2912654 2267098 1699724 -99742 -624779 3263893
$$ packed form
12771H56750L186015J623475O74367K44143j025391k208164p48872K299905K552976
12762G455204m94445j900685O65819K922099J168314k033989l018331k524257
12754B239729k221837j031435J103702J142091j357700k174326j9076M81709k082587
12745c919730j764137L552718N496910j548591q662535m910628M848830P411784
12737E04621J980940m67210L390963M888833l12803m899516k698437K060523K933356
12728G381270J87559k666698m154157l260252R05429N169137M304321q99217l887311
12719C080081k125362K94220J031770K477808M440185K502615l160941n687051
12711B853325k118394J756232J189304p67813o45556n67374j799466n25037L888672
$$ plain form
12702 3263893 7831672 6187841 -181514 -1996255 3980499 9941205 9074676 4955101
12694 4955101 4146079 5784275 4637715 492478 -1747158 243009 3236362 3022180
12686 3022180 -883164 -5021941 -5294721 -1278145 2458676 1172720 -3784402 -6197295
12678 -6197295 -3007124 1969951 3421598 716837 -2649667 -3250133 -131237 4694474
12670 4694474 7298139 5581865 2278251 1675343 3619411 4256293 2535634 1467432
12662 1467432 2296448 2375728 435310 -808827 405308 1630669 429057 -1982371 -3643426
12653 -3643426 -4598764 -4577751 -2163311 1288320 1488664 -2056264 -3936470 -1056652 1969903
12644 1969903 282061 -2943103 -1392315 4592322 9086120 9078792 6239232 2131278 -2626177
$$ packed form
12702C263893M567779j643831o369355j814741N976754N960706q66529m119575
12694D955101q09022J638196j146560m145237k239636J990167K993353k14182
12686C022180l905344m138777k72780M016576L736821j285956m957122k412893
12678f197295L190171M977075J451647k704761l366504o00466L118896M825711
12670D694474K603665j716274l303614o02908J944068O36882j720659j068202
12662A467432Q29016P9280j940418j244137J214135J225361j201612k411428j661055
12653c643426r55338K1013K414440L451631K00344l544928j880206K879818L026555
12644A969903j687842l225164J550788N984637M493798p328k839560m107954m757455
$$ plain form
12635 -2626177 -5663422 -4775373 -2012816 -1374334 -3248914 -5224965 -6854856 -8994502
12627 -8994502 -10058250 -8086378 -5110654 -4041554 -2755833 2419057 8472419 8333531
12619 8333531 1904748 -3138640 -2946561 -2234645 -4811980 -6955088 -4608904 -708747
12611 -708747 204543 -394445 1211932 3470906 2278299 -1199182 -1863553 1143725 3582450
12602 3582450 3445494 3520840 5390945 5837137 1867134 -4002719 -6592538 -4617877 -1812698
12593 -1812698 -1931639 -4477587 -5727955 -3148043 1739704 4965665 4395609 1710182
12585 1710182 -270335 -1108766 -2125499 -3007250 -1650809 1804794 3335448 -186567
12577 -186567 -5904825 -7719975 -4079773 87455 308767 -1518579 -432742 4516549
$$ packed form
12635b626177l037245Q88049K762557O38482j874580j976051j629891k139646
12627h994502j063748J971872K975724J069100J285721N174890O053362j38888
12619H333531o428783n043388J92079P11916k577335k143108K346184L900157
12611g08747R13290n98988J606377K258974j192607l477481o64371L007278K438725
12602C582450j36956P5346J870105M46192l970003n869853k589819J974661K805179
12593a812698j18941k545948j250368K579912M887747L225961n70056k685427
12585A710182j980517q38431j016733q81751J356441L455603J530654l522015
12577a86567n718258j815150L640202M167228K21312j827346J085837M949291
$$ plain form
12569 4516549 9404665 10460247 7211815 1613800 -3088328 -3619136 -144847 2334478
12561 2334478 -212379 -4628861 -4906728 -1900104 -2159936 -6439817 -7313018 -1502121 3415658
12552 3415658 607280 -4414908 -1855727 7162618 12419401 9575133 4757470 4459478
12544 4459478 8405109 13032686 15510428 13574232 7364116 2059980 3028624 8048625
12536 8048625 10112267 7735526 5757515 5917143 4623916 1324098 554266 2928148
12528 2928148 2403341 -3513438 -8568879 -7370998 -2847812 865345 5253512 10829206
12520 10829206 11419131 3434805 -5312271 -5484988 -295517 203477 -4582468 -6119089
12512 -6119089 -1908034 1030167 -994023 -2492305 863016 4820118 4061872 346615
$$ packed form
12569D516549M888116J055582l248432n598015m702128n30808L474289K479325
12561B334478k546857m416482k77867L006624k59832m279881q73201N810897M917779
12552C415658k808378n022188K559181R018345N256783k844268m817663k97992
12544D459478L945631M627577K477742j936196o210116n304136R68644N020001
12536H048625K063642k376741j978011J59628j293227l299818p69832K373882
12528B928148n24807n916779n055441J197881M523186L713157M388167N575694
12520A0829206N89925p984326q747076j72717N189471M98994m785945j536621
12512f119089M211055K938201k024190j498282L355321L957102p58246l715257
$$ plain form
12504 346615 -1748495 -1967007 -2426821 -2617341 -1137729 328072 -940830 -4326954 -6731631
12495 -6731631 -6388201 -3490953 1135909 5585235 6858329 3940924 -214196 -1858114
12487 -1858114 -541788 1650379 3515740 5221745 6392567 6039713 4275940 2500826
12479 2500826 1817301 2126820 2505988 1887778 34205 -1543086 -568124 3169887 6802866
12470 6802866 7261507 4509510 844592 -2310375 -5353471 -8339855 -9617437 -7659072
12462 -7659072 -3402133 599332 3299182 5995016 9331481 10953360 8124554 2211573
12454 2211573 -1877987 -1373228 1377049 2723380 2406960 2502061 3249747 2519897 -942330
12445 -942330 -5806276 -9864228 -12159650 -13356800 -14755819 -16645207 -17292571 -14666088
$$ packed form
12504C46615k095110k18512m59814j90520J479612J465801j268902l386124k404677
12495f731631L43430K897248M626862M449326J273094k917405m155120j643918
12487a858114J316326K192167J865361J706005J170822l52854j763773j775114
12479B500826o83525L09519L79168o18210j853573j577291R74962L738011L632979
12470F802866M58641k751997l664918l154967l043096k986384j277582J958365
12462g659072M256939M001465K699850K695834L336465J621879k828806n912981
12454B211573m089560N04759K750277J346331l16420R5101P47686p29850l462227
12445i42330m863946m057952k295422j197150j399019j889388o47364K626483
$$ plain form
12437 -14666088 -9691200 -6026839 -5449209 -5507361 -3588032 -1114210 -872280 -1810970 -99603
12428 -99603 5029862 9778366 10536593 7743004 4529832 3210513 3248624 1697416 -3471578
12419 -3471578 -9459363 -10247748 -4301109 2023683 2386988 -646510 444868 6930336
12411 6930336 12485174 12676028 9484279 5645958 1113734 -2750529 -2041626 2965798
12403 2965798 5630259 1963271 -3082336 -3452972 -1631114 -4024788 -9821880 -11744801
12395 -11744801 -7055439 -1060167 999410 -208645 -1784561 -3104331 -4363847 -4392099
12387 -4392099 -2497341 -138342 1095063 1288731 893213 -166286 -921010 699351 4747317
12378 4747317 8071087 7937998 5273501 2876736 2070976 2609241 4127297 5765325 5796242
$$ packed form
12437a4666088M974888L664361N77630n8152J919329K473822K41930r38690J711367
12428i9603N129465M748504P58227k793589l213172j319319L8111j551208n168994
12419c471578n987785p88385N946639O324792L63305l033498J091378O485468
12411F930336N554838J90854l191749l838321m532224l864263P08903N007424
12403B965798K664461l666988n045607l70636J821858k393674n797092j922921
12395a1744801M689362N995272K059577j208055j575916j319770j259516k8252
12387d392099J894758K358999J233405J93668l95518j059499p54724J620361M047966
12378D747317L323770j33089k664497k396765q05760N38265J518056J638028L0917
$$ plain form
12369 5796242 3760345 1930380 2606092 4887712 6264784 6443179 6958398 7582515 6331024
12360 6331024 3414499 1963552 3460176 5141484 3868232 421590 -2284379 -3483236
12352 -3483236 -4385415 -4970021 -3975410 -1692614 101857 1058834 2354894 3574751 2442413
12343 2442413 -1361199 -4840215 -5542631 -4314702 -2674727 -197223 3086683 4257959
12335 4257959 1078660 -3327271 -3262762 2050067 7179992 7516621 4738981 3734089 6032827
12326 6032827 8317562 6936379 2471713 -759248 258287 3322573 3502252 -303346
12318 -303346 -3657643 -3079853 -1649316 -4552181 -10488909 -12421849 -7573327 -1875051
12310 -1875051 -1774641 -5207995 -4711015 2158327 9633011 11159812 6866905 2425982
$$ packed form
12369E796242k035897j829965O75712K281620J377072J78395N15219O24117j251491
12360F331024k916525j450947J496624J681308j273252l446642k705969j198857
12352c483236r02179n84606R94611K282796J794471R56977J296060J219857j132338
12343B442413l803612l479016p02416J227929J639975K477504L283906J171276
12335D257959l179299m405931O4509N312829N129925L36629k777640j004892K298738
12326F032827K284735j381183m464666l230961J017535L064286J79679l805598
12318c03346l354297N77790J430537k902865n936728j932940M848522N698276
12310a875051J00410l433354M96980O869342P474684J526801m292907m440923
$$ plain form
12302 2425982 2390643 6147661 9620767 9611364 6373179 2689842 1012094 1596469 3107318
12293 3107318 4406002 5275122 5563208 4427408 1201893 -3106860 -6237358 -7161210 -7209834
12284 -7209834 -7706419 -7533567 -4953299 -1241417 80841 -2090768 -5109020 -6448697
12276 -6448697 -6039081 -3864641 1080926 7282059 9761333 6029873 150168 -2779573
12268 -2779573 -3371642 -4796226 -5771950 -2768080 2357494 3966271 2173593 3670097
12260 3670097 10965431 17357016 16258338 10267540 6466045 6599505 6785700 4525903
12252 4525903 1332067 -632788 -1014045 -844285 -1817877 -4873549 -7857384 -6624778 -561825
12243 -561825 5318030 6424091 4435251 3943468 5396798 5363647 2635976 -110654 -701004
$$ packed form
12302B425982l5339L757018L473106r403l238185l683337j677748N84375J510849
12293C107318J298684Q69120K88086j135800l225515m308753l130498r23852m8624
12284g209834m96585J72852K580268L711882J322258k171609l018252j339677
12276f448697M09616K174440M945567O201133K479274l731460n879705k929741
12268b779573n92069j424584r75724L003870N125574J608777j792678J496504
12260C670097P295334O391585j098678n990798l801495J33460J86195k259797
12252D525903l193836j964855l81257J69760r73592l055672k983835J232606O062953
12243e61825N879855J106061j988840m91783J453330l3151k727671k746630n90350
$$ plain form
12234 -701004 23380 491011 310302 -678777 -2857368 -5654027 -7693524 -8482103 -8512279
12225 -8512279 -7889616 -6615742 -6003126 -7674073 -10857361 -12565715 -11036263 -7526254
12217 -7526254 -4158434 -1347126 1734973 4849937 5860375 2686636 -3733463 -9037097
12209 -9037097 -9233624 -5010805 -842742 483894 613244 2135203 4493263 5044477 2763170
12200 2763170 -754972 -2988234 -2122780 1654812 5620601 7092740 7318464 10046596
12192 10046596 14921804 15996179 9637563 425197 -4687287 -4906429 -3566176 -716219
12184 -716219 5574338 11995099 11918863 5695698 1889680 5497904 11105212 11433935 7136719
12175 7136719 3280286 804044 -2409719 -5032365 -3660820 304390 1507374 -1221389
$$ packed form
12234g01004P24384M67631j80709r89079k178591k796659k039497p88579l0176
12225h512279O22663J273874O12616j670947l183288j708354J529452L510009
12217g526254L367820K811308L082099L114964J010438l173739o420099n303634
12209i037097j96527M222819M168063J326636J29350J521959K358060N51214k281307
12200B763170l518142k233262Q65454L777592L965789J472139K25724K728132
12192A0046596M875208J074375o358616r212366n112484k19142J340253K849957
12184g16219O290557O420761p6236o223165l806018L608224N607308L28723m297216
12175G136719l856433k476242l213763k622646J371545L965210J202984k728763
$$ plain form
12167 -1221389 -3239368 -1819429 -56522 -719907 -1291051 1027993 3306213 850853
12159 850853 -5062589 -8615480 -7762493 -6110377 -6359424 -6852061 -5849150 -4504832 -3496544
12150 -3496544 -1175823 2035354 1812555 -3423793 -7907483 -5795403 -55686 1937836
12142 1937836 -496306 -1698724 -110490 -265824 -3326408 -3909186 401809 3803454
12134 3803454 1283566 -3362634 -4126329 -2060972 -1523571 -1493189 1963633 7265053 8934359
12125 8934359 6564823 5174535 6732473 7721922 5683307 2425352 -128419 -2043882
12117 -2043882 -2472261 229431 4401126 6003995 4690730 3984092 4476408 2700751 -1360653
12108 -1360653 -2013383 3352125 8891836 8489922 4654292 3682101 5526141 4905846 667748
$$ packed form
12167a221389k017979J419939J762907o63385n71144K319044K278220k455360
12159H50853n913442l552891Q52987J652116k49047m92637J002911J344318J008288
12150c496544K320721L211177k22799n236348m483690K112080N739717J993522
12142A937836k434142j202418J588234j55334l060584n82778M310995L401645
12134C803454k519888m646200p63695K065357N37401L0382L456822N301420J669306
12125H934359k369536j390288J557938R89449k038615l257955k553771j915463
12117b043882m28379K701692M171695J602869j313265p06638M92316j775657m061404
12108a360653o52730N365508N539711m01914l835630r72191J844040o20295m238098
$$ plain form
12099 667748 -2560348 -2093458 -648983 -650829 -120655 2964878 5890772 4624430 431204
12090 431204 -847677 3293750 7707294 5259125 -4272639 -13278622 -14554297 -8461270
12082 -8461270 -925743 3609930 5039580 4819510 3609661 2020185 1066510 769369 22606
12073 22606 -1218460 -1161603 1329171 4621840 5852562 4107563 1479821 1187231 4572556
12064 4572556 9540560 12401015 11826779 10110802 9676870 9812925 8487002 5866208 3626817
12055 3626817 1907445 -338921 -2817402 -4493995 -5762504 -6922456 -5747525 -649581
12047 -649581 4630222 4615968 585469 -91298 5424879 10944946 10101225 4876886 1609877
12038 1609877 2210140 3468904 2676772 103612 -2797501 -4889384 -6028711 -7637568
$$ packed form
12099F67748l228096M66890J444475j846N30174L085533K925894j266342m193226
12090D31204j278881M141427M413544k448169r531764r005983j275675O093027
12082h461270P535527M535673J429650k20070j209849j589476r53675k97141p46763
12073B2606j241066N6857K490774L292669J230722j744999k627742k92590L385325
12064D572556M968004K860455n74236j715977m33932J36055j325923k620794k239391
12055C626817j719372k246366k478481j676593j268509j159952J174931N097944
12047f49581N279803j4254m030499o76767N516177N520067q43721n224339l267009
12038A609877O00263J258764p92132k573160k901113k091883j139327j608857
$$ plain form
12030 -7637568 -10815746 -13216403 -11049330 -5393201 -2394543 -5084798 -9373329 -10821609
12022 -10821609 -10379521 -9577091 -5501742 3462698 11173001 10278203 2949532 -1891873
12014 -1891873 -633226 2604381 4627266 6724742 8922084 7868356 2758194 -2206673
12006 -2206673 -3729560 -3397709 -3855408 -5172171 -6777014 -8973127 -10763506 -9975205 -7116981
11997 -7116981 -5274110 -4797070 -2439966 2405511 5221440 2769817 -2041032 -4579329
11989 -4579329 -4244465 -3093051 -2232059 -2328037 -4158009 -5847280 -3397023 2862985 6519609
11980 6519609 3733000 -566155 -146639 2756581 1534249 -3595175 -5811003 -2516827
11972 -2516827 1026224 -44561 -4006691 -6241122 -4504720 893639 7824555 11715997
$$ packed form
12030g637568l178178k400657K167073N656129K998658k690255m288531j448280
12022a0821609M42088Q02430M075349Q964440P710303q94798p328671m841405
12014a891873J258647L237607K022885K097476K197342j053728n110162m964867
12006b206673j522887L31851m57699j316763j604843k196113j790379P88301K858224
11997g116981J842871M77040K357104M845477K815929k451623m810849k538297
11989d579329L34864J151414Q60992r5978j829972j689271K450257O260008L656624
11980F519609k786609m299155M19516K903220j222332n129424k215828L294176
11972b516827L543051j070785l962130k234431J736402N398359O930916L891442
$$ plain form
11964 11715997 8548799 691629 -3911059 -802548 5696717 8416308 5644921 1110426
11956 1110426 -1704016 -2304387 -1835745 -1506496 -1543873 -380197 3689619 8895934 10208886
11947 10208886 5181287 -2107476 -5250158 -2706426 1152612 1620996 -1290791 -3271323
11939 -3271323 -589705 5165728 7891419 4134334 -1518773 -1527377 4326572 8354112 5954180
11930 5954180 1972043 2802745 6942266 8455734 6383809 4625359 4300458 2628001
11922 2628001 -696194 -1887969 870470 4324883 4721371 2103784 -1078318 -2619996
11914 -2619996 -1108230 3043516 6385356 5298648 743252 -2708574 -2789724 -1281403
11906 -1281403 117172 1679263 2947589 2358118 504706 -274870 -360171 -2365671 -5269088
$$ packed form
11964A1715997l167198p857170m602688L108511O499265K719591k771387m534495
11956A110426k814442o00371M68642L29249l7377J163676M069816N206315J312952
11947A0208886n027599p288763l142682K543732L859038M68384k911787j980532
11939c271323K681618N755433K725691l757085n653107q604N853949M027540k399932
11930E954180l982137Q30702M139521J513468k071925j758450l24901j672457
11922B628001l324195j191775K758439L454413L96488k617587l182102j541678
11914b619996J511766M151746L341840j086708m555396l451826q1150J508321
11906a281403J398575J562091J268326n89471j853412p79576q5301k005500k903417
$$ plain form
11897 -5269088 -4352035 1113443 5536455 4992103 2302357 1218370 1055767 679168 1929269
11888 1929269 4448482 3080652 -3607497 -7904785 -3510657 3332260 2212568 -5192906
11880 -5192906 -7248198 207643 8523500 9567478 5410791 1920146 301179 -1164726
11872 -1164726 -2720248 -4154762 -5910108 -6541597 -3311973 2444509 4978474 1631229
11864 1631229 -3389750 -5139146 -3925450 -2795559 -2796056 -3230637 -3373524 -1889969 2263123
11855 2263123 6887270 8047629 5598442 3015182 1018858 -2929710 -7267669 -5534813
11847 -5534813 3388843 11005868 10462693 6263176 6457817 10221443 10815777 7438606 5733373
11838 5733373 7715528 9046958 6929658 4174080 3844595 4892742 4935134 3692761 2112748
$$ packed form
11897e269088R17053N465478M423012n44352k689746j083987j62603l76599J250101
11888A929269K519213j367830o688149m297288M394128O842917j119692p405474
11880e192906k055292P455841Q315857J043978m156687l490645j618967j465905
11872a164726j555522j434514j755346o31489L229624N756482K533965l347245
11864A631229n020979j749396J213696J129891m97m34581j42887J483555M153092
11855B263123M624147J160359k449187k583260j996324l948568m337959J732856
11847e534813Q923656P617025n43175m199517J94641L763626N94334l377171j705233
11838E733373J982155J331430k117300k755578l29485J048147M2392j242373j580013
$$ plain form
11829 2112748 685250 -381267 -1093937 -1842721 -2258567 -1032991 1431494 2204725 63956
11820 63956 -1906328 -1061734 247229 -1050171 -2744480 -941326 2523246 2551240 -435410
11811 -435410 -1004386 1853199 2823270 -552975 -3382524 -1177672 3266102 4608832 2696795
11802 2696795 1596163 3246328 5325844 4305095 -955276 -7259174 -8412182 -1219796
11794 -1219796 9345893 14337235 11031168 5222582 2393224 1380517 -840921 -3027181
11786 -3027181 -2460427 -345482 236348 -411124 237997 1969472 2275488 1052005 917768
11777 917768 2876212 5038073 5960034 6229819 6056632 4032059 -254798 -4117123 -4076445
11768 -4076445 79938 4760100 6582838 6364630 7822108 11914741 14446135 11376793
$$ packed form
11829B112748j427498j066517p12670p48784m15846J225576K464485P73231k140769
11820F3956j970284Q44594J308963j297400j694309J803154L464572K7994k986650
11811d35410n68976K857585R70071l376245k829549K204852M443774J342730j912037
11802B696795j100632J650165K079516j020749n260371o303898j153008P192386
11794a219796J0565689M991342l306067n808586k829358j012707k221438k186260
11786c027181N66754K114945N81830o47472O49121J731475L06016j223483j34237
11777I17768J958444K161861R21961K69785j73187k024573m286857l862325M0678
11768d076445M156383M680162J822738k18208J457478M092633K531394l069342
$$ plain form
11760 11376793 4935132 989816 1043524 1312132 234928 1502759 7076220 12233335
11752 12233335 11842207 7740204 4900619 3363172 -49328 -3931509 -3177573 2121192
11744 2121192 5223636 2190825 -2488427 -2527858 1933741 5728044 5243802 862261 -4727622
11735 -4727622 -8200941 -7810581 -6046164 -7612370 -12575607 -14525766 -8712475 713254
11727 713254 5592154 3906159 543658 -809186 -1391430 -2842988 -3962380 -3489677 -2182302
11718 -2182302 -428436 2652748 5927132 5792433 1628509 -1724300 -411667 2290962
11710 2290962 551430 -5025116 -7762785 -4105393 1917566 4357926 1964463 -2307650
11702 -2307650 -5517111 -6492506 -5275141 -2911257 -1131406 -945890 -1720835 -1936748 -483648
$$ packed form
11760A1376793o441661l945316N3708K68608j077204J267831N573461N157115
11752A2233335l91128m102003k839585j537447l412500l882181P53936N298765
11744B121192L102444l032811m679252l9431M461599L794303m84242m381541n589883
11735d727622l473319L90360J764417j566206m963237j950159N813291R425729
11727G13254M878900j685995l362501j352844n82244j451558j119392M72703J307375
11718b182302J753866L081184L274384j34699m163924l352809J312633K702629
11710B290962j739532n576546k737669L657392O022959K440360k393463m272113
11702b307650l209461r75395J217365K363884J779851J85516p74945k15913J453100
$$ plain form
11693 -483648 2439749 4882581 4330250 714326 -2663599 -3101322 -2249110 -3118899 -4415344
11684 -4415344 -1959174 4170347 8653576 8571559 7387857 8619988 9882290 7323381
11676 7323381 2740637 1223915 3231019 3913162 278175 -4932404 -7124974 -4772149
11668 -4772149 11420 3643467 3725354 1299359 28077 1459890 2368453 -791920 -6219316
11659 -6219316 -8820196 -6961724 -3533687 -935403 796810 903042 -2299653 -7310951
11651 -7310951 -9541325 -7520867 -5093298 -4990331 -4174410 792452 6966488 8430195
11643 8430195 4958020 2254246 3426208 4941883 2787818 -1253353 -2634789 -948026
11635 -948026 186747 -538314 -159985 2978523 5644401 4697790 2627921 3651332 6009421
$$ packed form
11693d83648K923397K442832n52331l615924l377925m37723Q52212q69789j296445
11684d415344K456170O129521M483229q2017j183702J232131J262302k558909
11676G323381m582744j516722K007104O82143l634987n210579k192570K352825
11668d772149M783569L632047Q1887k425995j271282J431813R08563l160373n427396
11659f219316k600880J858472L428037K598284J732213J06232l202695n011298
11651g310951k230374K020458K427569J02967Q15921M966862O174036J463707
11643H430195l472175k703774J171962J515675k154065m041171j381436J686763
11635i48026J134773p25061L78329L138508K665878r46611k069869J023411K358089
$$ plain form
11626 6009421 3877033 -2831333 -6745653 -3403477 2434770 4599735 4276404 5555387
11618 5555387 6802412 3745916 -1347017 -1547060 3993911 8527531 7875989 5470303
11610 5470303 5592109 7685736 9553977 10672510 10094581 6517579 2788105 4519860
11602 4519860 11168202 14417676 9444974 2072368 -112373 1771034 2254206 1381009
11594 1381009 2839641 5591519 5288264 2513816 2106117 4633858 5537740 3184748 1204627
11585 1204627 1635813 1828812 5812 -1586575 -1382058 -1428958 -2923128 -3204304 -409507
11576 -409507 2497102 1842173 -1312612 -3262470 -3173489 -3113084 -3801469 -3562200 -1297865
11567 -1297865 1881594 4209166 4880482 3932971 1632071 -1552469 -4679931 -6488222
$$ packed form
11626F009421k132388o708366l914320L342176N838247K164965l23331J278983
11618E555387J247025l056496n092933k00043N540971M533620o51542k405686
11610E470303J21806K093627J868241J118533n77929l577002l729474J731755
11602D519860O648342L249474m972702p372606k184741J883407M83172q73197
11594A381009J458632K751878l03255k774448m07699K527741R03882k352992j980121
11585A204627M31186J92999j823000j592387K04517m6900j494170k81176K794797
11576d09507K906609o54929l154785j949858Q8981O0405o88385K39269K264335
11567a297865L179459K327572O71316r47511k300900l184540l127462j808291
$$ plain form
11559 -6488222 -6447735 -5821102 -6451928 -7668878 -6150918 -799004 4080496 3675683 -370648
11550 -370648 -1941561 854986 3611197 3114821 1895253 2841333 3909177 2120748 -618640
11541 -618640 -406371 2120751 3113743 2343104 3455766 6845549 7131572 143079 -10590163
11532 -10590163 -16990157 -14672986 -6236956 2441023 7231850 7630281 5650948 3704570
11524 3704570 2946030 2902387 2327960 492043 -1955192 -3235089 -1999883 1144514 4197725
11515 4197725 5950717 6619219 5950381 2374865 -4339378 -10637888 -11668902 -6446993
11507 -6446993 999019 5867100 6685734 5219173 4098741 5188934 8611408 12078693
11499 12078693 12202698 7862041 1876659 -1722503 -1820700 -728343 -921736 -2486067 -3911916
$$ packed form
11559f488222M0487O26633o30826j216950J517960N351914M879500m04813m046331
11550c70648j570913K796547K756211m96376j219568R46080J067844j788429k739388
11541f18640K12269K527122R92992p70639J112662L389783K86023o988493j0733242
11532a0590163o399994K317171Q436030Q677979M790827L98431j979333j946378
11524C704570p58540m3643n74427j835917k447235j279897J235206L144397L053211
11515D197725J752992O68502o68838l575516o714243o298510j031014N221909
11507f446993P446012M868081Q18634j466561j120432J090193L422474L467285
11499A2078693J24005m340657n985382l599162r8197J092357j93393j564331j425849
$$ plain form
11490 -3911916 -4183963 -3320804 -1672963 166977 1051208 248380 -917243 208331 4164053
11481 4164053 7788827 7812326 5339848 4401935 6025740 6665462 3715656 -355845 -1827144
11472 -1827144 -1289759 -1911062 -3548245 -2859212 629322 2750766 419573 -4202578 -7146475
11463 -7146475 -7537638 -7027584 -6717428 -6901015 -7820435 -8393833 -6253994 -1632539 963700
11454 963700 -1662881 -5863133 -5316911 66668 3966305 2733137 177956 1594769
11446 1594769 6619257 10457210 9782302 5143836 -624566 -4237084 -3641343 25920
11438 25920 2952754 2535864 -63549 -2081022 -2350137 -1182384 1119993 3738252 4726997
11429 4726997 3163544 1207217 2021186 5910408 9961012 11069135 8122838 2121672
$$ packed form
11490c911916k72047Q63159J647841J839940Q84231q02828j165623J125574L955722
11481D164053L624774K3499k472478r37913J623805O39722k949806m071501j471299
11472a827144N37385o21303j637183O89033L488534K121444k331193m622151k943897
11463g146475l91163N10054L10156j83587r19420n73398K139839M621455K596239
11454I63700k626581m200252N46222N383579L899637j233168k555181J416813
11446A594769N024488L837953o74908m638466n768402l612518N95741L667263
11438B5920K926834m16890k599413k017473k69115J167753K302377K618259R88745
11429D726997j563453j956327Q13969L889222M050604J108123k946297o001166
$$ plain form
11421 2121672 -4044063 -6500650 -3260726 3341656 8367944 8919035 6506422 4836688
11413 4836688 5798976 7623429 6868638 2529849 -2198176 -3358030 -1055827 1040860
11405 1040860 924013 243970 527691 805281 731452 2579426 7207505 11005549 10478189
11396 10478189 7479851 5929005 5498371 3231018 -277461 -1747862 -1462324 -2787540
11388 -2787540 -5266540 -4294449 902079 4866204 3979228 1597099 1952846 3804238 4033271
11379 4033271 3273434 3470103 3452181 1800898 1030367 3502859 5647205 2378932 -4026014
11370 -4026014 -5911359 -1062798 4719682 6758752 6801509 6964104 4831055 -925214 -5014825
11361 -5014825 -1675873 6226997 10365777 8331257 5773371 6407244 6026746 -58529
$$ packed form
11421B121672o165735k456587L239924O602382N026288N51091k412613j669734
11413D836688R62288J824453p54791m338789m728025j159854K302203K096687
11405A040860j16847o80043K83721K77590p3829J847974M628079L798044n27360
11396A0478189k998338j550846m30634k267353l508479j470401K85538j325216
11388b787540k479000R72091N196528L964125q86976k382129L55747J851392K29033
11379D033271p59837J96669j7922j651283p70531K472492K144346l268273o404946
11370d026014j885345M848561N782480K039070M2757J62595k133049n756269m089611
11361e014825L338952P902870M138780k034520k557886O33873l80498o085275
$$ plain form
11353 -58529 -8056792 -9571001 -3080332 3728476 4194557 1012683 1398525 6470526 9684177
11344 9684177 6040286 -815929 -3019432 1798877 8159331 9971590 7273661 4349849
11336 4349849 3350952 2655861 1004062 -71036 743605 1618441 55954 -3118571 -4866732
11327 -4866732 -4290094 -2981306 -1209727 2758377 8348992 10928027 6962602 -847650
11319 -847650 -6222282 -6266803 -3668916 -2552155 -4260884 -7240716 -9351533 -9703249 -8822946
11310 -8822946 -7313971 -4840048 -1475373 499779 -1334557 -5152657 -5587257 -491543
11302 -491543 5789551 8064737 6349757 3573042 460365 -3224802 -5015896 -2548064
11294 -2548064 1359880 1827164 -442624 -157176 3785583 6327763 4343002 1177372
$$ packed form
11353e8529p998263j514209O490669O808808M66081l181874L85842N072001L213651
11344I684177l643891o856215k203503M818309O360454J812259k697929k923812
11336D349849r98897o95091j651799j075098Q14641Q74836j562487l174525j748161
11327d866732N76638J308788J771579L968104N590615K579035l965425p810252
11319h47650n374632m4521K597887J116761j708729k979832k110817l51716Q80303
11310h822946J508975K473923L364675J975152j834336l818100m34600N095714
11302d91543O281094K275186j714980k776715l112677l685167j791094K467832
11294b548064L907944M67284k269788K85448L942759K542180j984761l165630
$$ plain form
11286 1177372 858650 2606570 3840733 4363136 4426628 2389706 -2201142 -6081328 -6118682
11277 -6118682 -3343307 -352462 2685864 6348495 8769512 7751859 4488309 1991980
11269 1991980 1096977 767821 896276 1832253 2332877 926201 -1456418 -2688865 -2396324
11260 -2396324 -1389574 647737 4126662 6944965 5844345 623599 -4950205 -6765278
11252 -6765278 -3975537 588410 2903603 1492947 -883619 -626594 1602863 1734182
11244 1734182 -1358051 -4034304 -4015730 -4237927 -7579799 -11401248 -11370240 -8020670 -5231570
11235 -5231570 -4255532 -3522050 -2614515 -2078168 -766556 2138201 3768655 1016310 -3554601
11226 -3554601 -4187113 22102 4348560 5522970 4684130 3258234 1198519 -2707
$$ packed form
11286A177372l18722J747920J234163N22403O3492k036922m590848l880186l7354
11277f118682K775375K990845L038326L662631K421017j017653l263550k496329
11269A991980q95003l29156J28455R35977N00624j406676k382619j232447K92541
11260b396324J006750K037311L478925K818303j100620n220746n573804j815073
11252f765278K789741M563947K315193j410656k376566K57025K229457J31319
11244A734182l092233k676253J8574k22197l341872l821449L1008L349570K789100
11235e231570R76038P33482R07535N36347J311612K904757J630454k752345m570911
11226c554601o32512M209215M326458J174410q38840j425896k059715j201226
$$ plain form
11218 -2707 2052148 5610053 5480016 702146 -3371592 -2923994 -819738 -1124842 -3105210
11209 -3105210 -4186960 -4739833 -5821038 -5711981 -3237568 -1557281 -3587410 -5862566
11201 -5862566 -2641900 4765091 8588572 5132487 -557222 -2398465 -1070906 -966450
11193 -966450 -2648516 -2651600 207997 2413930 739408 -3015168 -4349687 -1929534 1240283
11184 1240283 2559741 3332135 5977905 9361541 9429966 4377698 -3010894 -8601471 -10605762
11175 -10605762 -9507398 -6444698 -2977131 -783697 11518 1086505 3230245 4797584
11167 4797584 4328428 3022044 2437335 1399348 -1612593 -4004525 -1189910 6200680
11159 6200680 11249312 8866699 1874032 -3347532 -4433876 -3302936 -1443141 951340
$$ packed form
11218b707K054855L557905j30037m777870m073738M47598K104256l05104j980368
11209c105210j081750n52873j081205J09057K474413J680287k030129k275156
11201e862566L220666P406991L823481l456085n689709j841243J327559J04456
11193i66450j682066l084K859597K205933j674522l754576j334519K420153L169817
11184A240283J319458P72394K645770L383636O8425n052268p388592n590577k004291
11175a0605762J098364L062700L467567K193434P95215J074987K143740J567339
11167D797584m69156j306384n84709j037987l011941k391932K814615P390590
11159F200680N048632k382613o992667n221564j086344J130940J859795K394481
$$ plain form
11151 951340 2474936 1519583 -372083 -116425 1737147 1346774 -2397571 -6270554 -8038656
11142 -8038656 -9048019 -10107498 -9579341 -7816025 -8434281 -11881282 -12880659 -8730851 -5005112
11133 -5005112 -7021241 -10316279 -7377255 -562472 813133 -4883102 -9271119 -7077467
11125 -7077467 -2730705 -1658777 -3106692 -4693848 -6658439 -7853400 -4453204 3064187
11117 3064187 7952929 6670972 4217479 5226999 5984086 1313943 -5930205 -8948221
11109 -8948221 -6549231 -2451466 1255222 3906714 3232388 -1036283 -3677522 -404380
11101 -404380 5240081 7578324 7819354 10246975 12771881 9745488 2295364 -2657710
11093 -2657710 -2864948 -2209482 -2397946 -1533573 -888276 -4330190 -9874677 -10321178 -4469409
$$ packed form
11151I51340J523596r55353j891666K55658J853572l90373l744345l872983j768102
11142h038656j009363j059479N28157J763316o18256l447001r99377M149808L725739
11133e005112k016129l295038K939024O814783J375605n696235m388017K193652
11125g077467M346762J071928j447915j587156j964591j194961L400196P517391
11117C064187M888742j281957k453493J009520P57087m670143p244148l018016
11109h948221K398990M097765L706688K651492o74326m268671k641239L273142
11101d04380N644461K338243K41030K427621K524906l026393p450124m953074
11093b657710k07238O55466j88464Q64373O45297l441914n544487m46501N851769
$$ plain form
11084 -4469409 224546 -979697 -3486501 -1695112 2629155 4505647 2967507 131196
11076 131196 -2607251 -3968126 -2293059 1279189 2663041 272993 -2914008 -4475900
11068 -4475900 -5448631 -6232327 -4487941 94166 3439906 2722051 480896 62666 596072
11059 596072 -373398 -2517914 -4009464 -4404174 -3853330 -2198403 -678316 -1396794 -3541235
11050 -3541235 -3704367 -1297275 598130 1061914 2724698 5351976 4224845 -1616241
11042 -1616241 -5659822 -3295550 584490 -824670 -5698253 -7292306 -4703824 -2647066
11034 -2647066 -2375881 -152289 5156409 9096123 7580350 1742759 -4081068 -6254575
11026 -6254575 -3649813 1540724 4814272 3710764 941714 1033462 4549181 7866189
$$ packed form
11084d469409M693955j204243k506804J791389M324267J876492j538140k836311
11076A31196k738447j360875J675067L572248J383852k390048l187001j561892
11068d475900r72731p83696J744386M582107L345740p17855k241155m18230N33406
11059E96072r69470k144516j491550l94710N50844J654927J520087p18478k144441
11050c541235j63132K407092J895405M63784J662784K627278j127131n841086
11042a616241m043581K364272L880040j409160m873583j594053K588482K056758
11034b647066K71185K223592N308698L939714j515773n837591n823827k173507
11026f254575K604762N190537L273548j103508k769050R1748L515719L317008
$$ plain form
11018 7866189 7874402 4704318 636813 -1713057 -1141007 498974 -173901 -3318643 -4844874
11009 -4844874 -2192688 1504886 1982383 121024 3077 2436873 4293643 3388969 674095
11000 674095 -1731398 -1930469 1141710 5652187 6904983 2653681 -3130947 -5317231
10992 -5317231 -4746573 -5904729 -8641763 -7622550 -615578 7524324 10841700 8582202
10984 8582202 3865467 -609249 -3486180 -4128800 -3479813 -3791242 -5511295 -5994992 -3350468
10975 -3350468 -195634 -946739 -5675026 -9274258 -7602249 -2464381 1121205 1210868 32470
10966 32470 -701226 -2229424 -5198241 -6830916 -4603445 -797328 177003 -1895823 -2965338
10957 -2965338 -697159 2939672 5128605 4909305 2397719 -1089719 -2030095 2078167
$$ packed form
11018G866189Q213l170084m067505k349870N72050J639981o72875l144742j526231
11009d844874K652186L697574M77497j861359j17947K433796J856770r04674k714874
11000F74095k405493j99071L072179M510477J252796m251302n784628k186284
10992e317231N70658j158156k737034J019213P006972Q139902L317376k259498
10984H582202m716735m474716k876931o42620O48987l11429j720053m83697K644524
10975c350468L154834p51105m728287l599232J672009N137868L585586Q9663j178398
10966C2470p33696j528198k968817j632675K227471L806117R74331k072826j069515
10957b965338K268179L636831K188933k19300k511586l487438r40376M108262
$$ plain form
10949 2078167 7958366 9447348 6052036 3772447 5898312 8381610 7066448 4144699
10941 4144699 3312792 3043142 -196823 -5065055 -6853869 -4257587 -393644 1807228
10933 1807228 1918208 1023625 1147738 3926383 7351073 6283399 -847627 -8565301 -11023691
10924 -11023691 -9464199 -8959454 -10220399 -9524888 -5365356 -318095 3223814 5028582
10916 5028582 5025653 3101175 914619 810056 2911823 5561278 7732010 8637218 6582554
10907 6582554 1464729 -2949567 -2884885 188028 1774099 1141143 1976458 6137072 10326863
10898 10326863 10048172 4680765 -2029634 -5269893 -3225913 958967 2113979 -1045450
10890 -1045450 -4530984 -4823155 -3530345 -4118203 -6445215 -7571562 -6250313 -3625110
$$ packed form
10949B078167N880199J488982l395312k279589K125865K483298j315162k921749
10941D144699q31907k69650l239965m868232j788814K596282L863943K200872
10933A807228J10980q94583J24113K778645L424690j067674p131026p717674k458390
10924a1023691J559492N04745j260945O95511M159532N047261L541909J804768
10916E028582k929j924478k186556j04563K101767K649455K170732R05208k054664
10907F582554n117825m414296O4682L072913J586071o32956Q35315M160614M189791
10898A0326863k78691n367407o710399l240259K043980M184880J155012l159429
10890a045450l485534k92171J292810n87858k327012j126347J321249K625203
$$ plain form
10882 -3625110 -809831 1583338 2823259 3237298 4442774 6481022 6937029 4932353
10874 4932353 3113996 3183213 2811657 209896 -1822620 -491854 1734795 1307350 153818
10865 153818 2667833 8198975 11966605 12059552 10483142 8596064 6587991 6284051 9180021
10856 9180021 12341159 11216176 6124697 1509809 -523388 -1517032 -2534170 -3339691
10848 -3339691 -4657376 -6547789 -5826430 -289858 5717733 5798098 914512 -1760746 597308
10839 597308 3203921 1752251 -2005157 -4280149 -4052423 -2350996 -656030 -856055 -3172121
10830 -3172121 -4148079 -846172 3347209 2163206 -4099218 -7943687 -4632898 2072184
10822 2072184 5661692 4164021 31396 -3758494 -5764542 -6392894 -6766037 -6104920 -1987501
$$ packed form
10882c625110K815279K393169J239921M14039J205476K038248M56007k004676
10874D932353j818357O9217l71556k601761k032516J330766K226649m27445j153532
10865A53818K514015N531142L767630R2947j576410j887078k008073l03940K895970
10856I180021L161138j124983n091479m614888k033197r93644j017138q05521
10848c339691j317685j890413P21359N536572O007591Q0365m883586k675258K358054
10839E97308K606613j451670l757408k274992K27726J701427J694966k00025k316066
10830c172121r75958L301907M193381j184003o262424l844469L310789O705082
10822B072184L589508j497671m132625l789890k006048o28352l73143O61117M117419
$$ plain form
10813 -1987501 4582922 7624071 3788279 -1799788 -2633587 -296361 -162723 -1137562 1493269
10804 1493269 5180234 2589100 -4834295 -6509674 1535654 10279283 10863196 5532153
10796 5532153 1003330 -1121340 -1945571 -117893 4786404 8591832 7696429 4299847
10788 4299847 2335337 1849944 1026209 117809 68322 556885 1756164 4201751 5349464
10779 5349464 1457315 -5088097 -6431809 -241624 6304030 7419499 7049159 10929972
10771 10929972 16218485 15940118 9930673 4470293 3139417 3986704 4574016 4759812 4911044
10762 4911044 5136510 5993214 7403021 7582706 4853192 -412428 -6320188 -10146492 -8781063
10753 -8781063 -2015832 4486709 4156481 -1609391 -4519195 -642705 4966212 6819257
$$ packed form
10813a987501O570423L041149l835792n588067q33799K337226J33638r74839K630831
10804A493269L686965k591134p423395j675379Q045328Q743629N83913n331043
10796E532153m528823k124670q24231J827678M904297L805428q95403l396582
10788D299847j964510m85393q23735r08400m9487M88563J199279K445587J147713
10779E349464l892149o545412j343712O190185O545654J115469l70340L880813
10771A0929972N288513k78367o009445n460380j330876Q47287N87312J85796J51232
10762D911044K25466Q56704J409807J79685k729514n265620n907760l826304J365429
10753h781063O765231O502541l30228n765872k909804L876490N608917J853045
$$ plain form
10745 6819257 5997186 5441445 4215075 869458 -2172270 -2066639 148514 2098348 3351522
10736 3351522 3605970 1829020 -531588 -380026 979604 -1384288 -7007446 -9098260
10728 -9098260 -5744495 -3578768 -5648551 -5041014 2387719 8213503 4017709 -3991433
10720 -3991433 -4367929 1257218 1768775 -4838270 -9258038 -6477549 -1625084 734203
10712 734203 2306114 3952329 2652134 -1329257 -2755248 -437131 -349554 -5733861 -10869532
10703 -10869532 -9514956 -4176921 -1765033 -3698946 -5373260 -3503435 239703 2487294
10695 2487294 2328710 1767954 2768904 4089158 2140127 -3824853 -8969410 -7936612
10687 -7936612 -1852998 2576632 820243 -4998448 -9146222 -7767519 -1833915 3490923
$$ packed form
10745F819257q22071n55741j226370l345617l041728J05631K215153J949834J253174
10736C351522K54448j776950k360608J51562J359630k363892n623158k090814
10728i098260L353765K165727k069783O07537P428733N825784m195794q009142
10720c991433l76496N625147N11557o607045m419768K780489M852465K359287
10712G34203J571911J646215j300195l981391j425991K318117Q7577n384307n135671
10703a0869532J354576N338035K411888j933913j674314J869825L743138K247591
10695B487294j58584n60756J000950J320254j949031n964980n144557J032798
10687g936612O083614M429630j756389n818691m147774J378703N933604N324838
$$ plain form
10679 3490923 3235837 -1899054 -5781170 -4312751 -514360 350712 -1696070 -2208239 1055415
10670 1055415 6007631 9524175 9725027 6524244 2980476 3939217 9622405 12881422
10662 12881422 7334454 -3669563 -11037099 -11177435 -8052124 -5504352 -3566838 -1964454
10654 -1964454 -1379501 -988737 -36746 -1496879 -7936684 -13840484 -9851821 3315024
10646 3315024 12979726 10526104 2521117 400013 4824894 7375509 4073431 -724047
10638 -724047 -2801947 -3048590 -3101887 -2332828 -1213305 -2445674 -5908950 -6887837 -2831277
10629 -2831277 1845635 1920537 -735768 -520227 2779316 4201360 2021974 -660982 -2997789
10620 -2997789 -7625328 -12959476 -12322596 -4957095 -111099 -3902286 -9311065 -7414161
$$ packed form
10679C490923k55086n134891l882116J468419L798391Q65072k046782n12169L263654
10670A055415M952216L516544K00852l200783l543768R58741N683188L259017
10662A2881422n546968j1004017p367536j40336L125311K547772J937514J602384
10654a964454N84953L90764R51991j460133o439805n903800L988663J3166845
10646C315024R664702k453622q004987k121104M424881K550615l302078m797478
10638g24047k077900k46643n3297P69059J119523j232369l463276r78887M056560
10629b831277M676912P4902k656305K15541L299543J422044k179386k682956k336807
10620b997789m627539n334148O36880P365501M845996l791187n408779J896904
$$ plain form
10612 -7414161 -2009855 -2410300 -6625285 -4869054 2083415 2569168 -5965196 -10761843
10604 -10761843 -3211097 7564964 8713340 1882850 -1915964 788060 3830155 2857953
10596 2857953 403334 284252 2665036 4685470 3275676 -1436282 -4582745 -1657227
10588 -1657227 4289518 5608284 1224383 -1589047 1380430 5406422 5662433 4432683
10580 4432683 4935107 5065548 2727355 948188 1929002 1941570 -1957402 -5718822 -4755306
10571 -4755306 -1355584 206083 947802 3832763 7881630 10868218 13091615 13985813
10563 13985813 10787922 5141430 4187752 9767948 13862508 10859783 6664982 8439941
10555 8439941 12807382 12441838 7712786 3393432 -171507 -4475558 -7225888 -6982950
$$ packed form
10612g414161N404306m00445m214985J756231O952469M85753q534364m796647
10604a0761843P550746J0776061J148376o830490l798814K704024L042095r72202
10596B857953k454619j19082K380784K020434j409794m711958l146463K925518
10588a657227N946745J318766m383901k813430K969477M025992K56011j229750
10580D432683N02424J30441k338193j779167R80814J2568l898972l761420R63516
10571d755306L399722J561667P41719K884961M048867K986588K223397Q94198
10563A3985813l197891n646492r53678N580196M094560l002725m194801J774959
10555H439941M367441l65544m729052m319354l564939m304051k750330K42938
$$ plain form
10547 -6982950 -7483365 -10232224 -9703277 -3289458 1787248 -296232 -3966904 -2272435
10539 -2272435 1568295 1998774 1647416 3985419 4800311 1808787 2649685 10913606 14692255
10530 14692255 3649907 -11995742 -15472680 -8066659 -3161179 -3421479 -1769449 1078233
10522 1078233 -1417596 -6095623 -3998943 3002306 5108167 922435 -3287838 -6046302
10514 -6046302 -8742720 -7599345 -1229960 2003867 -1987720 -2827110 5306793 9147504
10506 9147504 -581031 -8884237 -2361112 3781660 -6932452 -17858029 -7009380 9958673
10498 9958673 5533142 -8798813 -4809439 6323953 -3928159 -18224615 -56355
10491 -56355 26306653 7891398 -19243651 52751967 228614922 351767460 294257492
$$ packed form
10547f982950n00415k748859N28947O413819N076706k083480l670672J694469
10539b272435L840730M30479l51358K338003Q14892k991524Q40898Q263921L778649
10530A4692255j1042348j5645649l476938P406021M905480k60300J652030K847682
10522A078233k495829m678027K096680P001249K105861m185732m210273k758464
10514f046302k696418J143375O369385L233827l991587q39390Q133903L840711
10506I147504r728535q303206O523125O142772j0714112j0925577J0848649J6968053
10498I958673m425531j4331955L989374J1133392j0252112j4296456J8168260
10491e6355K6363008j8415255k7135049P1995618J75862955J23152538n7509968
$$ plain form
10484 294257492 128711557 23554838 25095814 44446544 24018445 2589747 14480448
10477 14480448 27987626 13559338 -4149213 1584480 13024541 7840318 -673207
10470 -673207 4538996 10295419 1368683 -8924728 -4277326 5084835 3616372 -2228078
10462 -2228078 -833672 1668185 -3253286 -7622258 -3375726 331725 -4894480 -8725071
10454 -8725071 -823380 8757886 6892519 494267 3193257 11355137 12215698 6040599
10446 6040599 2708086 4080767 5142048 5697404 7511827 6658271 659500 -3919574
10438 -3919574 -1941863 44646 -5274784 -12830885 -13697495 -8980652 -4674477 -460542
10430 -460542 5717454 9462162 7110095 4197547 6417285 9061295 5836553 1160601
$$ packed form
10484B94257492j65545935j05156719J540976J9350730k0428099k1428698J1890701
10477A4480448J3507178j4428288j7708551N733693J1440061n184223q513525
10470f73207N212203N756423q926736j0293411M647402R362161j468463n844450
10462b228078J394406K501857m921471m368972M246532L707451n226205l830591
10454h725071P901691R581266j865367o398252K698990Q161880Q60561o175099
10446F040599l332513J372681J061281N55356J814423q53556n998771m579074
10438c919574J977711J986509n319430p556101q66610M716843M306175M213935
10430d60542O177996L744708k352067k912548K219738K644010l224742m675952
$$ plain form
10422 1160601 2530401 6819342 5707169 -73797 -3086901 -2105941 -2317727 -5297643
10414 -5297643 -7824419 -8406258 -7522609 -4319843 327418 1473837 -2524135 -5009377
10406 -5009377 -542816 5542851 4992801 -518006 -2738392 689627 5376619 8701600
10398 8701600 11127405 11390820 7895778 3179889 687620 -715896 -3230441 -4163513
10390 -4163513 48894 6508845 9182380 7599254 5991556 5425635 3002235 -1807150
10382 -1807150 -5407768 -4873269 -1098452 2518809 2716307 -738548 -3821205 -2809679
10374 -2809679 -295766 -1700520 -5392663 -3646444 4282637 8655228 3653774 -2915254
10366 -2915254 -1196251 6285796 9800871 6893356 3281739 2472962 2261884 183525
$$ packed form
10422A160601J369800M288941j112173n780966l013104R80960k11786k979916
10414e297643k526776n81839Q83649L202766M647261J146419l997972k485242
10406e009377M466561O085667n50050n510807k220386L428019M686992L324981
10398H701600K425805K63415l495042m715889k492269j403516k514545r33072
10390d163513M212407O459951K673535j583126j607698n65921k423400m809385
10382a807150l600618N34499L774817L617261J97498l454855l082657J011526
10374b809679K513913j404754l692143J746219P929081M372591n001454o569028
10366b915254J719003P482047L515075k907515l611617q08777k11078k078359
$$ plain form
10358 183525 -3421028 -6817883 -7699480 -4726559 -741845 -711131 -4239250 -5404085 -2472652
10349 -2472652 -805252 -2536880 -1676168 4947516 10248069 7720999 2037746 477559
10341 477559 941429 -2065106 -5891896 -4673604 -747919 -422066 -2431142 -1523352 -105109
10332 -105109 -4688211 -12752704 -14927734 -9884353 -5931751 -7136080 -8459094 -6428409
10324 -6428409 -4673840 -5815000 -6380826 -3540487 -95676 820993 596348 1608323 3296233
10315 3296233 4312774 5023121 5910830 6230565 5341532 3375871 734662 -1376094 -1479905
10306 -1479905 -755184 -2312138 -4908421 -2054103 7976527 16172444 13526284 3896878
10298 3896878 -1492613 473867 3117598 1962849 -297750 -727123 -94150 997043
$$ packed form
10358A83525l604553l396855q81597K972921L984714L0714l528119j164835K931433
10349b472652J667400j731628Q60712O623684N300553k527070n683253j560187
10341D77559M63870l006535l826790J218292L925685L25853k009076R07790J418243
10332a05109m583102q064493k175030N043381L952602j204329j323014K030685
10324f428409J754569j141160n65826K840339L444811R16669k24645J011975J687910
10315C296233J016541P10347Q87709L19735q89033j965661k641209k110756j03811
10306a479905P24721j556954k596283K854318J0030630Q195917k646160r629406
10298C896878n389491J966480K643731j154749k260599m29373O32973J091193
$$ plain form
10290 997043 3344537 5679012 5526533 3806777 3638932 5257676 7007501 9580617 13550912
10281 13550912 15031596 10596374 4380847 2868695 4724694 3963859 1080558 1541455
10273 1541455 4558623 3924331 47388 168994 5183949 7303168 3636650 1316762
10265 1316762 4934362 8991488 8225358 6414971 8748955 13081460 15017030 15072006 14780235
10256 14780235 11790322 4955128 -993443 -1678883 645464 2068430 3214210 5275945
10248 5275945 5168011 821227 -3004397 -591058 6149315 10540031 9823158 6112808
10240 6112808 1764440 -1242629 -218805 4945347 9779345 10691820 9575242 9187284
10232 9187284 8035582 4756343 3159323 6386428 9549020 5775459 -2405865 -5637033
$$ packed form
10290I97043K347494K334475j52479j719756j67845J618744J749825K573116L970295
10281A3550912J480684m435222o215527j512152J855999p60835k883301M60897
10273A541455L017168o34292l876943J21606N014955K119219l666518k319888
10265A316762L617600M057126p66130j810387K333984M332505J935570N4976k91771
10256A4780235k989913o835194n948571o85440K324347J422966J145780K061735
10248E275945j07934m346784l825624K413339O740373M390716p16873l710350
10240F112808m348368l007069J023824N164152M833998R12475j116578l87958
10232I187284j151702l279239j597020L227105L162592l773561q181324l231168
$$ plain form
10224 -5637033 -1254801 3405493 2286478 -1773041 -3138473 -1377464 298743 613889
10216 613889 530465 172893 -1277555 -3279586 -3774501 -1693759 1214070 1690031 -1466166
10207 -1466166 -5496941 -6675263 -5173070 -4794098 -7230734 -9398989 -8127867 -4565656
10199 -4565656 -1335498 1902108 6453594 10326261 10325712 7341727 5082843 3898365 614811
10190 614811 -4761523 -7077117 -3221371 2493754 3695404 480603 -1366687 956421
10182 956421 3467761 1679520 -2438433 -2971088 1498497 5650361 4695888 703005 -976181
10173 -976181 639167 1869979 828674 -243709 319375 909267 496401 1256664 4451682
10164 4451682 6957757 5639057 2790204 2914227 5464263 5464721 1234640 -3015893 -3327245
$$ packed form
10224e637033M382232M660294j119015m059519j365432J761009J676207L15146
10216F13889q3424l57572j450448k002031m94915K080742K907829M75961l156197
10207a466166m030775j178322J502193L78972k436636k168255J271122L562211
10199d565656L230158L237606M551486L872667n49k983985k258884j184478l283554
10190F14811n376334k315594L855746N715125J201650l214801j847290K323108
10182I56421K511340j788241m117953n32655M469585M151864r54473l992883j679186
10173i76181J615348J230812j041305j072383N63084N89892m12866P60263L195018
10164D451682K506075j318700k848853J24023K550036M58m230081m250533l11352
$$ plain form
10155 -3327245 -884132 915529 1055113 374645 -911601 -2484732 -2505794 226485 3688149
10146 3688149 4809593 3587129 2416870 1834441 92672 -2669951 -3281801 -207781
10138 -207781 3400627 3602297 506247 -3218566 -6588760 -9805473 -11073425 -8095981
10130 -8095981 -2550805 932639 838207 91983 504285 -83479 -3370843 -7116836 -8544218
10121 -8544218 -7987892 -6524931 -3189390 2179128 6144492 5604390 2527005 1017629
10113 1017629 1365596 889786 -702109 -995511 776700 2974252 4790645 6577700 7135188
10104 7135188 4400569 -729964 -4340249 -3796856 35235 4498340 6751472 4636901
10096 4636901 -1100758 -6200971 -7412420 -6601077 -7161817 -7878836 -4777386 1633299 5790274
$$ packed form
10155c327245K443113J799661J39584o80468j286246j573131k1062K732279L461664
10146C688149J121444j222464j170259n82429j741769k762623o11850L074020
10138b07781L608408K01670l096050l724813l370194l216713j267952K977444
10130h095981N545176L483444r4432p46224M12302n87764l287364l745993j427382
10121h544218N56326J462961L335541N368518L965364n40102l077385j509376
10113A017629L47967m75810j591895k93402J772211K197552J816393J787055N57488
10104G135188k734619n130533l610285N43393L832091M463105K253132k114571
10096D636901n737659n100213j211449Q11343n60740p17019L101450O410685M156975
$$ plain form
10087 5790274 4125410 -1327375 -6548712 -8889062 -7035185 -2113655 990145 -1939893
10079 -1939893 -8142446 -10480472 -6782179 -1765551 816016 2318359 4169091 4585225
10071 4585225 2880467 1876711 3057072 3860651 2650077 1774493 2500413 1515690 -3508127
10062 -3508127 -8744081 -8905476 -4166960 1473528 5925099 9100738 9714553 6283725
10054 6283725 227941 -5129430 -7724941 -7190123 -4284642 -1764019 -3003415 -7366825
10046 -7366825 -9768508 -7351933 -3566378 -2832148 -4423703 -4958692 -3821793 -2454972
10038 -2454972 -1221481 -807115 -3650549 -9574042 -12976667 -9600917 -3741739 -2929552
10030 -2929552 -6989898 -8708251 -5061038 -1289610 -2362934 -5957025 -6648448 -3186091
$$ packed form
10087E790274j664864n452785n221337k340350J853877M921530L103800k930038
10079a939893o202553k338026L698293N016628K581567J502343J850732M16134
10071D585225j704758j003756J180361Q03579j210574q75584P25920r84723n023817
10062c508127n235954j61395M738516N640488M451571L175639O13815l430828
10054F283725o055784n357371k595511N34818K905481K520623j239396m363410
10046g366825k401683K416575L785555P34230j591555n34989J136899J366821
10038b454972J233491M14366k843434n923493l402625L375750N859178Q12187
10030b929552m060346j718353L647213L771428j073324l594091o91423L462357
$$ plain form
10022 -3186091 1311610 3825466 3489314 876023 -2390840 -4047045 -2986341 -569292
10014 -569292 848560 660851 451567 1306059 1485270 -1624318 -6945918 -9409191 -6164935
10005 -6164935 -1039519 425739 -1269762 -1256198 1178974 1520680 -1779130 -4247067 -2957898
9996 -2957898 -1328474 -2721624 -4487026 -2883685 524960 2336974 3211659 4925634
9988 4925634 5060680 741949 -4809455 -5720757 -1978535 1346122 2215164 3072451 4780873
9979 4780873 5054792 3332462 1979277 1822939 962157 -1198746 -2751372 -2839258 -2776761
9970 -2776761 -3006747 -2247160 -98418 2541728 5781556 10411145 15246082 17723194 17149483
9961 17149483 14853791 11672413 7858106 4522977 2457725 771579 -700909 139062
$$ packed form
10022c186091M497701K513856l36152k613291l266863j656205J060704K417049
10014e69292J417852j87709k09284Q54492J79211l109588n321600k463273L244256
10005f164935N125416J465258j695501J3564K435172L41706l299810k467937J289169
9996b957898J629424j393150j765402J603341L408645J812014Q74685J713975
9988D925634J35046m318731n551404r11302L742222L324657Q69042Q57287J708422
9979D780873K73919j722330j353185j56338q60782k160903j552626q7886O2497
9970b776761k29986P59587K148742K640146L239828M629589M834937K477112n73711
9961A7149483k295692l181378l814307l335129k065252j686146j472488Q39971
$$ plain form
9953 139062 3449069 4546416 -108465 -6490363 -8026453 -5049487 -3285226 -4555435
9945 -4555435 -5616780 -5270135 -5540009 -5965462 -3907835 -929852 -1542166 -4665072 -3892900
9936 -3892900 2059234 6814963 6732641 6254331 9342397 12690144 11995015 8977407 7399114
9927 7399114 7162735 6767834 6848482 7091065 4543784 -572052 -2284086 2903510 9637391
9918 9637391 10835897 7216526 4231237 3039607 560361 -3773915 -6954440 -6931985 -4063390
9909 -4063390 503728 4581092 5321391 3073450 2158959 4743046 7434131 7352605 7157267
9900 7157267 9563764 11549127 9769819 7500230 9453352 13173664 12861562 9067470
9892 9067470 7059514 7650003 7354748 6048384 6610659 8351947 8835020 10299994 14444426
$$ packed form
9953A39062L310007J097347m654881o381898j536090K976966J764261j270209
9945d555435j061345L46645k69874m25453K057627K977983o12314l122906P72172
9936c892900N952134M755729q2322m78310L088066L347747o95129l017608j578293
9927G399114k36379l94901Q0648K42583k547281n115836j712034N187596O733881
9918I637391J198506l619371k985289j191630k479246m334276l180525K2455K868595
9909d063390M567118M077364P40299k247941r14491K584087K691085q1526j95338
9900G157267K406497J985363j779308k269589J953122L720312l12102l794092
9892I067470k007956N90489k95255j306364N62275J741288M83073J464974M144432
$$ plain form
9883 14444426 12353223 -7192610 -36756678 -51146117 -36655289 -9060979 6449629
9876 6449629 4841185 163277 1449192 3275207 -293137 -4839746 -3392255 2428261
9868 2428261 4965784 1277585 -3226647 -1741314 5618260 11533558 9629364 1958752
9860 1958752 -3593201 -3273556 -1504599 -3452309 -7309033 -7596269 -3676351 -454597 -1299039
9851 -1299039 -4168135 -4969645 -1908496 3497251 7333399 5764411 -749268 -6379653
9843 -6379653 -6061019 -2002826 -587418 -3310470 -5255117 -3163994 -238249 -702914 -3533546
9834 -3533546 -4707264 -2991830 -295105 1931297 3614725 4547643 4564639 4424276 4452496
9825 4452496 3377621 549623 -2052523 -2460186 -1954793 -2696846 -3352296 -838017 4050764
$$ packed form
9883A4444426k091203j9545833k9564068j4389439J4490828K7594310J5510608
9876F449629j608444m677908J285915J826015l568344m546609J447491N820516
9868B428261K537523l688199m504232J485333P359574N915298j904194p670612
9860A958752n551953L19645J768957j947710l856724k87236L919918L221754q44442
9851a299039k869096q01510L061149N405747L836148j568988o513679n630385
9843f379653L18634M058193J415408k723052j944647K091123K925745m64665k830632
9834c533546j173718J715434K696725K226402J683428R32918J6996j40363K8220
9825D452496j074875k827998k602146m07663N05393p42053o55450K514279M888781
$$ plain form
9816 4050764 6966370 6442393 5680698 6472699 5742858 1059513 -4036398 -4257073 54335
9807 54335 3970610 5261940 6365525 9120892 11545296 10999693 7681360 3710631 892503
9798 892503 276398 1795517 3434053 2904038 1132140 1754380 5791489 9232034 7946955
9789 7946955 3050071 -1003297 -2119054 -1755137 -1580216 -1959731 -3425524 -6653890 -10455748
9780 -10455748 -12205465 -11108291 -9128490 -7866192 -6370791 -3190788 956538 3981323
9772 3981323 4927552 4475189 3654515 3083054 2838897 2168131 -15596 -3412495 -5906062
9763 -5906062 -6080617 -5501464 -6844344 -9884604 -11082086 -7718192 -1167198 4706180 7438466
9754 7438466 7444015 6516976 6131717 6936706 8593887 9627787 8213825 3970757 -959875
$$ packed form
9816D050764K915606n23977p61695P92001p29841m683345n095911k20675M311408
9807E4335L916275J291330J103585K755367K424404n45603l318333l970729k818128
9798H92503o16105J519119J638536n30015j771898O22240M037109L440545j285079
9789G946955m896884m053368j115757L63917J74921l79515j465793l228366l801858
9780a0455748j749717J097174J979801J262298J495401L180003M147326L024785
9772C981323R46229m52363q20674n71461k44157o70766k183727l396899k493567
9763e906062j74555N79153j342880l040260j197482L363894O550994N873378K732286
9754G438466N549r27039l85259Q04989J657181J033900j413962m243068m930632
$$ plain form
9745 -959875 -3135651 -726836 4477558 8223381 7424029 2674638 -3007368 -7312922 -9591039
9736 -9591039 -9437496 -6681073 -3398740 -3277072 -6749189 -8786312 -4860349 1976338 4240355
9727 4240355 598136 -1569204 3313204 10268233 10235360 2897927 -2704673 -492997 5163100
9718 5163100 6552326 3096274 914920 3881973 9088301 11318677 9116891 5284642
9710 5284642 3063746 3222209 4284365 4441532 3060449 916903 -621747 -762070 -23304
9701 -23304 85887 -1524649 -4227349 -6120694 -6031363 -4670775 -3507665 -3147316 -3420998
9692 -3420998 -4253696 -5255003 -5008028 -2444649 973817 2165723 241549 -2026542 -1696653
9683 -1696653 472305 1242648 -435658 -1801081 111416 4594873 8190293 8756349 7059939
$$ packed form
9745i59875k175776K408815N204394L745823p99352m749391n682006m305554k278117
9736i591039J53543K756423L282333J21668l472117k037123L925963O836687K264017
9727D240355l642219k167340M882408O955029l2873p337433n602600K211676N656097
9718E163100J389226l456052k181354K967053N206328K230376k201786l832249
9710E284642k220896J58463J062156J57167j381083k143546j538650j40323P38766
9701b3304J09191j610536k702700j893345Q9331J360588J163110L60349k73682
9692c420998q32698j001307K46975K563379L418466J191906j924174k268091L29889
9683a696653K168958P70343j678306j365423J912497M483457L595420N66056j696410
$$ plain form
9674 7059939 4428867 968155 -2644920 -3605685 -140081 4338441 3794564 -2515558 -7838544
9665 -7838544 -6000724 734479 5032064 4000551 1401073 917025 1696385 1791986 2061256
9656 2061256 3916518 5740728 4826323 1848614 363104 1759004 3213410 1621416
9648 1621416 -2135584 -4368385 -3376332 -1444413 -1624642 -3734185 -4752713 -2687488 1441317
9639 1441317 5464343 8191784 9144436 8016438 5631136 3871170 3191952 1695774 -1620804
9630 -1620804 -4304769 -3426154 102772 2665026 2449830 447875 -1851278 -3006867 -1303841
9621 -1303841 2633946 4251918 419469 -4625099 -4004985 1373519 3484904 -597706
9613 -597706 -4203739 -1939403 1833751 738741 -3052644 -2975381 934159 2910391 1620574
$$ packed form
9674G059939k631072l460712l613075r60765L465604M478522n43877o310122n322986
9665g838544J837820O735203M297585j031513k599478m84048P79360R5601K69270
9656B061256J855262J824210r14405k977709j485510J395900J454406j591994
9648A621416l757000k232801R92053J931919j80229k109543j018528K065225M128805
9639A441317M023026K727441R52652j127998k385302j759966o79218j496178l316578
9630a620804k683965Q78615L528926K562254k15196k001955k299153j155589J703026
9621a303841L937787J617972l832449n044568O20114N378504K111385m082610
9613e97706l606033K264336L773154j095010l791385P7263L909540J976232j289817
$$ plain form
9604 1620574 1743432 5196722 7818902 6483461 3675236 2612363 2685842 2471749 3080347
9595 3080347 5324777 6880897 5639013 3459117 3435780 5339878 6675471 6424044 4679977
9586 4679977 390898 -6677796 -12726148 -13024362 -8530721 -5289587 -6023563 -6369062 -1975572
9577 -1975572 4167514 5491836 1027375 -3662194 -4380584 -2770687 -1956476 -1774756 -655955
9568 -655955 712630 496264 -1294317 -3477727 -5929889 -8693132 -10204282 -9049463 -6532781
9559 -6532781 -5085337 -5101342 -5559039 -6210400 -6487640 -4326217 212073 2304632 -1529659
9550 -1529659 -6156059 -3093153 6827203 13016115 9236798 1554374 -1088281 1734469
9542 1734469 4453613 4534172 3634750 2984508 2670752 3433811 5007404 4681279 1226783
$$ packed form
9604A620574J22858L453290K622180j335441k808225j062873P3479k14093O08598
9595C080347K244430J556120j241884k179896k3337J904098J335593k51427j744067
9586D679977m289079p068694o048352k98214M493641L241134p33976l45499M393490
9577a975572O143086J324322m464461m689569p18390J609897Q14211J81720J118801
9568f55955J368585k16366j790581k183410k452162k763243j511150J154819K516682
9559f532781J447444j6005m57697o51361k77240K161423M538290K092559l834291
9550a529659m626400L062906R920356O188912l779317p682424k642655K822750
9542A734469K719144Q0559q99422o50242l13756P63059J573593l26125l454496
$$ plain form
9533 1226783 -1964500 -1369768 1319032 2142253 910575 344382 1272167 2633469 4254439
9524 4254439 5783622 5091597 1686921 -749189 559558 2700933 2116963 1291357 4567439
9515 4567439 10016122 12117485 10532475 9240699 8660281 6268847 3872713 5715939
9507 5715939 9384698 7533344 -110446 -5356384 -4288042 -2381728 -3672375 -4043539
9499 -4043539 -409347 1984508 -1653420 -6444380 -5161483 314429 2727573 1008563
9491 1008563 350574 2925367 5668916 6223802 4967955 1998615 -2324346 -4652807 -1958777
9482 -1958777 2871025 3971356 849479 -1295717 275702 2594108 2841063 2539446 3823306
9473 3823306 5270486 4041410 93978 -3676885 -4532677 -2462484 -512121 -2076534
$$ packed form
9533A226783l191283N94732K688800Q23221j231678n66193R27785J361302J620970
9524D254439J529183o92025l404676k436110J308747K141375n83970q25606L276082
9515D567439N448683K101363j585010j291776n80418k391434k396134J843226
9507E715939L668759j851354p643790n245938J068342J906314j290647l71164
9499d043539L634192K393855l637928m790960J282897N475912K413144j719010
9491A008563o57989K574793K743549N54886j255847k969340m322961k328461K694030
9482a958777M829802J100331l121877k145196J571419K318406K46955l01617J283860
9473C823306J447180j229076l947432l770863q55792K070193J950363j564413
$$ plain form
9465 -2076534 -6456422 -8285633 -3843384 3187632 5778516 2998273 1179935 4693100
9457 4693100 9842913 10603560 7138365 4751209 5914278 7554832 6677600 5106632 6601620
9448 6601620 11313923 15653781 16917079 15590822 13114402 9993233 7021795 5831771
9440 5831771 6373646 5825819 2305874 -1821091 -2800775 -430899 2377708 3721069 3608248
9431 3608248 2184924 453006 1408272 6331700 10946295 9998312 5023480 2104315 2099038
9422 2099038 -228413 -6019667 -8509843 -3049942 5059750 7627921 4289268 1516559
9414 1516559 3921588 10333503 15892270 15268889 7135449 -2128148 -3513201 3087520
9406 3087520 7734141 4337007 -778084 326452 4555644 4067940 -12910 -159400 3962876
$$ packed form
9465b076534m379888j829211M442249P031016K590884k780243j818338L513165
9457D693100N149813P60647l465195k387156J163069J640554q77232j570968J494988
9448F601620M712303M339858J263298j326257k476420l121169k971438j190024
9440E831771N41875n47827l519945m126965r79684K369876K808607J343361j12821
9431C608248j423324j731918R55266M923428M614595r47983m974832k919165n277
9422B099038k327451n791254k490176N459901Q109692K568171l338653k772709
9414A516559K405029O411915N558767o23381q133440r263597j385053O600721
9406C087520M646621l397134n115091J104536M229192m87704m080850j46490M122276
$$ plain form
9397 3962876 4896700 279293 -3341622 -1393194 2214307 2298184 -488712 -2843921 -3772064
9388 -3772064 -3364463 -961853 2616237 4232191 2108639 -1779058 -3929320 -2119343
9380 -2119343 3385027 8933043 9455678 4823536 1928417 5647644 10426071 7521058
9372 7521058 -1384854 -6147747 -3304201 -39551 -1537569 -3771972 -2582363 -1349984
9364 -1349984 -4066670 -7417082 -5974919 -687161 3357771 4128716 3026677 1249990
9356 1249990 -232809 -51940 958591 -291776 -3954029 -5902366 -4194755 -2216945
9348 -2216945 -2409828 -2201599 22527 635348 -2608411 -5198447 -3042543 56760 -1152499
9339 -1152499 -3994228 -2615757 1539646 2545723 950521 2860917 8617889 11193816
$$ packed form
9397C962876R33824m617407l620915J948428L607501Q3877k786896k355209r28143
9388c772064M07601K402610L578090J615954k123552l887697k150262J809977
9380b119343N504370N548016N22635m632142k895119L719227M778427k905013
9372G521058q905912m762893K843546L264650j498018k234403J189609J232379
9364a349984k716686l350412J442163N287758M044932P70945j102039j776687
9356A249990j482799J80869J010531j250367l662253j948337J707611J977810
9348b216945j92883K08229K224126O12821l243759k590036K155904L099303j209259
9339a152499k841729J378471M155403J006077j595202J910396N756972K575927
$$ plain form
9331 11193816 7125971 1429502 -530750 329167 792259 578453 904830 1927450 3769303
9322 3769303 6646616 8612140 6821367 2351657 136191 2636079 6725364 7973023
9314 7973023 5055327 -613739 -6231914 -8121203 -4671374 550770 2402214 1250632
9306 1250632 2006912 5556913 6784072 3138054 -517165 812593 4821882 6070629
9298 6070629 3919084 1691176 676456 -213004 -537051 1183582 3684190 3692772 518527
9289 518527 -3107792 -4741124 -4314280 -2861399 -1497589 -1314716 -2187520 -2257789 -637683
9280 -637683 338542 -1975455 -6262287 -8642441 -7683279 -5098117 -2116188 1348143 4056064
9271 4056064 3862043 1437110 -146041 -491172 -2420495 -5755448 -5255724 1653195 8983672
$$ packed form
9331A1193816m067845n696469j960252Q59917M63092k13806L26377J022620J841853
9322C769303K877313J965524j790773m469710k215466K499888M089285J247659
9314G973023k917696n669066n618175j889289L449829N222144J851444j151582
9306A250632P56280L550001J227159l646018l655219J329758M009289J248747
9298F070629k151545k227908j014720q89460l24047J720633K500608Q582l174245
9289E18527l626319j633332M26844J452881J363810J82873q72804p0269J620106
9280f37683R76225k313997m286832k380154R59162K585162K981929L464331K707921
9271D056064j94021k424933j583151l45131j929323l334953M99724O908919P330477
$$ plain form
9262 8983672 9072344 3138300 -502812 2122180 6711057 8692328 9346902 11517537 14011922
9253 14011922 14021117 11946813 9921433 7619031 3400818 -1631268 -4425172 -4302553 -3356988
9244 -3356988 -2978768 -2966477 -3594217 -5220918 -5900391 -2849614 3154076 7972378 9333730
9235 9333730 8793251 7910950 6115213 3674583 3050815 5073208 6998535 6926907 7040540
9226 7040540 9264992 10582625 6968334 385033 -2804175 -334982 3068151 2116126
9218 2116126 -2938216 -7858941 -9557713 -8047315 -4939874 -1738784 894802 3159048
9210 3159048 5280216 6549718 5778397 2918013 -318762 -1782905 -706695 1736614
9202 1736614 3523020 3553128 2364846 933342 -721227 -2874289 -4541850 -4192286 -2225935
$$ packed form
9262H983672Q8672n934044l641112K624992M588877J981271O54574K170635K494385
9253A4011922R195k074304k025380k302402m218213n032086k793904J22619R45565
9244c356988L78220J2291o27740j626701o79473L050777O003690M818302J361352
9235I333730n40479q82301j795737k440630o23768K022393J925327p1628J13633
9226G040540K224452J317633l614291o583301l189208K469193L403133r52025
9218B116126n054342m920725j698772J510398L107441L201090K633586K264246
9210C159048K121168J269502p71321k860384l236775j464143J076210K443309
9202A736614J786406L0108j188282j431504j654569k153062j667561L49564J966351
$$ plain form
9193 -2225935 -1186019 -2861736 -6252080 -8658126 -7694915 -2606203 4410223 8423104
9185 8423104 6168446 760037 -1042242 2682972 6490632 5135739 309539 -2605646
9177 -2605646 -1508480 1606697 4271302 4893205 2661829 -828112 -1862624 582227
9169 582227 2638175 1270278 -627325 1062545 4619610 5345508 3582079 3936252 7146185
9160 7146185 8715767 6227690 2615271 915738 441275 -421427 -1705148 -3374980 -5462406
9151 -5462406 -5789946 -1778941 4392274 6881381 3884223 -160542 -1563478 -1675984 -2096820
9142 -2096820 -1001061 2217308 3552491 383540 -2854451 -291890 6470291 10341892
9134 10341892 8388334 4581074 3195883 3858958 3867413 2127913 -371326 -2074609 -2103246
$$ packed form
9193b225935J039916j675717l390344k406046R63211N088712P016426M012881
9185H423104k254658n408409j802279L725214L807660j354893m826200k915185
9177b605646J097166L115177K664605O21903k231376l489941j034512K444851
9169E82227K055948j367897j897603J689870L557065P25898j763429L54173L209933
9160G146185J569582k488077l612419j699533m74463q62702j283721j669832k087426
9151e462406l27540M011005O171215K489107k997158m044765j402936j12506m20836
9142b096820J095759L218369J335183l168951l237991K562561O762181L871601
9134A0341892j953558l807260j385191O63075Q455j739500k499239j703283k8637
$$ plain form
9125 -2103246 -962263 113558 1023574 2714356 4363969 2927535 -2362615 -7081803
9117 -7081803 -6225130 -542400 4804532 7090395 8157417 9782505 10391174 7652433 2147969
9108 2147969 -2924941 -4668685 -2580906 1171787 3174064 1415261 -2989644 -6974211
9100 -6974211 -8106818 -5800896 -1193206 3032707 3801355 340948 -4710330 -8161279
9092 -8161279 -9486216 -9858716 -9289507 -7155895 -4901369 -5179479 -7826046 -9384841 -7835361
9083 -7835361 -5561896 -5900656 -8403185 -9729696 -8431156 -6474839 -5854420 -5822157 -4563510
9074 -4563510 -2114723 2447 1223194 2114088 2382400 971893 -1350609 -1918392 -45557
9065 -45557 1307484 -117982 -2012907 -1055993 1361486 1078341 -1803020 -2544309 793601
$$ packed form
9125b103246J140983J075821R10016J690782J649613j436434n290150m719188
9117g081803Q56673N682730N346932K285863J067022J625088O08669k738741n504464
9108B147969n072910j743744K087779L752693K002277j758803m404905l984567
9100f974211j132607K305922M607690M225913P68648l460407n051278l450949
9092h161279j324937l72500N69209K133612K254526k78110k646567j558795J549480
9083g835361K273465l38760k502529j326511J298540J956317O20419L2263J258647
9074d563510K448787K117170J220747Q90894K68312j410507k322502n67783J872835
9065d5557J353041j425466j894925R56914K417479k83145k881361p41289L337910
$$ plain form
9056 793601 4155927 3717057 1242803 441173 1359651 1797467 1626951 1939363 1749715
9047 1749715 -521327 -3250535 -2968125 757385 4832294 6847749 6996170 5943811 3654863
9038 3654863 750053 -1242409 -1512834 -323499 2059662 5060206 6840036 5714208
9030 5714208 2427376 -610956 -1851669 -830778 2665448 6974988 7511384 1356849
9022 1356849 -7206247 -9950309 -4604045 2030177 2370884 -3612714 -10014944 -11943030
9014 -11943030 -8724400 -2786491 2075120 3087220 1475623 1666325 5732148 10433071
9006 10433071 11735392 10077746 8412260 7088464 4444049 1362520 968580 3522670
8998 3522670 5456614 4579081 2976992 3204682 4462527 4642945 3934209 3998675 5059868
$$ packed form
9056G93601L362326m38870k474254q01630R18478M37816j70516L12412j89648
9047A749715k271042k729208K82410L725510M074909K015455J48421j052359k288948
9038C654863k904810j992462k70425J189335K383161L000544J779830j125828
9030E714208l286832l038332j240713J020891L496226M309540N36396o154535
9022A356849q563096k744062N346264O634222L40707n983598o402230j928086
9014a1943030L218630N937909M861611J012100j611597J90702M065823M700923
9006A0433071J302321j657646j665486j323796k644415l081529l93940K554090
8998C522670J933944q77533j602089K27690J257845J80418p08736O4466J061193
$$ plain form
8989 5059868 6090440 6834470 7520000 7510997 6505524 6292235 8659465 11756224 11384078
8980 11384078 6561067 1271285 -533950 459520 951000 -113721 -975288 -573660 -219909
8971 -219909 -1258792 -2669624 -2230161 308025 2435028 2053848 696634 1659524 4520286
8962 4520286 4262732 -1706935 -8006681 -7023011 655776 6772153 6993370 6008678 8417987
8953 8417987 10709332 7673267 2141913 1208952 5137168 7516979 5789670 4014321
8945 4014321 4245768 2736575 -2411203 -6469072 -5299739 -2183549 -2449258 -5196243 -5773894
8936 -5773894 -3821645 -3110923 -4547820 -4813131 -2269070 357336 372209 -1324261 -2601012
8927 -2601012 -3265622 -3972162 -3890147 -1739891 1575944 3480870 3118608 2465295 2936589
$$ packed form
8989E059868J030572P44030O85530r003j005473k13289K367230L096759l72146
8980A1384078m823011n289782j805235R93470M91480j064721q61567M01628L53751
8971b19909j038883j410832M39463K538186K127003l81180j357214R62890K860762
8962D520286k57554n969667o299746R83670P678787O116377K21217r84692K409309
8953H417987K291345l036065n531354r32961L928216K379811j727309j775349
8945D014321K31447j509193n147778m057869J169333L116190k65709k746985n77651
8936e773894J952249P10722j436897k65311K544061K626406J4873j696470j276751
8927b601012o64610p06540Q2015K150256L315835J904926l62262o53313M71294
$$ plain form
8918 2936589 2437488 -1689826 -7287310 -8692291 -4847519 -2083392 -5313692 -9959182
8910 -9959182 -8154755 -937937 2728709 -800720 -4963642 -3621526 295471 951519
8902 951519 -1262103 -2298043 -2296121 -4872305 -10405950 -15145088 -16251300 -13938050 -9506516
8893 -9506516 -4630982 -1709398 -1884834 -3358971 -3742483 -2735146 -847650 2032857 4663040
8884 4663040 4190896 802949 -683689 2582057 6649437 6657090 4182615 3817104 5494690
8875 5494690 5796150 4357758 3162225 1704265 -1029748 -1948230 2038186 7134337 7217954
8866 7217954 3835488 3587591 6479326 6072982 1579997 -271857 2337642 2253033 -4005819
8857 -4005819 -9117324 -6679720 -1745373 -2034830 -5389349 -4676202 -327941 1319915 -490376
$$ packed form
8918B936589m99101m127314n597484j404981L844772K764127l230300m645490
8910i959182J804427P216818L666646l529429m162922J342116L916997O56048
8902I51519k213622j035940J922k576184n533645m739138j106212K313250M431534
8893i506516M875534K921584j75436j474137l83512J007337J887496K880507K630183
8884D663040m72144l387947j486638L265746M067380P653k474475l65511J677586
8875E494690L01460j438392j195533j457960k734013r18482L986416N096151Q3617
8866G217954l382466k47897K891735m06344m492985j851854K609499q4609o258852
8857d005819n111505K437604M934347k89457l354519P13147M348261J647856j810291
$$ plain form
8848 -490376 -292111 3316778 4976870 1405389 -3617343 -5148188 -3096117 -289877 1704032
8839 1704032 2781393 2935932 2391977 1547164 92526 -2409076 -5043110 -6245153 -5828185
8830 -5828185 -4753211 -3362036 -1606195 -402079 -608349 -987804 645166 4317094 7896769
8821 7896769 10094291 11415144 12067718 11140381 8551830 5994546 4822904 4182353 2467813
8812 2467813 57010 -789108 841780 2385808 344477 -4916950 -8646165 -7232306
8804 -7232306 -2730761 199475 538203 1001714 2567914 2885628 832650 -1297918 -1848066
8795 -1848066 -2381182 -3869027 -3781516 -329902 3114871 1876523 -3278355 -7108657 -6789176
8786 -6789176 -4193116 -1707054 478300 2408584 3019993 2059990 1144426 1725444 3498988
$$ packed form
8848d90376J98265L608889J660092l571481n022732j530845K052071K806240J993909
8839A704032J077361J54539n43955q44813j454638k501602k634034j202043M16968
8830e828185J074974J391175J755841J204116k06270l79455J632970L671928L579675
8821G896769K197522J320853O52574r27337k588551k557284j171642o40551j714540
8812B467813k410803q46118J630888J544028k041331n261427l729215J413859
8804g232306M501545K930236L38728M63511J566200L17714k052978k130568n50148
8795a848066n33116j487845Q7511L451614L444773j238348n154878l830302L19481
8786f789176K596060K486062K185354J930284O11409r60003r15564N81018J773544
$$ plain form
8777 3498988 5374392 6341480 5013963 670261 -4027147 -3779258 3246175 11292499 12331374
8768 12331374 5872531 185982 1881958 7223992 7461153 1030248 -4754428 -4453890
8760 -4453890 -1071998 676848 1817828 4743882 6147093 1673970 -4817018 -4967810
8752 -4967810 1260649 4861264 1651571 -1332116 2752693 9840961 11324974 6090974
8744 6090974 215051 -1951712 -797846 1921570 4183653 3177990 -1559972 -5791518
8736 -5791518 -5339564 -1651909 1063643 1997081 2673023 2079875 -1683468 -6181004 -6689285
8727 -6689285 -3198710 -232363 307266 984099 3105110 4363212 3509033 2687469 3225985
8718 3225985 3105381 808691 -1640340 -1705596 350625 3216186 6937908 11164742 13060293
$$ packed form
8777C498988J875404R67088j327517m343702m697408K47889P025433Q046324J038875
8768A2331374o458843n686549J695976N342034K37161o430905n784676L00538
8760d453890L381892J748846J140980K926054J403211m473123o490988j50792
8752d967810O228459L600615l209693k983687M084809P088268J484013n234000
8744F090974n875923k166763J153866K719416K262083j005663m737962m231546
8736e791518M51954L687655K715552R33438O75942n93148l763343m497536n08281
8727f689285L490575K966347N39629O76833K121011J258102q54179q21564N38516
8718C225985j20604k296690k449031o5256K056221K865561L721722M226834J895551
$$ plain form
8709 13060293 9809269 2533132 -4261641 -6924407 -5194733 -936673 4274964 9732072
8701 9732072 14278295 15744198 13092135 8798207 6959081 8298684 9187845 6818988
8693 6818988 2996464 961036 866270 938415 986989 1775769 2656771 2901960 3696559 5560346
8683 5560346 5634936 1448874 -4080370 -5694660 -2901144 196508 1243801 1224896 468334
8674 468334 -1719340 -3435387 -1556668 2579135 4076459 2091156 1165828 3330995 4407022
8665 4407022 930703 -4172989 -6338947 -5774171 -5412999 -5641567 -4802782 -2782360 -996221
8656 -996221 -440449 -1677769 -4478395 -6011625 -2810162 3389367 5795766 1623198 -3103206
8647 -3103206 -1924020 2746112 4041761 1291137 -334951 710784 491373 -2203708
$$ packed form
8709A3060293l251024p276137o794773k662766J729674M258060N211637N457108
8701I732072M546223J465903k652063m293928j839126J339603Q89161k368857
8693F818988l822524k035428r4766P2145M8574P88780Q81002K45189P94599J863787
8683E560346P4590m186062n529244j614290K793516L097652J047293j8905p56562
8674D68334k187674j716047J878719M135803J497324j985303r25328K165167J076027
8665D407022l476319n103692k165958N64776L61172k28568Q38785K020422J786139
8656i96221N55772j237320k800626j533230L201463O199529K406399m172568m726404
8647c103206J179186M670132J295649k750624j626088J045735k19411k695081
$$ plain form
8639 -2203708 -2729220 1588652 6006191 4790737 -585008 -4074101 -3639713 -2620875 -3311713
8630 -3311713 -3791546 -2160349 -128377 -28657 -826517 -196250 883010 -691593 -4506113
8621 -4506113 -6155481 -3780204 -1383064 -2986048 -6619344 -7826016 -6678703 -6509763
8613 -6509763 -7038372 -4524803 803956 3288931 30166 -4325350 -4242500 -901921 680902
8604 680902 -781897 -2506213 -3164912 -4360961 -6845856 -8871821 -8859316 -7248093 -5247626
8595 -5247626 -3637398 -3091978 -4020509 -5609006 -6093966 -4287938 -397753 4166171 7143660
8586 7143660 6544294 2763434 -834379 -743837 3106839 7124930 7374751 3227910 -1709489
8577 -1709489 -2677708 979679 4073927 1194666 -5976644 -9919648 -6795469 -1503092
$$ packed form
8639b203708n25512M317872M417539j215454n375745l489093M34388J018838o90838
8630c311713m79833J631197K031972R9720p97860O30267J079260j574603l814520
8621d506113j649368K375277K397140j602984l633296j206672J147313J68940
8613f509763n28609K513569N328759K484975l258765m355516Q2850L340579J582823
8604F80902j462799j724316o58699j196049k484895k025965J2505J611223K000467
8595e247626J610228N45420r28531j588497m84960J806028L890185M563924K977489
8586G143660n99366l780860l597813R0542L850676M018091K49821m146841m937399
8577a709489r68219L657387L094248k879261p171310l943004L124179N292377
$$ plain form
8569 -1503092 -1016546 -5384727 -8571286 -6684584 -1912448 1422528 1808616 990688 1256547
8560 1256547 2893165 3759717 1715812 -2227096 -4492114 -3428747 -1461856 -1507863 -3229883
8551 -3229883 -4585765 -4934240 -4284215 -1771163 1866800 2358796 -3167950 -10345954 -11667669
8542 -11667669 -6768852 -3503896 -6965603 -12240857 -11618997 -5489679 -1267856 -2815148
8534 -2815148 -5789700 -4384023 989718 4930111 3979571 -57727 -3061712 -2759658 205851
8525 205851 3545663 4771114 2718709 -946616 -2410421 596679 5895345 8869216
8517 8869216 7241875 2645391 -2099030 -5262224 -5753922 -3015646 1323118 3644311
8509 3644311 1977271 -1669215 -3928041 -3823217 -2572051 -1048383 686956 2249941
$$ packed form
8569a503092M86546m368181l186559J886702M772136L334976L86088q17928K65859
8560A256547J636618Q66552k043905l942908k265018J063367J966891m6007j722020
8551c229883j355882l48475O50025K513052L637963M91996n526746p178004j321715
8542a1667669M898817L264956l461707n275254O21860O129318M221823j547292
8534b815148k974552J405677N373741L940393r50540m037298l003985L02054K965509
8525B05851L339812J225451k052405l665325j463805L007100N298666K973871
8517H869216j627341m596484m744421l163194m91698K738276M338764K321193
8509C644311j667040l646486k258826J04824J251166J523668J735339J562985
$$ plain form
8501 2249941 3249642 4241837 5725813 6653435 5497196 2371517 -1380786 -5092795 -8448356
8492 -8448356 -9725361 -6721741 -28978 6353590 8710742 7145605 4874016 4608808
8484 4608808 6091859 6878207 5261903 2317873 743038 1737817 3815785 4894452 4465085
8475 4465085 3138198 1365023 -203468 -148148 2242944 5181913 5444174 1523114 -4741215
8466 -4741215 -9523446 -9869677 -6054510 -1655795 -459435 -2644739 -4786453 -4022828 -1050972
8457 -1050972 1567678 2559841 2307504 1383186 154700 -774294 -628287 1418679 5897793
8448 5897793 11290533 13222343 8659688 1475936 -204021 5750233 11899541 11110252
8440 11110252 6090360 4361514 6882213 7965977 5317158 3452252 6126420 10927665
$$ packed form
8501B249941R99701R92195J483976R27622j156239l125679l752303l712009l355561
8492h448356j277005L003620O692763O382568K357152j565137k271589k65208
8484D608808J483051P86348j616304k944030j574835R94779K077968J078667m29367
8475D465085j326887j773175j568491N5320K391092K938969K62261l921060o264329
8466d741215m782231l46231L815167M398715J196360k185304k141714P63625K971856
8457a050972K618650R92163k52337r24318j228486r28994J46007K046966M479114
8448E897793N392740J931810m562655p183752j679957N954254O149308p89289
8440A1110252n019892j728846K520699J083764k648819j864906K674168M801245
$$ plain form
8432 10927665 13397517 12230131 8496673 3675252 466769 1654771 5594336 6395466
8424 6395466 1617977 -3427256 -2702678 1837293 2926911 -1968422 -7782876 -8929429
8416 -8929429 -5128604 659131 6220934 9812875 8886596 2685396 -4711756 -7344413
8408 -7344413 -4187060 -543280 -1230237 -4615584 -5910921 -4621842 -4629502 -6805869 -6356760
8399 -6356760 -179469 6828289 7145633 627497 -5343892 -5437217 -1909754 218757 -287535
8390 -287535 -1171633 -967781 -563223 -1391847 -3508954 -5101579 -3728203 867531 5175085
8381 5175085 4862960 -188122 -5387464 -6610318 -4402066 -2339181 -2665004 -4521246 -5481237
8372 -5481237 -3928187 -435150 2805137 4219213 4194008 3678568 2558064 778213 -213491
$$ packed form
8432A0927665K469852j167386l733458m821421l208483J188002L939565Q01130
8424F395466m777489n045233P24578M539971J089618m895333n814454j146553
8416h929429L800825N787735N561803L591941r26279o201200p397152k632657
8408g344413L157353L643780o86957l385347j295337J289079p660k176367M49109
8399f356760O177291P007758L17344o518136n971389r3325L527463K128511n06292
8390b87535q84098K03852M04558q28624k117107j592625J373376M595734M307554
8381E175085l12125n051082n199342j222854K208252K062885l25823j856242r59991
8372e481237J553050L493037L240287J414076k5205n15440j120504j779851r91704
$$ plain form
8363 -213491 580271 1325595 -129241 -1927663 -20216 5317390 8593801 6216943 1222770
8354 1222770 -1198758 -228906 1026762 571003 -651196 -1163508 -983421 -1079234 -1698549
8345 -1698549 -1430798 1488382 6048971 7940039 4646867 170234 912930 6706028 10239823
8336 10239823 6721923 -302486 -5061660 -7078919 -8914331 -10010685 -7736087 -2924399
8328 -2924399 195949 -642101 -3718273 -6376744 -7420984 -6829583 -5455395 -4724303 -4897750
8319 -4897750 -4394815 -2295547 -52761 991708 1867801 3608715 4762675 3904313 2544600
8310 2544600 2694982 3780319 5024409 7999389 12681511 14060948 8395968 677438
8302 677438 -813866 3655358 6087188 3297969 600073 1393479 1560274 -1865492 -4189389
$$ packed form
8363b13491P93762P45324j454836j798422J907447N337606L276411k376858m994173
8354A222770k421528R69852J255668m55759j222199n12312J80087r5813o19315
8345a698549K67751K919180M560589J891068l293172m476633P42696N793098L533795
8336A0239823l517900p024409m759174k017259j835412j096354K274598M811688
8328b924399L120348q38050l076172k658471j044240N91401J374188P31092j73447
8319d897750N02935K099268K242786J044469Q76093J740914J153960q58362j359713
8310B544600J50382J085337J244090K974980M682122J379437n664980p718530
8302F77438j491304M469224K431830k789219k697896P93406J66795l425766k323897
$$ plain form
8293 -4189389 -1184086 2372836 -394271 -6947342 -8424031 -2393573 4722136 7629707
8285 7629707 7847656 8313449 8133066 5279422 702108 -2821242 -3693792 -1822930 1966143
8276 1966143 5528425 6304106 3978483 952149 -672947 -1325988 -2602012 -4959488 -7430537
8267 -7430537 -8717639 -8307982 -7203712 -7108102 -7798224 -6284546 -618596 6189734 8794568
8258 8794568 6062254 2244446 1251182 2651099 4156696 4988488 5174525 4176836 2171195
8249 2171195 547524 -556175 -2794498 -5801644 -5803846 -1010148 4324304 5170933 3005840
8240 3005840 3115264 5905567 6474989 3010955 -271777 -381024 -201937 -2648919 -4936302
8231 -4936302 -3212459 659731 2231704 1952974 3611390 6392323 4997407 -1382547
$$ packed form
8293d189389L005303L556922k767107o553071j476689O030458P115709K907571
8285G629707K17949M65793j80383k853644m577314l523350q72550J870862L789073
8276A966143L562282P75681k325623l026334j625096o53041j276024k357476k471049
8267g430537j287102M09657J104270R5610o90122J513678N665950O808330K604834
8258H794568k732314l817808r93264J399917J505597Q31792J86037r97689k005641
8249B171195j623671j103699k238323l007146k202M793698N334452Q46629k165093
8240C005840J09424K790303N69422l464034l282732j09247J79087k446982k287383
8231d936302J723843L872190J571973k78730J658416K780933j394916o379954
$$ plain form
8223 -1382547 -6226304 -4415831 941219 3722576 2998078 2189870 2994714 4462223 6232577
8214 6232577 8315660 8727050 5694389 1827475 1788324 5542987 8126091 6959906 5229924
8205 5229924 6366336 9108345 10513250 10605527 11131735 12206993 13040445 13781330 13862049
8196 13862049 10878502 4448771 -978657 -1095533 2106937 3292529 1446290 -223003
8188 -223003 -1023288 -3527944 -7155929 -7232741 -2662671 1006668 -475577 -3665650 -2903098
8179 -2903098 1585091 5338616 6373899 5791268 4175970 2019571 1752777 4609554 7010079
8170 7010079 4937611 702454 194334 4144001 7520603 7434911 6094522 5584016 5401231
8161 5401231 5913741 8210407 9261463 4008598 -5213872 -8504662 -1940924 5370313
$$ packed form
8223a382547m843757J810473N357050K781357p24498q08208Q04844J467509J770354
8214F232577K083083M11390l032661l866914l9151L754663K583104j166185j729982
8205E229924J136412K742009J404905R2277N26208J075258Q33452P40885Q0719
8196A3862049k983547o429731n427428j16876L202470J185592j846239j669293
8188b23003q00285k504656l627985p6812M570070L669339j482245l190073P62552
8179b903098M488189L753525J035283n82631j615298k156399k66794K856777K400525
8170G010079k072468m235157n08120L949667L376602q5692j340389n10506j82785
8161E401231N12510K296666J051056n252865r222470l290790O563738P311237
$$ plain form
8153 5370313 3704575 -3501295 -5605353 -270243 5337216 6540202 5668468 4947457 3211853
8144 3211853 1112711 2253949 6620879 9007152 6784026 3753870 3344301 3485397 2078366
8135 2078366 2308719 7239367 12947396 13013549 7730408 3084124 1582581 -155090 -4284736
8126 -4284736 -7586271 -6518365 -2669202 -465188 -1543245 -3785550 -4842828 -4585179
8118 -4585179 -4289553 -4796499 -5851734 -6791029 -7412738 -7789930 -7313778 -4944843 -1115752
8109 -1115752 1708378 1881842 1339375 3415426 7754228 9734443 6289204 489690 -1883379
8100 -1883379 440876 2961141 1627685 -2230555 -4636542 -4441168 -3425832 -2114868
8092 -2114868 985427 5513950 8010285 6328354 2779742 785092 634391 969813 2039355
$$ packed form
8153E370313j665738p205870k104058N335110N607459J202986q71734p21011j735604
8144C211853k099142J141238M366930K386273k223126l030156m09569J41096j407031
8135B078366K30353M930648N708029O6153n283141m646284j501543j737671m129646
8126d284736l301535J067906L849163K204014j078057k242305j057278K57649
8118d585179K95626n06946j055235r39295o21709l77192M76152K368935L829091
8109a115752K824130J73464n42467K076051M338802J980215l445239n799514k373069
8100a883379K324255K520265j333456l858240k405987J95374J015336J310964
8092b114868L100295M528523K496335j681931l548612j994650j50701L35422J069542
$$ plain form
8083 2039355 4058022 4473305 1455040 -1165342 1965723 8621551 10375313 4910072
8075 4910072 345780 3145460 7670367 4504929 -4529777 -7965978 -905254 8178138
8067 8178138 9264392 3347881 -895627 888337 4827460 5499405 2372283 -960055
8059 -960055 -1517071 299584 1934800 1850898 1004993 967153 1420119 854906 -649228 -1276236
8049 -1276236 -451801 8120 -1271042 -2921578 -2799950 -1045008 463109 1011244 1761103
8040 1761103 3602574 5571408 5782967 3408311 -429727 -3531744 -4495951 -3743318 -2403734
8031 -2403734 -586938 2113956 4421834 3482028 -1618913 -7562329 -9632330 -6620463
8023 -6620463 -1824092 674776 -153584 -1957372 -1643133 1586641 5220509 5682921 2169850
$$ packed form
8083B039355K018667M15283l018265k620382L131065O655828J753762n465241
8075D910072m564292K799680M524907l165438r034706l436201P060724R083392
8067H178138J086254n916511m243508J783964L939123O71945l127122l332338
8059i60055n57016J816655J635216q3902q45905l7840M52966n65213j504134o27008
8049a276236Q24435M59921j279162j650536J21628J754942J508117N48135P49859
8040A761103J841471J968834K11559k374656l838038l102017r64207P52633J339584
8031b403734J816796K700894K307878r39806n100941n943416k070001L011867
8023f620463M796371K498868q28360j803788L14239L229774L633868M62412l513071
$$ plain form
8014 2169850 -2097982 -3087770 -96750 3805947 4894506 1819135 -3467718 -6790258
8006 -6790258 -4809058 1405366 6506347 6193271 1742227 -2554705 -5365114 -8642713
7998 -8642713 -12267378 -12499020 -7559972 -1365725 1257058 823191 1347035 3707580 4695527
7989 4695527 2582709 -38772 -268254 879399 180043 -3194369 -6474184 -6276388 -1792844
7980 -1792844 4678478 9558298 10425657 7468881 3244745 1049571 2594290 6238298
7972 6238298 8043837 6119246 3527308 4535591 8004141 8043072 2546319 -3051449 -3477999
7963 -3477999 -1015419 -610531 -1253030 1210943 4902296 3672714 -1925389 -4038059 -148307
7954 -148307 2117765 -2767766 -8902743 -8325360 -3436749 -2007376 -4135033 -3330441 1291698
$$ packed form
8014B169850m267832r89788K991020L902697J088559l075371n286853l322540
8006f790258J981200O214424N100981l13076m451044m296932k810409l277599
7998h642713l624665k31642M939048O194247K622783m33867N23844K360545R87947
7989D695527k112818k621481k29482J147653o99356l374412l279815J97796M483544
7980a792844O471322M879820Q67359k956776m224136k195174J544719L644008
7972F238298J805539j924591k591938J008283L468550L8931n496753n597768m26550
7963c477999K462580M04888o42499K463973L691353j229582n598103k112670L889752
7954a48307K266072m885531o134977N77383M888611J429373k127657Q04592M622139
$$ plain form
7945 1291698 3199276 -528831 -4548717 -4046203 -1606162 -1923266 -4517009 -5389228 -2877532
7936 -2877532 1101979 3657667 2932034 -630835 -3891528 -3791635 -1087690 817502 788097
7927 788097 858116 2119425 3046774 2430956 639723 -2487202 -7214044 -10700961 -8577172
7918 -8577172 -1324992 4931879 5912852 3637532 1622399 107890 -1143020 244436
7910 244436 5382644 10279193 10150641 5609338 1003804 -1498070 -2728592 -3170930 -2304925
7901 -2304925 -270991 2415722 5471204 7225320 4979616 -328556 -2918255 480955
7893 480955 4783807 2876033 -4070576 -7889796 -4222487 3129383 8524370 10062150
7885 10062150 8209634 3800050 -820560 -2487048 -1076718 60724 -1094629 -2691331
$$ packed form
7945A291698J907578l728107m019886N02514K440041l17104k593743q72219K511696
7936b877532L979511K555688p25633l562869l260693R9893K703945J905192k9405
7927G88097P0019J261309R27349o15818j791233l126925m726842l486917K123789
7918h577172P252180O256871R80973k275320k015133j514509j250910J387456
7910B44436N138208M896549j28552m541303m605534k501874j230522m42338Q66005
7901b304925K033934K686713L055482J754116k245704n308172k589699L399210
7893D80955M302852j907774o946609l819220L667309P351870N394987J537780
7885A0062150j852516m409584m620610j666488J410330J137442j155353j596702
$$ plain form
7877 -2691331 -2486709 -1058442 12867 627556 1021521 224810 -2399430 -5493396 -7131407
$$ packed form
7877b691331K04622J428267J071309O14689L93965p96711k624240l093966j638011
$$ [...]
##END NTUPLES=NMR SPECTRUM
##END=
