##TITLE=31Pdec_SR147_k
 CDCl3, 124 sc
 26.10.2022
##JCAMPDX= 6.0         $$ Bruker NMR JCAMP-DX V2.0
##DATA TYPE= NMR SPECTRUM
##DATA CLASS= NTUPLES
##ORIGIN= UXNMR, Bruker Analytische Messtechnik GmbH
##OWNER= root
$$ XWIN-NMR		Version 3.5
$$ Wed Oct 26 16:47:18 2022 Russian Standard Time (UT+4h)  she@DPX200
##.OBSERVE FREQUENCY= 81.013821
##.OBSERVE NUCLEUS= ^31P
##.ACQUISITION MODE= SIMULTANEOUS
##.ACQUISITION SCHEME= undefined
##.AVERAGES= 24
##.DIGITISER RES= 16
##SPECTROMETER/DATA SYSTEM= spect
##.PULSE SEQUENCE= zgpg30
##.SOLVENT NAME= D2O
##.SHIFT REFERENCE= (INTERNAL, D2O, 0, 248.564)
##AUDIT TRAIL= $$ (NUMBER, WHEN, WHO, WHERE, WHAT)
$$ ##TITLE= Audit trail, XWIN-NMR		Version 3.5
$$ ##JCAMPDX= 5.01
$$ ##ORIGIN= Bruker BioSpin GmbH
$$ ##OWNER= she
$$ F:/spectra/data/she/nmr/P31/1/pdata/1/auditp.txt
$$ ##AUDIT TRAIL=  $$ (NUMBER, WHEN, WHO, WHERE, WHAT)
(   1,<2022-10-26 16:46:33.32 +0400>,<she>,<DPX200>,
      <created by zg, POWCHK disabled, PULCHK disabled
       configuration hash MD5:
       00 E9 B6 7A A2 85 ED C7 34 08 36 98 17 FE 4E 26
       data hash MD5: 32K
       7A A3 D3 E1 DE 1B CD 43 64 50 09 E2 21 31 62 65>)
(   2,<2022-10-26 16:46:36.01 +0400>,<she>,<DPX200>,
      <Start of raw data processing
       efp BC_mod = 2 LB = 1 FT_mod = 6 PKNL = 1 PHC0 = -10339.27 PHC1 = 263.2559 SI = 64K 
       data hash MD5: 64K
       8C C8 45 29 5E D2 68 29 D1 3F E0 EF 18 42 14 A5>)
(   3,<2022-10-26 16:46:49.54 +0400>,<she>,<DPX200>,
      <pk PHC0 = -20.9882 PHC1 = 0 
       data hash MD5: 64K
       57 70 D9 6D 53 CA BA F6 A2 E9 26 52 1E 04 FF CF>)
$$ ##END=
$$ 
$$ hash MD5
$$ C3 5B 69 43 59 5F 15 D8 18 04 51 7C BE 33 EA 38
##$RELAX= 
##$RELAX= 
##$RELAX= 
##$RELAX= 
##$RELAX= 
##$RELAX= 
##$RELAX= 
##$RELAX= 
##$RELAX= 
$$ Bruker specific parameters
$$ --------------------------
##$DU= <F:/spectra>
##$EXPNO= 1
##$NAME= <P31>
##$PROCNO= 1
##$TYPE= <nmr>
##$USER= <she>
##$AMP= (0..31)
100 100 100 100 100 100 100 100 100 100 100 100 100 100 100 100 100 100 
100 100 100 100 100 100 100 100 100 100 100 100 100 100 
##$AQSEQ= 0
##$AQ_mod= 1
##$AUNM= <au_zg>
##$AUTOPOS= <>
##$BF1= 81.014009
##$BF2= 200.13
##$BF3= 200.13
##$BF4= 200.13
##$BF5= 200.13
##$BF6= 200.13
##$BF7= 200.13
##$BF8= 200.13
##$BYTORDA= 1
##$CFDGTYP= 0
##$CFRGTYP= 5
##$CHEMSTR= <none>
##$CNST= (0..31)
1 1 145 1 1 1 1 1 1 1 1 1 1 1 1 1 1 1 1 1 1 1 1 1 1 1 1 1 1 1 1 1 
##$CPDPRG= <waltz16>
##$CPDPRG1= <>
##$CPDPRG2= <waltz16>
##$CPDPRG3= <>
##$CPDPRG4= <mlev>
##$CPDPRG5= <mlev>
##$CPDPRG6= <mlev>
##$CPDPRG7= <mlev>
##$CPDPRG8= <mlev>
##$CPDPRGB= <>
##$CPDPRGT= <>
##$D= (0..31)
0 1 0 0 0 0 0 0 0 0 0 0.03 2e-05 3e-06 0 0 0 0 0 0 0 0 0 0 0 0 0 0 0 0 
0 0 
##$DATE= 1666788392
##$DBL= (0..7)
120 120 120 11 120 120 24 19 
##$DBP= (0..7)
150 150 150 150 150 150 150 150 
##$DBP07= 0
##$DBPNAM0= <>
##$DBPNAM1= <>
##$DBPNAM2= <>
##$DBPNAM3= <>
##$DBPNAM4= <>
##$DBPNAM5= <>
##$DBPNAM6= <>
##$DBPNAM7= <>
##$DBPOAL= (0..7)
0.5 0.5 0.5 0.5 0.5 0.5 0.5 0.5 
##$DBPOFFS= (0..7)
$$ [...]
##$SUBNAM2= <"">
##$SUBNAM3= <"">
##$SUBNAM4= <"">
##$SUBNAM5= <"">
##$SUBNAM6= <"">
##$SUBNAM7= <"">
##$SUBNAM8= <"">
##$SUBNAM9= <"">
##$SW= 501.771253377433
##$SWIBOX= (0..15)
0 1 3 0 0 0 0 0 0 0 0 0 0 0 0 0 
##$SW_h= 40650.406504065
##$TD= 32768
##$TD0= 1
##$TE= 0
##$TE2= 300
##$TE3= 300
##$TEG= 300
##$TL= (0..7)
0 120 53 12 22 120 120 120 
##$TP= (0..7)
150 150 150 150 150 150 150 150 
##$TP07= 0
##$TPNAME0= <>
##$TPNAME1= <>
##$TPNAME2= <>
##$TPNAME3= <>
##$TPNAME4= <>
##$TPNAME5= <>
##$TPNAME6= <>
##$TPNAME7= <>
##$TPOAL= (0..7)
0.5 0.5 0.5 0.5 0.5 0.5 0.5 0.5 
##$TPOFFS= (0..7)
0 0 0 0 0 0 0 0 
##$TUNHIN= 0
##$TUNHOUT= 0
##$TUNXOUT= 0
##$USERA1= <user>
##$USERA2= <user>
##$USERA3= <user>
##$USERA4= <user>
##$USERA5= <user>
##$V9= 5
##$VALIST= <valist>
##$VCLIST= <CCCCCCCCCCCCCCC>
##$VD= 0
##$VDLIST= <DDDDDDDDDDDDDDD>
##$VPLIST= <PPPPPPPPPPPPPPP>
##$VTLIST= <TTTTTTTTTTTTTTT>
##$WBST= 1024
##$WBSW= 4
##$XGAIN= (0..3)
0 0 0 0 
##$XL= 0
##$YL= 0
##$YMAX_a= 1447
##$YMIN_a= -1771
##$ZGOPTNS= <>
##$ZL1= 120
##$ZL2= 120
##$ZL3= 120
##$ZL4= 120
##$ABSF1= 0
##$ABSF2= 0
##$ABSG= 0
##$ABSL= 0
##$ALPHA= 0
##$AQORDER= 0
##$ASSFAC= 0
##$ASSFACI= 0
##$ASSFACX= 0
##$ASSWID= 0
##$AUNMP= <proc_1d>
##$AZFE= 0.1
##$AZFW= 0.5
##$BCFW= 0
##$BC_mod= 2
##$BYTORDP= 0
##$COROFFS= 0
##$CY= -3
##$DATMOD= 1
##$DC= 0
##$DFILT= <>
##$DTYPP= 0
##$F1P= 0
##$F2P= 0
##$FCOR= 1
##$FTSIZE= 65536
##$FT_mod= 6
##$GAMMA= 0
##$GB= 0
##$INTBC= 1
##$INTSCL= 6.047779e-11
##$ISEN= 30
##$LB= 1
##$LEV0= 0
##$LPBIN= 0
##$MAXI= 10000
##$MC2= 0
##$MEAN= 0
##$ME_mod= 0
##$MI= 50
##$NCOEF= 0
##$NC_proc= -8
##$NLEV= 6
##$NOISF1= 182.463
##$NOISF2= 159.3651
##$NSP= 0
##$NTH_PI= 0
##$NZP= 0
##$OFFSET= 248.5645
##$PC= 4
##$PHC0= -10360.26
##$PHC1= 263.2559
##$PH_mod= 1
##$PKNL= yes
##$PPARMOD= 0
##$PSCAL= 0
##$PSIGN= 0
##$REVERSE= no
##$SF= 81.0140089999694
##$SI= 65536
##$SIGF1= 159.3651
##$SIGF2= -187.1042
##$SINO= 113.3802
##$SIOLD= 16384
##$SREGLST= <1H.CDCl3>
##$SSB= 0
##$STSI= 65536
##$STSR= 0
##$SW_p= 40650.406504065
##$SYMM= 0
##$S_DEV= 0
##$TDeff= 32768
##$TDoff= 0
##$TI= <>
##$TILT= no
##$TM1= 0
##$TM2= 0
##$TOPLEV= 0
##$USERP1= <user>
##$USERP2= <user>
##$USERP3= <user>
##$USERP4= <user>
##$USERP5= <user>
##$WDW= 1
##$XDIM= 65536
##$YMAX_p= 444414043
##$YMIN_p= -184217121
$$ End of Bruker specific parameters
$$ ---------------------------------
##NTUPLES= NMR SPECTRUM
##VAR_NAME=  FREQUENCY,     SPECTRUM/REAL,   SPECTRUM/IMAG
##SYMBOL=    X,             R,               I
##VAR_TYPE=  INDEPENDENT,   DEPENDENT,       DEPENDENT
##VAR_FORM=  AFFN,          ASDF,            ASDF
##VAR_DIM=   65536,         65536,           65536
##UNITS=     HZ,            ARBITRARY UNITS, ARBITRARY UNITS
##FACTOR=    0.620285442955139, 1,           1
##FIRST=     20137.2065510682, 0,            0
##LAST=      -20513.1999529968, 0,           0
##MIN=       -20513.1999529968, -184217121,  0
##MAX=       20137.2065510682, 444414043,    0
$$ Real data points
##PAGE= N=1
##DATA TABLE= (X++(R..R)), XYDATA
$$ [...]
41367F021526l279499l559167r70546K312955L806004L060157J676067J307184
41359A0374681J739570J246321r40092l343876m260894l995670l583053k379229
41351e142242P20152M231839N012672K362981j215385l364785l507073j566824
41343b468665J629659K885104l12725m795322m400745J118602M908129K878186
41335A442223o07561l83360J450594K47982k620504k319423P67750J570534j094192
41326a545957k582421J55422M095518M585132R24272l681602n439860k845525
41318f335021J814346M126355K504026K83897P38829K099265Q95769j850396k374031
41309A903039q01767p86036k725612k747444N90551L469921K470553q17303k674759
$$ plain form
41367 6021526 2742027 -817140 -1787686 525269 4331273 7391430 9067497 10374681
41359 10374681 12114251 13360572 12420480 9076604 4815710 820040 -2763013 -5142242
41351 -5142242 -4422090 -190251 4822421 7185402 5970017 2605232 -901841 -2468665
41343 -2468665 -839006 2046098 1733373 -3061949 -7462694 -6344092 -1435963 1442223
41335 1442223 834662 451302 1901896 2149878 -470626 -2790049 -2022299 -451765 -1545957
41326 -1545957 -4128378 -3972956 122562 4707694 5631966 1950364 -3489496 -6335021
41318 -6335021 -4520675 -394320 2109706 2393603 3132432 5231697 6127466 4277070 1903039
41309 1903039 1101272 315236 -2410376 -5157820 -4567269 -1097348 1373205 555902 -2118857
41300b118857j680370J155791L967864M774373L131432J303349J154162O66342
41292A2354086k596641n723211l813723J183481K033357k155331l748017P86189
41284a679810M269408M85322m976394l508757K480969L815108m77384k594534
41276b186072N19162L138402J536958n15911k0718p4756k504423k626432K695341
41267c8449P648376N055198k625157o897770n187800k119366m07621J981775N242032
41258B651218N440429J084055l523671m269299k378149j033630o43159j91785
41250b863991Q622k54386K56092J620860J717881K59366M53991L464291M842183
41241I504909Q60879m671969n240226j199886J225646m66157k396365j414737
$$ plain form
41300 -2118857 -3799227 -2643436 1324428 6098801 9230233 10533582 11687744 12354086
41292 12354086 9757445 4034234 220511 1403992 3437349 1282018 -2465999 -1679810
41284 -1679810 2589598 3074920 -1901474 -5410231 -2929262 885846 408462 -2186072
41276 -2186072 -1666910 1471492 3008450 2492539 2471821 2397065 -107358 -2733790 -38449
41267 -38449 7609927 12665125 10039968 3142198 -2045602 -4164968 -4572589 -2590814 2651218
41258 2651218 8091647 9175702 5652031 1382732 -995417 -2029047 -2672206 -2863991
41250 -2863991 -2855369 -3109755 -2853663 -1232803 485078 744444 1198435 4662726 9504909
41241 9504909 10365788 5693819 453593 -746293 479353 13196 -2383169 -3797906
41233c797906O93807J295554O07424l3984J23716J969932N217953O276788J914363
41224A4267647m787557p292668m845694k887889l290138j361119M623495Q263508
41216B689585M353318k551576m664311j592166J286559J414878L86620m32469
41208H90438m89070J165466L334375K208032k328299m288357n79796K787472J75305
41199B875566l427513m73112N432149M833308j324390l171675P70571J126609
41191F641513m875222o887882J388659J0148416P623780k277312o714178k728712
41183B319062J186020k89361l014451k039435J281943K832087J315426j599489
41175A991802l620108l283660j159960L02883k21509r28842L03201K474207L136615
$$ plain form
41233 -3797906 -3104099 -1808545 -1201121 -1235105 -1111389 858543 6076496 12353284 14267647
41224 14267647 9480090 2187422 -2658272 -5546161 -8836299 -10197418 -5573923 2689585
41216 2689585 7042903 4491327 -172984 -1765150 -478591 936287 1322907 890438
41208 890438 401368 1566834 4901209 7109241 4780942 492585 -87211 2700261 2875566
41199 2875566 -551947 -1025059 4407090 9240398 7916008 4744333 5514904 6641513
41191 6641513 1766291 -5121591 -3732932 6415484 14039264 11761952 5047774 2319062
41183 2319062 3505082 3215721 201270 -1838165 -556222 2275865 3591291 1991802
41175 1991802 -1628306 -4911966 -6071926 -5769043 -5990552 -6919394 -6616193 -4141986 -1005371
41166a005371K131740J053256J94963j164895k332227j897614m02967K33280l53934
41157c543769q60224p39964n55734k41857P67201J810402J526026J97156l60730
41148b001493M68084J215162O78850k82496q2241J346877K408885J673957n90811
41139D834774k755911l514169k912274j614927J36081K057793K954572J690528
41131H76467r51871k594711j744699P95484K985163L350719K020654O22794O41137
41122F001137J403757Q62333j034228j770089l53474O28204o97507k000090q76617
41113B163426M11194j119800l012354r88153K865166K377754k421557m543059
41105d267383q14376L598819L803956J683589N63964m25649k567193l514993j623657
$$ plain form
41166 -1005371 1126369 2179625 2374588 1209693 -1122534 -3020148 -3423115 -3189835 -3543769
41157 -3543769 -4403993 -5143957 -5699691 -5941548 -5174347 -3363945 -1837919 -1640763 -2001493
41148 -2001493 -1533409 -318247 360603 78107 -4134 1342743 3751628 5425585 4834774
41139 4834774 2078863 -1435306 -4347580 -5962507 -5826426 -3768633 -814061 876467
41131 876467 -75404 -2670115 -4414814 -3619330 -634167 2716552 4737206 5360000 6001137
41122 6001137 7404894 8267227 7232999 5462910 5109436 5737640 5040133 3040043 2163426
41113 2163426 2574620 1454820 -1557534 -2545687 319479 2697233 275676 -4267383
41105 -4267383 -5081759 -1482940 2321016 4004605 4568569 4142920 1575727 -1939266 -3562923
41096c562923J24472j015945k687961j682969P06207J762298K041343K762558
41088a552920K301317j91412j389480J131089L897871K689105o02421j513429
41080D769720l35912l84025j645761j724547q22810o28670o36535k49348j193240
41071b851128k944677n33691O627072R323400J023095r130655p383825L554311
41063b316098P868633P25892n423804j667024M415560L148837k105021l132446
41055A514529o44593K453l50162J748518L250157o79940o369719o044145n35901
41046h108803J958945q76279k694904L18405M017310M214398K652322J989721
41038C471115J038336j242101k026786P99837L968133L077069q08738k881441
$$ plain form
41096 -3562923 -3438451 -4454396 -7142357 -8825326 -8119119 -6356821 -4315478 -1552920
41088 -1552920 748397 556985 -832495 298594 4196465 6885570 6283149 4769720
41080 4769720 4433808 4049783 2404022 679475 -143335 -772005 -1408540 -1657888 -2851128
41071 -2851128 -5795805 -6329496 297576 9620976 10644071 1513416 -5870409 -2316098
41063 -2316098 5552535 6278427 854623 -812401 3603159 6751996 4646975 1514529
41055 1514529 869936 872389 522227 2270745 5520902 4840962 -1528757 -7572902 -8108803
41046 -8108803 -6149858 -7026137 -9721041 -9402636 -5385326 -1170928 1481394 3471115
41038 3471115 4509451 3267350 1240564 2040401 6008534 9085603 8276865 5395424
41030E395424j503164M27463M90154m35429p79343o54483l73970R71280L427462
41021F965394M287756J054638m061844n617740j915820K179041J504334k470751
41013A925008m047476j347720J806558J984121K12941j100119j706262j971571
41005d244520q18904K069117M096973K752707m49689j788534n14983L58343j402221
40996E8289m017787l952979m91524L047775L157961P14411J9474K563659M261903
40987E361182J489007k644814k630094M62377O76674k223954j658882L904585
40979B736081O406721Q34051n313662l147892L136874K972337l281973n305739
40971i63202o9735L930070J636942r45833J289215L408427J87992l617351j434715
$$ plain form
41030 5395424 3892260 4319723 4809877 4374448 3595105 2940622 2566652 3537932 6965394
41021 6965394 11253150 12307788 8245944 2628204 712384 2891425 4395759 1925008
41013 1925008 -2122468 -3470188 -1663630 320491 533432 -566687 -2272949 -4244520
41005 -4244520 -5063424 -2994307 1102666 3855373 3405684 1617150 1102167 1460510 58289
40996 58289 -3959498 -7912477 -8404001 -5356226 -2198265 -1483854 -1464380 1099279 5361182
40987 5361182 6850189 4205375 1575281 2037658 2714332 490378 -1168504 2736081
40979 2736081 9142802 9976853 4663191 1515299 4652173 7624510 4342537 -963202
40971 -963202 -1032937 2897133 4534075 3588242 4877457 8285884 8473876 4856525 3421810
40962C421810L093292J926719l592622m928912o29655J663387j694933m445880
40954e186794q20278N345993O484111J648890l521462m538579j999110Q24186
40946a763043J546746L50561m98256O53169K403543J910557j078447l781093m072721
40937d328984k387551J73634K935622M393944K819540q33659l206337k731932
40929c165723j094279J86542J552761K761264J943149q62120k513537j310669
40921b502612L91699M99278P41109K757965L850459Q52174l928020n182230k010555
40912d530733J280325J435277l12585j147327o4520J864594K554813N69245k665626
40903a016537l560184j073820J359037J044039L86503K390156M670117L064581
$$ plain form
40962 3421810 6515102 8441821 4849199 -79713 -709368 954019 -740914 -5186794
40954 -5186794 -6007072 -661079 5823032 7471922 3950460 -588119 -2587229 -1763043
40946 -1763043 -216297 134264 -363992 289177 2692720 4603277 3524830 -256263 -4328984
40937 -4328984 -6716535 -6542901 -3607279 786665 3606205 2772546 -433791 -3165723
40929 -3165723 -4260002 -4073460 -2520699 240565 2183714 1321594 -1191943 -2502612
40921 -2502612 -2110913 -1611635 -870526 1887439 5737898 6590072 2662052 -2520178 -4530733
40912 -4530733 -3250408 -1815131 -2127716 -3275043 -3339563 -1474969 1079844 1649089 -1016537
40903 -1016537 -4576721 -5650541 -4291504 -3247465 -2860962 -470806 4199311 7263892
40895G263892q78738k077342m22243l79854k193453r53279L915415N737575P62573
40886A0774546n223606n382205j749829q58530l100907k995673J394400N380589
40878a761215M546189L37942k589367j918158P15036K189519J077559j213660
40870A383845k236876j175730Q54442K492672K663875L46433l638935n325009
40862d635283j724164L757210M442347j71838l052262J70186M769765M336559
40854G892520J12532j998180n76416N96826o74206k591600l222586k557651q53138
40845c871899J599605L163829K303485J52232r03097o66381o77471j126319r77496
40836a003512n57947j192511k466249k350276j36980K564566L660899K251295
$$ plain form
40895 7263892 6385154 4307812 3885569 3505715 1312262 358983 4274398 10011973 10774546
40886 10774546 5550940 168735 -1581094 -2439624 -5540531 -8536204 -7141804 -1761215
40878 -1761215 2784974 3122916 533549 -1384609 -669573 1519946 2597505 1383845
40870 1383845 -853031 -2028761 -1174319 1318353 3982228 4328661 689726 -4635283
40862 -4635283 -6359447 -2602237 1840110 1668272 -1383990 -1213804 3555961 7892520
40854 7892520 8005052 6006872 5430456 6027282 5353076 2761476 -461110 -3018761 -3871899
40845 -3871899 -2272294 891535 3195020 3347252 2444155 1777774 1100303 -26016 -1003512
40836 -1003512 -1561459 -2753970 -5220219 -7570495 -7707475 -5142909 -1482010 769285
40828G69285p77324k912095k100547N65223K213067K698487M444560O796753N245815
40819A6943224j071786o040845m843529j018791k56796j592379j027749O3666
40811A155015k118523n107288k928605L454631O853627N019786K799622K381599
40803A1509864O9658m988018p283680l957426j3237L410r04395J313615L698418
40794e51791J046691m812733o788356k178892M267855O541797L457372j092874
40786a10931k170803J181445M382926K585075k566954m704796j559077K265593
40778f97522K448230J87273j637714k777557l431974k201952P54620K523454K144847
40769b688295K287659L614667K624264j463710l338432J68010L933681K443163
$$ plain form
40828 769285 -8039 -2920134 -5020681 -4455458 -2242391 456096 4900656 11697409 16943224
40819 16943224 15871438 9830593 4987064 3968273 3711477 2119098 1091349 1155015
40811 1155015 -963508 -6070796 -8999401 -5544770 1308857 6328643 9128265 11509864
40803 11509864 11579522 6591504 -692176 -4649602 -4662839 -4659429 -5563824 -4250209 -551791
40794 -551791 494900 -4317833 -11106189 -13285081 -9017226 -2475429 981943 -110931
40786 -110931 -2281734 -1100289 3282637 5867712 3300758 -1404038 -2963115 -697522
40778 -697522 1750708 1937981 300267 -2477290 -5909264 -8111216 -7356596 -4833142 -2688295
40769 -2688295 -400636 3214031 5838295 4374585 1036153 1204163 5137844 7581007
40761G581007j173741q75765J761835P03367l666508n148347k033957R54399P79508
40752a118202q01988k132842l078334j791237L182723P672711N866026k71879
40744G526978l059854j056060n14863l441907l660622J574478N350162K293513
40736E011825k109071p24326L308298K335699k863887m845430j502304K177117
40728G87921K989398K327084P43332k802642o100628n070640o96231J760922J024101
40719e037383P95156J983739J314512r42231M0906M117936M049660k475369o934482
40710c087556k707077L704431K813560k475232k174503L750063N480337n4461
40702E249562m458043k122391J528880P03791j112431J261079M627271K650849
$$ plain form
40761 7581007 6407266 5531501 7293336 7996703 4330195 -818152 -2852109 -1897710 -1118202
40752 -1118202 -1920190 -4053032 -7131366 -8922603 -5739880 1932831 7798857 7526978
40744 7526978 4467124 3411064 2896201 -545706 -4206328 -2631850 2718312 5011825
40736 5011825 2902754 2178428 5486726 7822425 4958538 113108 -1389196 787921
40728 787921 3777319 6104403 6847735 4045093 -2055535 -7126175 -7822406 -6061484 -5037383
40719 -5037383 -4242227 -2258488 -943976 -1886207 -1845301 2272635 6322295 3846926 -3087556
40710 -3087556 -5794633 -2090202 723358 -1751874 -3926377 -176314 5304023 5249562
40702 5249562 791519 -1330872 198008 901799 -210632 1050447 5677718 8328567
40694H328567l370631o473672m191481k61071K082575K686351J606294q88645
40686d81713k143894J22187L329130K793615j404457m554788l945996j253505
40678g539421J296246K972441K996632J058322p64335m09494M80625o03615j740284
40669b252883N48268M046221L096444j686550l362881l154J731005k140764n655202
40660e679496k517560L360695M096946J30853j671013L23616J034634j454880
40652b376205k404277J231132N219747M205548o99258m044913l316705q10762
40644b995693N76684N52769K80295j4247j087554k707593k942856n76595K342067
40635f572723K435131q7834j001622J822583M477371K312022k561161l360549
$$ plain form
40694 8328567 4957936 -1515736 -5707217 -5968288 -3885713 -1199362 406932 -481713
40686 -481713 -2625607 -2503420 825710 3619325 2214868 -2339920 -6285916 -7539421
40678 -7539421 -6243175 -3270734 -274102 784220 19885 -389609 91016 -512599 -2252883
40669 -2252883 -1704615 2341606 5438050 3751500 388619 385465 2116470 -24294 -5679496
40660 -5679496 -8197056 -4836361 -739415 -608562 -2279575 -1955959 -921325 -2376205
40652 -2376205 -4780482 -3549350 1670397 5875945 5176687 1131774 -2184931 -2995693
40644 -2995693 -2419009 -1866240 -1585945 -1600192 -2687746 -5395339 -8338195 -8914790 -6572723
40635 -6572723 -4137592 -4225426 -5227048 -3404465 1072906 3384928 823767 -2536782
40627b536782J724202O411214M696111j273924m836567l830853j781513j032434
40619b460546K71945K958115L366078r88134n459775l478069L294110O102787
40611C606511J485027l677363k660696J288814J038970k831245l580766N29025
40603d801723M015684L264016J108011Q34169J350795N65196j026817k242829
40595C066502k833799j843569J458710M022349J536060m000064n102884K87066
40587c409629M902263K824848k036007l044804p82339J81695k67973N00303J241024
40578A09381q12660l351430j964766J850384K761030O51635L17111K382341K060271
40569D003297k075999n242831m282631j856667m10781J789215N328055O141832
$$ plain form
40627 -2536782 -812580 5598634 10294745 9020821 4184254 353401 -1428112 -2460546
40619 -2460546 -2188601 769514 4135592 3147458 -2312317 -5790386 -2496276 3606511
40611 3606511 5091538 1414175 -1246521 42293 1081263 -1749982 -5330748 -4801723
40603 -4801723 -786039 2477977 3585988 4420157 5770952 6336148 5309331 3066502
40595 3066502 232703 -1610866 -152156 3870193 5406253 1406189 -3696695 -3409629
40587 -3409629 1492634 4317482 2281475 -763329 -1545668 -1363973 -1631946 -1131643 109381
40578 109381 -703279 -4054709 -6019475 -4169091 -1408061 -756426 -439315 1943026 4003297
40569 4003297 1927298 -3315533 -7598164 -9454831 -9865612 -8076397 -2748342 3393490
40561C393490J783924l270477l457407j27993J144831p83606j602676J329944
40553a589970N090015N360794J868960j706952k195185k54205R27031r7942j250357
40544F152189l76297J003026r7338k872836l151120K92141L303573K093763j356724
40535D990377k234221M32922K746689J130644l410393o370247m241341J885884
40527e069686O949932O796856K477672j379913k251318j805044k066065k160380
40519A492054n02496J794347K007020m82208l278075l398852K32128N628987Q150670
40510A1643575L917428n135851j1131360q101448N47422N499193K648861k557286
40502b669466l074333Q97647L793071K849432M01597j026129j593563j570417
$$ plain form
40561 3393490 5177414 1906937 -1550470 -1678463 -533632 -1317238 -2919914 -1589970
40553 -1589970 3500045 8860839 10729799 9022847 6827662 6573457 7500488 7402546 6152189
40544 6152189 5775892 6778918 6681580 3808744 657624 949765 4253338 6347101 4990377
40535 4990377 2756156 3189078 5935767 7066411 3656018 -2714229 -6955570 -5069686
40527 -5069686 1880246 8677102 11154774 9774861 7523543 5718499 3652434 1492054
40519 1492054 989558 2783905 4790925 4308717 1030642 -2368210 -2136082 3492905 11643575
40510 11643575 15561003 10425152 -706208 -8807656 -8260234 -2761041 -112180 -2669466
40502 -2669466 -5743799 -4846152 -1053081 1796351 2197948 1171819 -421744 -1992161
40494a992161L0793K527392K803833n1293k370329j102635J439595J541277k7120
40485B799352n75404j299248m554004p081998l373946M243097O984609K767423
40477i0119n03896J733181L080553j922094o702089k720541N469279O371756m38700
40468D277330m235496n72049L035829J076061j502916L06362K296192q40479n332361
40459a491527m289334Q91090L108177P68974j249733n92734r1948j133396r00337
40450d980768J956516M054104K302773j388059l041223j759655L78029J642985
40442h35298J595568R0902k274823l325838j107823L275958O189740N302747J869925
40433A0781058j204094k532849k759238k752672k499106j716698o66378m0590
$$ plain form
40494 -1992161 -1961368 566024 3369857 3318564 948235 -154400 1285195 2826472 2799352
40485 2799352 2223948 924700 -3629304 -10711302 -14085248 -9842151 -2857542 -90119
40477 -90119 -594015 1139166 4219719 2297625 -4404464 -7125005 -1655726 4716030 4277330
40468 4277330 41834 -530215 2505614 3581675 2078759 2385121 4681313 3840834 -1491527
40459 -1491527 -5780861 -4889771 -1781594 -1012620 -2262353 -2855087 -2947035 -4080431 -4980768
40450 -4980768 -3024252 1029852 3332625 1944566 -1096657 -2856312 -2478283 -835298
40442 -835298 760270 851172 -1423651 -4749489 -5857312 -2581354 3608386 8911133 10781058
40433 10781058 9576964 7044115 4284877 1532205 -966901 -2683599 -3349977 -3390567
40425c390567l12630j085016r68847J100732L826037M021888N88634l104036l064667
40416b388472j42087J348939K00531l23671J505262K793000J118117j300216j724344
40407A087059j560277k845454l334364k11175L740626L652787Q08451O98122L160898
40398E196673J987047m004852p193721k515402M028296M181784j99264r77450
40390E03111K905240M271428m6483l989925k271173J157732j01603m140633l579915
40381e292221K445407O238639K824912k852422l569392n2437J534560l91084j400609
40372e14647P82198K668566J221099j213391j045946J034618J904670R30648l7440
40363E730375M3420P40819J444277J234516j016136m389336n444800k207635K765523
$$ plain form
40425 -3390567 -3703197 -4788213 -5757060 -4656328 -830291 3191597 3780231 676195 -2388472
40416 -2388472 -2530559 -1181620 -981089 -1304760 200502 2993502 4111619 2811403 1087059
40407 1087059 -473218 -3318672 -6653036 -6864211 -3123585 529202 1337653 2035775 5196673
40398 5196673 7183720 3178868 -4014853 -6530255 -2501959 1679825 1480561 503111
40390 503111 3408351 7679779 7633296 3643371 1372198 2529930 2428327 -1712306 -5292221
40381 -5292221 -2846814 3391825 6216737 3364315 -205077 -257514 1277046 885962 -514647
40372 -514647 267551 2936117 4157216 2943825 1897879 2932497 4837167 5767815 5730375
40363 5730375 5773795 6514614 7958891 9193407 8177271 3787935 -1656865 -3864500 -1098977
40354a098977N203124L592785m74775m249321m742459p18052M281447M355596
40346F149368p68356m095954j069129L484521K877846j181609k259168k4502R7073
40337C210090l147463m754178j746679K814099N044460M158858P00887l901547
40329B378527n708543j700015M576314O186536K181911j764667k481878k658057
40321A010128l889736l204692Q43311M560054M689295K632282M93054k039256
40313E094440m248604l138795J179644L759770J831914j068665j268197m30589
40305A710918j093554j466513P30007L140416K347676l57237j331096m24326l14460
40296B941831j702604k752330k151107k36093J652239J540127j342876m196718
$$ plain form
40354 -1098977 4104147 7696932 7222157 2972836 -1769623 -2487675 1793772 6149368
40346 6149368 5381012 1285058 215929 3700450 6578296 5396687 3137519 3113017 3210090
40337 3210090 62627 -4691551 -6438230 -3624131 1420329 5579187 6280074 2378527
40329 2378527 -3330016 -5030031 -453717 5732819 7914730 6150063 3668185 1010128
40321 1010128 -2879608 -6084300 -5240989 -680935 4008360 6640642 7133696 5094440
40313 5094440 845836 -2292959 -1113315 2646455 4478369 3409704 2141507 1710918
40305 1710918 617364 -849149 -119142 3021274 5368950 5011713 3680617 3256291 2941831
40296 2941831 1239227 -1513103 -3664210 -3900303 -2248064 -707937 -2050813 -6247531
40288f247531l171071R03210L156778J964094Q01628J492170J291968r37053j669038
40279b414845Q32209K814071J615171J61708P11896K40931k925119m142581k30945
40270c337504L685334K112125j468841j002836J319523m66042m645839m516452
40262h320532k52139J593301n07868j514842K41286O18588j604570j890810J889729
40253i747857N488289N056223K133905l35844j870205k427628j147734J213361
40245a637490K457879K351848K164748J160070j905231m444735k703447J519519
40237a036839K689522P2282j740303r54838l93772n99043J335583M434808L245572
40228G052972k486741n209272q69065M072198K188694m079945o913301l967823
$$ plain form
40288 -6247531 -9418602 -8515392 -5358614 -3394520 -2592892 -1100722 191246 -745807 -2414845
40279 -2414845 -1582636 1231435 2846606 3008314 3720210 3961141 1036022 -3106559 -3337504
40270 -3337504 347830 2459955 991114 -11722 1307801 841759 -3804080 -8320532
40262 -8320532 -8572671 -6979370 -7487238 -9002080 -8760794 -8142206 -9746776 -11637586 -9747857
40253 -9747857 -4259568 796655 2930560 2594716 724511 -1703117 -2850851 -1637490
40245 -1637490 820389 3172237 5336985 6497055 4591824 147089 -2556358 -1036839
40237 -1036839 1652683 1724965 -15338 -970176 -1363948 -1962991 -627408 3807400 7052972
40228 7052972 4566231 -643041 -1512106 2560092 4748786 668841 -6244460 -10212283
40220a0212283R25764M388746N365856L196306r65232k910613k42994L344927
40212B890477K897267o29922k420556j356003p89245k529182m446873m087958
40204a0471995j168866L402954P735579Q409745L370689m005076p002904l163301
40196b893175K550172L755385M8961l526738l302110p12336J093032J709302K344165
40187A066658J954696j636510o534287p036086j345343M789903N537673K659992
40179e43304J336248J555842k87310l320778k976029M91294J717757m84102r50092
40170c460474K513273M893967K499640j058048j747047j645488l367528l859621
40162e231326p7835M120854L767611J322705J837629L092790o20294o823649o665692
$$ plain form
40220 -10212283 -9286519 -4897773 468083 3664389 2699157 -211456 -454450 2890477
40212 2890477 5787744 5157822 2737266 1381263 592018 -1937164 -6384037 -10471995
40204 -10471995 -11640861 -8237907 -502328 7907417 11278106 7273030 270126 -2893175
40196 -2893175 -343003 3412382 3461343 -65395 -3367505 -4079841 -2986809 -1277507 1066658
40187 1066658 3021354 1384844 -5149443 -12185529 -13530872 -8740969 -3203296 -543304
40179 -543304 792944 2348786 2061476 -1259302 -4235331 -3744037 -2026280 -2510382 -3460474
40170 -3460474 -947201 3946766 6446406 5388358 3641311 1995823 -1371705 -5231326
40162 -5231326 -5309161 -1188307 2579304 3902009 5739638 8832428 8212134 1388485 -5277207
40153e277207J085586P047650M676847j312301l627646k458197j968257k333233
40145d166758j072628J202476J830349P60038k98016j413513k907657k374105
40137h439814J915776O138064M898635m00242k895125m86535J355461j002199
40129A084021l361128j193525K201240J098741k608786k062998L101211N583255
40121C842031J787981k738606k200973J219612K322979J079826M90407n4644l049752
40112B698861o449279n240992P89347O165817O900600M003990k20213m394966
40104D253165o029682k672056L144421N057296J397342k019458n32617K509554
40096E107965J630624j995321l043492q56984L09130p98080m66224K670988L989166
$$ plain form
40153 -5277207 -4191621 2856029 7532876 6220575 2592929 134732 -1833525 -4166758
40145 -4166758 -5239386 -4036910 -2206561 -1446523 -1744539 -3158052 -6065709 -8439814
40137 -8439814 -6524038 -385974 4512661 4112419 1217294 730759 2086220 1084021
40129 1084021 -2277107 -3470632 -1269392 -170651 -2779437 -4842435 -1741224 3842031
40121 3842031 5630012 2891406 690433 1910045 4233024 5312850 5803257 5748613 2698861
40112 2698861 -3750418 -8991410 -8202063 -2036246 4864354 8868344 8648131 4253165
40104 4253165 -1776517 -4448573 -1304152 3753144 5150486 3131028 2598411 5107965
40096 5107965 6738589 4743268 1699776 842792 1151922 353842 -112382 2558606 6547772
40087F547772K4416m775098l522050K585996M976164q8580n492191l212635L716704
40078G60498N234361j139128o776124m612614J344023L244885O97026r82655r1630
40069b321358O11397M84352J615105L303199K296899j057327k744292j754482
40061D33493j007984r03070J586491N746814N862385J45410n280886n143545k158036
40052g18928j126424j248008M84207K720600K367976M21386l75196q70552l029102
40043a374041m697703k670061R75355J559148m97108o60369J735488K677141Q78328
40034b073822n4261J739605K951864P14795k594184l065619r06169N43647r9696
40025b843840p09828R16742L539189L398167q80547n312474m782315j72037K287675
$$ plain form
40087 6547772 6572188 1797090 -1724960 861036 5837200 5748620 256429 -2956206 760498
40078 760498 5994859 4855731 -1920393 -6533007 -5188984 -1944099 -1247073 -2229728 -2321358
40069 -2321358 -1709961 -1225609 389496 3692695 5989594 4932267 2187975 433493
40061 433493 -574491 -1477561 108930 5855744 11718129 11863539 6582653 1439108 -718928
40052 -718928 -1845352 -3093360 -2609153 111447 2479423 2900809 2525613 1655061 -1374041
40043 -1374041 -6071744 -8741805 -7766450 -6207302 -6704410 -7364779 -5629291 -2952150 -2073822
40034 -2073822 -2128083 -388478 2563386 3278181 683997 -2381622 -3287791 -2744144 -2843840
40025 -2843840 -3553668 -2636926 902263 4300430 3419883 -1892591 -6674906 -6846943 -4559268
40016d559268j469k116312L03133L701919K424842j749661k452749Q96068K654588
40007h98909M65791j814958j504776p65486j133890n19597J812451K763869R02588
39998f92917m53359J109020K828365J649728p00498j239812o10802n39291P0416
39989A420850K210821L129168L60765l224129l398107j358916j143919k151969
39981d155436n18925K897927K951120n51140j246492L279965O097161J120314
39973I874494o403663o507278Q79810N481356J291253n340932n361072N51081
39965e534951M240504J967258j732926j925609K36270R25641k22614n59482R64701
39956a641208K766495L412812K809681J039562j477439k801774j100800K116835
$$ plain form
40016 -4559268 -4560737 -6677049 -6373916 -2671997 -247155 -1996816 -4449565 -3553497 -898909
40007 -898909 -433118 -2248076 -3752852 -4518338 -5652228 -6171825 -4359374 -1595505 -692917
39998 -692917 -1146276 -37256 2791109 4440837 3740339 2500527 1889725 1350434 1420850
39989 1420850 3631671 6760839 7121604 3897475 499368 -859548 -2003467 -4155436
39981 -4155436 -4674361 -1776434 1174686 623546 -622946 2657019 8754180 9874494
39973 9874494 3470831 -3036447 -2156637 3324719 4615972 -724960 -6086032 -5534951
39965 -5534951 -1294447 672811 -1060115 -2985724 -2749454 -1823813 -2046427 -2605909 -1641208
39956 -1641208 1125287 4538099 7347780 8387342 6909903 4108129 3007329 5124164
39948E124164K965689L74299k050150r00481K268803L168025N22299k690855l337712
39939E444081j437237Q12833J786260J634871J493477J878370J873871M29980
39931A3916506j466253j415414N98376R14187k933526p422372o701358r12304
39923e422158L339979K185026k47371J087460L779006J952312l606604n856224
39915b788574k190450J767447J125644j490443j657687l00705j66522L05635L248029
39906b147626M868009L57252o307996n970402J786662O901242L511639j954882
39898A043898j897981R27049j47203l596582k647885K698601N318824K110832
39890C809553k224427l375975k588917j906687l81156K198674K836265j2661l032278
$$ plain form
39948 5124164 8089853 8464152 6414002 5513521 7782324 10950349 11472648 8781793 5444081
39939 5444081 4006844 4819677 6605937 8240808 9734285 11612655 13486526 13916506
39931 13916506 12450253 11034839 11633215 12547402 9613876 2191504 -4509854 -5422158
39923 -5422158 -2082179 102847 -144524 942936 4721942 6674254 3067650 -2788574
39915 -2788574 -4979024 -3211577 -2085933 -3576376 -5234063 -5534768 -5701290 -5395655 -2147626
39906 -2147626 2720383 3077635 -3230361 -9200763 -7414101 -512859 2998780 1043898
39898 1043898 -854083 72966 -74237 -3670819 -6318704 -3620103 1698721 3809553
39890 3809553 1585126 -1790849 -4379766 -6286453 -6667609 -4468935 -1632670 -1645331 -4677609
39881d677609k598070J41330J759925J620420J347938J244636L96251r28200j767653
39872c461032k323487k791124j486383K832482P306891P002682J293251m498990
39864C874290n202502j544541J841572K516815J913480J551416O13654j546550
39856D017634k903562j242078J979119L034818J027811j169750j331529k50815
39848C161648J008606K746813L956308J883090k973068n231568j994845J654803
39840D211787k15633m690865m211930J155716L721526Q38470j058589K088757
39832A839239M734880J240299m168131l953442Q43554K897497J29348k622039
39824I41205k390732j290153o44064J295501M173172M051437k32099m019320l289490
$$ plain form
39881 -4677609 -7275679 -7134349 -5374424 -3754004 -2406066 -1161430 -765179 -1693379 -3461032
39872 -3461032 -5784519 -8575643 -10062026 -7229544 77347 7080029 8373280 3874290
39864 3874290 -1328212 -2872753 -1031181 1485634 3399114 4950530 5564184 4017634
39856 4017634 1114072 -128006 1851113 4885931 5913742 4743992 3412463 3161648
39848 3161648 4170254 6917067 10873375 12756465 9783397 4551829 2556984 4211787
39840 4211787 3996154 -694711 -4906641 -3750925 -29399 809071 -249518 1839239
39832 1839239 6574119 7814418 3646287 -307155 536399 3433896 3563244 941205
39824 941205 -1449527 -2739680 -3383744 -2088243 2084929 6136366 5904267 1884947 -1404543
39815a404543m06944j6783k073147k695993l58875K338788K719974J166655p1631
39806h02499M63134K293385L603364K892630N07887j670439k284144j717708j086807
39797B198803p88332m57404K59174J238132J776606J013655r56451k713809l126248
39788a555874k851675l022906l059845j596227P94297K068605J998998K495504
39780d729123M037161M331188J760982k008647m293944m388937l022903q85610
39772i199833P92102L66298j571557j743480J344254M456780L886364R42132l6598
39763g63538J968146L730653K810211K77141j670100k045941r20954O24765N42680
39754D553063j720951l312600j459844J736941J698999j627255l459938j437477
$$ plain form
39815 -1404543 -1811487 -1828270 -3901417 -6597410 -6956285 -4617497 -1897523 -730868 -802499
39806 -802499 -339365 1954020 5557384 8450014 8957901 7287462 5003318 3285610 2198803
39797 2198803 1410471 953067 1212241 2450373 4226979 5240634 4284183 1570374 -1555874
39788 -1555874 -4407549 -7430455 -10490300 -12086527 -11292230 -9223625 -7224627 -4729123
39780 -4729123 -691962 3639226 5400208 3391561 -902383 -5291320 -8314223 -9199833
39772 -9199833 -8407731 -8041433 -9612990 -11356470 -10012216 -5555436 -1669072 -726940 -763538
39763 -763538 1204608 4935261 7745472 8022613 6352513 4306572 3385618 4010383 4553063
39754 4553063 2832112 -480488 -1940332 -203391 1495608 -131647 -3591585 -5029062
39746e029062J394759K182420K104139K390531J214785k118707m014799j691341
39738c567275J900976K568667J294505J389628J895603m38349m125394m115910
39730c197549r8K834146J411156o89185M80142L168203K908536j127379n328595
39721D59377n837945k172305K313304L326991L08396k437015j171036K138239
39713c071994L163515J939490J597958J649628j291149n924501o385472j756638
39705a0079163J563057J30804r65293K538765N989905L634359j136510j288533
39697C87391K183387K756903j4379o08445J661391J380143k485130l907226k72534
39688A081501K659972K67019l514727l150751o3595J147996L41252J05017J68067
$$ plain form
39746 -5029062 -3634303 -1451883 652256 3042787 4257572 2138865 -1875934 -3567275
39738 -3567275 -1666299 902368 2196873 3586501 5482104 5043755 918361 -3197549
39730 -3197549 -3197647 -363501 1047655 358470 838612 4006815 6915351 5787972 459377
39721 459377 -5378568 -7550873 -5237569 -1910578 -1602182 -4039197 -5210233 -3071994
39713 -3071994 91521 2031011 3628969 5278597 3987448 -1937053 -8322525 -10079163
39705 -10079163 -8516106 -8385302 -9350595 -6811830 -821925 2812434 1675924 387391
39697 387391 2570778 5327681 5313302 4704857 6366248 7746391 5261261 1354035 1081501
39688 1081501 3741473 4008492 493765 -2656986 -2720581 -1572585 -1231333 -1126316 -958249
39679i58249q32280j017483J587539L971361K055894k038963k690212K89675J669729
39670B037011l67018j823360l70301R93965N6942m57432J760076L751542J950525
39661G531950j748018k991918j644261r92131j772957j441573R86997L249881
39653A177970L306941J497905r91049l123657l378904r23922K172857K532261
39645B270402j31335k549178k328402m56348J072585J540235Q12985q88526j775680
39636b433262n007K697404K331796j139785k828446m14471J706687o08333m115439
39627d808856l061981J635415L949507K036944l9803L40262J104101M00299m75470
39618A080418m84409n66832m92540J522483M377534L831264j068603n547107n612711
$$ plain form
39679 -958249 -1790529 -2808012 -1220473 2750888 4806782 2767819 77607 367282 2037011
39670 2037011 1669993 -153367 -523668 470297 527239 69807 1829883 5581425 7531950
39661 7531950 5783932 2792014 1147753 155622 -1617335 -3058908 -2071911 1177970
39653 1177970 4484911 5982816 4991767 1868110 -1510794 -2434716 -261859 2270402
39645 2270402 2139067 -410111 -2738513 -3194861 -2122276 -582041 230944 -657582 -2433262
39636 -2433262 -2438269 259135 2590931 1451146 -1377300 -1791771 -85084 -693417 -4808856
39627 -4808856 -7870837 -6235422 -2285915 -248971 -288774 51488 1155589 1555888 1080418
39618 1080418 596009 29177 -463363 1059120 5436654 9267918 8199315 2652208 -2960503
39609b960503k975455q57670P72634K428318J858891j940115m815605k493736
39601a0983241K719954M962772K810179k30229j696313j976667j132695J335677
39593d190563L701959L204517K99579j738809j531042p22676n67947n74281m55737
39584b575000m80058j17024R53243J261296j67233j301507k85010O92715q97907
39575b916485k293117O47220N135204M262343j597784m069332L45099M444439
39567C957587J522505m499180n798343k082000J250383K458432L914744N379914
39559F104042L813541m36009l169863k635994j521065j924898k548805j911975
39551d231026p20292K67707J735685L733950M385977K099846k199596n698968
$$ plain form
39609 -2960503 -5935958 -6793628 -6020994 -3592676 -1733785 -3673900 -8489505 -10983241
39601 -10983241 -8263287 -3300515 -490336 -720565 -2416878 -4393545 -5526240 -4190563
39593 -4190563 -488604 2715913 3015492 1276683 -254359 -977035 -1544982 -2119263 -2575000
39584 -2575000 -3055058 -3172082 -2218839 -957543 -1124776 -2426283 -2711293 -2018578 -2916485
39575 -2916485 -5209602 -4562382 572822 4835165 3237381 -831951 -486852 3957587
39567 3957587 5480092 980912 -4817431 -6899431 -5649048 -3190616 724128 6104042
39559 6104042 9917583 9481574 6311711 3675717 2154652 229754 -2319051 -4231026
39551 -4231026 -4951318 -4683611 -2947926 786024 5172001 7271847 5072251 -626717
39543f26717n746410j799847L281013M870356J563154k460037k512342L38842
39535c091988J377158l71721j230340N06132J840785N27779j141729n77538P41522
39526a419940K77525j092542j022777J23825M92173L01805P13890P79771p18334
39517a564604j832602j35807K225534J125976k239494k345476J512623L260357
39509F507j76163l232336m05104M517386M149311r47643l532384j068045J416898
39500G28427K15455k096869k321269j245400m9443K460061N736144N502739R192
39491H939037n629315n724444j506307J934309L069709L452820K626280o74165
39483F487924l861490l071218J69135O69854j978337k635513P77526L800445K655066
$$ plain form
39543 -626717 -6373127 -8172974 -4891961 -21605 1541549 -918488 -3430830 -3091988
39535 -3091988 -1714830 -2086551 -3316891 -2810759 -969974 -442195 -1583924 -2161462 -1419940
39526 -1419940 -1142415 -2234957 -3257734 -3133909 -2641736 -2339931 -1626041 -846270 -1564604
39517 -1564604 -3397206 -3533013 -1307479 -181503 -2420997 -4766473 -3253850 6507
39509 6507 -169656 -3401992 -3807096 710290 4859601 3911958 379574 -688471 728427
39500 728427 943882 -1152987 -3474256 -4719656 -4769099 -2309038 3427106 8929845 8939037
39491 8939037 3309722 -2414722 -3921029 -1986720 1082989 4535809 7162089 6487924
39483 6487924 2626434 -444784 -275649 394205 -1584132 -4219645 -3442119 358326 3013392
39474C013392k89319j097868R2083J115210J621635J568979o73343m988453p136807
39465f774491l799773J983597M420485K623390P36025J269414K381576J929233
39457D769456N34617m58655j280969k427605k866330j326328J236822J946578
39449A27586o26717l872569l202491K309068P420149O060048j018502o622971
39441E73601n761636r80134K246254K272143J022005j67074r78621k76408K323665
39432B73795L975489J532661l193036m756290j230559L198690L886580J252606
39424D939936q79152m84720Q51290M47857k263743m838165m224792o23119K058490
39415e016118J105891q84365M78311M460870N602542J678713k732423k776868
$$ plain form
39474 3013392 2724073 1626205 1718288 2833498 4455133 6024112 5350769 362316 -6774491
39465 -6774491 -10574264 -8590667 -4170182 -1546792 -810767 458647 2840223 4769456
39457 4769456 5304073 4845418 3564449 1136844 -1729486 -3055814 -1818992 127586
39449 127586 -499131 -4371700 -7574191 -5265123 2155026 8215074 7196572 573601
39441 573601 -5188035 -6168169 -3921915 -1649772 -627767 -794841 -1773462 -2049870 273795
39432 273795 4249284 5781945 2588909 -2167381 -3397940 -199250 3687330 4939936
39424 4939936 4060784 3576064 4427354 4875211 2611468 -2226697 -6451489 -7074608 -5016118
39415 -5016118 -3910227 -4794592 -4316281 144589 5747131 7425844 4693421 1916553
39407A916553N103Q13642j022666j911736l25668J026663O5867j249681l01882
39398i83805J919015K467652J005784p3016J44966m21659l000799m833517k355389
39389f130768L206177O191714L282579k268069m805803l041469l34254P87686
39381c112207J271949K362415K933889J796620L94775P35696J952996J577233
39373I913366m27870j683193j405889j445335k518592k362874M61588L257335
39365C788536K390057j457683m038166l042088j61771K237299L618359L875639
39357G210182K378168r9840r82035N11933J403181q51894l787816k835761J737680
39348D683798M381511J607634l249049m498790j288823K035623J835039r52178
$$ plain form
39407 1916553 1921656 2735298 1712632 -199104 -524772 501891 567758 -681923 -983805
39398 -983805 935210 3402862 4408646 4335630 4480596 4058937 1058138 -3775379 -6130768
39389 -6130768 -2924591 3267123 6549702 4281633 -524170 -3565639 -3899893 -3112207
39381 -3112207 -1840258 522157 3456046 5252666 5647441 6383137 8336133 9913366
39373 9913366 9485496 7802303 6396414 4951079 2432487 69613 531201 3788536
39365 3788536 6178593 4720910 682744 -2359344 -2521115 -283816 3334543 7210182
39357 7210182 9588350 9488510 8506475 9018408 10421589 9569695 5781879 2946118 4683798
39348 4683798 9065309 10672943 7423894 2925104 1636281 3671904 5506943 4554765
39340D554765l035526k936068j760018p58919K08292J375240J643203P8554j609971
39331b240448l77028L533199N544432K413754k754439m151154j112186J262572
39323B118702l46107l130399l016337m83784J234743J260249J000232N91790q50248
39314a621159k093562p76472K103109K392481j164956m262369k582908K289742
39306e716094N035337L207303q52807l862169m769841m103003k383278k821K410183
39297a1037190M049003M074433K203879k24409q04768J020834K602816J404754
39289C289352j232506j927101k08169J119949L86035j170028k239051k851489
39281d833008k406722J42305L105469K943414m3249j106541J564870L429893Q87088
$$ plain form
39340 4554765 1519239 -1416829 -3176847 -3935766 -3727474 -2352234 -709031 -630477 -2240448
39331 -2240448 -2617476 915723 6460155 8873909 6119470 1968316 856130 2118702
39323 2118702 1772595 -1357804 -4374141 -4857925 -3623182 -2362933 -1362701 -770911 -1621159
39314 -1621159 -3714721 -4491193 -2388084 4397 -1160559 -5422928 -8005836 -5716094
39306 -5716094 -680757 2526546 1673739 -2188430 -6958271 -11061274 -13444552 -13447373 -11037190
39297 -11037190 -6988187 -2913754 -709875 -934284 -1739052 -718218 1884598 3289352
39289 3289352 2056846 129745 -78424 1041525 1427560 257532 -1981519 -4833008
39281 -4833008 -7239730 -7097425 -3991956 -1048542 -1091791 -2198332 -633462 2796431 3683519
39272C683519k753686l104633j821168k058958j322555L513522P612213L993668
39264G741922l824677n389940L95240L596077j01281k770305R59578L973662n92958
39255C987318o469964m284731K758444M524957N02410j016762K088666L223257
39247E313595m44745l455312j803545J546876L164068L563597K849807q35081
39239I899260n735116o092583p87496L479164J412881l474722m668975j640109
39231g607696J247662J809837J808440L001853M468326L656777p61906o348647
39223A274646p868810l007482L760280O085945L562756P81576k66200j606093
39215B716618l364277k454000J568736M713476M326044J989717n17034l167648
$$ plain form
39272 3683519 929833 -2174800 -3995968 -6054926 -7377481 -3863959 3748254 7741922
39264 7741922 3917245 -1472695 -1077455 2518622 2417341 -352964 606614 4580276 3987318
39255 3987318 -2482646 -6767377 -4008933 516024 1018434 1672 2090338 5313595
39247 5313595 4868850 1413538 -390007 1156869 4320937 7884534 10734341 9899260
39239 9899260 4164144 -1928439 -2715935 763229 2176110 -1298612 -5967587 -7607696
39231 -7607696 -6360034 -4550197 -2741757 260096 4728422 8385199 7623293 1274646
39223 1274646 -6594164 -9601646 -5841366 244579 3807335 4588911 4322711 2716618
39215 2716618 -647659 -3101659 -1532923 3180553 7506597 9496314 8979280 5811632
39207E811632m544421k378824J312591J571896j339125j664967J777532K689213
39199C235527j974691n915902l285120K240563M162760K809228J701260L9167
39191C012792l618523n084346l88594N661431N335297j54414l151570j915602
39183c03529j447580k934686j964966J867996K817324j048023l902011j677063
39175h592538J676159J647778M70442J817644L498055J502740k259208k607100
39167b846028M33889J888733O2618j289806q184O13314k154132m653328j515327
39158i468251N617772R006008N018564r90310k311071K45262R91223j418242k587973
39149D102982j03228K496426J385966j823392k887726r35164J265724J648451
$$ plain form
39207 5811632 1267211 -1111613 200978 1772874 433749 -1231218 546314 3235527
39199 3235527 1260836 -4655066 -7940186 -5699623 -1536863 1272365 2973625 3012792
39191 3012792 -605731 -5690077 -6078671 -417240 4918057 4763643 1612073 -303529
39183 -303529 -1751109 -4685795 -6650761 -4782765 -1965441 -3013464 -6915475 -8592538
39175 -8592538 -6916379 -5268601 -4798159 -2980515 517540 2020280 -238928 -2846028
39167 -2846028 -2412139 -523406 -460788 -1750594 -1758778 -1145464 -3299596 -7952924 -9468251
39158 -9468251 -3850479 5155529 10174093 9183783 6872712 7117974 8109197 6690955 4102982
39149 4102982 3999754 6496180 7882146 6058754 3171028 2235864 3501588 5150039
39141E150039Q83066N11918P70348L96061j723622m447595m698275j259609K788966
39132a628703L723477K170362J338012J386472j00315k472257k115495J026946
39124C328499K390273n4668k657223k282507p45737m85760n31363L45143R04634
39115B11291P06841J609781L266470K090222k166630m169888j171193J975298
39107B352192M69149k982046l451907j617312o95769l3834K271961M144162K809142
39098C265738P6407r39783r37376j365315l63593L035134N093365L195224O71272
39089A1731073K84370j260831n868060p850536l286779J271968q02082l793084
39081i573961P18624P764643O349046j275126l010915K254293L350158k860138
$$ plain form
39141 5150039 6033105 6545023 7315371 7711432 5987810 1540215 -3158060 -4417669 -1628703
39132 -1628703 2094774 4265136 5603148 6989620 6889305 4417048 2301553 3328499
39124 3328499 5718772 5664104 3006881 724374 -21363 -507123 -1038486 -693343 211291
39115 211291 918132 2527913 5794383 7884605 5717975 1548087 376894 2352192
39107 2352192 2821341 -160705 -3612612 -5229924 -5925693 -5959527 -3687566 456596 3265738
39098 3265738 3342145 2402362 1464986 99671 -263922 2771212 7864577 11059801 11731073
39089 11731073 12015443 10754612 4886552 -2963984 -6250763 -4978795 -5780877 -9573961
39081 -9573961 -8855337 -1090694 5258352 3983226 972311 3226604 6576762 3716624
39073C716624n989340n86968M719155K217632l482371n360042m182999k532275
39065a1480584J074400N675136N137294j391480n242961j163080L995167K449623
39057i46485k664867l960803j148208J573270L124928L753284J653000k337107
39049i52988k809930J512094L844747J42908l609029j765899J221075l64237k651137
39040e432396P1733L596766Q91883m352931l189533L016467M559405n52122m087315
39031e478043j412533K595870K990594J282250M52447N14904P87807R65791n34104
39022B164983m010385n225414q99344M101080K654749k698633k674767L797505
39014b790226P329853K904355k706337k457059P11666Q25883j124691r50402L95389
$$ plain form
39073 3716624 -2272716 -2859684 1859471 4077103 594732 -4765310 -8948309 -11480584
39065 -11480584 -10406184 -4731048 406246 -985234 -6228195 -7391275 -3396108 -946485
39057 -946485 -3611352 -7572155 -8720363 -7147093 -4022165 -268881 1384119 -952988
39049 -952988 -3762918 -2250824 1593923 1736831 -1872198 -3638097 -2417022 -2781259 -5432396
39040 -5432396 -5360663 -1763897 -872014 -5224945 -8414478 -5398011 -838606 -1390728 -5478043
39031 -5478043 -6890576 -4294706 -1304112 -21862 430585 945489 1733296 2699087 2164983
39022 2164983 -1845402 -7070816 -7970160 -3869080 -1214331 -3912964 -6587731 -2790226
39014 -2790226 4539627 7443982 4737645 2280586 2992252 3818135 2693444 1743042 2138431
39005B138431m48626j845237N9955L193063J696142l947898o101861j192935M382114
38996b066852L346277j961857l467499N74202L598691J192117k579901k288682
38988c653504M47471O69755j224316q14030J892438K277419m72926j817958k20642
38979b916293P4235k521242k866000K008385O444684M582212k22767j326250K75318
38970C532282j153723n144219n392545k37530M832686N494549L051275K06720
38962E189495j775319j363842K069542M965802L097659j301734j948169J413260
38954A0346694K115464k612049o949414n717606j862951m51748p18861P09441
38946e141030K971615L047269J722690J809496K311961L264m067825n196561k425646
$$ plain form
39005 2138431 1689805 -155432 -95477 3097586 4793728 845830 -5256031 -6448966 -2066852
38996 -2066852 1279425 -682432 -4149931 -3575729 22962 1215079 -1364822 -3653504
38988 -3653504 -3206033 -2536278 -3760594 -4574624 -2682186 -404767 -877693 -2695651 -2916293
38979 -2916293 -2842058 -5363300 -8229300 -6220915 223769 4805981 4583214 3256964 3532282
38970 3532282 2378559 -2765660 -8158205 -8395735 -3563049 1931500 4982775 5189495
38962 5189495 3414176 2050334 4119876 9085678 12183337 10881603 8933434 10346694
38954 10346694 12462158 9850109 2900695 -2816911 -4679862 -5131610 -5850471 -5141030
38946 -5141030 -2169415 877854 2600544 4410040 6722001 6725265 2657440 -2539121 -4964767
38937d964767k07605j363162k951264j490308J489900K372403J245678R05773
38929d963352J556568P90423j267521j193841J990323M288240K535080o01761
38921C134159j034758Q916j558000m950751m883628l3779M364152M182267J788781
38912A017359J115988J717793J302904N77277J287459J987554K53269k451549
38904F808054k529766j23023R26103j039079l368476l424495j847470n28034J69608
38895d956578R27739J921436K845963L471271L490930K566116R18322o97944j837008
38886H650247k716049l496114l466964j487821K147125M629027L134283r67086
38878F426648k729855k52285J976151m70654m758041m883749j156323O56694q21744
$$ plain form
38937 -4964767 -5172372 -6535534 -9486798 -10977106 -9487206 -7114803 -5869125 -4963352
38929 -4963352 -3406784 -2616361 -3883882 -5077723 -3087400 1200840 3735920 3134159
38921 3134159 2099401 2108317 550317 -4400434 -9284062 -9317841 -4953689 -771422 1017359
38912 1017359 2133347 3851140 5154044 5731321 7018780 9006334 9259603 6808054
38904 6808054 4278288 4155265 5081368 4042289 673813 -2750682 -4598152 -5126186 -4956578
38895 -4956578 -4028839 -2107403 738560 4209831 7700761 10266877 11185199 10487255 8650247
38886 8650247 5934198 2438084 -1028880 -2516701 -369576 4259451 7393734 6426648
38878 6426648 3696793 3444508 5420659 4950005 191964 -4691785 -5848108 -5191414 -6013158
38869f013158p97646K370236L679607N50970j795342J024980M692934L102947
38861F815528j694772l313818j278198k32976j089508l52430K292807K723819
38853C870452l13516k549203q28124K174951K427406M92153Q9336K279880L881766
38844A1525101K010289j609426k712934o55284L41476k122581l871120k04507
38836B701014N702395O464358J681313j528785J13743J667824o82246l259475
38828A2860141j840735J321118K047523P61496J95063Q93883K379301M525717
38820B3143507N616713M126372L442195P898292J3694768J3219597Q965108J0664864
38812I0771416J7558902K0862044K7467889N6359686R7400624J00332608L3660874
$$ plain form
38869 -6013158 -6810804 -4440568 -760961 -209991 -2005333 -980353 3712581 6815528
38861 6815528 5120756 1806938 528740 295764 -793744 -1146174 1146633 3870452
38853 3870452 3556936 1007733 179609 2354560 4781966 5274119 5363455 7643335 11525101
38844 11525101 13535390 11925964 9213030 8557746 8899222 6776641 2905521 2701014
38836 2701014 8403409 14867767 16549080 15020295 15134038 16801862 16119616 12860141
38828 12860141 11019406 12340524 14388047 15149543 15344606 16238489 18617790 23143507
38820 23143507 28760220 32886592 36328787 44227079 57921847 71141444 80106552 90771416
38812 90771416 108330318 129192362 156660251 213019937 310420561 410753169 444414043
38805D44414043o1511646j10118537q9822137m6791920k6611995k5750473k0699227
38798F3108108j0163667o292324p368524l969789O68722k447670r314915r122907
38790A5097034k921293j02624j361204j82328K668428Q29696l832609l080891
38782G114209K700403M354109n39084m035266j727171P52166j323981l817776
38774C477609j640280K634446L473397P07676j795712k313119j741844l29510
38766B472663K079785L918203L406515J482069M19285J50926j022890k271181
38758A0635375n66286L579014M691510k02881n925830n485695K06016M452984
38750A1384207M965234N175387O116950N069487K917092M058989P623040Q591382
$$ plain form
38805 444414043 382902397 272783860 182961723 136169803 109557808 83807335 63108108
38798 63108108 52944441 46652117 39283593 35313804 35982526 33534856 24219941 15097034
38790 15097034 12175741 12073117 10711913 10529585 13198013 14027709 10195100 7114209
38782 7114209 9814612 14168721 13629637 9594371 7867200 8619366 7295385 3477609
38774 3477609 1837329 4471775 7945172 8652848 6857136 4544017 2802173 2472663
38766 2472663 4552448 8470651 11877166 13359235 13778520 13929446 12906556 10635375
38758 10635375 10069089 13648103 18339613 18136732 12210902 6725207 6931223 11384207
38750 11384207 16349441 21524828 27641778 32711265 35628357 39687346 47310386 55901768
38742E5901768R109984J6188650K5947191K7316701K6998923M7274163Q3383638
38735B92121018Q8011801K7871178n9710338j02414444p9966444l9687308k4622804
38728A01602659k5915596j8649256o611230o037351j1784268q719253m65381n68331
38720B2851993o346962n355504O39654M38303m300205k736497L682853L568365
38712A2442000l309361o044577k251702j37605j590078M8345M987521N593251
38704I737794J206605k41361K958387L546498p27709l302735j281138K62865j136745
38695A1022461j536370L43044N65735j479435j631706N16779Q84271p38895r30531
38686G015353q56622m040098o789726k490713M990460N031373k106657n012972
$$ plain form
38742 55901768 65011752 81200402 107147593 134464294 161463217 208737380 292121018
38735 292121018 380132819 408003997 348293659 245879215 165912771 126225463 101602659
38728 101602659 75687063 57037807 50426577 44389226 32604958 23885705 23420324 22851993
38720 22851993 16505031 11149527 11789181 12227484 7927279 5190782 8873635 12442000
38712 12442000 9132639 3088062 836360 698755 -891323 -842978 4144543 9737794
38704 9737794 10944399 10703038 13661425 17207923 16480214 13177479 11896341 12159206 11022461
38695 11022461 9486091 9829135 10394870 8915435 7283729 7800508 8684779 7945884 7015353
38686 7015353 6158731 2118633 -4671093 -7161806 -2171346 2860027 753370 -4259602
38678d259602j08633L492328J172274o6251L251539L577663k726068o690762k026893
38669d384405L099169q4114n787706l660866M320157Q434462O472662L460358
38661A1869717Q72297l351537p118154o086305j635606P97017p8606j173723j067743
38652f972643n37233P77916K877530L003607j53833k641777q26718K258248J771474
38643d43429p40808l39812K443258K608782m75269j932312N45898L185592K007572
38634F859472k036371n229962n325798k442083J941177N663927O777195M688857
38626A0896414O30060k651861k416292J110090L815466K231437j525652k676148
38618I413514j145338j288045l791867l637200J517685O368113N183996k04069
$$ plain form
38678 -4259602 -4368235 -875907 296367 230116 3481655 7059318 4333250 -2357512 -4384405
38669 -4384405 -1285236 -1369350 -7157056 -10817922 -6497765 1936697 8409359 11869717
38661 11869717 12742014 9390477 2272323 -3813982 -5449588 -4652571 -4731177 -5904900 -6972643
38652 -6972643 -7509876 -6731960 -3854430 -850823 -1004656 -3646433 -4473151 -2214903 -443429
38643 -443429 -1184237 -1524049 919209 3527991 3052722 1120410 1666308 4851900 6859472
38634 6859472 4823101 -406861 -5732659 -8174742 -6233565 -569638 6207557 10896414
38626 10896414 11526474 8874613 6458321 7568411 11383877 13615314 12089662 9413514
38618 9413514 8268176 6980131 3188264 -448936 1068749 7436862 12620858 12416789
38610A2416789l746936l202044p83955J414540K521676J462778j647968m001622
38602D433258l208474q48323k64018j854031k873938j177314K440547M955109
38594A602816L633971q41814l941027k181391K004044L435288J616641O82675
38586F011203K052331K448824J84683k048784k358529k345363k726545j599534
38578c81714Q58145J482192J05551N65397L386181L987998J027510p00209P02304
38569A1033355K50605m011999n557879m76710M144940J333167l683131k458023
38561E74325J831504R1785o298731p152448K0283O767359P087936L698036K59582
38552F879631k800966l536706Q13159O305613M541344m785109j1736622r406554
$$ plain form
38610 12416789 8669853 5467809 4683854 6098394 8620070 10082848 8434880 4433258
38602 4433258 1224784 376461 112443 -1741588 -4615526 -5792840 -3352293 1602816
38594 1602816 5236787 4394973 453946 -1727445 276599 3711887 5328528 6011203
38586 6011203 8063534 10512358 10697041 8648257 6289728 3944365 1217820 -381714
38578 -381714 476431 1958623 2064174 2629571 6015752 10003750 11031260 10331051 11033355
38569 11033355 11283960 7271961 1714082 1237372 5382312 6715479 3032348 574325
38561 574325 2405829 2497614 -3801117 -10953565 -10933282 -4165923 2922013 6620049 6879631
38552 6879631 4078665 541959 1355118 7660731 12202075 7416966 -4319656 -13726210
38544a3726210j705269M745402Q419503R256987N515696r84906l744026r18588
38536F858589P92046l039732o558521l053585L568938M790875P33458j303889
38528B788179P11724J446050j415069k863271R31625N932566N687148l9898n378904
38519G800150n451517j080961K933453L002779K67307j122334N20611J938799
38511H808287n33736n193142o560390k786083J603590J816397q03764j137185
38503d786026K105796M503540K384275j848304l248193j270865K40886n97093
38495b515984j395810l70564N75657r5630j85619K091178L720899J171971l112690
38486a16592l675503l61194J798060P78395r6154J181003K063079Q31350j20357
$$ plain form
38544 -13726210 -15431479 -10686077 -2266574 6990413 12506109 11521203 7777177 6858589
38536 6858589 7650635 4610903 -1947618 -5001203 -1432265 3358610 4092068 2788179
38528 2788179 3499903 4945953 3530884 667613 1599238 7531804 13218952 13179054 7800150
38519 7800150 2348633 1267672 4201125 7203904 7471211 6348877 6869488 8808287
38511 8808287 8274551 3081409 -3478981 -6265064 -4661474 -2845077 -3648841 -4786026
38503 -4786026 -2680230 1823310 4207585 2359281 -888912 -2159777 -1918891 -2515984
38495 -2515984 -3911794 -4282358 -3706701 -3802331 -3987950 -1896772 1824127 2996098 -116592
38486 -116592 -3792095 -4153289 -2355229 -1576834 -1672988 -491985 1571094 2402444 2282087
38477B282087Q52858J289110n89735k092469q11405Q72339L12666j39699K459028
38468D434780N066556K540020l595106o486761l692630K72448J585212J678018
38460A802537K673089L307323J883365m60011j784703j700408J5363L791340P325232
38451A6853127O018549o62133o455282n589867l51729K658544J980710K230118
38443A6682037N945109R272071P309662N48909n977314q172613o040681k648139
38435A6919041j169326k297881l903462l612385j619830j75805o26381k126352
38427A387619l046401k415536k47381K223945L010981J585840J16342O95558K009291
38418E320258J187817j458907k568731p66079J590495K336896J923692R18298
$$ plain form
38477 2282087 3134945 4424055 3834320 1741851 930446 1802785 2115451 1975752 4434780
38468 4434780 9501336 12041356 8446250 1959489 -1733141 -1460693 124519 1802537
38460 1802537 4475626 7782949 9666314 9206303 7421600 5721192 5736555 9527895 16853127
38451 16853127 22871676 22209543 15754261 10164394 9812665 12471209 14451919 16682037
38443 16682037 22627146 31899217 39208879 39757788 33780474 25607861 19567180 16919041
38435 16919041 15749715 13451834 9548372 5935987 4316157 4140352 3513971 1387619
38427 1387619 -1658782 -4074318 -4321699 -2097754 913227 2499067 2615409 3310967 5320258
38418 5320258 6508075 5049168 2480437 1714358 3304853 5641749 7565441 8483739
38410H483739j386723m205873m592064j833170O78321N27513m6444J345063K466578
38401A436940M10351k462090j672264J852885K782325m56716l554729k910522
38393d573820J7759K003354K116754J340017Q58137J477823K610317K084044o75840
38384G258545k453036n00002K549853K453735N44746J318397L644876J708344
38376A6525458m337775o637926j701431L288808J192181m427933n573562j787947
38368c460127J129943J006796O31743R76342L1386j911791j888232L26836J458038
38359a699066J05641j370477j006250M68237J942590L005845K479689m22114l118667
38350C85428j792100K653909M677254J609075k545244k956223n60873R6925k197119
$$ plain form
38410 8483739 7097016 2891143 -1700921 -3534091 -2855770 -2328257 -2374701 -1029638 1436940
38401 1436940 1847291 -614799 -2287063 -434178 2348147 1891431 -1663298 -4573820
38393 -4573820 -4556061 -2552707 -435953 904064 1762201 3240024 5850341 7934385 7258545
38384 7258545 4805509 4305507 6855360 9309095 9853841 11172238 14817114 16525458
38376 16525458 12187683 5549757 3848326 7137134 8329315 3901382 -1672180 -3460127
38368 -3460127 -2330184 -1323388 -691645 284697 316083 -1595708 -3483940 -3157104 -1699066
38359 -1699066 -1593425 -2963902 -3970152 -3501915 -1559325 1446520 3926209 3504095 385428
38350 385428 -1406672 1247237 5924491 7533566 4988322 2032099 1471226 1568151 -628968
38341f28968l724601j203666L375089M628007L58622n003547n139523K58173M909558
38332b170856M201336Q77193P7485J750079J960890k45922j995464j784391r60059
38323A710291k18939R09890J127480j275841l782974j733399L791671N912892
38315F441071K047940j862776r05425Q48052k379178p380126o037562J823174
38307g404830P283037M603320j854529m939698l541192j123501L64383J284652
38299e328358J516935O39476j79090M89093J626328R96781j082507j645813P74925
38290b192230L881198M427683K042693p71996j734650r25638k3062q2286m20917
38281D200795J97888J527900J801199J68557j784077k087157j156859p78448q18168
$$ plain form
38341 -628968 -4353569 -5557235 -2182146 2445861 2804483 -2199064 -7338587 -7080414 -2170856
38332 -2170856 2030480 2907673 2985158 4735237 6696127 6450205 4454741 2670350 1710291
38323 1710291 1491352 2401242 3528722 2252881 -1530093 -3263492 528179 6441071
38315 6441071 8489011 6626235 5720810 6568862 4189684 -3190442 -9228004 -7404830
38307 -7404830 -121793 4481527 2626998 -2312700 -5853892 -6977393 -6613010 -5328358
38299 -5328358 -3811423 -3171947 -3351037 -2861944 -1235616 -238835 -1321342 -2967155 -2192230
38290 -2192230 1688968 6116651 8159344 7387348 5652698 4727060 4703998 4621712 4200795
38281 4200795 4398683 5926583 7727782 7896339 6112262 4025105 2868246 2089798 1271630
38272A271630N24093K756987K376494j971581n991869m478178J465194N179126
38264A131896K677009k569347m130971j65229M836117N229224M37753m186173
38256C260279l291525J771289M206242Q28414l066354j114460M255181M635473
38248A1484539k099884q268110o959349r35115K451739J233393o25622k35074
38240c953483J193978J597375P53152l61209o62298L67063J626770J060260j139379
38231D82229j759961Q28520L319954J852843j822346k487108P94035L293007J694508
38222F195681j345688j651007M03382J090075q09822k346505r26175J777563K149412
38213D536916r257q96820J646056M258635K372515k964671o069934m247417o77953
$$ plain form
38272 1271630 1795723 4552710 6929204 4957623 -1034246 -5512424 -4047230 1131896
38264 1131896 3808905 1239558 -2891413 -3056642 1779475 7008699 7446452 3260279
38256 3260279 -31246 1740043 5946285 6774699 3708345 2593885 6849066 11484539
38248 11484539 9384655 1116545 -5842804 -6777919 -4326180 -3092787 -3718409 -3953483
38240 -3953483 -2759505 -1162130 -408978 -770187 -1432485 -1065422 561348 1621608 482229
38231 482229 -1277732 -449212 2870742 4723585 2901239 414131 1208166 4501173 6195681
38222 6195681 4849993 3198986 3602368 4692443 3882621 1536116 609941 2387504 4536916
38213 4536916 4527659 3630839 5276895 9535530 11908045 8943374 2873440 -1373977 -2051930
38204b051930R81568R51221P57871K23734o46191l29786R91002L81830k699662
38195a440343m018471j066144J998799P75366j718252L3665M336179M796432J032952
38186D730183j085575O8579n21702m528943o006533j190007M182487L001167k436953
38177c787297l955753P57332N789519N669285J574229j746365j979699r09938
38169A411313j390110l409827l566830M51264N399814N402748N2960m047148k065743
38160a761559K298553K561126r04108k213332K21710J420947j357083l492650
38152c226396n63239L462098J578519m700654o286858n6675N663936L261218k522156
38143c390207j977053M377301O891184K184868k340505j567281m20834l280844
$$ plain form
38204 -2051930 -1070362 -119141 638730 862464 216273 -113513 877489 1259319 -1440343
38195 -1440343 -5458814 -6524958 -4526159 -3750793 -5469045 -5435380 -1099201 3697231 4730183
38186 4730183 3644608 3713187 3191485 -1337458 -7343991 -8533998 -4351511 -1350344 -3787297
38177 -3787297 -7743050 -6985718 -1196199 4473086 6047315 4300950 2321251 1411313
38169 1411313 21203 -3388624 -6955454 -6504190 -1104376 4298372 4351332 304184 -1761559
38160 -1761559 536994 3098120 2194012 -19320 202390 1623337 266254 -3226396
38152 -3226396 -3789635 -327537 1250982 -3449672 -9736530 -9793205 -4129269 -868051 -3390207
38143 -3390207 -5367260 -989959 5901225 8086093 5745588 4178307 3757473 476629
38135D76629m616123J315473Q110993N320130m547693q550212k481447L607812
38127a364438J452293l938737l802936J222392M009708K101659n45725o95803
38119a561587N55843P75605m89680j472568j42392K949590M106462Q80229l613181
38110A988321m137745p19130J636338O24498q93587p17405j18560M77589K751399
38101H91718N330206L548443k464217n543045j578584L752466L394303r76524
38093F354766l024475j646883l40278J07253J518949K884479J549116j064008
38085F338919q58833K072970L309040R61089k013668k762222j709682k94817R32241
38076E975037J408859O18786o21618j111991j149760j492561j494838m96425L26877
$$ plain form
38135 476629 -4139494 -2824021 5286972 10607102 6059409 -2490803 -4972250 -1364438
38127 -1364438 87855 -3850882 -7653818 -6431426 -2421718 -320059 -865784 -1561587
38119 -1561587 -1005744 -230139 -719819 -2192387 -2334779 614811 4721273 5601502 1988321
38110 1988321 -2149424 -2868554 -1232216 -607718 -1501305 -2218710 -2337270 -1859681 891718
38101 891718 6221924 9770367 7306150 1763105 184521 3936987 7331290 6354766
38093 6354766 3330291 1683408 1343130 1450383 2969332 5853811 7402927 6338919
38085 6338919 5480086 7553056 10862096 11823185 9809517 7047295 5337613 5042796 5975037
38076 5975037 7383896 8002682 7381064 6269073 5119313 3626752 2131914 1635489 1962366
38067A962366o0410l77030N14961R08090q72854k829242k114792R9840L52678
38058b416393j683639l049729j885669R83567L671317M025022Q89755k931489
38050b397258k089905L732827P459029M005132k181807m276058l194733l601477
38042b544250m046993k3204N816032O337981J856591m82479P95869j60515m559324
38033B989708n889160j538912K572933K649802K545210M255924K823197l450287
38025F958415p209596l616547J040258L38931j101722K982206P527314M070733
38017A0989992l837184n572484n82571J932538q44409k083660J088083K823704
38009C914009J74661j534527P42200J641940k586737o325405l515084K317238
$$ plain form
38067 1962366 1901956 1524926 2039887 2947977 2075123 -754119 -2868911 -2769071 -2416393
38058 -2416393 -4100032 -7149761 -9035430 -8051863 -4380546 -355524 534231 -2397258
38050 -2397258 -4487163 -754336 6704693 10709825 8528018 4251960 1057227 -2544250
38042 -2544250 -6591243 -6614447 -798415 5539566 7396157 6913678 7709547 7549032 2989708
38033 2989708 -2899452 -4438364 -1865431 784371 3329581 7585505 10408702 6958415
38025 6958415 -251181 -3867728 -2827470 -2488539 -3590261 -608055 6919259 10989992
38017 10989992 7152808 1580324 997753 2930291 2085882 2222 1090305 3914009
38009 3914009 4088670 2554143 3296343 4938283 2351546 -3973859 -7488943 -5171705
38001e171705M097294K148716J683641K981817J768830k253838m403841k612448
37993a761534j49863J88190j29599J104754L176529M077805L236955J087439k065745
37984H764931n230431o312851m190458n09085J911127K245746K215834L344829
37976B239642M592803L581366n9407l715838m683122l024355o43197J363606K820581
37967B472079K897885Q73323j640107j860198J70420J265866k17538j934630j418342
37958F08758K0796l19793j962394j902538Q12339L592247L417429k7227m016945
37949B22672m641224k08174N828719P074038J543204m850813n112212k3127L578774
37940C411857K437491J9890k97874P8027q50541j507027j43102J221269J86510
$$ plain form
38001 -5171705 -1074411 1074305 2757946 5739763 7508593 5254755 850914 -1761534
37993 -1761534 -1911397 -1723207 -1852806 -748052 2428477 6506282 9743237 10830676 8764931
37984 8764931 3534500 -2778351 -6968809 -7477894 -5566767 -3321021 -1105187 2239642
37976 2239642 6832445 10413811 10354404 6638566 1955444 -1068911 -1712108 -348502 2472079
37967 2472079 5369964 6243287 4603180 2742982 2913402 4179268 3961730 2027100 608758
37958 608758 629554 309761 -1652633 -3555171 -2742832 849415 4266844 4239617 222672
37949 222672 -4418552 -4626726 1201993 8276031 9819235 4968422 -143790 -166917 3411857
37940 3411857 5849348 5869238 5571364 5649391 4798850 3291823 3148721 4369990 4556500
37931D556500j453361p14513J184651J010294n55549l48960P84169j092764n032322
37922a661855m611255J951372O933164L200988m955239p155159j098982N092124
37914b304842M865247J181315q5907O27259j133490n109651n825238j135890L847458
37905e073739L868754Q43016K07001K188388J770156k667341n944138l575020
37897h382923J643179M183986L645658L345895L292244M43281m325621n630384
37889a784685j605357K741303K887124R53008R88683K035132N23798k871972l768706
37880I8328p03604K926653L676538J715093n34185j136547k8045Q14883o37392
37871F191722l077993k487543J862647M871615K476406j746691j701817J574591
$$ plain form
37931 4556500 3103139 2388626 3573277 4583571 4028022 3679062 4463231 3370467 -1661855
37922 -1661855 -6273110 -4321738 2611426 5812414 857175 -6297984 -7396966 -2304842
37914 -2304842 2560405 3741720 3655813 4283072 3149582 -1960069 -7785307 -8921197 -5073739
37905 -5073739 -1204985 -361969 -154968 2033420 3803576 1136235 -4807903 -8382923
37897 -8382923 -6739744 -2555758 1089900 4435795 7728039 8171320 3845699 -1784685
37889 -1784685 -3390042 -648739 2238385 3191393 4180076 6215208 6739006 3867034 98328
37880 98328 -605276 2321377 5997915 7713008 7178823 6042276 6014231 6829114 6191722
37871 6191722 3113729 626186 2488833 7360448 9836854 8090163 6388346 7962937
37863G962937J489311l464854p242696n539494j363966R49247J672047K425447
37855c112021J935765q36477l034552j660468J596524L078996K447814J654170
37847B069751P79343j247856l319828l231914j125547J157663K950905M188004
37839B220521L633870R54870j057284L8528K046389J215226j690675k794975j672393
37830B894077j582630l267156l620742j308727J155145K170773L105312L956182
37822C502234K016423k509411m467780j093148K834657J729567k360213l326847
37814c674518m33272J854576K069741L066537M776872K564048m465385r336831
37806c578232n965355J771037M895760J196883l116963l076020q00760k27381
$$ plain form
37863 7962937 9452248 5987394 -1255302 -6794796 -8158762 -7209515 -5537468 -3112021
37855 -3112021 -1176256 -2012733 -5047285 -6707753 -5111229 -2032233 415581 2069751
37847 2069751 2849094 1601238 -1718590 -4950504 -6076051 -4918388 -1967483 2220521
37839 2220521 5854391 6809261 5751977 5790505 7836894 9052120 7361445 4566470 2894077
37830 2894077 1311447 -1955709 -5576451 -6885178 -5730033 -3559260 -453948 3502234
37822 3502234 5518657 3009246 -1458534 -2551682 282975 2012542 -347671 -3674518
37814 -3674518 -4107790 -2253214 -183473 2883064 7659936 10223984 5758599 -3578232
37806 -3578232 -9543587 -7772550 -2876790 -1679907 -4796870 -7872890 -8673650 -8901031
37798h901031o49668J103295M681121O305031M218809Q24558j014700j224327
37790E343088j053517m67738J156503K749744K028340j452127n015842n455278
37782b166827k504489R38053K106187J305268R66300K026498K498638M61367k579138
37773C051857l145692n75067J697147O75777k001471k281950O13110K913455J195261
37764B142427l101808n283135k845717J921382M818780M209798K011042Q15636
37756D688405J099388J472106P64387q55473k368690k844836k231596j636683
37748a912992k135106k807621j300967K442452M691354K577053j031337p68902
37740b46066L449521O000345L688254o5554j191243q29498j920914l654047l623994
$$ plain form
37798 -8901031 -9550699 -8447404 -3766283 2538748 6757557 7582115 6567415 5343088
37790 5343088 4289571 3821833 4978336 7728080 9756420 8304293 3288451 -2166827
37782 -2166827 -4671316 -3733263 -1627076 -321808 644492 2670990 5169628 5630995 3051857
37773 3051857 -93835 -668902 1028245 1704022 -297449 -2579399 -1966289 947166 2142427
37764 2142427 -959381 -6242516 -9088233 -7166851 -2348071 1861727 3872769 4688405
37756 4688405 5787793 7259899 8024286 7168813 4800123 1955287 -276309 -1912992
37748 -1912992 -4048098 -6855719 -8156686 -5714234 -1022880 1554173 522836 -246066
37740 -246066 3203455 9203800 12892054 12826500 11635257 10805759 8884845 5230798 1606804
37731A606804k688484k847244k515614O60210L893296K413712k014720k595015
37723d087055J692399M005840P88310k256933K14595M020416K274168l247061
37715C404679m985360j334723K046991J890091R75049J332906N72239k581629
37707A320243m628285k538128J388656L289937L147822K964782K209028q90844
37699F263211m871560n770684k395907J906207L227093J168371j240954o21205
37691b335428L420049P128470N773603o85028o350648n828492q91519J911720
37683B142727j86571l199865k556443R20218L030417J923065o07500k313790k573925
37674c421667j680482j42773J127046J433525J294127J651938K180229J727483
$$ plain form
37731 1606804 -1081680 -3928924 -6444538 -5784328 -1891032 522680 -1492040 -4087055
37723 -4087055 -2394656 1611184 2399494 142561 357156 4377572 6651740 3404679
37715 3404679 -1580681 -2915404 -868413 1021678 1996727 3329633 3901872 1320243
37707 1320243 -3308042 -5846170 -4457514 -1167577 1980245 4945027 7154055 6263211
37699 6263211 1391651 -4379033 -6774940 -4868733 -1641640 -473269 -1714223 -2335428
37691 -2335428 1084621 8213091 13986694 13301666 6951018 1122526 231007 2142727
37683 2142727 1956156 -1243709 -3800152 -2879934 150483 2073548 1466048 -847742 -3421667
37674 -3421667 -5102149 -5244922 -4117876 -2684351 -1390224 261714 2441943 4169426
37666D169426L95873m19355k17164J18832K84260Q72074J077621j206310n294989
37657b19732o450009j716395M904721O806100L198937q51674k214400k613059
37649H44489l164337j540476K766861N192409K212236k786506m248679k335953
37641c059956j188689j516912o15699J331709J115870j094098j209900J632257
37633d605418L109271R98242j070411r6580J298839K73617o84394J387825L550634
37624D161625J428247k749646l111819L52230K009367L9320j170674P69284K210034
37615C937968J93157k510008k631951j834806k638770k983486J3799L749661L340068
37606a364368k56054j188774K158517M684950K684046p73867j478680p57862k198487
$$ plain form
37666 4169426 4565299 4145944 3928780 4047612 4331872 5203946 6281567 5075257 -219732
37657 -219732 -6669741 -8386136 -3481415 3324685 6523622 5671948 3457548 844489
37649 844489 -2319848 -3860324 -1093463 4098946 6311182 3524676 -724003 -3059956
37641 -3059956 -4248645 -5765557 -6381256 -5049547 -3933677 -5027775 -6237675 -4605418
37633 -4605418 -1496147 -497905 -1568316 -1664896 -366057 -92440 -776834 610991 4161625
37624 4161625 5589872 2840226 -271593 80637 2090004 2129324 958650 1727934 3937968
37615 3937968 4131125 1621117 -1010834 -2845640 -5484410 -8467896 -8454097 -4704436 -1364368
37606 -1364368 -1620422 -2809196 -650679 4034271 6718317 5944450 4465770 3707908 1509421
37597A509421m523083l072952K231256N632439L516465o98478k096810j070374
37589A427884r63900j600634j27583K536741J681192l378586o492198k907745
37581i824829L468478N345349K100294m98551L89778J236049r30619l238851j640483
37572c593385K460206L969693J085286k718737l404909o66230K649861L655582
37564C437367J668456j370036k416777k05470L185935M391345K445292l95363
37556A0740749j612917j140554m87940j71180M99781J259418M42258k280325m369348
37547B879942l552895j296653n00521o36269R58827K967079O02017n633559p517108
37538a1729140l25953Q300698P751095l45229m779954j628099J232145j676841
$$ plain form
37597 1509421 -3013662 -6086614 -3855358 1777081 5293546 4595068 2498258 1427884
37589 1427884 463984 -1136650 -1264233 1272508 2953700 -424886 -6917084 -9824829
37581 -9824829 -6356351 -1011002 1089292 590741 980519 2216568 1285949 -1952902 -3593385
37572 -3593385 -1133179 2836514 3921800 1203063 -2201846 -2868076 -218215 3437367
37564 3437367 5105823 3735787 1319010 1113540 4299475 8690820 11136112 10740749
37556 10740749 9127832 7987278 7499338 7328158 7827939 9087357 9529615 7249290 2879942
37547 2879942 -672953 -1969606 -2470127 -3106396 -2147569 819510 1421527 -4212032 -11729140
37538 -11729140 -12055093 -3754395 3996700 3651471 -1128483 -2756582 -1524437 -3201278
37530c201278m491947m92114O367714P631790K816419j720765k927675k894060
37522A088084k802430j885729j114232j784965j669347J471039M072351J215005
37514a410224m309828n046667p01562J540946m97631m59703M497051P370904K635057
37505C618343m025088m569984r66568l50377k464058j340693K896265L749204
37497c452956p7745k071976J013035L730069J405048j911243l01025M236973N018773
37488G588953Q14490l295824m021713l181503k737024j656679O33913J762317
37480d093070q376k399847k143096K60183J541707M96672q63667o88481O43281
37471g254694J939734K474357J661727k97223j279917N25173K821770J140835
$$ plain form
37530 -3201278 -7693225 -8185339 -1817625 5814165 8630584 6909819 3982144 1088084
37522 1088084 -1714346 -3600075 -4714307 -6499272 -8168619 -6697580 -2625229 -1410224
37514 -1410224 -5720052 -10766719 -11468281 -9927335 -10424966 -10884669 -6387618 983286 3618343
37505 3618343 -406745 -4976729 -5943297 -6293674 -8757732 -10098425 -7202160 -3452956
37497 -3452956 -3530701 -5602677 -4589642 -859573 545475 -1365768 -1666793 2570180 7588953
37488 7588953 8403443 5107619 1085906 -2095597 -4832621 -6489300 -5855387 -4093070
37480 -4093070 -4101446 -6501293 -8644389 -8384206 -6842499 -6345827 -7209494 -7897975 -7254694
37471 -7254694 -5314960 -2840603 -1178876 -1476099 -2756016 -2230843 590927 1731762
37463A731762m088326o449707k274649L541493M632221K398564K336963L923920
37455E752241J877199l126650l694291K155759O294956K379142m428759n569376
37447A640221j474692J159528N79652O31906K199812J917695o16432j588302j52496
37438D296892m01633l948799o252841l573573R49959K033601j48393j217522L36024
37429g926285J454605q3841j795012K12389N163739P172759K338145n079577o913882
37420e456960j863396K404169K55708l718336k311400K866476M684240K441120
37412f98379J809742L601199K298631k612671l884489Q49348L261560k272852
37404B352089p804340l163490P786144J2213837O313882j616566m734218m725846
$$ plain form
37463 1731762 -2356564 -8806271 -11080920 -7539427 -2907206 -508642 1828321 5752241
37455 5752241 7629440 4502790 808499 2964258 9259214 11638356 7209597 1640221
37447 1640221 165529 1325057 1904709 2536615 4736427 6654122 6037690 4449388 4296892
37438 4296892 3895259 -53540 -6306381 -9879954 -8929995 -6896394 -7044787 -8262309 -7926285
37429 -7926285 -6471680 -6555521 -8350533 -8138144 -2974405 4198354 6536499 1456922 -5456960
37420 -5456960 -7320356 -4916187 -4660479 -8378815 -10690215 -7823739 -3139499 -698379
37412 -698379 1111363 4712562 7011193 4398522 514033 1363381 4624941 2352089
37404 2352089 -5452251 -8615741 -829597 11384240 17698122 16081556 11347338 6621492
37396F621492m663366l434213k4380K868433K467417p31764m570671o717686m685498
37387a2870236J281153N772479L776478j714962l390408m41505J262499m2635
37379f367137M71217L946737M181206j375924n444725k029979L561688L432464
37371C75547k74659l75627K306400J121525l431716l708184J589126M195615l30688
37362A467339m886241j732790N509570P319835J834391l657359l427489J69576
37354B596832J513168j008665m257903m767542k224277Q22160J714715J06207
37346e505305j987101k269098l08424K085042K565312P96926p46467M69105L322455
37337a577555L728892O468m256356m528008j069514K059232K689730K226775J854900
$$ plain form
37396 6621492 1958126 -1476087 -1500467 1367966 3835383 3103619 -1467052 -8184738 -12870236
37387 -12870236 -11589083 -5816604 -2040126 -3755088 -7145496 -7587001 -6324502 -6367137
37379 -6367137 -5895920 -1949183 2232023 856099 -4588626 -6618605 -3056917 375547
37371 375547 100888 -274739 2031661 3153186 -278530 -3986714 -2397588 1798027 1467339
37362 1467339 -3418902 -5151692 357878 7677713 9512104 5854745 2427256 2596832
37354 2596832 4110000 3101335 -1156568 -5924110 -8148387 -7326227 -5611512 -5505305
37346 -5505305 -7492406 -9761504 -10069928 -7984886 -5419574 -4622648 -5369115 -4900010 -1577555
37337 -1577555 2151337 2157805 -2098551 -6626559 -7696073 -5636841 -2947111 -720336 1134564
37328A134564N03393k104264l131645Q7073N439035P190155K390485n181743q630559
37319b303506n118062J834511P181087R239860Q373489L712428m599602j1156965
37311G163240r158798j3525O313450L565536k944556m605664r86590K255177K970282
37302D558552L234771K877893k46098m161915m151774p24202N74277j585870k097342
37293a721708J437626M081512J634719k422725k607616K24610J007961j786770
37285a52391m780864m557913r12444L586390N550491L849262J437943J661980
37277E682454K789604M01066m415838n090352K07174M657054K784592j599333
37269E416421k406583p80138j331980l210380k166360J066364J682209j007428
$$ plain form
37328 1134564 1637957 -466307 -3597952 -3510879 1928156 9118311 11508796 6327053 -2303506
37319 -2303506 -7421568 -5587057 1594030 10833890 19207379 22919807 18320205 7163240
37311 7163240 -1995558 -2009083 4304367 7869903 4925347 319683 -666907 1588270 4558552
37302 4558552 7793323 10671216 10425118 6263203 2111429 1387227 1961504 375634 -1721708
37293 -1721708 -284082 3797430 5432149 3009424 401808 626418 1634379 -152391
37285 -152391 -4933255 -9491168 -10403612 -6817222 -1266731 2582531 4020474 5682454
37277 5682454 8472058 8873124 4457286 -633066 -425892 4231162 7015754 5416421
37269 5416421 3009838 2229700 897720 -2312660 -4479020 -3412656 -1730447 -2737875
37261b737875k756579j456361O01636J559992K150093K809699K801631K205146
37253E177382J412616m46391l242710l908743q30313K131820R08171j936096j410423
37244b144687J316217J555243K96872K305242N772576L480708m347846q059804
37236A74521k908156L456554K845338j789629k763970L47803K094275N01285j451074
37227E06947j334040P40034L512621M296275L63082n857564p024286o76738N635283
37218A61614M459858o91020j434749K187492K925316r53660l225116o21686K176321
37209D984370Q91769j941602k213272l65813J139485J963499K193092N02645k681573
37200D472600l787159j231387J367187N45801j721918j919878q50014q94258l83513
$$ plain form
37261 -2737875 -5494454 -6950815 -6349179 -4789187 -2639094 170605 2972236 5177382
37253 5177382 6589998 6143607 2900897 -1007846 -1838159 293661 1201832 -734264 -2144687
37244 -2144687 -828470 726773 1023645 3328887 9101463 12582171 8234325 174521
37236 174521 -2733635 722919 3568257 1778628 -985342 -637539 1456736 1958021 506947
37227 506947 -827093 -87059 3425562 7721837 8084919 2227355 -4796931 -5473669 161614
37218 161614 4621472 3930452 2495703 4683195 7608511 6654851 3429735 2808049 4984370
37209 4984370 5876139 3934537 1721265 1355452 2494937 4458436 6651528 7154173 4472600
37200 4472600 685441 -545946 821241 1367042 -354876 -2274754 -3124768 -4019026 -4402539
37191d402539L341672P047405M717102k423746o073692k807064R91496m49551
37183e8917l428283j804253K372217K596375q25058j455112K120816M086288J585370
37174E189443p16708P09130K110245m53479l769198k929455L36475R70339j031980
37165D14812j874152j226867j720114k642994p64835L063162M472292K812872
37157B534176J736334K216974J254394j571395k612432q09144L26066o22607m89513
37148A962853J820554K500044j20228j896887j37373J570061L70136k37868K439997
37139H271289L564945j329826o669540m066562L761865N972240k51711o024895
37131C227805m565167J15025J575156N26063J055749K524039J040918l369005
$$ plain form
37191 -4402539 -1060867 5986538 10703640 8279894 2206202 -600862 390634 -58917
37183 -58917 -3487200 -5291453 -2919236 -322861 -1147919 -2603031 -482215 3604073 5189443
37174 5189443 4472735 5181865 7292110 6838631 3069433 139978 476453 1446792 414812
37165 414812 -1459340 -2686207 -4406321 -7049315 -7814150 -4750988 -278696 2534176
37157 2534176 4270510 6487484 7741878 6170483 3558051 2748907 3074973 2452366 1962853
37148 1962853 3783407 6283451 6163223 4266336 4128963 5699024 6069160 5831292 8271289
37139 8271289 11836234 10506408 3836868 -229694 3532171 9504411 9252700 3227805
37131 3227805 -1337362 -1222337 352819 878882 1934631 4458670 5499588 2130583
37123B130583o050895l841151J174051M292067L105596l07856j694822N61276
37115f31151L385920K921218k88001k192733j012784O73908K22117j382166j593589
37106A02739j71058Q34505M6230j740067k769963k166948m90812J166979K252489
37097b935906K573269J626179n16697j805182M3063L638325M400958P08469l055672
37088D676806k356746Q15998Q91763k844307n030308j849062L731668N809396
37080C845208K435810k778772m853038k337306J619463K995007J486324K18287
37072B630983Q68532J488147K46653j424313j491486o01294k22734R2450Q88014
37063B474952P42496r34038j674384M9714J416852k29854k477396k068724q14546
$$ plain form
37123 2130583 -3920312 -7761463 -6587412 -2295345 810251 502395 -1192427 -631151
37115 -631151 2754769 5675987 5387986 3195253 2182469 2856377 3078494 1696328 102739
37106 102739 -68319 766186 812416 -927651 -3697614 -5864562 -6355374 -5188395 -2935906
37097 -2935906 -362637 1263542 746845 -1058337 -1015274 2623051 7024009 7732478 4676806
37088 4676806 2320060 3136058 4027821 1183514 -3846794 -5695856 -1964188 3845208
37080 3845208 6281018 3502246 -1350792 -3688098 -2068635 926372 2412696 2630983
37072 2630983 3499515 4987662 5234315 3810002 2318516 1717222 1494488 1586938 2474952
37063 2474952 3217448 2283410 609026 658740 2075592 1845738 -631658 -2700382 -3514928
37054c514928j642561j916933K261909P471347O766414Q47548l070318l053110
37046D149368l839723n968694l878676K610941N385106J134500k437472M83208
37038b361442L971947J131507l559295k195910K608241K383837k606196m301769
37030d929080n51446K494974J647281P06502J816896J494654j891401m035844
37022c247464j886492Q44674l76847l610951l494625P72109M396661L302134j072849
37013d373650l572040j053623L997235O099048L182446j099653k344269n78827
37005B56667J323788K137133K463534K281686J415795R95521J394210L34202l463736
36996I138800o331559l627959L005579O606900L373830l179319o854745m930575
$$ plain form
37054 -3514928 -5157489 -7074422 -4812513 2658834 9425248 10272796 7202478 4149368
37046 4149368 309645 -5659049 -9537725 -6926784 -1541678 -407178 -2844650 -2361442
37038 -2361442 1610505 2742012 -817283 -3013193 -404952 1978885 -627311 -4929080
37030 -4929080 -5480526 -2985552 -1338271 -631769 1185127 2679781 788380 -3247464
37022 -3247464 -5133956 -4289282 -4666129 -8277080 -11771705 -10999596 -6602935 -3300801 -4373650
37013 -4373650 -7945690 -8999313 -5002078 1096970 4279416 3179763 835494 256667
37005 256667 1580455 3717588 6181122 8462808 9878603 10874124 12268334 12602536 9138800
36996 9138800 2807241 -820718 2184861 8791761 12165591 8986272 2131527 -2799048
36988b799048K52049L727697K495695q33473q31461K801627L755967j456090p197673
36979h4710o773776k293593Q5785O21115L403454O507157M534166n14927j334018
36970D150653J945983J981406k032293k615149J623751K416637k831719m901997
36962b62728J070174N557837K55575p245489n928378P68993K694693J140080M393067
36953B443824R986173P434842k601699p492280k644873J870463j453452o389321
36945A153677m804249P56272L166390J633308p6180n71495l68425R87479K885993
36936D762770K763000M81216o73337K19788J5847k099411k456269l7767O10091
36927C585928k619684m777197j796336K781592L963132K713666K067045J169731
$$ plain form
36988 -2799048 -2546999 1180698 3676393 2842920 2011459 4813086 8569053 7112963 -84710
36979 -84710 -6858486 -9152079 -9066294 -8445179 -5041725 1465432 5999598 5484671 4150653
36970 4150653 6096636 8078042 6045749 3430600 5054351 7470988 4639269 -262728
36962 -262728 807446 6365283 6620858 -624631 -6553009 -5784016 -3089323 -1949243 2443824
36953 2443824 12429997 19864839 17263140 9770860 7125987 8996450 7542998 1153677
36945 1153677 -3650572 -2894300 272090 1905398 1829218 1257723 889298 1876777 4762770
36936 4762770 7525770 8006986 7333649 7553437 7569284 5469873 3013604 2975837 3585928
36927 3585928 966244 -3810953 -5607289 -2825697 1137435 3851101 5918146 7087877
36919G087877j230270k414443o47225M09379j736635k627405J457026N256345
36911E554649K293980l492412l392574J734683K966180j944600n506348k923900
36903d710342J662238L307241K571290J273007r85600l399691l188919o63039
36895d133815L98924q04249r04701Q68507R49699j499873k168080R87070L905699
36886b400819L202061J157178N70402N6723j762744k439505j85519K176427J725670
36877B099874M2812k38581L70238P25373J719643L227881K608397m87308k150678
36868G917651k17179K431439L543892N026969P709145R230938J0826518J7619579
36860F4088952K6205583K1935645j062749k5344279k9076716j4611894l640251
$$ plain form
36919 7087877 5857607 3443164 2795939 3205318 1468683 -1158722 298304 5554649
36911 5554649 7848629 4356217 963643 2698326 5664506 3719906 -1786442 -4710342
36903 -4710342 -3048104 259137 2830427 4103434 3117834 -281857 -3470776 -4133815
36895 -4133815 -3734891 -4539140 -5443841 -4575334 -3625635 -5125508 -7293588 -6306518 -2400819
36886 -2400819 801242 1958420 2528822 2585545 822801 -1616704 -1802223 374204 2099874
36877 2099874 2142686 1904105 2274343 2999716 4719359 7947240 10555637 10068329 7917651
36868 7917651 7700472 10131911 13675803 18702772 26411917 35642855 46469373 64088952
36860 64088952 90294535 112230180 111167431 85823152 56746436 42134542 38494291
36853C8494291o312984j1307051q035742k163255k328997n042538k757066K259838
36845B806496K646582j166007k595613k75121R24854j021784k564987j141105
36837b386685J217681J855537J132276Q32523J208253O94070j890943m888425
36829b225713m478753L17746M567092L177835r85643m11096M975273O235073q40718
36820A0331096p818433n547209K029201M197898k06997k344237J694842N152582
36812G488743K133534l185228l500777Q09658L185551N19511l492967m036553
36804g8528q43160K293968K007541j138002l350388k078537O32225O52130k466532
36795d369283m410103j716339L485736O007238L652571j009636m175015m219276
$$ plain form
36853 38494291 32181307 20874256 12838514 10675259 8346262 3303724 546658 2806496
36845 2806496 5453078 4287071 1691458 1416337 2341191 1319407 -1245580 -2386685
36837 -2386685 -1169004 686533 1818809 2651332 3859585 4553655 2662712 -2225713
36829 -2225713 -6704466 -6386720 -1819628 1358207 372564 -38532 4936741 11171814 10331096
36820 10331096 2512663 -3034546 -1005345 3192553 2985556 641319 2336161 7488743
36812 7488743 9622277 6437049 2936272 3745930 6931481 7450992 3958025 -78528
36804 -78528 -921688 1372280 3379821 2241819 -1108569 -3187106 -2554881 -1902751 -4369283
36795 -4369283 -8779386 -10495725 -7009989 -1002751 2649820 1640184 -2534831 -6754107
36787f754107j773809J605590M022672L862787J254307j440600j789394l2122
36779a044676J329938Q67626j27740o4596K78331p69299k354190j556617K182739
36770a258484N148024L429165k006199n906741m422932P66683M349129K977444
36762C076089j470964m353547l496779j039166M8824j82957M92265K780077M805132
36753F58974M631850K392399k82895j963231k447844k671912l280003l109826
36745f072488m49149L541122M844443J766693k153735k914982j371992m14000
36737c224088O29290L787509O398531L607791l094387o392499l536293J49139
36729a675007K91392n53299O65974J568634k56035j624585M89752K377208l96621
$$ plain form
36787 -6754107 -8527916 -6922326 -2899654 963133 2217440 776840 -1012554 -1044676
36779 -1044676 285262 1152888 1025148 960552 1238883 469584 -1884606 -3441223 -1258484
36770 -1258484 3889540 7318705 5312506 -594235 -5017167 -4250484 98645 3076089
36762 3076089 1605125 -2748422 -6245201 -7284367 -7235543 -7418500 -6926235 -4146158 658974
36753 658974 5290824 7683223 7400328 5437097 2989253 317341 -2962662 -6072488
36745 -6072488 -6521637 -2980515 1863928 3630621 1476886 -1438096 -2810088 -3224088
36737 -3224088 -2594798 1192711 7591242 11199033 8104646 1712147 -1824146 -1675007
36729 -1675007 -1383615 -1936914 -1270940 297694 41659 -1582926 -1093174 1284034 887413
36720H87413m230792k466954L327338N271593J455209j941684j309493k53191
36712G39439j497793j789237J267225L508584M17354n144478o501014k075636
36704a1075556L530093N870386M563472J865313J71131L61835Q79417n21592l003587
36695B640912k832570R56161L895316K017593k044279k820585j12752J452867
36687C152663L81256L23418K867688L708056n58863n878303n838805j076672J903381
36678a016181P39463R2744L009924N254256K253954k734879l145444O45785K090054
36669G189676j010830l575066k236728m90333j420592j539252K518684N987156
36661E422715K150615n882232p869107j150451N318090M186818k78241k16498
$$ plain form
36720 887413 -3343379 -5810333 -2482995 2788598 4243807 2302123 992630 739439
36712 739439 -758354 -2547591 -1280366 2228218 2645572 -2498906 -8999920 -11075556
36704 -11075556 -7545463 -1675077 2888395 4753708 4924839 5286674 6166091 5644499 2640912
36695 2640912 -191658 764503 4659819 6677412 4633133 1812548 1699796 3152663
36687 3152663 3533919 3857337 6725025 10433081 9874218 3995915 -1842890 -2919562 -1016181
36678 -1016181 -276718 -183974 2825950 8080206 10334160 7599281 4453837 5099622 7189676
36669 7189676 6178846 2603780 367052 -123281 -1543873 -3083125 -564441 5422715
36661 5422715 7573330 1691098 -6178009 -7328460 -2010370 2176448 1898207 1681709
36653A681709L525709M014092J08341k104041J27088J560315k180241o825382
36645i2410n508201Q01507M675287K796934o61409j625323j217967j172148J93636
36636a810094L403714M054335p23302n547101l417660K959702M312191j066207
36628B165578m814440j869334K292391J787388k56558J407317M223190K492966
36620G428498k219598l390344j05055K152276N14107k022148k321525n94279J801759
36611A243691L334023J745295k778638n173792j541171L831179L654637j367159
36603B948065l823632j318782J067976O47175Q96448L137761K831565j928705
36595D457871n592530l581894O85975K074881J290308J037027J26134k703712
$$ plain form
36653 1681709 5207418 9221510 9329851 7225810 7352898 8913213 6732972 -92410
36645 -92410 -5600611 -4799104 -123817 2673117 2011708 386385 -831582 -2003730 -1810094
36636 -1810094 1593620 5647955 4924653 -622448 -4040108 -1080406 3231785 2165578
36628 2165578 -2648862 -4518196 -2225805 -438417 -694975 712342 4935532 7428498
36620 7428498 5208900 1818556 1713501 3865777 4379884 2357736 36211 -558068 1243691
36611 1243691 4577714 6323009 3544371 -1629421 -3170592 660587 4315224 2948065
36603 2948065 -875567 -2194349 -1126373 -479198 417250 3555011 6386576 4457871
36595 4457871 -1134659 -4716553 -4030578 -1955697 -665389 371638 497772 -2205940
36587b205940l853704j84945M462404M485810J201518o0083J145825J131607k25094
36578E897398L45966K405637J842816j595397l196896r57967J324108N66400r18920
36569E713145J17762K518023K796097J95832k912621m375227m062972k927140
36561b937101j505001M38921K790413L913882J954638k131297m573157l025183
36553e073885P08889L233813K975462J96840l602993n064754j382830M656112
36545c353346O323078K461976K16057L910777P024908K185275n837984o471702
36537F459039J89093L822506L41958l001020r27580J931957N77750k005534j529834
36528E858335Q2754k83448q52084K70814K33482k620670l802965k14191L144821
$$ plain form
36587 -2205940 -6059644 -6244589 -1782185 2703625 3905143 3845060 4990885 6122492 5897398
36578 5897398 6243364 8649001 10491817 8896420 5699524 4741557 6065665 6632065 5713145
36569 5713145 5830907 8348930 11145027 11340859 8428238 4053011 -9961 -2937101
36561 -2937101 -4442102 -4003181 -1212768 2701114 4655752 2524455 -2048702 -5073885
36553 -5073885 -4364996 -1131183 1844279 2041119 -1561874 -6626628 -8009458 -3353346
36545 -3353346 2969732 5431708 5647765 9558542 16583450 18768725 12930741 6459039
36537 6459039 6648132 10470638 10812596 7811576 6883996 8815953 9393703 7388169 5858335
36528 5858335 5941089 5657641 4805557 5076371 5309853 2689183 -1113782 -1327973 1816848
36519A816848J359098j244883J099190L960912k81046p464835o288972K950769
36511d092919P463701J852312l986048j681086K841615J069575l592491k892833
36503c018174J830203L096109P29789Q44705L429706J889160m507096p752478
36495c458076l397305K619556L361465L79388q46494L64241R93904N91703J199031
36486A807413K841453L400537K110821R2609j750743l029755l192620k471893
36478a92178k053689j813407k01240J988593J200862k760739m227899K69688N160465
36469b629544L142502l353875n382477r39969K985586K290892J001694K188736
36461f96455K250565j116579k938170P13655M726376K705457k239169k707937
$$ plain form
36519 1816848 3175946 1931063 3030253 6991165 6710119 -754716 -7043688 -4092919
36511 -4092919 3370782 5223094 1237046 -444040 2397575 3467150 -125341 -3018174
36503 -3018174 -1187971 1908138 2637927 3482632 6912338 8801498 4294402 -3458076
36495 -3458076 -6855381 -4235825 -874360 -494972 -1341466 -977225 16679 608382 1807413
36486 1807413 4648866 8049403 10160224 10252833 8502090 5472335 2279715 -192178
36478 -192178 -2245867 -4059274 -4260514 -2271921 -1071059 -3831798 -8059697 -7790009 -2629544
36469 -2629544 512958 -2840917 -8223394 -9163363 -6177777 -3886885 -2885191 -696455
36461 -696455 1554110 437531 -2500639 -1786984 2939392 5644849 3405680 697743
36453F97743O79975J278296j422409j392058K299588L269483p79589l637253j289725
36444b95949J175557j378288n068288l467845J891927M418226K527190Q3061j069896
36435a184305k333467l069456o57664L590293M377224J22509l819996k240675
36427e215537K724102M401682K09895n069951m965338Q98504N936941M259238
36419C179536j975739n322166k872266N54300L43576j381134n54590J635874J455572
36410d937037l85512l98697Q35043J5929j497196J062754O528998P302971Q82957
36401I410210n047589l338899K538162M419991J120448j784509j180778N26001
36393F663037O60884l83282j183164j185451n38413l20679j973946m354323l388368
$$ plain form
36453 697743 1377718 2656014 1233605 -158453 2141135 5410618 4631029 993776 -295949
36444 -295949 879608 -498680 -5566968 -9034813 -7142886 -2724660 -197470 -114409 -1184305
36435 -1184305 -3517772 -6587228 -7244892 -3654599 722625 845134 -2974862 -5215537
36427 -5215537 -2491435 1910247 2120142 -2949809 -7915147 -7016643 -1079702 3179536
36419 3179536 1203797 -4118369 -6990635 -6436335 -6092759 -7473893 -8028483 -6392609 -4937037
36410 -4937037 -5322549 -5721246 -4886203 -4870274 -6367470 -5304716 1224282 8527253 9410210
36401 9410210 4362621 1023722 3561884 7981875 9102323 7317814 6137036 6663037
36393 6663037 7323921 6940639 5757475 4572024 4033611 3712932 1738986 -2615337 -6003705
36384f003705K216390P135240N560014l55925l116815l63354K604341J474467
36376I150653j170620q68752J949019L411784J944539n36329j946003k078307
36368I855984j740718j521544j421131r14413M60121K176087K718469R84441k155349
36359H441947l830230j625165K883650M177711r46358p607865p438639R6145O028730
36350A79926M294833K17041J393476N219866L421055l865438p851717m780133
36342a771091o77987n74198j551833p0883J477418L63966p37849R61298K628213
36333D7054J010289j161401P3891K552055J642021j685370k810679j353356p39231
36324b424727j260091L1600K861046L242714J23535k652837k189424j64135N74698
$$ plain form
36384 -6003705 -3787315 3347925 8907939 8552014 5435199 5071845 7676186 9150653
36376 9150653 7980033 7111281 9060300 12472084 14416623 13880294 11934291 9855984
36368 9855984 8115266 6593722 5172591 4258178 4718299 6894386 9612855 10597296 8441947
36359 8441947 4611717 2986552 5870202 10047913 9101555 1493690 -5944949 -5848804 179926
36350 179926 4474759 4691800 6085276 11305142 14726197 10860759 3009042 -1771091
36342 -1771091 -2449078 -3023276 -4575109 -4645992 -3168574 -2804608 -3542457 -2581159 47054
36333 47054 1057343 -104058 -30167 2521888 4163909 2478539 -332140 -1685496 -2424727
36324 -2424727 -3684818 -3653218 -792172 2450542 2574077 -78760 -2268184 -2432319 -1857621
36315a857621l38935j553753j790654l84802J819355K458216P15734p06173O48158
36306i90475K827137K484487M07503j52082O81725Q0640j752852j755694J78274
36297B008663Q95844j4704O13483L171594L561413j99l388047k645296L71602
36288D574353J430942k83644k690977m266629m189646j530349K860921N490514
36280A395485L777484p35797m352793m969286k719861J092585M214649M452730
36272B155196K094070k4744M8588J254133J487683P3795k236019m023223l713057
36263b883578j200275J089468Q78942o68072r17541j60808n18543j270983J47377
36254e504013K686895K485201k57545q51045K017767L853851K038535l3591L14087
$$ plain form
36315 -1857621 -2196556 -3750309 -5540963 -5925765 -4106410 -1648194 -932460 -1638633 -990475
36306 -990475 1836662 4321149 4728652 4576570 5258295 5338935 3586083 1830389 2008663
36297 2008663 2904507 2889803 3503286 6674880 10236293 10236094 6848047 4202751 4574353
36288 4574353 6005295 5721651 3030674 -1235955 -5425601 -6955950 -4095029 1395485
36280 1395485 5172969 4437172 84379 -4884907 -7604768 -6512183 -2297534 2155196
36272 2155196 4249266 4224522 4273110 5527243 7014926 7088721 4852702 829479 -2883578
36263 -2883578 -4083853 -2994385 -2115443 -2783515 -3701056 -3861864 -4380407 -5651390 -5504013
36254 -5504013 -2817118 -331917 -589462 -1440507 577260 4431111 6469646 6436055 6750142
36245F750142Q7331l293237o278389m713871o81170J520696K260398L721008L842280
36236C215188j74988m764946l579828K550897N842567K268565l469769m871605
$$ plain form
36245 6750142 6837473 3544236 -2734153 -7448024 -8129194 -6608498 -4348100 -627092 3215188
36236 3215188 3040200 -1724746 -5304574 -2753677 3088890 5357455 1887686 -2983919
$$ [...]
##END NTUPLES=NMR SPECTRUM
##END=
