##TITLE=31Pdec_SR146_oil
 DMSO-d6, 24 sc
 20.10.2022
##JCAMPDX= 6.0         $$ Bruker NMR JCAMP-DX V2.0
##DATA TYPE= NMR SPECTRUM
##DATA CLASS= NTUPLES
##ORIGIN= UXNMR, Bruker Analytische Messtechnik GmbH
##OWNER= root
$$ XWIN-NMR		Version 3.5
$$ Thu Oct 20 15:38:53 2022 Russian Standard Time (UT+4h)  she@DPX200
##.OBSERVE FREQUENCY= 81.013821
##.OBSERVE NUCLEUS= ^31P
##.ACQUISITION MODE= SIMULTANEOUS
##.ACQUISITION SCHEME= undefined
##.AVERAGES= 24
##.DIGITISER RES= 16
##SPECTROMETER/DATA SYSTEM= spect
##.PULSE SEQUENCE= zgpg30
##.SOLVENT NAME= DMSO
##.SHIFT REFERENCE= (INTERNAL, DMSO, 0, 248.564)
##AUDIT TRAIL= $$ (NUMBER, WHEN, WHO, WHERE, WHAT)
$$ ##TITLE= Audit trail, XWIN-NMR		Version 3.5
$$ ##JCAMPDX= 5.01
$$ ##ORIGIN= Bruker BioSpin GmbH
$$ ##OWNER= she
$$ F:/spectra/data/she/nmr/P31/1/pdata/1/auditp.txt
$$ ##AUDIT TRAIL=  $$ (NUMBER, WHEN, WHO, WHERE, WHAT)
(   1,<2022-10-20 15:37:26.01 +0400>,<she>,<DPX200>,
      <created by zg, POWCHK disabled, PULCHK disabled
       configuration hash MD5:
       00 E9 B6 7A A2 85 ED C7 34 08 36 98 17 FE 4E 26
       data hash MD5: 32K
       F5 68 1C 71 6F 2F 21 DA BB 70 0E 02 AA 81 6A 2B>)
(   2,<2022-10-20 15:37:30.53 +0400>,<she>,<DPX200>,
      <Start of raw data processing
       efp BC_mod = 2 LB = 1 FT_mod = 6 PKNL = 1 PHC0 = -10422.46 PHC1 = 498.8561 SI = 64K 
       data hash MD5: 64K
       8A E6 91 9D 9D C7 EE AB 1D 65 6E 2C F2 03 DC F0>)
(   3,<2022-10-20 15:37:57.26 +0400>,<she>,<DPX200>,
      <pk PHC0 = 30.92936 PHC1 = -141.4001 
       data hash MD5: 64K
       04 87 81 6F 12 93 A9 C1 69 D2 1C 8B 66 75 63 DA>)
$$ ##END=
$$ 
$$ hash MD5
$$ 93 24 BF 2C 64 34 A4 5B A2 D2 EE 3D E0 D4 0B DD
##$RELAX= 
##$RELAX= 
##$RELAX= 
##$RELAX= 
##$RELAX= 
##$RELAX= 
##$RELAX= 
##$RELAX= 
##$RELAX= 
$$ Bruker specific parameters
$$ --------------------------
##$DU= <F:/spectra>
##$EXPNO= 1
##$NAME= <P31>
##$PROCNO= 1
##$TYPE= <nmr>
##$USER= <she>
##$AMP= (0..31)
100 100 100 100 100 100 100 100 100 100 100 100 100 100 100 100 100 100 
100 100 100 100 100 100 100 100 100 100 100 100 100 100 
##$AQSEQ= 0
##$AQ_mod= 1
##$AUNM= <au_zg>
##$AUTOPOS= <>
##$BF1= 81.014009
##$BF2= 200.13
##$BF3= 200.13
##$BF4= 200.13
##$BF5= 200.13
##$BF6= 200.13
##$BF7= 200.13
##$BF8= 200.13
##$BYTORDA= 1
##$CFDGTYP= 0
##$CFRGTYP= 5
##$CHEMSTR= <none>
##$CNST= (0..31)
1 1 145 1 1 1 1 1 1 1 1 1 1 1 1 1 1 1 1 1 1 1 1 1 1 1 1 1 1 1 1 1 
##$CPDPRG= <waltz16>
##$CPDPRG1= <>
##$CPDPRG2= <waltz16>
##$CPDPRG3= <>
##$CPDPRG4= <mlev>
##$CPDPRG5= <mlev>
##$CPDPRG6= <mlev>
##$CPDPRG7= <mlev>
##$CPDPRG8= <mlev>
##$CPDPRGB= <>
##$CPDPRGT= <>
##$D= (0..31)
0 1 0 0 0 0 0 0 0 0 0 0.03 2e-05 3e-06 0 0 0 0 0 0 0 0 0 0 0 0 0 0 0 0 
0 0 
##$DATE= 1666265845
##$DBL= (0..7)
120 120 120 11 120 120 24 19 
##$DBP= (0..7)
150 150 150 150 150 150 150 150 
##$DBP07= 0
##$DBPNAM0= <>
##$DBPNAM1= <>
##$DBPNAM2= <>
##$DBPNAM3= <>
##$DBPNAM4= <>
##$DBPNAM5= <>
##$DBPNAM6= <>
##$DBPNAM7= <>
##$DBPOAL= (0..7)
0.5 0.5 0.5 0.5 0.5 0.5 0.5 0.5 
$$ [...]
##$SUBNAM2= <"">
##$SUBNAM3= <"">
##$SUBNAM4= <"">
##$SUBNAM5= <"">
##$SUBNAM6= <"">
##$SUBNAM7= <"">
##$SUBNAM8= <"">
##$SUBNAM9= <"">
##$SW= 501.771253377433
##$SWIBOX= (0..15)
0 1 3 0 0 0 0 0 0 0 0 0 0 0 0 0 
##$SW_h= 40650.406504065
##$TD= 32768
##$TD0= 1
##$TE= 0
##$TE2= 300
##$TE3= 300
##$TEG= 300
##$TL= (0..7)
0 120 53 12 22 120 120 120 
##$TP= (0..7)
150 150 150 150 150 150 150 150 
##$TP07= 0
##$TPNAME0= <>
##$TPNAME1= <>
##$TPNAME2= <>
##$TPNAME3= <>
##$TPNAME4= <>
##$TPNAME5= <>
##$TPNAME6= <>
##$TPNAME7= <>
##$TPOAL= (0..7)
0.5 0.5 0.5 0.5 0.5 0.5 0.5 0.5 
##$TPOFFS= (0..7)
0 0 0 0 0 0 0 0 
##$TUNHIN= 0
##$TUNHOUT= 0
##$TUNXOUT= 0
##$USERA1= <user>
##$USERA2= <user>
##$USERA3= <user>
##$USERA4= <user>
##$USERA5= <user>
##$V9= 5
##$VALIST= <valist>
##$VCLIST= <CCCCCCCCCCCCCCC>
##$VD= 0
##$VDLIST= <DDDDDDDDDDDDDDD>
##$VPLIST= <PPPPPPPPPPPPPPP>
##$VTLIST= <TTTTTTTTTTTTTTT>
##$WBST= 1024
##$WBSW= 4
##$XGAIN= (0..3)
0 0 0 0 
##$XL= 0
##$YL= 0
##$YMAX_a= 1691
##$YMIN_a= -1708
##$ZGOPTNS= <>
##$ZL1= 120
##$ZL2= 120
##$ZL3= 120
##$ZL4= 120
##$ABSF1= 0
##$ABSF2= 0
##$ABSG= 0
##$ABSL= 0
##$ALPHA= 0
##$AQORDER= 0
##$ASSFAC= 0
##$ASSFACI= 0
##$ASSFACX= 0
##$ASSWID= 0
##$AUNMP= <proc_1d>
##$AZFE= 0.1
##$AZFW= 0.5
##$BCFW= 0
##$BC_mod= 2
##$BYTORDP= 0
##$COROFFS= 0
##$CY= -3
##$DATMOD= 1
##$DC= 0
##$DFILT= <>
##$DTYPP= 0
##$F1P= 0
##$F2P= 0
##$FCOR= 1
##$FTSIZE= 65536
##$FT_mod= 6
##$GAMMA= 0
##$GB= 0
##$INTBC= 1
##$INTSCL= 6.047779e-11
##$ISEN= 30
##$LB= 1
##$LEV0= 0
##$LPBIN= 0
##$MAXI= 10000
##$MC2= 0
##$MEAN= 0
##$ME_mod= 0
##$MI= 50
##$NCOEF= 0
##$NC_proc= -9
##$NLEV= 6
##$NOISF1= 182.463
##$NOISF2= 159.3651
##$NSP= 0
##$NTH_PI= 0
##$NZP= 0
##$OFFSET= 248.5645
##$PC= 4
##$PHC0= -10391.53
##$PHC1= 357.456
##$PH_mod= 1
##$PKNL= yes
##$PPARMOD= 0
##$PSCAL= 0
##$PSIGN= 0
##$REVERSE= no
##$SF= 81.0140089999694
##$SI= 65536
##$SIGF1= 159.3651
##$SIGF2= -187.1042
##$SINO= 113.3802
##$SIOLD= 16384
##$SREGLST= <1H.CDCl3>
##$SSB= 0
##$STSI= 65536
##$STSR= 0
##$SW_p= 40650.406504065
##$SYMM= 0
##$S_DEV= 0
##$TDeff= 32768
##$TDoff= 0
##$TI= <>
##$TILT= no
##$TM1= 0
##$TM2= 0
##$TOPLEV= 0
##$USERP1= <user>
##$USERP2= <user>
##$USERP3= <user>
##$USERP4= <user>
##$USERP5= <user>
##$WDW= 1
##$XDIM= 65536
##$YMAX_p= 540474791
##$YMIN_p= -363587609
$$ End of Bruker specific parameters
$$ ---------------------------------
##NTUPLES= NMR SPECTRUM
##VAR_NAME=  FREQUENCY,     SPECTRUM/REAL,   SPECTRUM/IMAG
##SYMBOL=    X,             R,               I
##VAR_TYPE=  INDEPENDENT,   DEPENDENT,       DEPENDENT
##VAR_FORM=  AFFN,          ASDF,            ASDF
##VAR_DIM=   65536,         65536,           65536
##UNITS=     HZ,            ARBITRARY UNITS, ARBITRARY UNITS
##FACTOR=    0.620285442955139, 1,           1
##FIRST=     20137.2065510682, 0,            0
##LAST=      -20513.1999529968, 0,           0
##MIN=       -20513.1999529968, -363587609,  0
##MAX=       20137.2065510682, 540474791,    0
$$ Real data points
##PAGE= N=1
##DATA TABLE= (X++(R..R)), XYDATA
$$ [...]
39549A3539796l715651m136869k015699m1273N14390q63418k355503O32393P890150
$$ 13539796 9824145 5687276 3671577 3630304 4144694 3281276 925773 1558166 9448316
39540I448316R506864j364671j3619756j0380686M295895Q717952l013586j1345989
$$ 9448316 18955180 17590509 3970753 -6409933 -2114038 6603914 3590328 -7755661
39532g755661l537947O150101L137267j579563O646532J5884485O192310j3169254
$$ -7755661 -11293608 -5143507 -2006240 -3585803 3060729 18945214 25137524 11968270
39524A1968270j5031249J966379J1347200J752716p687189k060208O591310L819066
$$ 11968270 -3062979 -1096600 10250600 12003316 4316127 2255919 8847229 12666295
39516A2666295l041272j567925K764342j470399r254762p120946L787224R407569
$$ 12666295 9625023 8057098 10821440 9351041 96279 -7024667 -3237443 6170126
39508F170126M176145l228689m527060r28113K747255M201088K780199j128313
$$ 6170126 10346271 7117582 2590522 1662409 4409664 8610752 11390951 10262638
39500A0262638m501009l601178J620546P161161Q738882N076704r68886m131109
$$ 10262638 5761629 2160451 3780997 10942158 19681040 24757744 23788858 19657749
39492A9657749k066863J031400m84134n419007p149988l298170J565025L638167
$$ 19657749 17590886 18622286 18138152 12719145 5569157 2270987 3836012 7474179
39484G474179M441790O024694P076682N865979K609344k164179p178178q514494
$$ 7474179 11915969 17940663 25017345 30883324 33492668 31328489 24150311 15635817
39476A5635817l816207K031095K161163j822250k690056m57337k195269p764777
$$ 15635817 11819610 13850705 16011868 14189618 11499562 11042225 8846956 1082179
39468A082179p614607R20318O852749K157286n139103l664716L617541N011127
$$ 1082179 -6532428 -5612110 1240639 3397925 -1741178 -5405894 -1788353 3222774
39460C222774j749984p396511n026968K484112Q252244Q152738K631740l222814
$$ 3222774 1472790 -5923721 -10950689 -8466577 -214333 7938405 10570145 7347331
39452G347331k804828M343137R873823O172778l382047q562902n456520n55857
$$ 7347331 4542503 8885640 18759463 24932241 21550194 12987292 7530772 6974915
39444F974915j429238p087258r353440k817511P864730J2262367O541214j396875
$$ 6974915 5545677 -1541581 -10895021 -13712532 -5847802 6414565 12955779 11558904
39436A1558904k246949K533644M349756N72224l352556l667035k072741J80148
$$ 11558904 9311955 11845599 16195355 16767579 13415023 9747988 7675247 7855395
39428G855395L713637O009217L233606k352637n086236n485713p315158o503678
$$ 7855395 11569032 17578249 20811855 18459218 13372982 7887269 572111 -5931567
39420e931567L580602J5611765J3668257j131822q320238J071250R775157K235183
$$ -5931567 -2350965 13260800 26929057 25797235 17476997 18548247 28323404 30558587
39412C0558587j0255407q874965K598682O756972J851129J012244P053199Q415217
$$ 30558587 20303180 11428215 14026897 20783869 22634998 23647242 30700441 39115658
39404C9115658Q4572q523089q685726k415171M190861P397306N650840J641583
$$ 39115658 39200230 30677141 21991415 19576244 23767105 31164411 36815251 38456834
39396C8456834K422876R419030J3337681Q315517L433364P667337J2268420N031577
$$ 38456834 40879710 50298740 63636421 71951938 75385302 83052639 95321059 100352636
39388A00352636n688395k423897J0468477J1472064k386443r919608j218428O158261
$$ 100352636 94664241 92240344 102708821 114180885 111794442 101874834 100656406 106814667
39380A06814667k707939j5534250j3361501R20696J0528507R328476L644398j415577
$$ 106814667 104106728 88572478 75210977 76131673 86660180 95988656 99633054 98217477
39372I8217477m209371k293007K839279L204914m150875j0319929p843607k506483
$$ 98217477 94008106 91715099 94554378 97759292 93608417 83288488 75444881 72938398
39364G2938398k692093o037275p055550q740226j4256198j5519125m451025J0334075
$$ 72938398 70246305 64209030 57153480 48413254 34157056 18637931 14186906 24520981
39356B4520981J3012938L241494m886482m499234k402461l945547n036340j928599
$$ 24520981 37533919 40775413 35888931 31389697 28987236 25041689 20005349 18076750
39348A8076750J917281K237121o88384n155849r580062j0067000l577821N654494
$$ 18076750 19994031 22231152 21542768 16386919 6806857 -3260143 -6837964 -1183470
39340a183470R539892O385878J479004j833712m250583m429864M23026P087498
$$ -1183470 8356422 14742300 16221304 14387592 10137009 5707145 6130171 13217669
39332A3217669Q210634L642533J561576N470910Q217436L222137n441922r598028
$$ 13217669 21428303 25070836 26632412 32103322 40320758 43542895 38100973 28502945
39324B8502945q153381n869959m665599k305263J501117K989217m82903n841779
$$ 28502945 20349564 14479605 9814006 7508743 9009860 11999077 11516174 5674395
39316E674395o882772j569088M507945M016905k765199p768741n657651l52736
$$ 5674395 -1208377 -2777465 1730480 5747385 2982186 -4786555 -10444206 -10796942
39308a0796942K012804J977696L307725M646918J889223l072268l734461Q99987
$$ -10796942 -8784138 -6806442 -3498717 1148201 3037424 -34844 -3769305 -2869318
39300b869318M594806L156220o44589k464071j261969J972879N156198M504794
$$ -2869318 1725488 4881708 4237119 1773048 511079 2483958 7640156 12144950
39292A2144950j399253o897900m963038K037061M356010j182958o654773m627454
$$ 12144950 10745697 3847797 -1115241 921820 5277830 4094872 -2559901 -7187355
39284g187355K799297R291033J1850543J0041849M210495k124220m124587k749706
$$ -7187355 -4388058 4902975 16753518 26795367 31005862 28881642 24757055 22007349
39276B2007349l669580o906762n769957O75638L839817k43713l179631J484212
$$ 22007349 18337769 11431007 5661050 6336688 10176505 9932792 6753161 8237373
39268H237373O132720J945860m703747k147120O147100O240567l398619r107528
$$ 8237373 14370093 16315953 11612206 9465086 15612186 21852753 18454134 9346606
39260I346606l511020M340488M445006o07007l378491l102469k885996k890625
$$ 9346606 5835586 10176074 14621080 14014073 10635582 7533113 4647117 1756492
39252A756492k516281l404280n013639l094970K374640M093689j619590o882772
$$ 1756492 -759789 -4164069 -9177708 -12272678 -9898038 -5804349 -7423939 -14306711
39244a4306711k952896N836843P858737J562557k376550L008674J1094336J0964439
$$ -14306711 -17259607 -11422764 -3564027 -2001470 -4378020 -1369346 9724990 20689429
39236B0689429J126887r998805j4230100j0585719l508448K318115M581819L138038
$$ 20689429 21816316 11817511 -2412589 -12998308 -16506756 -14188641 -9606822 -6468784
39228f468784j69610j566060J728165O798274O331293j658140q182682l510897
$$ -6468784 -6638394 -8204454 -6476289 321985 6653278 4995138 -3187544 -6698441
39220f698441Q154007J2257379L557996o552785o601650k64196K209921M58888
$$ -6698441 1455566 13712945 17270941 10718156 4116506 3852310 6062231 6521119
39212F521119J612299N630934M747749k662789q350222o733364k339756j116028
$$ 6521119 8133418 13764352 18512101 15849312 7499090 765726 -1574030 -2690058
39204b690058j793613n51636J658515J774888O12446J191718L506071M880946
$$ -2690058 -4483671 -5035307 -3376792 -1601904 -989458 202260 3708331 8589277
39196H589277L833795R02650k356385l247401K77938N512475O235264J078200
$$ 8589277 12423072 13325722 10969337 7721936 7999874 13512349 19747613 20825813
39188B0825813l182544r83972K961776J24258q172269j1014207l165380O750669
$$ 20825813 17643269 16659297 19621073 19745331 11573062 558855 -2606525 4144144
39180D144144P592723N87831l318865O69947N185063K679398l110583l730750
$$ 4144144 11736867 12324698 9005833 9675780 14860843 17540241 14429658 10698908
39172A0698908r4272j125907q251952j1122191l332924O387556O679259M37762
$$ 10698908 10604636 9478729 1226777 -9895414 -13228338 -6840782 -161523 276239
39164B76239j287753K213722J702348m305694o209508n19203L075168j919122
$$ 276239 -1011514 1202208 2904556 -1401138 -7610646 -8129849 -5054681 -6973803
39156f973803p123865k724250O878005J0797438P633602L288277j019929p208212
$$ -6973803 -14097668 -16821918 -9943913 853525 8487127 11775404 10755475 3547263
39148C547263j1222412p334478Q71205N007004N426897Q550321J1990520N967060
$$ 3547263 -7675149 -15009627 -14138422 -9131418 -3704521 4845800 16836320 22803380
39140B2803380q666014j7351390j1752013j132273K585594Q55724J693779N518835
$$ 22803380 14137366 -3214024 -14966037 -16098310 -13512716 -12656992 -10963213 -5444378
39132e444378P165883N855831L818131k96738p112625r497439p82498J1422894
$$ -5444378 1721505 7577336 11395467 11098729 3986104 -5511335 -6293833 5129061
39124E129061J1451029k302537j2721163p059030N012713N881742m036460p817959
$$ 5129061 16580090 14277553 1556390 -5502640 -489927 5391815 1355355 -6462604
39116f462604J393504R677972M292667n928008m410749O272927P706769m874809
$$ -6462604 -5069100 4608872 8901539 2973531 -1437218 4835709 12542478 7667669
39108G667669j3821458o072085O449908N264692o999207j2308045m325660N740930
$$ 7667669 -6153789 -12225874 -5775966 -511274 -7510481 -19818526 -24144186 -18403256
39100a8403256Q202822N156063J213500k671584l979437O79620O635593M158913
$$ -18403256 -10200434 -5044371 -3830871 -6502455 -10481892 -9802272 -3166679 992234
39092I92234o062289j1226095m391910O096537R705566O269364P60570m244471
$$ 992234 -5070055 -16296150 -20688060 -14591523 -4885957 1383407 2143977 -2100494
39084b100494n543345P16460R745474R353856k295054j0815020n763611M214341
$$ -2100494 -7643839 -6927379 2818095 12171951 9876897 -938123 -6701734 -2487393
39076b487393O343080K941550L304143N909020L351717j799735j314976K933301
$$ -2487393 3855687 6797237 10101380 16010400 19362117 17562382 16247406 19180707
39068A9180707K298379k467811k865404J230770J492844l081358m339220j67322
$$ 19180707 21479086 19011275 16145871 17376641 18869485 15788127 11448907 11281585
39060A1281585J689247k396262n952052l821222M66812K003240P43016j787903
$$ 11281585 12970832 10574570 4622518 801296 1268108 3271348 4014364 2226461
39052B226461m421191m139731N16697M454128K599115o36952J703878N704589
$$ 2226461 -2194730 -6334461 -5817764 -1363636 1235479 598527 2302405 8006994
39044H006994K403028n481191p098872k228246k32087r04439M698151J2694199
$$ 8006994 10410022 4928831 -2170041 -4398287 -4630374 -5534813 -836662 11857537
39036A1857537P384039j0173525j7009054k431789J3648972J0892794k160666
$$ 11857537 19241576 9068051 -7941003 -10372792 3276180 14168974 12008308
39029A2008308o255279j860300j104842k907372J513151P595610M023253n637311
$$ 12008308 5753029 3892729 2787887 -119485 1393666 8989276 13012529 7375218
39021G375218q421586m256754k956766l717682J371060O994671O91165j1635647
$$ 7375218 -1046368 -5303122 -8259888 -11977570 -10606510 -3611839 -2920674 -14556321
39013a4556321j0185581O078573J4872983M845019q048079p646762m19571R15261
$$ -14556321 -24741902 -18663329 -3790346 1054673 -6993406 -14640168 -15059739 -14144478
39005a4144478j405821L21806K983289O70825k179482L67345L241858L0879l459555
$$ -14144478 -15550299 -15228493 -12245204 -11574379 -13753861 -13386516 -10144658 -10113779 -13573334
38996a3573334J130941Q743934Q351860Q09806m095088m046810m443187n353646
$$ -13573334 -12442393 -3698459 4653401 5463207 1368119 -2678691 -7121878 -12475524
38988a2475524j495177N706500Q044678L176654k447861l881172k498945n23729
$$ -12475524 -13970701 -8264201 -219523 2957131 509270 -3371902 -5870847 -6394576
38980f394576J383655J284500j898917m063954r11083M053430M103154L05743
$$ -6394576 -5010921 -3726421 -5625338 -9689292 -10600375 -6546945 -2443791 -2138048
38972b138048m66667K692733M087453K122661J152136K101619P45738l251562
$$ -2138048 -2604715 88018 4175471 6298132 7450268 9551887 10297625 7046063
38964G046063m837428l080405k970908n111645l040907N133719J1193530Q133041
$$ 7046063 2208635 -871770 -3842678 -8954323 -11995230 -6861511 4332019 12465060
38956A2465060j04490n196017m460368r4199M966282O252718J60202q137117p329288
$$ 12465060 12360570 7164553 2704185 2609986 7576268 13828986 13989188 5852071 -1477217
38947a477217L394032R301167M54615j1451425q826019N168388J0705573P06022
$$ -1477217 1916815 11217982 11672597 221172 -8604847 -3436459 7269114 7975136
38939G975136r471767n690809N274467Q110279J493201k642814J859439P674230
$$ 7975136 -1496631 -7187440 -1912973 6197306 7690507 5047693 6907132 14581362
38931A4581362N852101k457619r136331r276004m753735m5033K163902J773937
$$ 14581362 20433463 17975844 8839513 -436491 -5190226 -5235259 -3071357 -1297420
38923a297420L15885l20099K76855K41107j942685l947916j409432N488796J0263815
$$ -1297420 -981535 -1301634 -1024779 -783672 -2726357 -6674273 -8083705 -2594909 7668906
38914G668906P881054J697987j508459j459255l498865q285047r535514m394331
$$ 7668906 15549960 17247947 15739488 14280233 10781368 2496321 -7039193 -11433524
38906a1433524P41421m90315m505998l374912K827722O093451K139051m093891
$$ -11433524 -10692103 -11182418 -15688416 -19063328 -16235606 -10142155 -8003104 -12096995
38898a2096995n557923j148474M956503Q729808R140311P333551M676100J644169
$$ -12096995 -17654918 -18803392 -13846889 -5117081 4023230 11356781 16032881 17677050
38890A7677050j418847l060719k056910r1383l41359k589758l149773r70677N10574
$$ 17677050 16258203 13197484 11140574 11049191 10707832 8118074 4968301 3997624 4508198
38881D508198j53805N86287L919271M135459k325960q489106n849141J918401
$$ 4508198 4354393 4940680 8859951 12995410 10669450 2180344 -3668797 -1750396
38873a750396M062230m05816k064138K407524M993619J030267k363596R02537
$$ -1750396 2311834 1906018 -158120 2249404 7243023 8273290 5909694 6812231
38865F812231M318680r64041j0950511j3815746o635407K107192N332641M414257
$$ 6812231 11130911 10166870 -783641 -14599387 -21234794 -19127602 -13794961 -9380704
38857i380704L247412K478119J428577O53774M35053k22942j819906l483734l936220
$$ -9380704 -6133292 -3655173 -2226596 -1572822 -1137769 -1360711 -3180617 -6664351 -10600571
38848a0600571j892957L141157Q431013Q547685J571222p034160j0220541p296580
$$ -10600571 -12493528 -9352371 -921358 7626327 9197549 2163389 -8057152 -15353732
38840a5353732k546449J603222N126488O220307K893394j803405k422285P03469
$$ -15353732 -17900181 -16296959 -11170471 -4950164 -2056770 -3860175 -6282460 -5578991
38832e578991K110417N33586M85257K868406K016597l923391p293334j901743
$$ -5578991 -3468574 -2934988 -2449731 418675 2435272 -1488119 -8781453 -10683196
38824a0683196O427210Q042532L666291J410222K406085j3499o461652p869359
$$ -10683196 -4255986 3786546 7452837 8863059 11269144 11255645 4793993 -3075366
38816c075366p8682P168835L320291o913966r496570n80011Q833907Q500546J438477
$$ -3075366 -3154048 4014787 7335078 421112 -9075458 -9655469 -821562 7678984 9117461
38807I117461k646388r41216P29648k456233p949903r740773n572029J346278
$$ 9117461 6471073 5529857 6259505 3803272 -4146631 -13887404 -19459433 -18113155
38799a8113155O399954P537265N423290J688385j564607j887059J205891M189684
$$ -18113155 -11713201 -4175936 1247354 2935739 1371132 -515927 689964 4879648
38791D879648K857232j705048m121428k987461l125464o360621o039036K568789
$$ 4879648 7736880 6031832 1910404 -1077057 -4202521 -10563142 -16602178 -14033389
38783a4033389J1357583Q755959k213191o861528n98159M862816J137030l982856
$$ -14033389 -2675806 6080153 3866962 -2994566 -3592725 1270091 2407121 -1575735
38775a575735j404679L315979P15203m970907l271712L291030L310883k572276
$$ -1575735 -2980414 335565 1050768 -3920139 -7191851 -3900821 -589938 -3162214
38767c162214j559411Q878122J4565052O127468o763254j0343580m844128Q93931
$$ -3162214 -4721625 4156497 18721549 24849017 18085763 7742183 2898055 3791986
38759C791986L497979M309998K064780l560281o351685j341920N459218M360556
$$ 3791986 7289965 11599963 13664743 10104462 3752777 2410857 7870075 12230631
38751A2230631l624396q647452o560764k643384j220514k81014K163679L794986
$$ 12230631 8606235 -41217 -6601981 -9245365 -10465879 -10746893 -8583214 -4788228
38743d788228K627248M16996r32469j896433k272376O5885M750215O810861K358482
$$ -4788228 -2160980 -1743984 -2676453 -4572886 -6845262 -6779377 -2029162 4781699 7140181
38734G140181n437134r141942n604973L91545J804330k311295n585577k000957
$$ 7140181 1703047 -7438895 -13043868 -12652323 -10847993 -13159288 -18744865 -20745822
38726b0745822O605812J2409123J0227163K273228n133524p200699l454188K370752
$$ -20745822 -14140010 -1730887 8496276 10769504 5635980 -1564719 -5018907 -2648155
38718b648155N332464M319543K911305K903805L16200p168956j2500781p264322
$$ -2648155 2684309 7003852 9915157 12818962 13135162 5966206 -6534575 -13798897
38710a3798897M383077R597236M844466m77952L3617J706562J07134j390185p29717
$$ -13798897 -9415820 181416 5025882 4547930 4581547 6288109 6395243 5005058 4275341
38701D275341k287046o280783m891912L122873O354462q07366o468696n72957
$$ 4275341 1988295 -4292488 -9184400 -6061527 292935 -514431 -6983127 -7556084
38693g556084O738279K099755p031854m767004N125781N535657l928795o353394
$$ -7556084 -817805 1281950 -5749904 -10516908 -5391127 144530 -3784265 -10137659
38685a0137659K936871Q854702K576425n497902n323881j501251k20944J666147
$$ -10137659 -7200788 1653914 4230339 -1267563 -6591444 -8092695 -8313639 -6647492
38677f647492N905673N871182o30255m743901j482817J335409k238143n330739
$$ -6647492 -741819 5129363 4499108 -244793 -1727610 -392201 -2630344 -7961083
38669g961083j571363K845701J126779j354039K069176N624129P02189q605051
$$ -7961083 -9532446 -6686745 -5559966 -6914005 -4844829 779300 1481489 -7123562
38661g123562j1530905o168236J234891O514398Q093402M067968k410262k397825
$$ -7123562 -18654467 -24822703 -23587812 -17073414 -8980012 -4912044 -7322306 -9720131
38653i720131N431559R432882K507287n397940l859613L61036k732982n676967
$$ -9720131 -4288572 5144310 7651597 2253657 -1605956 -1244920 -3977902 -9654869
38645i654869L767333J6774705J2834580p024540j8727028r707251N224457Q592733
$$ -9654869 -5887536 10887169 23721749 16697209 -2029819 -11737070 -6512613 2080120
38637B080120K920279k47746O22187P6324j987608j548206J302106K885286J394498
$$ 2080120 5000399 4752653 5374840 5451164 3463556 1915350 3217456 6102742 7497240
38628G497240k244190n475591m574698J208610N905048L607781j756548j809888
$$ 7497240 5253050 -222541 -4797239 -3588629 2316419 5924200 4167652 2357764
38620B357764K017579O55774n543156n256026M317604J0081676K703298q426507
$$ 2357764 4375343 5031117 -512039 -5768065 -1450461 8631215 11334513 2908006
38612B908006r811697l485157m98991k366004j764654K624104M603372K352882
$$ 2908006 -6903691 -10388848 -10887839 -13253843 -15018497 -12394393 -7791021 -5438139
38604e438139P00504J260569J00157l336941l745577Q42218M618299K502668k261926
$$ -5438139 -4737635 -3477066 -3376909 -6713850 -10459427 -9617209 -4998910 -2496242 -4758168
38595d758168l025785J311710N910955O373812K546133k694756o026255n762948
$$ -4758168 -7783953 -6472243 -561288 5812524 8358657 5663901 -362354 -6125302
38587f125302l219602j748967l158734n287798m281869O97983O192443Q339023
$$ -6125302 -9344904 -11093871 -14252605 -19540403 -23822272 -23124289 -16931846 -8592823
38579h592823O928359M521152K667046J123222K36393R18804J714008l27756m073269
$$ -8592823 -1664464 2856688 5523734 6646956 6883349 7802153 9516161 9188405 5115136
38570E115136l901115J619437M969411n25501r070727q302060L483939J3943687
$$ 5115136 1214021 2833458 7802869 7277368 -1793359 -10095419 -6611480 7332207
38562G332207J2635379L241763l881185n164008m372185m113131l403778k060514
$$ 7332207 19967586 23209349 19328164 14164156 9791971 5678840 2275062 214548
38554B14548j609352j642136K02981L780858N584381L694194O94209k32653Q1901
$$ 214548 -1394804 -3036940 -2833959 946899 6531280 10225474 10919683 10687030 10768931
38545A0768931j221628l452159k345119L119018P070088L586806m195164o869983
$$ 10768931 9547303 6095144 3750025 6869043 13939131 17525937 13330773 6460790
38537F460790j652349L002856o50092p797599p448309J651630Q899830O226248
$$ 6460790 4808441 7811297 7161205 -636394 -8084703 -6433073 2466757 8693005
38529H693005k189582p204527o106365k676578M9074J979434K796208J544667
$$ 8693005 6503423 -701104 -6807469 -9484047 -9434973 -7455539 -4659331 -3114664
38521c114664m29263J18878L752231O589294M728636q84446n609730o443872m424061
$$ -3114664 -3543927 -3425049 327182 6916476 11645112 10760666 5150936 -1292936 -5716997
38512e716997j834838N55129K214381J346475k279566m583054j564570L784036
$$ -5716997 -7551835 -6996706 -4782325 -3435850 -5715416 -10298470 -11863040 -8079004
38504h079004M035916j807218n320568J26611R566115J2459788N652199m335373
$$ -8079004 -4043088 -5850306 -11170874 -11044263 -1478148 10981640 16633839 12298466
38496A2298466r899963q684208k804091L619716O617917N693363M525320N676705
$$ 12298466 2398503 -6285705 -9089796 -5470080 1147837 6841200 11366520 17043225
38488A7043225O243539K173088m802520q645504o601396j780722J227353N90635
$$ 17043225 23286764 25459852 20657332 12011828 5410432 3629710 4857063 5447698
38480E447698j914204k319657J351658N090412K917482l598693n968263j952135
$$ 5447698 3533494 1213837 2565495 7655907 10573389 6974696 1006433 -945702
38472i45702R1412m151718n533947L239686J1727991N768645q190954j0129799
$$ -945702 -854290 -5006008 -10539955 -7300269 4427722 10196367 2005413 -8124386
38464h124386L349113J3844782R072555j378830m577827k660124l216247m526871
$$ -8124386 -4775273 9069509 18142064 16763234 12185407 9525283 6309036 1782165
38456A782165j825976J663321J266174L66393K659333K696171m141567r350311
$$ 1782165 -43811 1619510 2885684 3252077 5911410 8607581 4466014 -4884297
38448d884297k765880Q341209O878276q076424j7698584r138346P571147J4351575
$$ -4884297 -7650177 691032 7569308 -507116 -18205700 -27344046 -19772899 -5421324
38440e421324P689515j049289k332723K254117N684421M230866n32027m891980
$$ -5421324 2268191 1218902 -1113821 1140296 6824717 11055583 10523556 5631576
38432E631576o036490l269353J391135L504445j78491o301276o073041L562279
$$ 5631576 -404914 -3674267 -2283132 1221313 1042822 -5258454 -11331495 -7769216
38424g769216J2146181O568633r737292j7464148n817297J1899102J4998429K126793
$$ -7769216 4376965 10945598 1208306 -16255842 -22073139 -10174037 4824392 6951185
38416F951185q855084n805158L629204N533268j344301o461856l143892L521111
$$ 6951185 -1903899 -7709057 -4079853 1453415 109114 -6352742 -9496634 -5975523
38408e975523M807697m25398n539864n138858o81273L152315M218622L193330
$$ -5975523 -1167826 -1593224 -7133088 -12271946 -12953219 -9800904 -5582282 -2388952
38400b388952J118742m36652P41545M108531N212443J628903k812773m129277
$$ -2388952 -1270210 -1706862 -965317 3143214 8355657 9984560 7171787 3042510
38392C042510m731226p656849q387583j380202Q007619R022249K184125j314098
$$ 3042510 -1688716 -9345565 -17733148 -19113350 -11105731 -2083482 100643 -1213455
38384a213455K275380M458493O97372j853700J771919N214523K550014k147581
$$ -1213455 1061925 5520418 6217790 4364090 6136009 11350532 13900546 11752965
38376A1752965m276265o276560q066458k717252Q611663J1110266j429471j2077461
$$ 11752965 7476700 1200140 -6866318 -9583570 -971907 10138359 8708888 -3368573
38368c368573m668071R658820R326880l679470r209884k664170J266528k454644
$$ -3368573 -8036644 1622176 10949056 7269586 -1940298 -4604468 -3337940 -5792584
38360e792584j810552O562058Q378650k652291j1328047n149204N643045N949005
$$ -5792584 -7603136 -1041078 7337572 4685281 -6642766 -11791970 -6148925 -199920
38352a99920q42045k214456K194211L847843J523903o0840j538832n500219p070974
$$ -199920 -1041965 -3256421 -1062210 2785633 4309536 4248696 2709864 -2790355 -9861329
38343i861329p92647P316891P238266J121220p05188K596960K039258m378344
$$ -9861329 -10653976 -3337085 3901181 5022401 4317213 6914173 8953431 4575087
38335D575087p818000l544289K069448K877926J274686J273593J990046K084211
$$ 4575087 -3242913 -6787202 -4717754 -1839828 -565142 708451 2698497 4782708
38327D782708L060468M335672K253931k447658l736403n85885J97577l588041
$$ 4782708 7843176 12178848 14432779 11985121 8248718 7662833 7860410 4272369
38319D272369l450431N804402J4387847J0304652k012592p576067k090281M827952
$$ 4272369 821938 6626340 21014187 31318839 29306247 21730180 19639899 24467851
38311B4467851O529032O632183P650199M718233m282991j2382259j3507070j0776805
$$ 24467851 30996883 37629066 45279265 49997498 45714507 33332248 19825178 9048373
38303I048373q742523n157612K213244P464610L970067m605577q866562n910457
$$ 9048373 305850 -4851762 -2638518 4826092 8796159 4190582 -4675980 -10586437
38295a0586437m9607M766263O237938K047502n152198o011361L037691J0700185
$$ -10586437 -10636044 -5869781 368157 2415659 -2736539 -8747900 -5710209 4989976
38287D989976N335822o261532q294602q08672J340306n885586r325414j969674
$$ 4989976 10325798 4064266 -4230336 -5039008 -3698702 -9584288 -18909702 -20879376
38279b0879376N350377L953574K584080J0499931J8402645J1286435p497727j9458758
$$ -20879376 -15528999 -11575425 -8991345 1508586 19911231 31197666 23699939 4241181
38271D241181j4654043o80588R852295J1582384P359988L581678L479556K420274
$$ 4241181 -10412862 -11093450 -1241155 10341229 17701217 21282895 24762451 27182725
38263B7182725n500377j4935514j3008964N12090R049163K846217o176216m278267
$$ 27182725 21682348 6746834 -6262130 -5750040 3299123 6145340 -30876 -4309143
38255d309143K237878J20749o777295n057298L768587O188476N86873j357964
$$ -4309143 -2071265 -1950516 -8727811 -13785109 -10016522 -3828046 -3241173 -4599137
38247d599137L489433N331545M58648l038625j633283j777046m911982l151639
$$ -4599137 -1109704 4221841 4680489 1641864 8581 -1768465 -6680447 -9832086
38239i832086M835432R018968N324405K871543O528029O977596k107400j0333947
$$ -9832086 -4996654 4022314 9346719 12218262 18746291 25723887 23616487 13282540
38231A3282540o072200M569719O983725o89474p480288o361097p82268K936310
$$ 13282540 7210340 11780059 18763784 18074310 10594022 4232925 3450657 6386967
38223F386967J707033l711197q397892o499510Q09368N090947K629150L70012
$$ 6386967 8094000 4382803 -4015089 -10514599 -9705231 -4614284 -1985134 -1615122
38215a615122M096500P636922K302018q207414j2175473o481244O71560K800279
$$ -1615122 2481378 10118300 12420318 4212904 -7962569 -14443813 -13772253 -10971974
38207a0971974J914526J283015k38714l312390l818825J567444Q831392J0787053
$$ -10971974 -9057448 -7774433 -8013147 -11325537 -15144362 -13576918 -4745526 6041527
38199F041527O839874L547047M196378L072208n149097j4122717j2312278n88627
$$ 6041527 12881401 16428448 20624826 23697034 18547937 4425220 -7887058 -8475685
38191h475685O617650J602088n251569j962328O394613O836505k60471k677062
$$ -8475685 -1858035 -255947 -5507516 -7469844 -1075231 5761274 5500803 2823741
38183B823741L795844J0645451J1263016P456029R18282q864265j6456594j3160270
$$ 2823741 6619585 17265036 28528052 35984081 36902363 28038098 11581504 -1578766
38175a578766j260289O198774L595553o75798M59531K800028J308697j032487
$$ -1578766 -2839055 3359719 6955272 6279474 6739005 9539033 10847730 9815243
38167I815243r35324r91278k253020q15600K612184P61199o272676p146297K373632
$$ 9815243 8879919 7888641 5635621 4820021 7432205 8193404 1920728 -5225569 -2851937
38158b851937R052828J182545j1922440j2200859J733314J3804749J2039151R41788
$$ -2851937 6200891 7383436 -4539004 -16739863 -15006549 -1201800 10837351 11779139
38150A1779139o506873k780941P081806R789982r31993j3413755j0925506L954746
$$ 11779139 5272266 2491325 9573131 19363113 18431120 5017365 -5908141 -1953395
38142a953395J0753133O31072j0750121p930838K131787M680475N07523l36981
$$ -1953395 8799738 9430810 -1319311 -9250149 -7118362 -2437887 -1930364 -2267345
38134b267345K205319J269287j980898j767522l58449l016643n501869o43742
$$ -2267345 -62026 1207261 -773637 -2541159 -2899608 -5916251 -11418120 -12061862
38126a2061862P215694Q139858K904818P1319P65070k92653k376883q27883J888636
$$ -12061862 -4846168 3293690 6198508 6269827 7034897 6742244 4365361 3537478 5426114
38117E426114L13848k362613J95076M457213L046409r46600k76842J043408m692234
$$ 5426114 5739962 3377349 3572425 8029638 11076047 10129447 9852605 10896013 6203779
38108F203779j0669244m072135R821984J2622086J749916o491655m502446k497303
$$ 6203779 -4465465 -8537600 1284384 13906470 15656386 9164731 4662285 2164982
38100B164982n874819n399354K504305O368318N98985l245476K345324O410347
$$ 2164982 -3709837 -9109191 -6604886 -236568 362417 -2883059 -537735 5872612
38092E872612K8307n581139J715533J1574431O432081r243560j5158380o075986
$$ 5872612 5900919 319780 2035313 13609744 20041825 10798265 -4360115 -10436101
38084a0436101K793130J029433l736980j644216M257580N633272K566914J617273
$$ -10436101 -7642971 -6613538 -10350518 -11994734 -7737154 -2103882 463032 2080305
38076B080305M150156L783771l797943j2786400j2792312k117900Q988640J0971420
$$ 2080305 6230461 10014232 6216289 -6570111 -19362423 -21480323 -12491683 -1520263
38068a520263O207686K478283K73837m398779p995915k749971P489592Q247170
$$ -1520263 4687423 7165706 7439543 3040764 -4955151 -7705122 -215530 8031640
38060H031640m164243j4589991r777727L340746R282054N337925N64934o06912
$$ 8031640 3867397 -10722594 -20500321 -17159575 -7877521 -2539596 -1974662 -2581574
38052b581574k217023o436707r370934p698383k852939J853374L930368K504267
$$ -2581574 -4798597 -11235304 -20606238 -28304621 -31157560 -29304186 -25373818 -22869551
38044b2869551K10250K251326R347387J3922565Q369772m207845j2503707j0107216
$$ -22869551 -22659301 -20407975 -11060588 2861977 11231749 7023904 -5479803 -15587019
38036a5587019j950608L004856K310548J308073M696028R040273O460936l812754
$$ -15587019 -17537627 -14532771 -12222223 -10914150 -6218122 2822151 9283087 5470333
38028E470333j2027379r813736j393058L342047L428072N501315R418883O602833
$$ 5470333 -6557046 -16370782 -17763840 -14421793 -10993721 -5492406 3926477 10529310
38020A0529310m729717j3439904j0149954L09244P369986Q568442P976985O590235
$$ 10529310 5799593 -7640311 -17790265 -17481021 -10111035 -1542593 6434392 13024627
38012A3024627K187954m213830q390482q013984l647233L067643Q804282R179217
$$ 13024627 15212581 10998751 2608269 -5405715 -9052948 -5985305 2818977 11998194
38004A1998194L639451k918677o178545o708126n841800k097181M253770P529023
$$ 11998194 15637645 12718968 6540423 -167703 -6009503 -8106684 -3852914 3676109
37996C676109L131283m724135p008188r35568O750914P752827J428561m551380
$$ 3676109 6807392 2083257 -4924931 -5860499 890415 8643242 10071803 5520423
37988E520423k961332L575404M635764m265681j3828043j2049070j13903R633363
$$ 5520423 2559091 6134495 10770259 6504578 -7323465 -19372535 -19486438 -9853075
37980i853075R648475L675382j280793j598691L039971Q275050N779866n354636
$$ -9853075 -204600 3470782 2189989 591298 3631269 11906319 17686185 12331549
37972A2331549j1488068j288411J3563547J1388802o271004j4719803l608889
$$ 12331549 843481 -444930 13118617 24507419 18236415 3516612 -92277
37965i2277P500359J194542j0985825r606355J723957N853050Q23179j142247
$$ -92277 7408082 8602624 -2383201 -11989556 -10265599 -4412549 -3589370 -4731617
37957d731617L349316N737093K294266j940073m200191n580166l859689K904310
$$ -4731617 -1382301 4354792 6649058 4708985 508794 -5071372 -8931061 -6026751
37949f026751Q285447M954277k600438m512318j390609j416858m609217l124205
$$ -6026751 2258696 7212973 4612535 100217 -1290392 -2707250 -7316467 -10440672
37941a0440672M161110R727553R440035N651956k04990p426207j0564266n317993
$$ -10440672 -6279562 3447991 12888026 18539982 18334992 10908785 344519 -4973474
37933d973474K135819K617459k018751l614926k509018m377795o144358m86459
$$ -4973474 -2837655 -220196 -2238947 -5853873 -8362891 -12740686 -18885044 -19371503
37925a9371503P837715O799855k172778n258532R19515M849676J136766j721351
$$ -19371503 -11533788 -4733933 -6906711 -12165243 -11245728 -6396052 -5259286 -6980637
37917f980637Q12467J156060l879573m945761K731468R060002N882596N99192
$$ -6980637 -6168170 -5012110 -8891683 -13837444 -11105976 -2045974 3836622 4435814
37909D435814K014624M701845J796p071931n461043L410303P282123P14041q431161
$$ 4435814 6450438 11152283 11154079 4082148 -1378895 2031408 9313531 10027572 1596411
37900A596411r463815l14142J0358624J0662752j321553j2236290q521141M126968
$$ 1596411 -7867404 -8181546 2177078 12839830 11518277 -718013 -9239154 -5112186
37892e112186P675321j164708n949796K386704J0122233L112737r921887j1129970
$$ -5112186 2563135 1398427 -4551369 -2164665 7957568 11070305 1148418 -9981552
37884i981552l26446P627041N904273J234065k21323P04073K255698L544737J852212
$$ -9981552 -10307998 -2680957 3223316 4457381 4236058 4940131 7195829 10740566 12592778
37875A2592778l060611m894706L62957N605428K078907o362686q769361l333592
$$ 12592778 9532167 4637461 5000418 10605846 12684753 6322067 -2447294 -5780886
37867e780886K609015N700374Q208555Q678024K973962n597953q315182l782154
$$ -5780886 -3171871 2528503 10737058 19415082 22389044 16791091 8475909 4693755
37859D693755J042963K421992K591863J447344l622158r083477p604737n32435
$$ 4693755 5736718 8158710 10750573 12197917 8575759 -507718 -8112455 -8644890
37851h644890K951761R95067J671152P254963Q389042n126q295824o103470J955220
$$ -8644890 -5693129 -4698062 -3026910 4228053 12617095 12611969 4316145 -1787325 167895
37842A67895L913966j977850o566849l544943L839249Q428090O133911j314074
$$ 167895 4081861 2104011 -4462838 -8007781 -4168532 4259558 10393469 9079395
37834I079395o894850l972185N308591J0570682N603252l663350p693728n630939
$$ 9079395 2184545 -1787640 3520951 14091633 19694885 16031535 8337807 2706868
37826B706868l526264l781494l268876o69923J091847N17904K28637K156573L958412
$$ 2706868 -819396 -4600890 -7869766 -8539689 -7447842 -6929938 -6701301 -4544728 -586316
37817e86316K616176p09918j918198N64801L444101K514749j832019m934659m281765
$$ -586316 2029860 1319942 -598256 -33455 3410646 5925395 4093376 -841283 -5123048
37808e123048k922110l918648m286135L93299O906484P232772J291909j384907
$$ -5123048 -8045158 -11963806 -16249941 -15856642 -8950158 -1717386 -425477 -1810384
37800a810384L541532P037162L75045r725871r584839J319403R675638P418818
$$ -1810384 1731148 8768310 9143355 -582516 -10167355 -8847952 827686 8246504
37792H246504O03932l020245m602734o918339n796414K496356J1105415R622016
$$ 8246504 8850436 5830191 1227457 -5690882 -11487296 -8990940 2114475 11736491
37784A1736491r23286q988227q134430l449711j233476m60773J954487M221156
$$ 11736491 10813205 1824978 -6309452 -9759163 -10992639 -11453412 -9498925 -5277769
37776e277769L312129R80930O18111J257465K66936m11433K935980P669141O335862
$$ -5277769 -1965640 -984710 -366599 890866 1157802 746369 3682349 11351490 17687352
37767A7687352k250568r456786p480075Q32709O577915N940370K258075j126065
$$ 17687352 15436784 5979998 -1500077 -667368 5910547 11850917 14108992 12982927
37759A2982927m656914q435236q958367l457232M327057O731911J513177m442363
$$ 12982927 8326013 -109223 -9067590 -12524822 -8197765 -1465854 47323 -4395040
37751d395040l465919K647766M913563l71841o508443n995010l04503M246808
$$ -4395040 -7860959 -5213193 -299630 -671471 -7179914 -13174924 -13479427 -9232619
37743i232619O086503P512060P224975J942559n050627n718439M24001M007997
$$ -9232619 -3146116 4365944 11590919 13533478 8482851 2764412 3188413 7196410
37735G196410o42148p254560p784612l771503j140624J17048L055202N179483
$$ 7196410 6554262 -700298 -8484910 -12256413 -13397037 -13279989 -10224787 -5045304
37727e045304J895107l842389m478719J04695K154552j595365n210994l215192
$$ -5045304 -3150197 -6992586 -11471305 -11366610 -9212058 -10807423 -16018417 -19233609
37719a9233609K155910O139595P806606Q087941O615744L838065K106443J822631
$$ -19233609 -17077699 -10938104 -3131498 4956443 11572187 15410252 17516695 19339326
37711A9339326L04822l213845n510913m514367k214563k51969K442284M890958
$$ 19339326 19644148 16430303 10919390 6405023 4190460 3938491 6380775 11271733
37703A1271733K766092l850795p100562j893292M707773K246183p541612j2110971
$$ 11271733 14037825 10187030 3086468 1193176 5900949 8147132 605520 -11505451
37695a1505451m960546O406933J1098671P214585P13323l379020m713101m883174
$$ -11505451 -16465997 -10059064 1039607 8254192 8967515 5588495 875394 -4007780
37687d007780m421318k559296J088956M796543N656840L423784J780318L175946
$$ -4007780 -8429098 -10988394 -9899438 -5102895 553945 3977729 5758047 8933993
37679H933993L935411j366606j0902027j5673203j0145391R64463Q613463R038585
$$ 8933993 12869404 11502798 600771 -15072432 -25217823 -24253360 -15639897 -6601312
37671f601312N114369J012810j173398r75918R10170K448554J557904j868631
$$ -6601312 -1486943 -474133 -1647531 -2623449 -1713279 735275 2293179 424548
37663D24548n696622p082475m449320Q41528M794626M528620J962501J569279
$$ 424548 -5272074 -12354549 -16803869 -15962341 -11167715 -6639095 -4676594 -3107315
37655c107315L992769M801336J023190l977016m541123M02926O700615R275805
$$ -3107315 885454 5686790 6709980 2732964 -1808159 -1405233 5295382 14571187
37647A4571187N188549m749162j4424451j5414974n870758N551343R245282O263263
$$ 14571187 19759736 15010574 586123 -14828851 -20699609 -15148266 -5902984 360279
37639C60279M676932N965350L261377n350612j0567492m368065P408682J2060299
$$ 360279 5037211 11002561 14263938 8913326 -1654166 -6022231 1386451 13446750
37631A3446750O142127k383758o121688n124879k167791J497940L808369J530825
$$ 13446750 19588877 17205119 11083431 5958552 3790761 5288701 9097070 10627895
37623A0627895m459748q006322n096112J106018N641146Q216479J0249479R253819
$$ 10627895 6168147 -1838175 -6934287 -5828269 -187123 8029356 18278835 27532654
37615B7532654K150292p491035j1756286q205358k157162J348796K384044J780417
$$ 27532654 29682946 22191911 10435625 2230267 73105 1421901 3805945 5586362
37607E586362j589626n841019m534342M224040J1721089Q776519q51061n158966
$$ 5586362 3996736 -1844283 -6378625 -2154585 9566504 18343023 17491962 12332996
37599A2332996q67790L235684J071012k173454o84130J343680k714487r484878
$$ 12332996 11465206 14700890 15771902 13598448 12914318 14257998 11543511 2058633
37591B058633r734224k279509M806885O145776M300256K700725R27949j248638
$$ 2058633 -7675591 -9955100 -5148215 997561 5297817 7998542 8926491 7677853
37583G677853j925713j521665l055731n591837l924469J990993M380637n30207
$$ 7677853 5752140 4230475 1174744 -4417093 -8341562 -6350569 -1969932 -2500139
37575b500139m865131n93255O761504N454030m036229q505253j126309Q655640
$$ -2500139 -7365270 -7958525 -1197021 4257009 220780 -8284473 -9410782 -755142
37567g55142Q772902P81229m113808j234412K731379Q15989m535318n808570j109783
$$ -755142 8017760 8798989 4685181 3450769 6182148 6998137 2462819 -3345751 -4455534
37558d455534L783985L857776J259329P86424J843875l96789o197691q970450
$$ -4455534 -671549 3186227 4445556 5231980 7075855 6679066 481375 -8489075
37550h489075m085621M150089P760604M637914m93619k458348J24660M802630
$$ -8489075 -12574696 -8424607 -664003 3973911 3480292 1021944 1146604 5949234
37542E949234O469693J137415q087666j1790025n268372M285576O800122K352702
$$ 5949234 12418927 13556342 5468676 -6321349 -11589721 -7304145 -504023 1848679
37534A848679j456466k338253m574647q008848n955412K961332R852468P673095
$$ 1848679 392213 -1946040 -6520687 -14529535 -20484947 -17523615 -7671147 1948
37526A948J466193M59614M972547P668284M663841q91475m874959o397405n992464
$$ 1948 1468141 1927755 6900302 14568586 19232427 18340952 13465993 7068588 1076124
37517A076124l592211P19979N525049P973860N364797j284756n969393l848444
$$ 1076124 -2516087 -1796108 3728941 11702801 17067598 15782842 9813449 5965005
37509E965005J356889J389145m154729o245815l28350N594152K718956n037565
$$ 5965005 7321894 8711039 4556310 -1689505 -2017855 3576297 6295253 1257688
37501A257688p427823l387573n59200j249593O46461P202154J0536371M113387
$$ 1257688 -6170135 -9557708 -10116908 -11366501 -10720040 -3517886 7018485 11131872
37493A1131872o580367j0570800n196271J974917L696830R89255n5621L469937
$$ 11131872 4551505 -6019295 -11215566 -9240649 -5543819 -4554564 -4610185 -1140248
37485a140248P980517P797813J626283o042636r462943o494256M83917O432767
$$ -1140248 6840269 14638082 16264365 10221729 758786 -5735470 -5251553 1181214
37477A181214O622258Q96161m269623j790357O133511Q623506K03638j0093581
$$ 1181214 7803472 8699633 4430010 2639653 8773164 17396670 17600308 7506727
37469G506727r529016R92150P357168K89970j3019848j7520592o998407R824403
$$ 7506727 -2022289 -1030139 6327029 6616999 -6402849 -23923441 -30921848 -21097445
37461b1097445J8255417J2033157n78706o216787k112674J842486j221472m330669
$$ -21097445 -2842028 9191129 8612423 2395636 282962 2125448 903976 -3426693
37453c426693J522184J0667674R294682l017157j1129091o311606J786216J276617
$$ -3426693 -1904509 8763165 18057847 15040690 3911599 -2400007 -613791 662826
37445F62826m306183l697160L969460R341029P614979L127370K65897j280462
$$ 662826 -3643357 -7340517 -3371057 5969972 13584951 16712321 16978218 15697756
37437A5697756j679032O18943L548871J297855p086105j3839495j1157902p97114
$$ 15697756 14018724 14637667 18186538 19484393 12398288 -1441207 -12599109 -13396223
37429a3396223Q331873J0117789N718913l75852m971644o462955l870276J742092
$$ -13396223 -5064350 5053439 10772352 10396500 5424856 -1038099 -4908375 -3166283
37421c166283O028924M844973j54329k527815M1647J321683m195999j0446672
$$ -3166283 2862641 7707614 7553285 5025470 5067117 6388800 2192801 -8253871
37413h253871o393806O214230J1849206K934251p237982l010182R601666J1230619
$$ -8253871 -14647677 -8433447 3415759 6350010 -887972 -3898154 5703512 16934131
37405A6934131j249988r733350k908564O553677K512856r358122j1026820J78428
$$ 16934131 15684143 5950793 3042229 9595906 12108762 2750640 -8276180 -8097752
37397h097752R244030P123030J041696j350796l286829p596570o999137L601841
$$ -8097752 1146278 8269308 9311004 7960208 4673379 -2923191 -9922328 -6320487
37389f320487J4174503J1638682j51963n492109K02483N605736K369938m215879
$$ -6320487 7854016 19492698 19340735 13848626 14051109 19656845 22026783 17810904
37381A7810904p264589q851781j1651561j0250094l93385J0023550R647505l06530
$$ 17810904 10546315 1694534 -9957027 -20207121 -20600506 -10576956 -929451 -1235981
37373a235981q037772o836678k17806O569838J1006673J0138681K504581n903114
$$ -1235981 -9273753 -16110431 -16328237 -9758399 1248274 11386955 13891536 7988422
37365G988422o577039j068438L29684n080547p250386N39106J0077024J0605949
$$ 7988422 1411383 342945 672629 -4407918 -11658304 -11119198 -1042174 9563775
37357I563775N064523L687826O305744L129024p396463j3462805o763912M462599
$$ 9563775 14628298 18316124 24621868 27750892 20354429 6891624 127712 4590311
37349D590311O253999k092976p672468j836803Q477362J0194108Q36262q905498
$$ 4590311 10844310 8751334 1078866 -757937 7719425 17913533 18749795 9844297
37341I844297q751751m66340O132944N447808N35316l137035l642628j831843
$$ 9844297 1092546 626206 6759150 12206958 12742274 9605239 5962611 4130768
37333D130768J039130K986295J787624j996823m816144m663211l351031k628718
$$ 4130768 5169898 8156193 9943817 7946994 3130850 -1532361 -4883392 -7512110
37325g512110j142304K154614M526386K981197o36658j703905J137107N070865
$$ -7512110 -8654414 -6499800 -1973414 1007783 371125 -1332780 -195673 4875192
37317D875192P097375N975187J678587l529762m887056m19502M267354J697874
$$ 4875192 11972567 17947754 19626341 16096579 11209523 10790021 15057375 16755249
37309A6755249o459387r852009l365070M959054M732707k114159m451464J451773
$$ 16755249 10295862 443853 -2921217 2037837 6770544 4656385 204921 1656694
37301A656694O476092K571867m912396n321689R79508L229883k763428p595001
$$ 1656694 8132786 10704653 5792257 470568 1450076 4679959 1916531 -5678470
37293e678470k598160O355337P088449j235458p800845o263749j924763j092810
$$ -5678470 -8276630 -1921293 5167156 3931698 -3869147 -10132896 -12057659 -13150469
37285a3150469j769524O76788M827280N747705K464194j923094m908046n246119
$$ -13150469 -14919993 -14243205 -9415925 -3668220 -1204026 -3127120 -8035166 -13281285
37277a3281285j584231N109885R538501P020929k1402m087341j306364M173181
$$ -13281285 -14865516 -9755631 -217130 6803799 6782397 2695056 1388692 5561873
37269E561873M821072k142746j1050499j2747434m834878M447385O029614J878048
$$ 5561873 10382945 8240199 -2810300 -15557734 -20392612 -15945227 -9915613 -8037565
37261h037565R22380M151856L120133m455506q404049j884171O258837M588801
$$ -8037565 -7115185 -2963329 156804 -4298702 -12702751 -14586922 -8328085 -3739284
37253c739284l010222m178490K292619O564284M925377L485946M678599L200542
$$ -3739284 -6749506 -10927996 -8635377 -2071093 2854284 6340230 11018829 14219371
37245A4219371k203470n066167l114732k463173n037834l299146N419347J0174608
$$ 14219371 12015901 6949734 3835002 1371829 -3666005 -6965151 -1545804 8628804
37237H628804K031504r961181j0300437N41083P586566L323703l885410m592860
$$ 8628804 10660308 699127 -9601310 -9060227 -1473661 1850042 -2035368 -6628228
37229f628228o65497J207180J58675l82797M57999J404208K975256N692466O462347
$$ -6628228 -7293725 -6086545 -5927870 -6310667 -5852668 -4448460 -1473204 4219262 10681609
37220A0681609K166388m034666n588303k240961r98105n045702p573508j718171
$$ 10681609 12847997 8813331 3225028 984067 -14038 -5059740 -12633248 -14351419
37212a4351419P684877R434848J319907p307395q356259l037757L878207R723953
$$ -14351419 -6666542 2768306 4088213 -3219182 -11575441 -14613198 -10734991 -1011038
37204a011038J1222083M672298o201135j0240471l009310N616949M774765k803875
$$ -1011038 10211045 14883343 8682208 -1558263 -4567573 1049376 5824141 3020266
37196C020266p032823n027764p75468L852945P967391O853930q96723o136712
$$ 3020266 -4012557 -9040321 -9815789 -5962844 2004547 8858477 7961754 1825042
37188A825042p08628P966085O568283l573429r589631p507699l930180K40412
$$ 1825042 1116414 9082499 15650782 12077353 2487722 -5019977 -8950157 -8709745
37180h709745R460314J6966986Q905594j0930376k0418199j0104604L901530O338426
$$ -8709745 750569 17717555 26623149 15692773 -4725426 -14830030 -10928500 -4590074
37172d590074K972714L479360L190311l316230o992003K17781Q142108M257301
$$ -4590074 -1617360 1862000 5052311 1736081 -5255922 -5038141 3103967 7361268
37164G361268m525631l928121L491065M711274q53341l343258j453269j473270
$$ 7361268 2835637 -1092484 2398581 7109855 6256514 2913256 1459987 -13283
37156a3283k092286K307405P179205L960726k808740k028842L292155L10723j0113262
$$ -13283 -2105569 201836 7381041 11341767 8533027 6504185 9796340 10107063 -6199
37147f199j2991756l399226O494706P175069K797578m41888k438258k598746J648780
$$ -6199 -12997955 -16397181 -9902475 -2727406 70172 -371716 -2809974 -5408720 -3759940
37138c759940O823667N552859j330401n435537l730577n28177J553300J858831
$$ -3759940 3063727 8616586 7286185 1850648 -1879929 -2408106 -854806 1004025
37130A004025k833222j0747004r528650O242799J9476462J1848127o302051j0070935
$$ 1004025 -1829197 -12576201 -22104851 -15862052 3614410 15462537 9160486 -910449
37122i10449J785563Q708106M514937K620409N977227K835018n370063l669517
$$ -910449 875114 9583220 14098157 16718566 22695793 25530811 20160748 16491231
37114A6491231N385184L687485n425135M79297J7768806J7054212j148818l14772
$$ 16491231 21876415 25563900 20138765 20618062 38386868 55441080 54292262 53977490
37106E3977490K5798427L7578758K8218377N2354182J25159038J55905937O1482582
$$ 53977490 79775917 117354675 145573052 197927234 323086272 478992209 540474791
37099E40474791r3986643j64324502j10692554l4615275k0136475l7301525k9267253
$$ 540474791 446488148 282163646 171471092 136855817 116719342 79417817 50150564
37092E0150564p873791r802943k1469399r914461J1460272P073155j5911433k0260180
$$ 50150564 42276773 32473830 11004431 1089970 12550242 19623397 3711964 -16548216
37084a6548216j172719J1821412P176577K352061N402072M279106l640643m892358
$$ -16548216 -17720935 -5899523 1277054 3629115 9031187 13310293 9669650 4777292
37076D777292K557049L878562m621697p560100K044805R889938M389901n160141
$$ 4777292 7334341 11212903 6591206 -968894 1075911 10965849 15355750 10195609
37068A0195609n076898K471059O415877L761791L0343p60558O50242J591433m21636
$$ 10195609 5118711 7589770 14005647 17767438 17797781 17037223 17687465 19278898 18857262
37059A8857262n001701p120866k571301M492762N184716j948787q087600n545767
$$ 18857262 13855561 6734695 4163394 8656156 13840872 11892085 3804485 -1741282
37051a741282K424340O031534R88000o320776o386773J238497O403635J938012
$$ -1741282 683058 6714592 7702592 1381816 -5004957 -3766460 2637175 4575187
37043D575187n285761m025646L741480N968864N91536j640855K763976L070370
$$ 4575187 -710574 -4736220 -994740 4974124 5565660 3924805 6688781 9759151
37035I759151n379088j0050067j957286P318275M362428l285841j116184O204946
$$ 9759151 4380063 -5670004 -7627290 -309015 4053413 767572 -348612 5856334
37027E856334L682565o088667o917584J861163M156361l316583m196831P919125
$$ 5856334 9538899 3450232 -3467352 -1606189 2550172 -766411 -4963242 2955883
37019B955883J5281767L631509j3738773j5018051q33658R791184P178745m22338
$$ 2955883 18237650 21869159 8130386 -6887665 -7721323 2069861 9248606 8826268
37011H826268k994153l77624K767979L879556K145952k461320p508902r091013
$$ 8826268 5832115 5454491 8222470 12102026 14247978 11786658 4277756 -4813257
37003d813257o124000j795062q789j296623k530691p40699K812544L849964J297503
$$ -4813257 -10937257 -12732319 -12741108 -14037731 -16568422 -17309121 -14496577 -10646613 -9349110
36994i349110l84207K307682O067078N596124J723790n50136k40699o71187k702674
$$ -9349110 -9733317 -7425635 -1358557 4237567 5961357 5411221 5170522 4499335 1796661
36985A796661l825706l487129l301747k469702P52490L627011J999892j454044
$$ 1796661 -2029045 -5516174 -8817921 -11287623 -10535133 -6908122 -4908230 -6362274
36977f362274R6239N984434P398709O21621o918165p201212j545737L575484M814749
$$ -6362274 -6266035 -281601 7117108 7738729 820564 -6380648 -7926385 -4350901 463848
36968D63848K597947j304997l607543j391690L260370M571954M73529n462592
$$ 463848 3061795 1756798 -1850745 -3242435 17935 4589889 5063418 -399174
36960c99174r465273r591069l576786P435304J3939211P259086n512843p855210
$$ -399174 -9864447 -19455516 -23032302 -15596998 -1657787 5601299 88456 -7766754
36952g766754K154884P873822j9864q304342k307254J0569590J2513427J618028
$$ -7766754 -5611870 2261952 2242088 -6062254 -8369508 2200082 14713509 16331537
36944A6331537q490169r784906o095839j774515K051908K101852l160137o188986
$$ 16331537 7841368 -1943538 -8039377 -9813892 -7761984 -5660132 -8820269 -15009255
36936a5009255J10498P898596M217124o266296n810180P522446J4584027M787617
$$ -15009255 -14898757 -7000161 -2783037 -9049333 -14859513 -7337067 7246960 12034577
36928A2034577p614119p263462p58751j544183n670714o79451J0244903J2215893
$$ 12034577 4420458 -2843004 -3601755 -5145938 -10816652 -11496103 -1251200 10964693
36920A0964693K935854m722194l677901j87247K59356n29625k663021q826446
$$ 10964693 13900547 9178353 5500452 5313205 5572561 5042936 2379915 -6446531
36912f446531j2959960m274120J2225722J5814658n44721j6538130j2461459L091571
$$ -6446531 -19406491 -23680611 -11454889 4359769 3815048 -12723082 -25184541 -22092970
36904b2092970Q953894L280645Q23235N483450O429355P1399l830380n34246K495780
$$ -22092970 -13139076 -9858431 -9035196 -3551746 2877609 2949008 -881372 -1415618 1080162
36895A080162J040012J049197M707876M478735k149644o041895k371506N51205
$$ 1080162 2120174 3169371 7877247 12355982 10206338 4164443 1792937 2344142
36887B344142k562995l196991L928244P056895l670482j5148086q460663J0146098
$$ 2344142 -218853 -3415844 512400 7569295 3898813 -11249273 -19709936 -9563838
36879i563838J6467596M207819p412246m468224L102662J430048n186656l976214
$$ -9563838 6903758 11111577 3699331 -768893 2333769 3763817 -1422839 -5399053
36871e399053M779647Q589618J239839r317649j1627275l923594M634512M778715
$$ -5399053 -619406 7970212 9210051 -107598 -11734873 -15658467 -11023955 -6245240
36863f245240j519954l189479M594771J2302777R223325j67824k666076L373348
$$ -6245240 -7765194 -10954673 -6359902 5942875 15166200 14998376 12332300 15705648
36855A5705648N972425j252780r389823p946980Q72571O830905M164253m619790
$$ 15705648 21678073 20425293 11035470 3088490 3961061 10791966 14956219 10336429
36847A0336429j2263563j1690483k541240O403943P043406L040182L120213N632506
$$ 10336429 -1927134 -13617617 -16158857 -9754914 -2711508 328674 3448887 9081393
36839I081393J884837n807322n080511M236820O060723n830343j4351021m368724
$$ 9081393 10966230 5158908 78397 4315217 10375940 4545597 -9805424 -14174148
36831a4174148J2765326J5873477M592409m344974m484646m321122p150318n159496
$$ -14174148 -1408822 14464655 19057064 14712090 10227444 5906322 -1243996 -6403492
36823f403492L724234Q997954L548587n112877o242893m68185L335263P36445
$$ -6403492 -2679258 6318696 9867283 4754406 -1488487 -1956672 1378591 2115036
36815B115036m074710m768615m85417L076569P64875l989822k624451N128457
$$ 2115036 -1959674 -6728289 -7213706 -4137137 -3372262 -7362084 -9986535 -4858078
36807d858078Q262181M89267q318503n982951K887536M010133l865001p572739
$$ -4858078 3404103 3893370 -4425133 -10408084 -7520548 -3510415 -7375416 -14948155
36799a4948155r27842O892284P779745O050532P029787O087668j751883r887695
$$ -14948155 -15875997 -8983713 -1203968 4846564 11876351 17964019 16212136 6324441
36791F324441q388610P29361O454006M609478J401032J367384Q25225l527168
$$ 6324441 -2064169 -1334808 5119198 9728676 11129708 12497092 13322317 9795149
36783I795149o496836j258013Q423182J0174382p60841j3174781j3298040l106671
$$ 9795149 3298313 2040300 10463482 20637864 19877023 6702242 -6595798 -9702469
36775i702469K766902k066772p744026m474720L111755N442802L453671M048327
$$ -9702469 -6935567 -9002339 -16746365 -21221085 -18109330 -12666528 -9212857 -5164530
36767e164530O014273K994890k418988j035046O446953Q709387K287617k210036
$$ -5164530 849743 3844633 1425645 390599 6837552 15546939 17834556 15624520
36759A5624520K254191P180864K466342p104060r509413l726598K37832k903071
$$ 15624520 17878711 25059575 27525917 20421857 10912444 7185846 7423678 4520607
36751D520607p473600o900545k664081m14371j253846n30700M830846J0203222
$$ 4520607 -2952993 -9853538 -12517619 -12931990 -14185836 -14716536 -9885690 317532
36743C17532P742934k107351q371019l568836M306230K221996p682158r549392
$$ 317532 8060466 5953115 -2417904 -5986740 -1680510 541486 -7140672 -16690064
36735a6690064K786931J5585753J4138346J963139p006756p556706m965636l148297
$$ -16690064 -13903133 1682620 15820966 17784105 10777349 3220643 -1744993 -4893290
36727d893290j327242J576r51260k110295K5947L331121K341664k704992n647878
$$ -4893290 -6220532 -6218956 -7170216 -9280511 -9254564 -5923443 -3581779 -6286771 -11934649
36718a1934649l388137P71356L040218K981744J243792j268324j697679K002927
$$ -11934649 -15322786 -14551430 -11511212 -8529468 -7285676 -8554000 -10251679 -8248752
36710h248752O185407M780166j696724n897180l925595m14608p30797l052665
$$ -8248752 -2063345 2716821 1020097 -4877083 -8802678 -9217286 -9948083 -13000748
36702a3000748k233236J620618K994054j255374p214460p962310j315900P340262
$$ -13000748 -15233984 -13613366 -10619312 -11874686 -19089146 -27051456 -28367356 -21027094
36694b1027094J0616490P290145L160408L169485N487169N497986K584643p06722
$$ -21027094 -10410604 -3120459 39949 3209434 8696603 14194589 16779232 16072510
36686A6072510l708820p025773q504214n362323L1973K064661J5290j141879Q99363
$$ 16072510 12363690 5337917 -3166297 -8528620 -8496647 -6431986 -6416696 -7558575 -6659212
36677f659212K202381n04789m295846m187980R06123Q279335J3628993J2063032
$$ -6659212 -4456831 -4961620 -9257466 -13445446 -12539323 -4259988 9369005 21432037
36669B1432037K268952q483551r917689k458186J762442l661592r024245l500372
$$ 21432037 23700989 15217438 5299749 2841563 4604005 942413 -8081832 -11582204
36661a1582204O788691P350094k060969o953957m17570P420453O113565o31643
$$ -11582204 -4793513 2556581 495612 -6458345 -6875915 544538 6658103 6026460
36653F026460l630406j900059J01850J524976L111964J993902k959174n511443
$$ 6026460 2396054 495995 597845 2122821 5234785 7228687 4269513 -1241930
36645a241930q77337M078415j34216r216835r612210O77435Q236327M260933l273238
$$ -1241930 -2119267 1959148 1824932 -7391903 -17004113 -16326678 -8090351 -3829418 -7102656
36636g102656l562691R01118J106765k333452m73772Q546588J4830683R455837
$$ -7102656 -10665347 -9764229 -8657464 -10990916 -11464688 -2918100 11912583 21368420
36628B1368420l750487j2156209q136175K831976Q259468K834986n521873o462515
$$ 21368420 17617933 5461724 -2674451 157525 8416993 11251979 5730106 -732409
36620g32409j352823j70413n090872o555225R54207Q635606O009158l340625p690480
$$ -732409 -2085232 -2255645 -7346517 -13901742 -12947535 -4311929 1697229 -1643396 -9333876
36611i333876m153332m2416L01417L35878K965918N668442N403576K403740j782311
$$ -9333876 -13487208 -13529624 -13228207 -12892329 -9926411 -4257969 1145607 3549347 1767036
36602A767036n257569n235559j316212K038876J366568R7021K465400M875620
$$ 1767036 -3490533 -8726092 -10042304 -8003428 -6636860 -6539839 -4074439 801181
36594H01181J622948l675487k672525L214339M527028K9127j496953K318297K844135
$$ 801181 2424129 -1251358 -3923883 -709544 3817484 3846611 2349658 4667955 7512090
36585G512090l195918o596158k182357P95236n060025j0488310m136844P181769
$$ 7512090 4316172 -2279986 -4462343 -3667107 -8727132 -19215442 -23352286 -16170517
36577a6170517P903956j938644p207289q33273P733139Q421388K826638k060081
$$ -16170517 -8266561 -10205205 -17412494 -18245767 -10512628 -2091240 735398 -1324683
36569a324683k755437P64539O028339P129594M39656p516063o125327L849863
$$ -1324683 -4080120 -3315581 2712758 9842352 10282008 2765945 -3359382 490481
36561D90481R854880N188777k376647l929816j924289k633349m297041j837898
$$ 490481 10345361 15534138 13157491 9227675 7303386 4670037 372996 -1464902
36553a464902K101900Q78099l967873m106193K002932O064422K748647k444939
$$ -1464902 636998 1515097 -2452776 -6558969 -4556037 1508385 4257032 1812093
36545A812093k466282N22492l3291l493030l056701K168101L974448k881191j1250801
$$ 1812093 -654189 -131697 -164988 -3658018 -6714719 -4546618 -572170 -3453361 -14704162
36536a4704162r931972J136186J0084574P778090j713690p254022l838962L148723
$$ -14704162 -24636134 -23499948 -13415374 -5637284 -7350974 -14604996 -18443958 -15295235
36528a5295235N605417K288554k29164L535848R495962Q232571j251063p986451
$$ -15295235 -9689818 -7401264 -7630428 -4094580 5401382 13633953 12382890 4396439
36520D396439m197170K099190j128324r788143q524671M374602J2251541N449987
$$ 4396439 199269 2298459 1170135 -8618008 -17142679 -12768077 -516536 4933451
36512D933451l586333p54573P035667M164124p406694j1165753k168498O372926
$$ 4933451 1347118 592545 7628212 11792336 4385642 -6780111 -8948609 -2575683
36504b575683M011019l158032l660908M267272J2724326J2761211J658604j2592760
$$ -2575683 1435336 -1722696 -5383604 -1116332 11607994 24369205 26027809 13435049
36496A3435049j5727162l742017Q199765L975273r665650j1744377J584119J1677206
$$ 13435049 -2292113 -6034130 2165635 6140908 -3524742 -15269119 -13685000 -2007794
36488b007794O493359l350539n290180l905418p150877q797194o14400Q998894
$$ -2007794 4485565 1135026 -4155154 -8060572 -15211449 -24008643 -24623043 -15624149
36480a5624149O294027m557459o996494K247080R647963O847999Q27169l27911
$$ -15624149 -9330122 -13887581 -20884075 -18636995 -8989032 -2141033 -1313864 -1641775
36472a641775J278164O21516j708018k805910k098197L18174L857698M665859
$$ -1641775 -363611 257905 -1450113 -4256023 -6354220 -6036046 -2178348 2487511
36464B487511n60585o973541n359159M571401J1935278Q398670k009760r268014
$$ 2487511 1926926 -5046615 -10405774 -5834373 6100905 14499575 12489815 3221801
36456C221801q156656q81678N971685N982512o23983n186118j101688N454701
$$ 3221801 -4934855 -5816533 155152 6137664 5513681 327563 -774125 4680576
36448D680576L692120m315413n914642J302185M729133k219946q381346l327477
$$ 4680576 8372696 4057283 -1857359 -555174 4173959 1954013 -6427333 -9754810
36440i754810N032934M217439j390185J149329R434434Q039455n713719j5497662
$$ -9754810 -4721876 -504437 -1894622 -745293 8689141 16728596 11014877 -4482785
36432d482785r851439K162196O339140K568968n16759r66012k473465l538859
$$ -4482785 -14334224 -12172028 -5832888 -3263920 -3780679 -4746691 -7220156 -10759015
36424a0759015N85130O992792P039950q8444n314221l523133m55406j483981k189609
$$ -10759015 -10173885 -3181093 3858857 3770413 -1543808 -5066941 -5522347 -7006328 -9195937
36415i195937K584965P221608L068495n944369p191915J015714N792802m20468
$$ -9195937 -6610972 610636 3679131 -2265238 -9457153 -8441439 -2648637 -3069105
36407c069105p748883m371325N242315Q242956L198974m31306M78125p33537o298379
$$ -3069105 -10817988 -15189313 -9946998 -1704042 1494932 1063626 1541751 808214 -5490165
36398e490165q961246m493696J580868M346637O697106J0534059J0181588K128931
$$ -5490165 -14451411 -18945107 -17364239 -13017602 -6320496 4213563 14395151 16524082
36390A6524082o422944p280253l433909k755144m649551k657020K965742N176433
$$ 16524082 10101138 2820885 -613024 -3368168 -8017719 -10674739 -7708997 -2532564
36382b532564J588939k561395k732593O21783N298672Q188297M349896p015492
$$ -2532564 -943625 -3505020 -6237613 -5615830 -317158 7871139 12221035 5205543
36374E205543j6535033j3086652J114211J1687082R518992k08405p351406p417697
$$ 5205543 -11329490 -24416142 -23301931 -11614849 -2095857 -2304262 -9655668 -17073365
36366a7073365j323211P302636J1737814O632450l655222p924072k618003L471368
$$ -17073365 -18396576 -11093940 643874 7276324 3621102 -4302970 -6920973 -3449605
36358c449605K494804k096857l367123j516610j38348J655853N618652P820003
$$ -3449605 -954801 -3051658 -6418781 -7935391 -8073739 -6417886 -799234 7020769
36350G020769L959203k132375l353323l43493L59764k335570k942517K87847K023078
$$ 7020769 10979972 8847597 5494274 5150781 5510545 3174975 232458 520305 2543383
36341B543383j119495m865180l836962Q95203M140297L376636L90930j951350
$$ 2543383 1423888 -3441292 -7278254 -6383051 -2242754 1133882 1524812 -426538
36333d26538k417143j767914j365685j041804Q78764M211566N329019J729539
$$ -426538 -2843681 -4611595 -5977280 -7019084 -6140320 -1928754 3400265 5129804
36325E129804l210803l863628j47515K590399J712464N12514J768393K947771
$$ 5129804 1919001 -1944627 -2092142 498257 2210721 2723235 4491628 7439399
36317G439399J199995p90663J136669M819014L821524k518182o857353m124617
$$ 7439399 8639394 7848731 8985400 13804414 17625938 15107756 8250403 4125786
36309D125786J021668J546871j166653p53976J998499k57998p232445p825143
$$ 4125786 5147454 6694325 5527672 4773696 6772195 6514197 -718248 -8543391
36301h543391K728855J1980301O820694n905364q651381N76981O841200L411139
$$ -8543391 -5814536 6165765 12986459 7081095 -1570286 -993305 5847895 9259034
36293I259034R53939O149545Q343826j282450j1654170q340673K067778J962544
$$ 9259034 10212973 16362518 24706344 23423894 11769724 3429051 5496829 7459373
36285G459373q644181j2473775l005462O476674N447944J001528K757381O543932
$$ 7459373 -1184808 -13658583 -16664045 -10187371 -4739427 -3737899 -980518 5563414
36277E563414L236266n325875r604434o269064k86830L564348M519713L533622
$$ 5563414 8799680 3473805 -6130629 -12399693 -12686523 -9122175 -4602462 -1068840
36269a068840K189291J836603Q79731l487912q530835o774854K480523Q993661
$$ -1068840 1120451 2957054 3836785 348873 -8181962 -14956816 -12476293 -3482632
36261c482632N038939k877505l687041J489853K046860m581606q614255k984004
$$ -3482632 1556307 -1321198 -5008239 -3518386 -1471526 -6053132 -14667387 -17651391
36253a7651391O041138P739961Q83185o113549o173700m21293N232596P180095
$$ -17651391 -11610253 -3870292 -2987107 -9100656 -15274356 -15695649 -10463053 -3282958
36245c282958O494277N131431K137679l783228q872328o624378K210005P259296
$$ -3282958 3211319 8342750 10480429 6697201 -2175127 -8799505 -6589500 669796
36237F69796J390979q177119q923281p18684M696045K002922n37267L782578Q139924
$$ 669796 2060775 -6116344 -15039625 -15758309 -11062264 -9059342 -9596609 -5814031 2325893
36228B325893L751464m165657l578905M592170O701621k480549j1057833p632423
$$ 2325893 6077357 1911700 -1667205 2924965 9626586 7146037 -3911796 -11544219
36220a1544219K449967O443709K319235k102555l196155l876985m016929K59552
$$ -11544219 -9094252 -2650543 -331308 -2433863 -5630018 -9507003 -13523932 -13264380
36212a3264380O931821Q200591K924296o31132J765637L598695k90877m198746
$$ -13264380 -6332559 1868032 4792328 4161196 5926833 9525528 9234651 5035905
36204E035905j800868K263176O74158l124467r50109M832191M187849l890661
$$ 5035905 3235037 5498213 6172371 3047904 2097795 6929986 11117835 7227174
36196G227174r510044p464067l471082k371578o67546M684403R016551P373107
$$ 7227174 -2282870 -9746937 -13218019 -15589597 -16257143 -11572740 -2556189 4816918
36188D816918K615791M12938J098113J543605R39720N3061j775392m690439o253365
$$ 4816918 7432709 7845647 8943760 10487365 11427085 11480146 9704754 5014315 -1239050
36179a239050m766853k007959M8453K176328M958294O136786L838055j43636k716841
$$ -1239050 -6005903 -8013862 -7965409 -5789081 -830787 5305999 9144054 9000418 6283577
36170F283577k912052j458780L72968N38227j976337m447131l184127P29261K847731
$$ 6283577 3371525 1912745 2285713 2823940 847603 -3599528 -6783655 -6054394 -3206663
36161c206663K368870K126365J746458j835172o061456l656501N111627R755023
$$ -3206663 -837793 1288572 3035030 1199858 -4861598 -8518099 -3406472 6348551
36153F348551M023527m702215o229205r03571M036025N256188L918260P96258
$$ 6348551 10372078 5669863 -559342 -1462913 2573112 7829300 11747560 12543818
36145A2543818k745280l381567q71563L12782j161160n26509L219469K819564
$$ 12543818 9798538 6416971 5545408 5858190 4697030 4170521 7389990 10209554
36137A0209554m721928r862800m428685L963227K888352n573706q976101l606199
$$ 10209554 5487626 -4375174 -8803859 -4840632 -1952280 -7525986 -16502087 -20108286
36129b0108286L201265O826608Q804415Q422806L357017k195650j784920J709631
$$ -20108286 -16907021 -10080413 -1275998 7146808 10503825 8308175 6523255 8232886
36121H232886K98449m657968m726733k6205J175755j802453j625270R99065k671109
$$ 8232886 8531335 3873367 -853366 -879571 296184 -1506269 -3131539 -2132474 -4803583
36112d803583j0470744q224334O139557J4982776P175371m205137k899768N883492
$$ -4803583 -15274327 -23498661 -17359104 -2376328 4799043 593906 -2305862 3577630
36104C577630O952223L00596k083087K144552L902555j56912l210905q38520L203633
$$ 3577630 10529853 10830449 8747362 10891914 14794469 14637557 11426652 10588132 13791765
36095A3791765L964896j90979q318742j4750844j0473805M294966J4114981O542630
$$ 13791765 17756661 17565682 9246940 -5503904 -15977709 -11682743 2432238 8974868
36087H974868q156666r616267K902472R770182R95959j0230656r590266j536046
$$ 8974868 818202 -8798065 -5895593 3874589 4870548 -5360108 -14950374 -16486420
36079a6486420K251976J658744L473494O655003M921771o88980l345238k118511
$$ -16486420 -14234444 -12575700 -9102206 -2447203 2474568 1785588 -1559650 -3678161
36071c678161k086442l944286k921583J773666N023174M601278M186081N436509
$$ -3678161 -5764603 -9708889 -12630472 -10856806 -5833632 -1232354 2953727 8390236
36063H390236M326212j048807n215341k863782K617254L568319j358375o158797
$$ 8390236 12716448 11667641 6452300 3588518 6205772 9774091 8415716 2256919
36055B256919n993171k079705J963612M452909N152810L808102J141202p51666
$$ 2256919 -3736252 -5815957 -3852345 600564 5753374 9561476 10702678 9951012
36047I951012q94813r39127k465403m027096l084341l64021K73306k908981o469924
$$ 9951012 9056199 8117072 5651669 1624573 -1459768 -1823789 -1550483 -4459464 -10929388
36038a0929388n763877q31864L948595N771645N975043N645122K271478n362558
$$ -10929388 -16693265 -17525129 -13576534 -7804889 -1829846 3815276 6086754 724196
36030G24196j1177569o840203O130955J5295271J1896038J668578l918163k920295
$$ 724196 -10453373 -17293576 -11162621 4132650 16028688 17697266 13779103 10858808
36022A0858808k301902m655877m672454J32118L815133J091309m358272n450352
$$ 10858808 8556906 3901029 -771425 -639307 3175826 4267135 -91137 -5541489
36014e541489j130794M126094O658178N605042J901060j345063j031942N21308
$$ -5541489 -6672283 -2546189 4111989 9717031 11618091 10273028 9241086 9762394
36006I762394k758332j0081083j1320482j299597R648570Q212221l035299r439143
$$ 9762394 7004062 -3077021 -14397503 -15697100 -6048530 2163691 -871608 -10310751
35998a0310751m833669K530344M896520M880995P204029R823534Q466531L489945
$$ -10310751 -15144420 -12614076 -7717556 -2836561 4367468 14191002 22657533 26147478
35990B6147478k500416q525225j2496044r948790o94815P353052O575156n60937
$$ 26147478 23647062 15121837 2625793 -7322997 -8017812 -664760 5910396 5349459
35982E349459n042075l005398R60138J810112O53196J497365M173528L973837
$$ 5349459 307384 -2698014 -1737876 72236 725432 2222797 6396325 10370162
35974A0370162j096681n749849l660515K878543N079042O34124k292705J727156
$$ 10370162 9273481 3523632 -136883 2741660 7820702 8454826 6162121 7889277
35966G889277N439163N2368r358310j0285846j696756N306437N129128L457306
$$ 7889277 13328440 13380808 4022498 -6263348 -7960104 -2653667 2475461 5932767
35958E932767L653202N13445p391249j1232048n412630K266140K460747j893055
$$ 5932767 9585969 10099414 2708165 -8523883 -13936513 -11670373 -9209626 -11102681
35950a1102681k585552K40066J222979O10726J654451J896801k216636n658886
$$ -11102681 -13688233 -13448167 -12225188 -11614462 -9960011 -8063210 -10279846 -15938732
35942a5938732j144426P115581Q006129J322033j653518K873689M739634k499784
$$ -15938732 -17083158 -9967577 -1961448 -639415 -2292933 580756 5320390 2820606
35934B820606r490282n515845M078706O077931l74170l964593o1549L101391k52395
$$ 2820606 -6669676 -12185521 -8106815 -2028884 -2403054 -6367647 -6429196 -3327805 -3580200
35925c580200l338222J062495O932495L594934o449771r703070j527982P218953
$$ -3580200 -6918422 -5855927 1076568 4671502 -1778269 -11481339 -13009321 -5790368
35917e790368O624879Q27440j238834K33953n16085l401521l807496j517195M03294
$$ -5790368 834511 1661951 423117 657070 140985 -3260536 -7068032 -8585227 -8181933
35908h181933K435686N615206N285782j913957p974547k812711P819848P935035
$$ -8181933 -5746247 -131041 5154741 3240784 -4733763 -7546474 273374 8208409
35900H208409l984491j1181507m218848M744627J898909o918437o611500M176161
$$ 8208409 4223918 -6957589 -11176437 -6431810 -4532901 -11451338 -18062838 -13886677
35892a3886677J2567231R458505j563259j0493237r515932J219618J1729501J0951012
$$ -13886677 -1319446 8139059 6575800 -3917437 -13433369 -12213751 -484250 10466762
35884A0466762Q80575n175441j828994J308497k604612n504373N0211N563392
$$ 10466762 11347337 6171896 4342902 5651399 3046787 -2457586 -2407375 3156017
35876C156017P34122p004760l601437P496722R974425N51584o882308l483558
$$ 3156017 3890139 -3114621 -6716058 780664 10755089 11306673 4424365 940807
35868I40807L376463L807631j879326p131390o762195N43737R722163J0890946
$$ 940807 4317270 8124901 6245575 -885815 -7648010 -7104273 2617890 13508836
35860A3508836J603325o243712j843443P332541O901434r11087j874933M657074
$$ 13508836 15112161 8868449 7025006 14357547 21258981 20347894 18472961 23130035
35852B3130035L982628q333580j7746151j2907536o46734P105224P454358K733420
$$ 23130035 27112663 18779083 1032932 -11874604 -12521338 -5416114 2038244 4771664
35844D771664l773102m402323N931212J6085435R003774j0304874j7147400m302189
$$ 4771664 998562 -3403761 2527451 18612886 27616660 17311786 164386 -4137803
35836d137803N842415k087832j1319206k565369J2404333J0764504l533406q533780
$$ -4137803 1704612 -383220 -11702426 -14267795 -1863462 8901042 5367636 -3166144
35828c166144q30365L628824m2625p95843M067373M491708p55380j005379M382433
$$ -3166144 -3996509 -367685 -410310 -1206153 2861220 7352928 6597548 5592169 9974602
35819I974602K899723p083617j0447961j068874O803446K936823k058121K897758
$$ 9974602 12874325 5790708 -4657253 -5726127 1077319 4014142 1956021 4853779
35811D853779R108387M095394n567361n247218K914843M394106l191334p398578
$$ 4853779 13962166 18057560 12490199 7242981 10157824 14551930 11360596 3962018
35803C962018k191935L513640J310125m666006n729936o97776M438499M339622
$$ 3962018 1770083 5283723 6593848 1927842 -3802094 -4499870 -61371 4278251
35795D278251o34414m644043k104729M132937L650523p319651j6741555j0526349
$$ 4278251 3643837 -1000206 -3104935 1028002 4678525 -2641126 -19382681 -29909030
35787b9909030O826153J6140120Q954150k291913l366057L418965P233013N674588
$$ -29909030 -23082877 -6942757 2011393 -280520 -3646577 -227612 7005401 12679989
35779A2679989L195980r22793r941268j7087311r724769J0476094K3635246J5441561
$$ 12679989 15875969 14953176 5011908 -12075403 -21800172 -11324078 12311168 27752729
35771B7752729l670811j2375979n753904K253491J342756k671943r35235L704044
$$ 27752729 24081918 11705939 5952035 8205526 9548282 6876339 5941104 9645148
35763I645148K733068l520998o509958k634059K298764K452113q64820l546913
$$ 9645148 12378216 8857218 2347260 -286799 2011965 4464078 3599258 52345
35755E2345m653286m628361k043097L247821O680942M205813m43928J96795N593450
$$ 52345 -4600941 -9229302 -11272399 -8024578 -1343636 2862177 2418249 2615044 8208494
35746H208494O219794k620416j2100902j0896482q74628N730220L164679k115727
$$ 8208494 14428288 11807872 -293030 -11189512 -12064140 -6333920 -3169241 -5284968
35738e284968l268939j999611k221449k471811j50301K704007L973498O397531
$$ -5284968 -8553907 -10553518 -12774967 -15246778 -15397079 -12693072 -8719574 -2322043
35730b322043J1112229J1664233L182327o940887q018652k665589k219090o821748
$$ -2322043 8790186 20454419 23636746 16695859 8677207 6011618 3792528 -3029220
35722c029220m559685O931477J3125224M123845r477254j2346335n586596m80446
$$ -3029220 -7588905 -657428 12467796 16591641 7114387 -5231948 -10818544 -11298990
35714a1298990M95387K958157O466062N249988P00712j59340K098907L21642m929443
$$ -11298990 -10803603 -7845446 -1379384 3870604 4571316 4411976 6510883 6832525 1903082
35705A903082n289868m52256l05922p064416q962456R80873J2190637J2192136
$$ 1903082 -3386786 -3839042 -4144964 -11209380 -20171836 -19190963 -7000326 5191810
35697E191810M793208J220436J436113k171081p748738n668791L699015Q137870
$$ 5191810 9985018 11205454 12641567 10470486 2721748 -2947043 751972 8889842
35689H889842K087597n188142m522173M80857J899770Q7027K41592K544743L534521
$$ 8889842 10977439 5789297 1267124 1747981 3647751 3734778 3976370 6521113 10055634
35680A0055634L080205K548331m85962p728539j2819569p470554N201455J2207206
$$ 10055634 13135839 15684170 15198208 7469669 -5349900 -12820454 -7618999 4588207
35672D588207P375172j361532m386897k542389j937004l119898k330662M63491
$$ 4588207 11963379 10601847 6214950 3672561 1735557 -1384341 -3715003 -3251512
35664c251512K000540K171488L335517M213876J108282m631964o690089k561806
$$ -3251512 -1250972 920516 4256033 8469909 9578191 4946227 -1743862 -4305668
35656d305668L285422O427967P036899N585931L81435o986199r722354m801725
$$ -4305668 -1020246 5407721 12444620 18030551 18411986 11425787 1703433 -3098292
35648c098292Q77931j48644m128228j793074N957617P822519o00916q686091n638255
$$ -3098292 -2220361 -2369005 -6497233 -8290307 -2332690 5489829 4888913 -3797178 -9435433
35639i435433L542434N345744k454156p857957k315944P228662Q432606L4194
$$ -9435433 -5892999 -547255 -3001411 -10859368 -13175312 -5946650 2485956 2520150
35631B520150p772677o913662K97489N989343N287320k56404m342279j200884
$$ 2520150 -5252527 -12166189 -11868700 -5879357 -592037 -848441 -5190720 -6391604
35623f391604P453782J1821005N105637n933627q476610j791831J470780m684248
$$ -6391604 1062178 12883183 17988820 12055193 3578583 1786752 3257532 -1426716
35615a426716r166870j526736R506707P970682m521298j0920263m287964M302128
$$ -1426716 -10593586 -12120322 -2613615 5357067 835769 -10084494 -14372458 -10070330
35607a0070330N690598M984969P789119Q372205J558421n108220l242464J164164
$$ -10070330 -4379732 605237 8394356 16766561 18324982 13216762 9974298 11138462
35599A1138462k101986q703098o342686L407368O334010r45008n169148J370814
$$ 11138462 9036476 333378 -6009308 -2601940 3732070 2787062 -2382086 -1011272
35591a011272P994055L537729n263033m964225L335894O983262J875262l405460
$$ -1011272 6982783 10520512 5257479 293254 3629148 10612410 12487672 9082212
35583I082212l168896k250933m962129o537281j776090M631145M131868k400788
$$ 9082212 5913316 3662383 -1299746 -7837027 -9613117 -4981972 -850104 -3250892
35575c250892m926061J892525J0870052J0918099M45592j0633764j1525260j716899
$$ -3250892 -8176953 -6284428 4585624 15503723 15949315 5315551 -6209709 -7926608
35567g926608Q365339P740284l389008j2798179r123027M456414J2620293N747004
$$ -7926608 438731 8179015 4790007 -8008172 -17131199 -12674785 -54492 5692512
35559E692512p820966j1169086R44124J5733368J7022008K798431j3463369j6903027
$$ 5692512 -2128454 -13297540 -12353416 3379952 20401960 23200391 9737022 -7166005
35551g166005n310670R558865J3852062N521679m249187m814420J132466K692834
$$ -7166005 -12476675 -2917810 10934252 16455931 12206744 7392324 8524790 11217624
35543A1217624l074749p309595l303514L213477K884300l640573p681728n089266
$$ 11217624 8142875 833280 -2470234 743243 3627543 -13030 -7694758 -12784024
35535a2784024K19358M052394O394081P576955O082578J986023j883025l935547
$$ -12784024 -12564666 -8512272 -2118191 5458764 11541342 13527365 11644340 7708793
35527G708793n345763o498850n860250l588684j953680n00145M255895J1357036
$$ 7708793 2363030 -4135820 -9996070 -13584754 -15538434 -16038579 -11782684 -425648
35519d25648J2823433L863651p833010r760142o59551P652982N675944k495663
$$ -425648 12397785 16261436 8428426 -1331716 -1991267 5661715 11337659 8841996
35511H841996o287345k358886L390817M973873K414194j005644l335319m462171
$$ 8841996 2554651 195765 3586582 8560455 10974649 9969005 6633686 2171515
35503B171515m467033k875506J114759P179246J1596383Q665136k042675j1441939
$$ 2171515 -2295518 -5171024 -4056265 3122981 14719364 23384500 21341825 9899886
35495I899886r535654J259743P435522J283918r480717j2687429o532833J782665
$$ 9899886 364232 1623975 9059497 10343415 862698 -11824731 -18357564 -16574899
35487a6574899O961054Q220162M997561j856937o716577m882133l01149N5923
$$ -16574899 -9613845 -1393683 3603878 1746941 -4969636 -9851769 -10152918 -10096995
35479a0096995k190776R8987N919075O388632J6098l580316J051924O752248N932654
$$ -10096995 -12287771 -12188784 -6269709 118923 135021 -3445295 -2393371 4358877 10291531
35470A0291531J551224o45521j986963n172339o299964j311419N358852O827834
$$ 10291531 11842755 11197234 9210271 4037932 -2262032 -3573451 1785401 8613235
35462H613235L600172M7235l432807o966528n903385J845505Q400074N817866
$$ 8613235 12213407 12260642 8827835 1861307 -4042078 -2196573 6203501 12021367
35454A2021367j063414k189343J430851Q39594m299563n244320J41841L953332
$$ 12021367 10957953 8768610 10199461 11039055 6739492 1495172 1637013 5590345
35446E590345K075526j04661J427802L017083J271195j589394l432634n252127
$$ 5590345 7665871 7561210 8989012 12006095 13277290 11687896 8255262 3003135
35438C003135o103881l034333J902744K889815M01984R66553M931108M737461
$$ 3003135 -3100746 -6135079 -4232335 -1342520 -940536 26017 4957125 9694586
35430I694586j375343m842897j035594K456757j371327p101785n787965J754817
$$ 9694586 8319243 3476346 2440752 4897509 3526182 -3575603 -9363568 -7608751
35422g608751Q325302J0654156R101257L147888n462648j0555330r368945p076907
$$ -7608751 716551 11370707 20471964 23619852 18157204 7601874 -1767071 -8843978
35414h843978p161679m307554N000202J1986073O562653n900918j0385833k761961
$$ -8843978 -16005657 -20313211 -15313009 -3326936 3235717 -2665201 -13051034 -15812995
35406a5812995O261591P351357K909454P9742J474369M769794N840754J493832
$$ -15812995 -9551404 -2200047 709407 789149 2263518 7033312 12874066 14367898
35398A4367898o358268j0140885n197791K864103N148323J539990j083173o20902
$$ 14367898 8009630 -2131255 -7329046 -4464943 683380 2223370 1140197 519295
35390E19295j361240m388806n130135j753553J697112K511702K918577M519580
$$ 519295 -841945 -5230751 -10360886 -12114439 -10417327 -7905625 -4987048 -467468
35382d67468N325454M246262K741045N69652l837822p338621l746911N506238
$$ -467468 4857986 9104248 11845293 12414945 8577123 1238502 -2508409 2997829
35374B997829R628798K123027r486843j2817384n375671M672434R052781O065202
$$ 2997829 12626627 14749654 5262811 -7554573 -12930244 -8257810 794971 6860173
35366F860173n23819m779701k615863L803443P144347L104832m398655q584772
$$ 6860173 6336354 1556653 -1059210 2744233 9888580 12993412 8594757 9985
35358I985p572653l824467J051694O517658R962442Q235408K451340k276093k610162
$$ 9985 -7562668 -11387135 -10335441 -3817783 6144659 14380067 16831407 14555314 11945152
35349A1945152l23775N25063j759913m977871n594022l080176j088874k412882
$$ 11945152 11621377 12146440 10386527 5408656 -185366 -3265542 -4354416 -6767298
35341f767298l666354P67640Q887712J1024968L034714o071184n548377K228235
$$ -6767298 -10433652 -9666012 -778300 10246668 13281382 7210198 1661821 3890056
35333C890056N826993J214353m477412n297144l444144j885401J080836N587265
$$ 3890056 9717049 10931402 6453990 1156846 -2287298 -4172699 -3091863 2495402
35325B495402O386493J226323l467619k042245J111545l90969l179376n52144
$$ 2495402 8881895 10108218 6640599 4598354 5709899 5318930 2139554 1587410
35317A587410L530652m36606r469032r264120L609146J4208881J0173040j792515
$$ 1587410 5118062 4681456 -4787576 -14051696 -10442550 3766331 13939371 12146856
35309A2146856q599500q783282p191547j946488R112216J6252369Q749986n255330
$$ 12146856 3547356 -5235926 -12427473 -14373961 -5261745 10990624 19740610 14485280
35301A4485280p064825M139421Q747201l149144j6097998j2653837J630119Q688331
$$ 14485280 7420455 11559876 20307077 17157933 1059935 -11593902 -9963783 -1275452
35293a275452L747651k510595k297860J093798J979679k90873k897674k724012
$$ -1275452 2472199 -38396 -2336256 -1242458 737221 446348 -2451326 -5175338
35285e175338J358320N744593M545505j771458n010662r56947L613778J704359
$$ -5175338 -3817018 1927575 6473080 4701622 -309040 -1265987 2347791 4052150
35277D052150k795351l009477j675954n046358q922495l708855Q179332J3215081
$$ 4052150 1256799 -1752678 -3428632 -8474990 -17397485 -21106340 -12927008 288073
35269B88073O459058j932797l272567j877927m324174p168540l725673L452846
$$ 288073 6747131 4814334 1541767 -336160 -4660334 -11828874 -15554547 -12101701
35261a2101701N880913K021989j017113J585944N968446N939638J784718n98037
$$ -12101701 -6220788 -4198799 -5215912 -3629968 2338478 8278116 10062834 9464797
35253I464797J606256L898539J068108m590756o327445l350600j744342l712038
$$ 9464797 11071053 14969592 16037700 11446944 5119499 1768899 24557 -3687481
35245c687481l650060J146473M021398j30584m971041k563399L262807L738835
$$ -3687481 -7337541 -6191068 -2169670 -2300254 -7271295 -9834694 -6571887 -2833052
35237b833052p5609j108915k31938k806531m729582K120756J1468316P622071
$$ -2833052 -2908661 -4017576 -4249514 -7056045 -11785627 -9664871 1803445 9425516
35229I425516q188296j4841116k034916J2916265J0165704m649295j1236653l750475
$$ 9425516 1237220 -13603896 -15638812 -2722547 7443157 2793862 -8442791 -12193266
35221a2193266N492598O127987N04532l877511k931400K459374P310291O525622
$$ -12193266 -6700668 -572681 -68149 -3945660 -6877060 -4417686 2892605 9418227
35213I418227J548519r89261K48005o77736n007195n147825J266805L965525l787562
$$ 9418227 10966746 9977485 10225490 9547754 4540559 -607266 659539 4625064 837502
35204H37502j1543323o466214N952590R693029J603375o688797p108535k328646
$$ 837502 -10705821 -17172035 -11219445 -1526416 76959 -6611838 -13720373 -16049019
35196a6049019L423130Q356736Q955520L309131k190936k21672M830696K808548
$$ -16049019 -12625889 -4269153 4686367 7995498 5804562 5582890 10413586 13222134
35188A3222134n155566p795448j499457N512933P215700N557383J425406p004319
$$ 13222134 8066568 271120 -1228337 4284596 11500296 17057679 18483085 11478766
35180A1478766j4725860j2085778n35880O128476J215211n583349l870446L160848
$$ 11478766 -3247094 -15332872 -15868752 -9740276 -8525065 -14108414 -17978860 -14818012
35172a4818012O461275M007452l07599l103121k003144L053240N958618M73892
$$ -14818012 -8356737 -4349285 -4656884 -7760005 -9763149 -6709909 -751291 -277399
35164b77399p728403n972875N556116J1848247N741374j869857j803681j134120
$$ -277399 -8005802 -13978677 -8422561 3425686 9167060 7297203 5493522 4359402
35156D359402o994071j0774765l509046N382291K543010n328945j726763J0802068
$$ 4359402 -2634669 -13409434 -16918480 -11536189 -8993179 -14322124 -16048887 -5246819
35148e246819J2982384m65051j2331052r036811J800659O398203L489302J01004
$$ -5246819 7735565 7270514 -5060538 -14097349 -12296690 -5898487 -2409185 -2308181
35140b308181o19953P36775M203250P445163M958895l169257p584885j615033
$$ -2308181 -2928134 -2191359 2011891 9457054 14415949 11246692 3661807 2046774
35132B046774P873678Q968516J068034m953434k432946K477358N46937p229870
$$ 2046774 9920452 18888968 19957002 15003568 12570622 15047980 15594917 8365047
35124H365047j1249501o945182q74466l04362j747961L124502J2083660J2565608
$$ 8365047 -2884454 -9829636 -10704102 -11008464 -12756425 -9631923 2451737 15017345
35116A5017345K28379j1979390j0224986J484554P735078K657096m959535n806163
$$ 15017345 15245724 3266334 -6958652 -5474098 2260980 4918076 -41459 -5847622
35108e847622m44518M810688N398708J150968l416598j981145N612926J0305246
$$ -5847622 -6292140 -1481452 3917256 5068224 1651626 -329519 5283407 15588653
35100A5588653M655545n846241r654071n074621o34369r56686k109035j275421
$$ 15588653 20244198 14397957 4743886 -330735 -965104 -1921790 -4030825 -5306246
35092e306246r33274j472287P49508N051280N179640M2415k950592L34412L831407
$$ -5306246 -6239520 -7711807 -6962299 -1911019 3268621 3311036 360444 694856 4526263
35083D526263J408951l452877m140599r32006J531008J708404M64155k383953
$$ 4526263 5935214 2482337 -1658262 -2590268 -1059260 649144 1113299 -1270654
35075a270654n350206l716862L509467R176172O654688l85250l163700l10122
$$ -1270654 -6620860 -10337722 -6828255 2347917 9002605 8617355 5453655 5143533
35067E143533J382532k049397o044979m191795L088485Q630857O569163p58360
$$ 5143533 6526065 4476668 -1568311 -5760106 -2671621 5959236 12528399 11770039
35059A1770039n327968l526247p09406k448087n044705j546413N326427N823102
$$ 11770039 6442071 2915824 2206418 -241669 -5286374 -6832787 -1506360 4316742
35051D316742j095877n346982j901098J591942j145277l920671N34685O791780
$$ 4316742 3220865 -2126117 -4027215 -2435273 -3580550 -7501221 -6966536 -174756
35043a74756M947035l036675o220204j163244M508874M252460r7612l492632l469623
$$ -174756 4772279 1735604 -4484600 -5647844 -1138970 3113490 3015878 -476754 -3946377
35034c946377j97549M193008N962818L097513j999387n368582n239676j470065
$$ -3946377 -4143926 49082 6011900 9109413 7110026 1741444 -3498232 -4968297
35026d968297M742501Q528216M452929m584474q071149k150325M032006K265826
$$ -4968297 -225796 8302420 12755349 8170875 99726 -2050599 1981407 4247233
35018D247233k378807j331889L092683L510538J097430J444632K053852k724583
$$ 4247233 1868426 536537 3629220 7139758 8237188 9681820 11735672 9011089
35010I011089q007951m230338M948472N902930k960835p847619j606425N653449
$$ 9011089 1003138 -3227200 1721272 7624202 4663367 -3184252 -4790677 862772
35002H62772M011510j414340j409794K113093J442834l573016o541412m508831
$$ 862772 4874282 3459942 2050148 4163241 5606075 2033059 -4508353 -9017184
34994i017184P9565M128360N570157L586494P10269Q37681K688429N23226o008087
$$ -9017184 -8937619 -4809259 760898 4347392 5057661 5895342 8583771 9106997 3098910
34985C098910r149776l957740M232118P493047M661024r69969o808801r209626
$$ 3098910 -6050866 -10008606 -5776488 1716559 6377583 5407614 -1401187 -10610813
34977a0610813l621616P413438J2957643P348362r46564j926457Q11196k258337
$$ -10610813 -14232429 -6818991 6138652 13487014 12540450 10613993 11425189 9166852
34969I166852q714883p060106L395612R177843K978642m678863j809445O087546
$$ 9166852 451969 -6608137 -3212525 5965318 8943960 4265097 2455652 8543198
34961H543198M476818p257754j3922242o710270M449285O641950K402902K288356
$$ 8543198 13020016 5762262 -8159980 -14870250 -10420965 -3779015 -1376113 912243
34953I12243N522553K124218o872777p242227N409356J5241527Q742773m584658
$$ 912243 6434796 8559014 1686237 -5555990 -146634 15094893 23837666 19253008
34945A9253008p513800j467809j002122p730361q644019O9400N928133Q45608
$$ 19253008 11739208 10271399 9269277 1538916 -7105103 -7035703 -1107570 -261962
34937b61962o745734o570036n06628M446492O242768M923812k10359n204248l051582
$$ -261962 -7007696 -13577732 -14084360 -9637868 -3395100 1528712 1318353 -3885895 -6937477
34928f937477M536343P183507J954356k055345J82198K065200o2405P28837O478587
$$ -6937477 -2401134 4782373 6736729 4681384 4863582 6928782 6866377 7595214 14073801
34919A4073801O119540n650372j5054217q894939M161245P380749J299052j160427
$$ 14073801 20193341 14542969 -511248 -9406187 -5244942 2135807 3434859 2274432
34911B274432K515438L247959k505110r252492j2673022j1102825k014441J1109199
$$ 2274432 4789870 8037829 5532719 -3719773 -16392795 -27495620 -29510061 -18400862
34903a8400862J5533027O052867l413532k1879O099403r61708j3285486j0496629
$$ -18400862 -2867835 3185032 -228500 -250379 5849024 4887316 -8398170 -18894799
34895a8894799N010117J0915017K061285k925748M175212P830276j581294r929909
$$ -18894799 -13884682 -2969665 -908380 -3834128 341084 8171360 6590066 -3339843
34887c339843m189541N934782N974534q51125l775293k597787j748558Q37511
$$ -3339843 -7529384 -1594602 4379932 3528807 -246486 -2844273 -4592831 -3755320
34879c755320N647996M576933m909476j0300699k205522R080066R182004J507079
$$ -3755320 1892676 6469609 1560133 -8740566 -10946088 -1866022 7315982 8823061
34871H823061j349908J100374M20251l188256k386713K480226M193114J337062
$$ 8823061 7473153 8573527 8993778 5805522 3418809 5899035 10092149 11429211
34863A1429211j560126l013803l360288L53676P703529R333245k38705j0725213
$$ 11429211 9869085 6855282 3494994 3848670 11552199 20885444 20646739 9921526
34855I921526r825932k402433j467415n903238l816240N327197R458832M509072
$$ 9921526 95594 -2306839 -3774254 -9677492 -13493732 -8166535 1292297 5801369
34847E801369j14504J555570M042725K009693k357727n751717p068762l992965
$$ 5801369 5686865 7242435 11285160 13294853 10937126 5185409 -1883353 -5876318
34839e876318L358712O941648P43053o495157k688897O435118N094343n091059
$$ -5876318 -2517606 4424042 5167095 -1328062 -4016959 2418159 7512502 2421443
34831B421443o261823M753371R352844j744675j2507135q434181Q19855R71814
$$ 2421443 -3840380 912991 10265835 8521160 -3985975 -12420156 -11600301 -10628487
34823a0628487k383352K744568J0809948Q948938J356922J930890Q123286L900122
$$ -10628487 -13011839 -10267271 542677 9491615 10848537 12779427 20902713 24802835
34815B4802835j1910746k0539160j0574344O060129J1930982N684747j423230
$$ 24802835 12892089 -7647071 -18221415 -12161286 -230304 5454443 4031213
34808D031213k123452R60236J727294k131456p017559p302706k214727K921566
$$ 4031213 1907761 2867997 4595291 2463835 -4553724 -11856430 -14071157 -11149591
34800a1149591M036643K937089J692685j458519n390299k799292P740037J3564755
$$ -11149591 -7112948 -4175859 -2483174 -3941693 -9331992 -12131284 -4391247 9173508
34792I173508L758670j1805734j3478363J65669J0468875N851086m172191o134781
$$ 9173508 12932178 1126444 -12351919 -12186250 -1717375 4133711 -38480 -6173261
34784f173261j86855N573120O909203L068389n333858j1736739o972812N934751
$$ -6173261 -6360116 -786996 6122207 9190596 3856738 -7880001 -14852813 -8918062
34776h918062J0595749p25101j3921936j2326567k06619N837315K343909R37023
$$ -8918062 1677687 952586 -12969350 -25295917 -25502536 -19665221 -17321312 -16384289
34768a6384289P218469J2542553Q994904O94303m198552m237782k815760j472584
$$ -16384289 -9165820 3376733 12371637 13065940 8867388 4629606 1813846 341262
34760C41262N11099L163861N314553N359211K204539k575700m788340k706250
$$ 341262 852361 4016222 9330775 14689986 16894525 14318825 9530485 6824235
34752F824235r6692n99782j938720n12634J574245N07932j267385R05061M092544
$$ 6824235 6727543 6127761 4189041 3676407 5250652 5758584 4491199 5396260 9488804
34743I488804J478120m929187n821946J21349L543920L4061k816555O36661L837823
$$ 9488804 10966924 6037737 215791 337140 3881060 3915121 1098566 1735227 5573050
34734E573050k68325o219126m533040L078709P101356M595627N40202k122585
$$ 5573050 5304725 -914401 -5447441 -2368732 4732624 9328251 9868453 7745868
34726G745868m264587m419314l12181M284420L213110j710839k763833J020512
$$ 7745868 3481281 -938033 -1250214 3034206 6247316 4536477 1772644 2793156
34718B793156K459512j232622m156459k896213k299004n102895m856303L347956
$$ 2793156 5252668 4020046 -136413 -3032626 -5331630 -10434525 -15290828 -11942872
34710a1942872J2181705J1283750K713048k498720j142287r79068o194164r607577
$$ -11942872 238833 11522583 14235631 11736911 10594624 9615556 3421392 -6186185
34702f186185m135393N274119Q271414L919861J077456M310360O992295J849812
$$ -6186185 -10321578 -5047459 3223955 7143816 8221272 12531632 19523927 21373739
34694B1373739p096681r295528k497835L886407J792419m858712o635925j945396
$$ 21373739 14277058 4981530 2483695 6370102 8162521 3303809 -3332116 -5277512
34686e277512J907839N3465l542950k980160P55447J844626j236218k992572J388036
$$ -5277512 -3369673 -3316208 -6859158 -9839318 -9083871 -7239245 -8475463 -11468035 -10079999
34677a0079999Q364574R345629J681161p074596q265490k761809J750536K217441
$$ -10079999 -1715425 7630204 9311365 2236769 -6028721 -8790530 -7039994 -4822553
34669d822553K439424L659929J296392n213981p688006j402933N087030K078566
$$ -4822553 -2383129 1276800 2573192 -2640789 -10328795 -11731728 -6644698 -4566132
34661d566132m817904k735500O845274R346226J046126m035574K853373J0189367
$$ -4566132 -9384036 -12119536 -5274262 4071964 5118090 1082516 3935889 14125256
34653A4125256M789952o493407p756145R02189M852795j556648q091640o071059
$$ 14125256 18915208 12421801 4665656 5567845 10420640 8863992 772352 -5298707
34645e298707O20846N284701P751104Q934448N564067l079029r980462q623307
$$ -5298707 -4677861 606840 8357944 17292392 22856459 19777430 9796968 1173661
34637A173661j970661K212454J286500j759222m068853m221176q41452M939475
$$ 1173661 -797000 1415454 2701954 942732 -3126121 -7347297 -8188749 -3249274
34629c249274P804462L939328l007680o005029l470484P4098J021587L0998j009221
$$ -3249274 4555188 8494516 5486836 -518193 -3988677 -3914579 -2892992 -2861994 -3871215
$$ [...]
##END NTUPLES=NMR SPECTRUM
##END=
