##TITLE=31Pdec_SR146_k3
 CDCl3, 24 sc
 27.10.2022
##JCAMPDX= 6.0         $$ Bruker NMR JCAMP-DX V2.0
##DATA TYPE= NMR SPECTRUM
##DATA CLASS= NTUPLES
##ORIGIN= UXNMR, Bruker Analytische Messtechnik GmbH
##OWNER= root
$$ XWIN-NMR		Version 3.5
$$ Thu Oct 27 13:50:12 2022 Russian Standard Time (UT+4h)  she@DPX200
##.OBSERVE FREQUENCY= 81.013821
##.OBSERVE NUCLEUS= ^31P
##.ACQUISITION MODE= SIMULTANEOUS
##.ACQUISITION SCHEME= undefined
##.AVERAGES= 24
##.DIGITISER RES= 16
##SPECTROMETER/DATA SYSTEM= spect
##.PULSE SEQUENCE= zgpg30
##.SOLVENT NAME= CDCl3
##.SHIFT REFERENCE= (INTERNAL, CDCl3, 0, 248.564)
##AUDIT TRAIL= $$ (NUMBER, WHEN, WHO, WHERE, WHAT)
$$ ##TITLE= Audit trail, XWIN-NMR		Version 3.5
$$ ##JCAMPDX= 5.01
$$ ##ORIGIN= Bruker BioSpin GmbH
$$ ##OWNER= she
$$ F:/spectra/data/she/nmr/P31/1/pdata/1/auditp.txt
$$ ##AUDIT TRAIL=  $$ (NUMBER, WHEN, WHO, WHERE, WHAT)
(   1,<2022-10-27 13:49:30.57 +0400>,<she>,<DPX200>,
      <created by zg, POWCHK disabled, PULCHK disabled
       configuration hash MD5:
       00 E9 B6 7A A2 85 ED C7 34 08 36 98 17 FE 4E 26
       data hash MD5: 32K
       8A B2 56 88 0C 4B 83 99 61 8B F2 C9 44 53 14 A3>)
(   2,<2022-10-27 13:49:34.03 +0400>,<she>,<DPX200>,
      <Start of raw data processing
       efp BC_mod = 2 LB = 1 FT_mod = 6 PKNL = 1 PHC0 = -10360.26 PHC1 = 263.2559 SI = 64K 
       data hash MD5: 64K
       5D 25 44 7C D3 65 EB 20 33 37 4A 0C E9 9A 17 DB>)
(   3,<2022-10-27 13:49:46.40 +0400>,<she>,<DPX200>,
      <pk PHC0 = 29.14281 PHC1 = 0 
       data hash MD5: 64K
       0A F3 69 41 B1 0A 7F DD 23 0F 4B BD 2F 07 1F A9>)
(   4,<2022-10-27 13:49:50.18 +0400>,<she>,<DPX200>,
      <abs ABSG = 5 
       data hash MD5: 64K
       D8 94 50 0D CE 35 43 63 EC 35 48 DB 2A 78 62 9C>)
$$ ##END=
$$ 
$$ hash MD5
$$ 04 AF 2D 25 34 9C C8 4E 7E 2E 3C EC 06 12 9F 24
##$RELAX= 
##$RELAX= 
##$RELAX= 
##$RELAX= 
##$RELAX= 
##$RELAX= 
##$RELAX= 
##$RELAX= 
##$RELAX= 
$$ Bruker specific parameters
$$ --------------------------
##$DU= <F:/spectra>
##$EXPNO= 1
##$NAME= <P31>
##$PROCNO= 1
##$TYPE= <nmr>
##$USER= <she>
##$AMP= (0..31)
100 100 100 100 100 100 100 100 100 100 100 100 100 100 100 100 100 100 
100 100 100 100 100 100 100 100 100 100 100 100 100 100 
##$AQSEQ= 0
##$AQ_mod= 1
##$AUNM= <au_zg>
##$AUTOPOS= <>
##$BF1= 81.014009
##$BF2= 200.13
##$BF3= 200.13
##$BF4= 200.13
##$BF5= 200.13
##$BF6= 200.13
##$BF7= 200.13
##$BF8= 200.13
##$BYTORDA= 1
##$CFDGTYP= 0
##$CFRGTYP= 5
##$CHEMSTR= <none>
##$CNST= (0..31)
1 1 145 1 1 1 1 1 1 1 1 1 1 1 1 1 1 1 1 1 1 1 1 1 1 1 1 1 1 1 1 1 
##$CPDPRG= <waltz16>
##$CPDPRG1= <>
##$CPDPRG2= <waltz16>
##$CPDPRG3= <>
##$CPDPRG4= <mlev>
##$CPDPRG5= <mlev>
##$CPDPRG6= <mlev>
##$CPDPRG7= <mlev>
##$CPDPRG8= <mlev>
##$CPDPRGB= <>
##$CPDPRGT= <>
##$D= (0..31)
0 1 0 0 0 0 0 0 0 0 0 0.03 2e-05 3e-06 0 0 0 0 0 0 0 0 0 0 0 0 0 0 0 0 
0 0 
##$DATE= 1666864170
##$DBL= (0..7)
120 120 120 11 120 120 24 19 
##$DBP= (0..7)
150 150 150 150 150 150 150 150 
##$DBP07= 0
##$DBPNAM0= <>
##$DBPNAM1= <>
$$ [...]
##$SUBNAM3= <"">
##$SUBNAM4= <"">
##$SUBNAM5= <"">
##$SUBNAM6= <"">
##$SUBNAM7= <"">
##$SUBNAM8= <"">
##$SUBNAM9= <"">
##$SW= 501.771253377433
##$SWIBOX= (0..15)
0 1 3 0 0 0 0 0 0 0 0 0 0 0 0 0 
##$SW_h= 40650.406504065
##$TD= 32768
##$TD0= 1
##$TE= 0
##$TE2= 300
##$TE3= 300
##$TEG= 300
##$TL= (0..7)
0 120 53 12 22 120 120 120 
##$TP= (0..7)
150 150 150 150 150 150 150 150 
##$TP07= 0
##$TPNAME0= <>
##$TPNAME1= <>
##$TPNAME2= <>
##$TPNAME3= <>
##$TPNAME4= <>
##$TPNAME5= <>
##$TPNAME6= <>
##$TPNAME7= <>
##$TPOAL= (0..7)
0.5 0.5 0.5 0.5 0.5 0.5 0.5 0.5 
##$TPOFFS= (0..7)
0 0 0 0 0 0 0 0 
##$TUNHIN= 0
##$TUNHOUT= 0
##$TUNXOUT= 0
##$USERA1= <user>
##$USERA2= <user>
##$USERA3= <user>
##$USERA4= <user>
##$USERA5= <user>
##$V9= 5
##$VALIST= <valist>
##$VCLIST= <CCCCCCCCCCCCCCC>
##$VD= 0
##$VDLIST= <DDDDDDDDDDDDDDD>
##$VPLIST= <PPPPPPPPPPPPPPP>
##$VTLIST= <TTTTTTTTTTTTTTT>
##$WBST= 1024
##$WBSW= 4
##$XGAIN= (0..3)
0 0 0 0 
##$XL= 0
##$YL= 0
##$YMAX_a= 2737
##$YMIN_a= -3015
##$ZGOPTNS= <>
##$ZL1= 120
##$ZL2= 120
##$ZL3= 120
##$ZL4= 120
##$ABSF1= 248.5645
##$ABSF2= -253.2056
##$ABSG= 5
##$ABSL= 3
##$ALPHA= 0
##$AQORDER= 0
##$ASSFAC= 0
##$ASSFACI= 0
##$ASSFACX= 0
##$ASSWID= 0
##$AUNMP= <proc_1d>
##$AZFE= 0.1
##$AZFW= 0.5
##$BCFW= 0
##$BC_mod= 2
##$BYTORDP= 0
##$COROFFS= 0
##$CY= -3
##$DATMOD= 1
##$DC= 0
##$DFILT= <>
##$DTYPP= 0
##$F1P= 0
##$F2P= 0
##$FCOR= 1
##$FTSIZE= 65536
##$FT_mod= 6
##$GAMMA= 0
##$GB= 0
##$INTBC= 1
##$INTSCL= 6.047779e-11
##$ISEN= 30
##$LB= 1
##$LEV0= 0
##$LPBIN= 0
##$MAXI= 10000
##$MC2= 0
##$MEAN= 0
##$ME_mod= 0
##$MI= 50
##$NCOEF= 0
##$NC_proc= -9
##$NLEV= 6
##$NOISF1= 182.463
##$NOISF2= 159.3651
##$NSP= 0
##$NTH_PI= 0
##$NZP= 0
##$OFFSET= 248.5645
##$PC= 4
##$PHC0= -10331.12
##$PHC1= 263.2559
##$PH_mod= 1
##$PKNL= yes
##$PPARMOD= 0
##$PSCAL= 0
##$PSIGN= 0
##$REVERSE= no
##$SF= 81.0140089999694
##$SI= 65536
##$SIGF1= 159.3651
##$SIGF2= -187.1042
##$SINO= 113.3802
##$SIOLD= 16384
##$SREGLST= <1H.CDCl3>
##$SSB= 0
##$STSI= 65536
##$STSR= 0
##$SW_p= 40650.406504065
##$SYMM= 0
##$S_DEV= 0
##$TDeff= 32768
##$TDoff= 0
##$TI= <>
##$TILT= no
##$TM1= 0
##$TM2= 0
##$TOPLEV= 0
##$USERP1= <user>
##$USERP2= <user>
##$USERP3= <user>
##$USERP4= <user>
##$USERP5= <user>
##$WDW= 1
##$XDIM= 65536
##$YMAX_p= 369130075
##$YMIN_p= -157871518
$$ End of Bruker specific parameters
$$ ---------------------------------
##NTUPLES= NMR SPECTRUM
##VAR_NAME=  FREQUENCY,     SPECTRUM/REAL,   SPECTRUM/IMAG
##SYMBOL=    X,             R,               I
##VAR_TYPE=  INDEPENDENT,   DEPENDENT,       DEPENDENT
##VAR_FORM=  AFFN,          ASDF,            ASDF
##VAR_DIM=   65536,         65536,           65536
##UNITS=     HZ,            ARBITRARY UNITS, ARBITRARY UNITS
##FACTOR=    0.620285442955139, 1,           1
##FIRST=     20137.2065510682, 0,            0
##LAST=      -20513.1999529968, 0,           0
##MIN=       -20513.1999529968, -157871518,  0
##MAX=       20137.2065510682, 369130075,    0
$$ Real data points
##PAGE= N=1
##DATA TABLE= (X++(R..R)), XYDATA
$$ [...]
44644 -4246650 870253 401884 -9221838 -17141414 -13771608 -5856303 -5434523 -11479715
44636 -11479715 -13928755 -9939069 -4319127 1426552 8221789 11147903 4721536 -5452695
44628 -5452695 -8566937 -5067806 -5011830 -10557588 -13230795 -9655493 -6409124 -6243866 -3120223
44619 -3120223 3896999 5148417 -3386004 -10227250 -4906890 5211653 6232653 -1258639
44611 -1258639 -5217639 -1888277 878774 -766868 -716665 4611704 8815834 6240725
44603 6240725 2257102 5593749 14921388 20457923 17477376 11700725 10357111 13044037
44595 13044037 14162018 11152158 6661732 3702244 2167040 541054 -1666578 -4225138
44587 -4225138 -6765775 -7831080 -5320862 420325 5411692 5699672 1409157 -3879338
44579 -3879338 -6645202 -5668761 -2645445 -1499586 -4881448 -10244428 -11893467 -7961360
44571 -7961360 -2153105 2537109 7262229 12130424 12893645 7183909 -243674 -3289105
44563 -3289105 -1724176 1865773 7530718 14591945 17926113 14934893 11706329 14051610
44555 14051610 16892772 12150167 2972653 -1278589 -858084 -3170813 -6509411 -1788776
44547 -1788776 8567396 10090936 -961026 -10319285 -8089877 -2901050 -4189835 -5364497
44539 -5364497 2106407 10168942 5878717 -6359797 -10703038 -3863758 2069377 -721661
44531 -721661 -6908207 -8971037 -5421064 2658136 13000523 18990791 14233506 1745929
44523 1745929 -8735386 -12786115 -13561117 -13228802 -10735097 -7771949 -8074421 -10218004
44515 -10218004 -9528226 -7481800 -9963956 -15001130 -12362776 1001634 14049535 15389219
44507 15389219 7303853 762645 1290197 4765323 4307739 -2340264 -10751690 -13900318
44499 -13900318 -10177673 -6381271 -9038849 -14547272 -13920882 -6351922 -429595 -992173
44491 -992173 -2626948 1019413 8365017 14046678 16438090 17119969 16825082 14959768 10260692
44482 10260692 936151 -11949114 -21263077 -19739701 -9916689 -1924189 -312277 -73132
44474 -73132 2816434 5373144 5441500 6877391 11510333 13651679 9428094 5077732 7961337
44465 7961337 14131387 13556247 5088918 -2269313 -2526290 361926 15572 -3639451 -5877851
44456 -5877851 -4405903 -2308426 -3792221 -8094381 -9586487 -5466268 -854015 -2005320
44448 -2005320 -6266740 -5425724 907735 3454556 -2462249 -9002012 -7530430 -1439710
44440 -1439710 -151709 -4918381 -8106593 -4362170 3800537 10237467 10204619 2863676
44432 2863676 -6889119 -11011259 -6811422 -811897 -485167 -4978132 -8175716 -7760846
44424 -7760846 -6130924 -4927327 -4097554 -4585724 -6873011 -8328037 -6589584 -3916808
44416 -3916808 -3785848 -5148930 -4600786 -2093357 160658 1988845 3386994 1189816
44408 1189816 -6205505 -12994494 -11684730 -3634223 2398931 1248360 -5161051 -13488861
44400 -13488861 -20597876 -20635246 -9597603 5913538 13008390 8184298 1087198 -204666
44392 -204666 591137 -2777157 -7420180 -6438711 -856100 1682358 -1946409 -7630841 -11645780
44383 -11645780 -14186800 -14659723 -10024303 -736595 6594476 6702128 2850718 2116379
44375 2116379 5484759 8007002 8177680 10339592 15461056 16517270 8855334 -128861
44367 -128861 21730 6888648 7893522 -1068022 -9931686 -10148191 -6043276 -5000038 -5202379
44358 -5202379 -1265642 4327786 4676378 -165654 -3738808 -3188026 -1342552 -140921
44350 -140921 1242871 2447950 1963238 453523 -761369 -2913432 -6571624 -7675921
44342 -7675921 -2684315 4512219 7371678 6839905 9778036 17622640 22966346 18283421
44334 18283421 4063830 -11313540 -17226042 -9493322 3139465 6137884 -2660278 -8988435
44326 -8988435 -3078377 4318536 -1506886 -14426884 -15429665 -1772978 9513896 7726314
44318 7726314 626299 -3059109 -6406077 -12576641 -14850813 -7629575 3167067 8803928
44310 8803928 8121799 3403994 -4273899 -9851184 -5523810 5889285 10139285 2091090
44302 2091090 -4661183 1536779 11864561 11567460 2907760 -953422 2238111 3390757
44294 3390757 -639575 -3612889 -2101810 938766 3612325 5784780 4352751 -2191255
44286 -2191255 -7062310 -3437266 3445253 3653762 -731384 939076 9024894 12007567
44278 12007567 5112763 -2527319 -2581275 2090806 5693812 7739459 8517201 5753622
44270 5753622 952885 1082896 8856734 18058821 22680976 23831191 23505011 18997410
44262 18997410 9252601 732961 489452 6862612 11834213 9792883 931683 -10234482
44254 -10234482 -16676092 -13338904 -3378757 3564744 2441111 -1178111 1086031 9932154
44246 9932154 18542945 20399389 14579980 5668820 -210876 -1524906 -3173364 -8716044
44238 -8716044 -12620962 -7056541 4218679 7906950 -753610 -11468316 -14745322 -14588711
44230 -14588711 -18168365 -21397243 -15158772 -1180646 8705837 7548133 -911329 -10232324
44222 -10232324 -17012401 -18767670 -13766642 -4638227 3115568 7120438 8546036 7482626
44214 7482626 3507252 195408 2142864 6571441 5074509 -3659581 -9831347 -6015286
44206 -6015286 973196 -1309137 -12981549 -20059461 -11814563 5869064 17907174 17287467
44198 17287467 10296998 5631306 3949065 959349 -3293785 -3962063 350659 4628295
44190 4628295 4933944 4358653 7798054 13877401 16670842 14132334 10339418 9337577
44182 9337577 10587525 11319848 10296552 7970237 5147189 2719237 1215431 -40015
44174 -40015 -1851308 -3008709 -1254670 2987558 6032881 5298785 2410487 557276 618441
44165 618441 1904379 5014957 10773333 16673884 17867442 12953779 6180256 2139273
44157 2139273 789278 367696 2619300 10242141 19855865 23647821 20172039 17850357
44149 17850357 23178912 29693589 25038388 7239463 -12468357 -22911312 -23147790 -18788497
44141 -18788497 -14296256 -11156370 -8740117 -4538998 2310332 6291389 -27728 -14185191
44133 -14185191 -22930473 -17781939 -5687355 1572250 2802313 4362600 6610277 4034251
44125 4034251 -2491507 -4756377 -607333 1421380 -4929130 -13948551 -16461764 -11654871
44117 -11654871 -4658570 2190757 8790438 11905492 8259637 1730925 232092 4783343
44109 4783343 7803499 4211721 -772344 1631620 11786243 19914299 16501274 3002069
44101 3002069 -8632761 -7686451 4069845 14196690 13285065 4754207 -800069 1300549
44093 1300549 5916272 6290956 1907438 -2828274 -4412585 -2739333 288984 2533759
44085 2533759 2664349 971802 -597688 289138 4509487 10352524 14579311 15850769
44077 15850769 16657044 19380815 20659028 14184605 947581 -8755872 -7951058 -2494883
44069 -2494883 -1360933 -2196475 3486476 13031272 13203202 447569 -11530016 -10504188
44061 -10504188 -1958147 1344233 -2617300 -7311273 -11065246 -16593055 -20760487 -16836089
44053 -16836089 -6671518 -451962 -3242817 -10132175 -15454365 -18477730 -18606265 -13328994
44045 -13328994 -3978664 2858327 2606179 -2902941 -8871828 -10827712 -5889361 2871629
44037 2871629 5462945 -3187852 -12641132 -9146813 3085413 6930232 -413056 -2199858
44029 -2199858 10196117 21854558 17378773 4236991 -1110960 1946282 3490888 3439096
44021 3439096 8148348 12825398 6689284 -6418395 -11061180 -4465185 -417418 -6315292
44013 -6315292 -12918616 -11990411 -8910177 -10357765 -12257688 -8705005 -3019833 -1386561
44005 -1386561 -3089453 -4463324 -5841037 -7837305 -6943804 -1432347 3635642 3263143
43997 3263143 -254372 -1953557 -1340121 -351652 1108251 3457401 5730719 8436128
43989 8436128 12574131 13920383 6502337 -4932548 -6115939 6667204 17663284 11974798
43981 11974798 -3623572 -11157038 -6137069 644763 1840972 737345 509239 -1196809
43973 -1196809 -4638758 -4913305 -209725 4041525 2773508 -2231745 -6346615 -8486603
43965 -8486603 -10799556 -14299855 -16509912 -13052210 -2715259 8451891 11638783 6143576
43957 6143576 1254884 3525155 7353269 4061666 -4440462 -8783412 -5798515 -931273
43949 -931273 1191434 767186 -1360706 -4169390 -3638987 2778631 9410780 7868464 -907476
43940 -907476 -7793809 -8373393 -6569807 -5708000 -5033949 -5586973 -9642514 -12743502 -6818901
43931 -6818901 5654416 11337237 4680897 -3610454 -3342373 145446 -3049460 -9779278
43923 -9779278 -8897319 581818 7989620 6619582 1152790 -1103319 1422054 6180102
43915 6180102 10120550 10278311 5914684 1160396 796937 2626962 -698739 -10536501
43907 -10536501 -18267039 -15970199 -7153927 -2230032 -5344998 -10674385 -11589915 -8409925
43899 -8409925 -4997432 -2043535 1976051 5723885 6349825 5129202 5718799 6378556 1288733
43890 1288733 -7832677 -10005543 -1057793 6532245 -290190 -14718443 -18001421 -5685343
43882 -5685343 7227514 8493656 2913396 169467 436899 -827418 -3424369 -5894145
43874 -5894145 -10690200 -17388238 -17481181 -5551535 9221252 12721526 4233332 -4439165
43866 -4439165 -6569487 -7370529 -12496995 -18697183 -19420370 -13767646 -5956010 606552
43858 606552 5217112 7534946 6454196 2082213 -2452503 -3412416 -1555391 -1895732 -5498703
43849 -5498703 -5425563 2982206 11444824 8531665 -1187860 -1222853 10869517 16837581 4906944
43840 4906944 -11305342 -13894393 -7924053 -10295259 -20154616 -20846624 -8424791 2172684
43832 2172684 1404743 -2642292 -1181705 2105892 1708562 568610 1946832 2271733 -244652
43823 -244652 59710 5799927 9886760 7158162 3531844 5113957 6950330 2297803
43815 2297803 -4605413 -5747270 -3087305 -3696734 -5785560 -1748159 7018394 10365080
43807 10365080 5016266 -500405 1087579 6193383 7094532 2014111 -4843105 -8828612
43799 -8828612 -7462560 -765715 8181787 14542223 15476921 12454482 9513238 9105056
43791 9105056 9241802 5839269 -467299 -2368953 4545809 12443633 9459986 -2722547
43783 -2722547 -9616674 -5081002 -241246 -4826866 -11240093 -7881216 1336861 4432294
43775 4432294 1442387 1814892 5951173 5838935 2639700 6109306 14517135 12962263
43767 12962263 -2237625 -13863409 -7877194 6709582 13465526 12128493 12700255 14987188
43759 14987188 10388555 135702 -4416072 -405454 1543013 -5422237 -13561631 -12816287
43751 -12816287 -5359863 -659681 -1271843 -1217071 3194496 7541819 5676378 -2018371
43743 -2018371 -9319995 -11656876 -10268219 -8527734 -6743742 -3222958 837464 1659809
43735 1659809 -1077993 -2598900 122142 3270529 1476334 -4299324 -8281138 -7750140
43727 -7750140 -5006315 -2170146 1205005 4689129 5680154 3612751 2040370 3813691
43719 3813691 6530160 5775986 1521690 -1859625 -1629974 245200 670012 -627253 -2204663
43710 -2204663 -3761863 -5601780 -6808123 -6807355 -7644795 -11064325 -13887584 -11307519 -5743720
43701 -5743720 -6233778 -15248312 -22002235 -15625658 -1099233 6497099 2354629 -2692731
43693 -2692731 1353407 10678470 15223198 11919331 4827130 -2264989 -6898370 -5554444
43685 -5554444 2757357 12130688 14854045 10126996 3002954 -3918949 -11925067 -19483525
43677 -19483525 -20538945 -12310615 -851123 4655332 1759605 -3430126 -3867923 759461
43669 759461 4731911 3794003 -208685 -3409420 -5975205 -9957377 -12388771 -7072931
43661 -7072931 4748862 12041904 7068000 -4094852 -10040730 -9110583 -8653207 -11547533
43653 -11547533 -12148639 -6512341 1118812 5081877 5672142 5940127 5509417 2120831 -3023807
43644 -3023807 -5787706 -4670567 -2986451 -4654000 -8777642 -9470785 -2419462 7997914
43636 7997914 10964252 1791147 -9777375 -9177818 4779116 17292867 15945021 6183293
43628 6183293 2848435 9613810 14804659 8699191 -2468210 -5090187 3357767 11699245
43620 11699245 10675285 3988904 610070 1990487 2806357 935989 -371195 715203
43612 715203 2387015 3986830 6607546 8392434 6305006 3717848 7878951 17027645
43604 17027645 19381462 10320779 1328062 3746169 11687257 11298547 776095 -10305465
43596 -10305465 -16770470 -19989150 -17274853 -4021307 12658654 16849613 4891476 -8170196
43588 -8170196 -8570313 -236735 4468865 1204502 -5716818 -11381101 -12301266 -6917208
43580 -6917208 -132615 -1118917 -10898777 -18687649 -16508342 -10183072 -8602224 -9494895
43572 -9494895 -5237108 3083370 7991967 8194267 8301057 8519352 5278666 991553 2369594
43563 2369594 8301543 9537086 2554864 -5352924 -7572538 -6019857 -3787621 1488224
43555 1488224 11022203 18342705 16559159 8246383 1516983 -1166620 -3891924 -8345768
43547 -8345768 -10343275 -6073347 3039903 13073857 21175503 24680275 20833892 11080902
43539 11080902 3095442 3747039 10330758 13310216 8733978 3229871 4047976 8729290
43531 8729290 9481831 4672031 -40980 -399385 2997681 9051806 16595630 19998810
43523 19998810 12697283 -2133593 -12338772 -12259471 -9651531 -11835438 -13343193 -5797610
43515 -5797610 6765173 13308886 12482493 12222986 14310024 11683004 2735347 -3495859
43507 -3495859 -1060941 3742482 3330698 1088662 4638777 12182429 14622953 9257561
43499 9257561 2706496 -433507 -3914407 -11126207 -16054922 -9766964 5591268 16293417
43491 16293417 13024417 2103121 -3981469 -3168215 -3390488 -7026023 -5979648 3928244
43483 3928244 12865481 9352901 -2912162 -9945744 -6428171 -178020 1816089 2042005
43475 2042005 4634206 7249143 5704727 1455357 -741728 -49312 -512953 -5760280
43467 -5760280 -14710070 -21861041 -21608893 -13813581 -4678685 -82802 780407 2276240
43459 2276240 4892164 5752811 5297015 7179538 11006863 11519332 7007688 2864004 3865684
43450 3865684 7683755 9257525 7627109 5158165 3321182 2446956 2997473 4183096
43442 4183096 3500917 216325 -2263578 568069 9634417 20789904 26894378 23012343
43434 23012343 12312039 4426751 3721880 2585445 -6688995 -16973154 -14414574 -778622
43426 -778622 6185694 -1369242 -9222217 -3071468 10012407 14238291 9309761 7039163
43418 7039163 9701091 8027301 -559821 -7065369 -6453573 -4918463 -7467498 -9233124
43410 -9233124 -4591600 3717412 10099853 13668253 15031636 11765414 2879708 -6488630
43402 -6488630 -9783216 -5631576 2727677 10557597 12509285 6517967 -292200 3285025
43394 3285025 16736349 24319147 14413707 -3531616 -10076141 122580 14411690 19827376
43386 19827376 14990172 5175087 -4331308 -8399380 -4862718 -75910 -3335041 -12515644
43378 -12515644 -14337616 -3981205 5309252 857208 -9596090 -9083918 2321847 7349589
43370 7349589 -1942740 -12495712 -10815636 -2336790 -306859 -4675027 -4956106 558605
43362 558605 2548624 -2006206 -3363038 5209645 15335484 14793200 4433525 -4256512
43354 -4256512 -4708093 -306098 4292684 8410105 10904636 8093868 -51200 -6617421
43346 -6617421 -5376780 805802 3402567 -1217399 -8512870 -12517362 -11782050 -7769285
43338 -7769285 -1323494 6366597 11568556 10567942 4523170 -869856 -1254514 2601214
43330 2601214 7206115 10328963 11587529 11105141 9254724 6555981 2695894 -2830250
43322 -2830250 -8049520 -8977074 -5149511 -2469489 -6950607 -16677121 -23567149 -22547331
43314 -22547331 -15416626 -6477306 727708 2154508 -5007085 -16386178 -21365752 -14505055
43306 -14505055 -2622352 4142251 5278717 8113717 14973742 19424324 16324978 8909432
43298 8909432 2619508 -2638543 -9194365 -14471663 -13539870 -7669409 -4249132 -7379928
43290 -7379928 -13669168 -18729559 -22441744 -24948370 -22894120 -14747556 -5853387 -1963970
43282 -1963970 -610635 3747663 7873665 2502509 -11906891 -21960662 -18176775 -6635304
43274 -6635304 1921611 6555154 11703048 15269449 11841376 4047099 -242705 -440736
43266 -440736 -2331729 -5365037 -2553351 5401885 7923636 881624 -5897868 -3964704
43258 -3964704 595023 -2167321 -10003238 -13224861 -10492740 -9133930 -11716603 -12328199
43250 -12328199 -6878309 800826 4745973 2922054 -3405180 -10763550 -12991441 -5493627
43242 -5493627 7833448 16733643 16182043 11785037 11008624 13234663 12699099 8359786
43234 8359786 5296046 6538556 8659464 7521301 4543218 3657829 4377787 2691979
43226 2691979 -1507410 -3206889 -183805 2863937 1458172 -1708131 -1447846 1962944
43218 1962944 4756728 6184121 6850725 3985999 -3703230 -9287526 -5675660 912007
43210 912007 -2701152 -15835368 -22558599 -15173778 -5795344 -7065323 -13806843 -14602090
43202 -14602090 -11155912 -12509143 -16848035 -13775216 -1908037 8970178 12540673 11296761
43194 11296761 7738023 1406193 -4638671 -4929273 -959043 -360315 -5133471 -9169121
43186 -9169121 -8698479 -6496101 -4349427 -518226 3259979 1556702 -4938311 -8220524
43178 -8220524 -5000456 -1363366 -1844202 -2907511 -1895172 -3176366 -9164875 -13813522
43170 -13813522 -12520057 -10730471 -13948756 -15974145 -7686177 6606904 12701313 5347495
43162 5347495 -6026243 -10926706 -8867046 -5385219 -4214454 -5983724 -9253104 -10230057
43154 -10230057 -5739757 1196153 2643853 -4646943 -14053713 -16622720 -11697426 -6637324
43146 -6637324 -6941076 -10396695 -11812086 -10025672 -7231641 -3448874 3461953 11685689
43138 11685689 14665982 9878589 4167281 4945975 8855873 6081018 -4746130 -13551162
43130 -13551162 -12526921 -6003970 -3058133 -5687236 -8760274 -7712117 -1685917 7987058
43122 7987058 17619714 21143639 14833043 2222845 -8251911 -10728179 -6335050 -1544415
43114 -1544415 -2853867 -10910392 -18660410 -17490438 -6535845 5999006 11492626 8602170
43106 8602170 2146788 -2433796 -2876422 -1635448 -3926798 -10634587 -13940426 -5751543
43098 -5751543 9561377 18202936 14191687 5476046 227902 -3529000 -9454906 -13638625
43090 -13638625 -11884678 -8520236 -8888790 -9768586 -6968182 -5729217 -11739110 -17401220
43082 -17401220 -11165745 2610378 8359028 3065175 -755393 2402921 2709645 -4964789
43074 -4964789 -9340449 -1354887 9209377 8664764 673293 -1474910 3746811 7219499
43066 7219499 6521316 6551975 5355494 -4221178 -17659289 -19741819 -7127543 4571398
43058 4571398 3482862 -2148189 -501503 2760733 -5380221 -21117209 -26478596 -15372424
43050 -15372424 -1826842 1042699 -2705372 -2854894 340420 -327044 -5551479 -9443774
43042 -9443774 -10065346 -11224032 -14177485 -14918211 -11008787 -5688164 -3344110 -4526923
43034 -4526923 -6736977 -7357959 -5098947 -942836 2144934 2580567 2449350 3678646 3290221
43025 3290221 -3360172 -15027860 -24626617 -27066636 -23117726 -15775535 -7770023 -3012886
43017 -3012886 -4645551 -9526746 -9542692 -963959 11247257 19912285 21989021 17398350
43009 17398350 7542858 -2423721 -5924152 -3136008 -1141792 -2376776 16591 9758161
43001 9758161 17669636 12916561 -919419 -10448237 -10271569 -6765105 -5644636 -5520520
42993 -5520520 -4380076 -3641890 -3785670 -3021606 -1914677 -2814494 -3721091 -1787 6351645
42984 6351645 7194426 676807 -4754209 -2733005 2372422 4356061 5231667 9261348
42976 9261348 13028887 10359563 3803762 2290869 8224032 14582866 15044929 10327816
42968 10327816 4008443 -1416681 -3161487 559932 5573974 4329173 -3139866 -6770577
42960 -6770577 48010 9793408 10540033 2897486 -1338501 3294894 9001120 7730280
42952 7730280 2440335 2178 -84230 -2286824 -5248927 -4459268 -2286568 -5668606 -13825477
42943 -13825477 -17816469 -14097866 -9197797 -7686815 -5009843 2364153 8627205 7895074
42935 7895074 4193826 3566308 2824180 -3717813 -11536731 -11484258 -4975100 -1679284 -3510275
42926 -3510275 -3222641 888741 1832179 -1988441 -2076184 5805881 13628293 13734013 9952613
42917 9952613 9179652 10351462 9399523 7878030 8762015 9814408 8554873 7630225 7754952
42908 7754952 2436783 -10850422 -21034691 -16834034 -4975191 -1725757 -8726841 -11788465
42900 -11788465 -4334882 3115326 1610020 -1951752 2083110 9272658 8574159 515423
42892 515423 -3888895 -318004 3695204 2289526 757219 6595515 16730905 20200981
42884 20200981 12233434 106577 -6384524 -6223215 -5760248 -8502257 -11088379 -9606858
42876 -9606858 -5237891 -1425631 856699 1876786 171708 -5161696 -10989901 -13069384
42868 -13069384 -11609529 -10283444 -10367195 -9408884 -5284036 1683325 9886059 16255241
42860 16255241 16154639 8184019 -1213711 -3184617 2494250 6580756 2225296 -6718057
42852 -6718057 -11409598 -8039878 664284 10471916 18459055 22622068 22273994 18958534
42844 18958534 15401467 13448271 13097305 12641991 9944310 4945719 536282 -659743
42836 -659743 502457 1661742 2563553 3785794 3967564 2803559 4850989 13916375 24148357
42827 24148357 24264786 12160832 -1929293 -9063154 -10597277 -10277964 -6401947 1515126
42819 1515126 6125440 1504294 -6177416 -6951444 -2496031 -2956114 -10163397 -15123642
42811 -15123642 -12985399 -9726568 -10677802 -11917300 -8309749 -2554174 -75242 -531134
42803 -531134 -614176 -826954 -2984730 -4388788 -1521509 2270250 -101204 -8665564 -15095752
42794 -15095752 -13409817 -6400663 528381 6481646 12510884 16531844 16163774 14355928
42786 14355928 16407793 21632295 23504887 19369730 14592706 13962559 13806621 7914563
42778 7914563 -1793803 -7144965 -5476330 -2680951 -3252727 -3940753 -709685 3469698
42770 3469698 2715059 -3341014 -9980024 -13798223 -14339156 -11765228 -7720177 -6529534
42762 -6529534 -10139884 -12984417 -7636617 4365354 12839523 11160420 3353234 -2512455
42754 -2512455 -3641963 -2952258 -3554419 -5591256 -7186798 -6970360 -5891062 -5809246 -5526868
42745 -5526868 -1086919 7067834 10991344 5158531 -3212489 -1927210 8623653 15020550
42737 15020550 9906161 1764271 775892 4008931 2575771 -3288603 -6115621 -4482196
42729 -4482196 -4268568 -7338676 -8258643 -4033306 504691 216680 -3085662 -4534254 -3239188
42720 -3239188 -1685064 -990623 -591179 -945403 -2817149 -4488418 -3352111 -750949 -1482518
42711 -1482518 -6344373 -8606196 -2386546 7242149 8925931 757734 -5960247 -2820097
42703 -2820097 3096929 646765 -6835242 -5732782 6721954 17869994 18252742 12914883
42695 12914883 9252559 4963383 -3712997 -10948874 -9057555 -1552069 1956942 419283
42687 419283 965277 5931566 10049855 10435800 10612838 13212396 15691029 15249715 12854291
42678 12854291 10813938 10049278 10319266 10428826 9046136 7628924 9865311 15190026
42670 15190026 16929165 11312076 3808770 1122305 2032985 2747163 5170617 10805065
42662 10805065 12350136 3217613 -8648034 -9699575 -1239248 3188663 -101678 -1207769
42654 -1207769 3359899 3749300 -4652996 -11235593 -7082933 1222679 3968402 2891595
42646 2891595 3475745 3310404 -726795 -2761097 2675332 8871569 6603220 -605897
42638 -605897 -3239963 -2578775 -7175014 -15411738 -15560962 -3915036 8982781 12549921
42630 12549921 7272606 -606839 -7128365 -10420183 -9448976 -6613057 -6934257 -11622551
42622 -11622551 -15272123 -11336533 995080 15363220 22676126 18835564 9595521 5113607
42614 5113607 8316144 12714098 13112089 11937411 11634933 8815856 2344953 -224122
42606 -224122 6986246 16922408 17794027 8188233 -4358686 -14605362 -20029767 -16166952
42598 -16166952 -3682816 4726795 -1515791 -12900198 -11174585 2869456 9945469 2016436
42590 2016436 -6566356 -3231870 4721642 5856277 3917645 8684933 17551907 19663087
42582 19663087 12915276 5327366 2463435 2535127 1880331 -1649118 -8473783 -15004822
42574 -15004822 -14737660 -6572356 1797759 3643384 1901087 3079717 7483570 11380160
42566 11380160 14074037 16328856 15963139 11427548 5830762 1660697 -3368124 -8848350
42558 -8848350 -6828854 6301426 19081198 17881133 6614576 479347 2086386 -1137916
42550 -1137916 -14004830 -23386227 -17495386 -2915687 6473142 8110179 8392024 8838484
42542 8838484 5875703 945968 136004 4146693 7261131 6812147 6074984 6508011 4460503
42533 4460503 -1410104 -5388839 -1653849 7502785 13983706 12147290 2542232 -9527558
42525 -9527558 -16526776 -13348270 -3553304 1718834 -4132602 -13981737 -15212090 -5966032
42517 -5966032 3092885 3379908 -2259090 -6736550 -7969772 -6753242 -2196223 4133499
42509 4133499 4788403 -4346637 -14390441 -12525452 -283941 7048772 1408409 -7511276
42501 -7511276 -7972841 -3629281 -6093070 -15302211 -18866404 -11215308 -2515172 -3447467
42493 -3447467 -9179956 -6999486 4140392 12097869 10237564 7088130 11685916 18106125
42485 18106125 14775916 4154130 182211 6487297 10863801 5594990 45446 4611927
42477 4611927 13380142 14522577 9657016 8983633 12282403 9822349 502965 -5866699
42469 -5866699 -5511626 -5745019 -9924024 -10849188 -4618636 934914 -1214349 -6085723 -5385992
42460 -5385992 779874 7700823 13747399 17453575 14657023 6003158 223190 2398054
42452 2398054 5889275 3670259 123944 2188490 5874633 3068073 -3187176 -2472629
42444 -2472629 6215211 12842159 11046386 4768490 161324 -715317 1852341 5967443
42436 5967443 7736217 6516236 8127801 15678453 21061179 15087983 2587205 -4057528
42428 -4057528 -4009605 -7384333 -16098007 -20053890 -15164125 -10767999 -13519575 -16803958
42420 -16803958 -13575746 -8442783 -8271165 -10119370 -7773321 -2838442 -479213 -508041
42412 -508041 -824564 -3059437 -6330860 -2635622 11069207 22435242 17741393 2504872
42404 2504872 -4802529 2119182 11679995 14000626 12457757 12043791 9097411 145211
42396 145211 -8352426 -8216866 -2352981 -1191192 -8783984 -18611063 -21669814 -14162272
42388 -14162272 860896 14913071 18858812 11158139 750464 -2171511 2493585 6390355
42380 6390355 4575949 796782 513395 3614321 6203484 5953503 2923491 -2341650
42372 -2341650 -8402300 -12058778 -10992945 -7099200 -4958136 -6815992 -10613046 -12954534
42364 -12954534 -12459277 -9993232 -7197704 -5540640 -5742274 -7112192 -7690064 -5608879
42356 -5608879 -502110 6170932 11856968 14239161 12504281 7574168 1225900 -4678571
42348 -4678571 -8505532 -9790041 -10103714 -11170549 -11409947 -6900847 2348882 9940779
42340 9940779 10330560 6234429 4103480 3879817 -220639 -8387377 -12254666 -6688745
42332 -6688745 1881294 4132064 -146786 -4819804 -7931830 -11698327 -14468439 -11843473
42324 -11843473 -6209042 -6103823 -13050356 -17169426 -11375601 -3416198 -6006780 -18460237
42316 -18460237 -26789586 -22152371 -11452182 -6771540 -10156027 -13652232 -11084839 -4174793
42308 -4174793 2498956 7436475 11115840 12332585 9026217 2050995 -4375065 -6432686
42300 -6432686 -3827464 694589 3858720 4264215 3716653 5898987 11966210 17570594
42292 17570594 16648703 8964670 1510197 586674 4126808 4215376 -3327436 -14029757
42284 -14029757 -19767273 -17289113 -10959335 -7359901 -7933501 -7984320 -3426647 3055167
42276 3055167 4992249 935346 -2954789 -609199 6160295 10046012 7192949 1339750
42268 1339750 -761295 3748061 11755014 17754449 18607848 14654741 7088506 -3328792
42260 -3328792 -13605725 -17632602 -12373442 -3927450 -2035140 -7781641 -12234535 -9098429
42252 -9098429 -2599365 800192 2190256 5569283 8462620 5458635 -1314867 -4044060
42244 -4044060 -1514697 -1226567 -7617613 -15874747 -20276615 -21213058 -19620538 -12000890
42236 -12000890 1690180 10809974 4743810 -10530737 -16622656 -5621345 9970303
42229 9970303 14737700 9722044 6229567 6087001 173335 -13221804 -20964300 -12204677
42221 -12204677 5676698 16665893 15953973 10845339 6049721 -231924 -6249979 -5325017
42213 -5325017 2019298 5586594 896496 -2804213 2378483 8779598 4586487 -6798381
42205 -6798381 -11257915 -5242957 104025 -2984563 -8395588 -7741677 -2989227 -1185889
42197 -1185889 -2866594 -2799586 498617 2085579 -2505177 -11079709 -16383933 -13185663
42189 -13185663 -3942646 2985482 1951661 -3919789 -7020062 -4236890 1227886 5695197
42181 5695197 8378037 8871053 5728079 -863225 -7999727 -13014482 -15322395 -14962044
42173 -14962044 -12038741 -8054181 -4930466 -2210861 1941554 6680705 8683419 7032132
42165 7032132 4603915 3784426 4044729 4499463 5140898 4363843 -576980 -8477431 -13567186
42156 -13567186 -13237446 -12995354 -19219647 -28855181 -31595169 -22882920 -10109040 -3152734
42148 -3152734 -1916605 2029453 11855781 19288315 15508112 3990487 -3813223 -3893583
42140 -3893583 -3045165 -5997347 -7981914 -4429240 61224 -347066 -2190406 862301
42132 862301 5547384 3552902 -3515930 -5028124 2043488 8252947 6589566 2438473
42124 2438473 3428567 7408588 7304146 2385237 -2309618 -4408525 -5555226 -5977213 -3540302
42115 -3540302 1447925 4514403 1565639 -6276757 -13236412 -14463564 -11248171 -9667868
42107 -9667868 -13095459 -17892870 -18543077 -14645815 -9612866 -5133292 -1570498 -1276317
42099 -1276317 -5265425 -8177484 -3772764 4925777 8602455 5358364 3381265 7898741
42091 7898741 13409026 12548815 6085505 70973 -1597268 1489959 7064787 9551382
42083 9551382 4396391 -4078980 -5325209 3689763 13776192 16029781 11975075 6925781
42075 6925781 1046626 -6547568 -11655734 -10864375 -8647190 -10780071 -14342797 -11775585
42067 -11775585 -2182513 8236531 14687163 16416455 13220867 5737500 -2282931 -7333731
42059 -7333731 -10015201 -11244115 -8278620 -380263 5372610 1658262 -7676691 -11407654
42051 -11407654 -5404368 3495531 7531022 5296069 -800992 -7693106 -11592117 -10488938
42043 -10488938 -7350430 -5892862 -3722246 4120284 14931639 19311387 14461346 9231700
42035 9231700 11571873 16680541 13728665 1378708 -9920731 -11190016 -4986934 206041
42027 206041 1607760 3130334 5901458 4621106 -3118417 -9599856 -6288497 2449442
42019 2449442 3891011 -4723828 -12053402 -9616517 -3301195 -2465026 -6188221 -8125289
42011 -8125289 -8129839 -9781519 -11026583 -6998507 339449 4299690 3678072 2635788 1859011
42002 1859011 -1414503 -5079938 -3168985 3385958 5525634 -1198082 -9379910 -9198547
41994 -9198547 -490402 8141734 9297548 3343208 -2942644 -2911545 3290118 8683239
41986 8683239 7779875 3519626 2943457 7495319 11737552 11231765 7733591 6077785 8506896
41977 8506896 12279557 11777610 4532808 -3944618 -4857145 2454028 8456954 5905462
41969 5905462 -1245348 -6005004 -8946731 -13375923 -15569152 -9432430 2196250 10361918
41961 10361918 12277923 11961313 10657575 6463646 2316535 3743626 8307299 7713666
41953 7713666 1621563 -1224975 2157516 3884798 -1118086 -6667867 -6231103 -3260745
41945 -3260745 -3718406 -5641134 -3975937 -633994 -1835756 -8219527 -14313759 -16569909
41937 -16569909 -16559749 -16520121 -15876692 -13032342 -8532157 -5298248 -5471373 -7404915 -7717267
41928 -7717267 -6815918 -8738007 -13587961 -15396959 -11770158 -9706797 -14959473 -21395199
41920 -21395199 -20277104 -15044422 -15034474 -18187541 -14274915 -4108761 489736 -2214610
41912 -2214610 244023 11765638 17155011 4327517 -16153140 -25511781 -20781520 -12758294
41904 -12758294 -8352513 -7235870 -9775929 -15769902 -18726219 -12316125 -602805 6606968
41896 6606968 5979833 926131 -5995755 -12386383 -12083191 -2061204 9399068 11566338
41888 11566338 6844838 7589342 17623381 26626332 24468061 13044425 1575512 -3618530
41880 -3618530 -2674076 -476606 -2744290 -10020619 -15633233 -13383361 -5975589 -1185148
41872 -1185148 -1357150 -2522192 -2833194 -5177045 -10734484 -15736522 -16290431 -12557261 -7351753
41863 -7351753 -3714919 -3557920 -5470860 -4811857 594467 6338085 6818984 2879722 -301909
41854 -301909 -780721 -125427 1828792 6339894 10862665 10932173 6710582 2246551 -1051299
41845 -1051299 -4398956 -6060599 -2676334 3761483 7239142 6809537 7405912 10355530
41837 10355530 10480778 5129495 -1030923 -3775050 -5341743 -8398412 -10107093 -7729635
41829 -7729635 -5070562 -6744890 -9528977 -6645460 940375 4870996 1604856 -2468871
41821 -2468871 -781277 4057634 5314763 3139727 4255565 10750627 15378999 11243761
41813 11243761 1678198 -4777852 -6738572 -10501312 -18129283 -22536900 -17976100 -9342238
41805 -9342238 -5504847 -7493369 -9647005 -9817468 -11033728 -13305905 -11131583 -1748612
41797 -1748612 9275933 14257932 12347682 9214703 9474386 12250217 13903118 12945419
41789 12945419 11180128 10595781 10657099 9723731 8016973 6918983 5803296 2725513 -1346146
41780 -1346146 -2709651 -588814 1436358 1676299 3443880 8621056 12772356 11595402
41772 11595402 8317841 8481339 10256067 7441659 1133632 194311 8087193 16086100
41764 16086100 13783821 2242674 -7742033 -8481949 -2378584 3803009 7901054 12782706
41756 12782706 18833893 20378432 12744953 235673 -8172465 -10245927 -11415105 -13987080
41748 -13987080 -13365022 -7849820 -3696470 -4789024 -5182701 306893 5247149 1406761
41740 1406761 -6169553 -6065575 653208 1921419 -5169818 -9514733 -4357108 2541657
41732 2541657 3208491 2685010 9234222 19481483 23175676 18039480 10696764 5492262
41724 5492262 1171465 -1870465 646685 9237410 16118510 12353077 -1961934 -17111389
41716 -17111389 -23356518 -19846233 -13324559 -9078417 -5871079 -922828 3503197 2704611
41708 2704611 -2341448 -4125160 2938691 16043399 26929016 29285771 23045521 13491028
41700 13491028 6587924 4128268 3997728 5288253 9735534 16247559 18836129 14517272
41692 14517272 9020319 8611301 9954170 5619589 -2984260 -6815416 -2333386 4871014
41684 4871014 8989669 8151548 521873 -13703627 -25681281 -23896283 -9492609 3620760
41676 3620760 6300281 2219776 -3335032 -10603838 -17144489 -15472249 -6235384 -2134618
41668 -2134618 -9871889 -18757312 -17070276 -9463459 -6527182 -6600699 -1928144 4401560
41660 4401560 3121556 -3857968 -5875365 -1159734 2284510 2368046 5209356 11319735
41652 11319735 13399136 9822235 7365552 8020994 5747560 -622826 -4149740 -3510922
41644 -3510922 -6772640 -15744355 -19750112 -12949466 -5588748 -7920283 -13601725 -10975971
41636 -10975971 -2346838 1202055 -1473821 -1442754 4578342 10656519 12724800 12351476
41628 12351476 9916324 4344008 -140789 2911966 10950033 13440950 6133273 -3925365
41620 -3925365 -9475403 -10845149 -10362961 -7500219 -3172799 -1223295 -1581371 1040709
41612 1040709 7557975 10669920 5357445 -3275497 -7510279 -6049149 -987865 6767981
41604 6767981 13348968 11501455 2115077 -2060010 5905063 13730599 7033414 -6855679
41596 -6855679 -8485515 3388428 9512411 5211 -11773740 -11697521 -4792412 -2578622
41588 -2578622 -4019594 -1789988 2203088 1105293 -3107596 -2548838 3728305 10392689
41580 10392689 15538530 19524910 18275822 9058024 -296932 -63787 5573918 4194755
41572 4194755 -4272512 -6692665 1797924 9614381 6815708 -1186624 -4532921 -2591198
41564 -2591198 788268 5870582 12086759 12815065 5015378 -2317286 398337 8320434
41556 8320434 9302166 2511182 -1624154 1181231 3746414 1279196 -768073 2393131
41548 2393131 5383671 1427261 -5470273 -5475604 2770479 10778406 12631069 11316004 11105179
41539 11105179 10614212 7548920 4926333 6580120 9862173 9807087 8756568 13463949
41531 13463949 22058692 23266299 12526264 236829 -2514253 1118380 1608557 -732096
41523 -732096 1117816 5489243 3409234 -4424283 -5786044 3875861 12566275 9011068
41515 9011068 -1073029 -4725865 -426312 2769925 195768 -4252693 -6919370 -8035205
41507 -8035205 -6338496 1532382 13686408 21386223 18839941 10803657 6265648 6644750
41499 6644750 4976354 -2927700 -11428331 -12752100 -8514799 -7203288 -10294358 -8731234
41491 -8731234 2908338 15818839 17443700 7632931 -3466540 -9645497 -11702612 -9466981
41483 -9466981 -1754924 6381010 7445513 3542232 4035514 9773774 11044654 4164409
41475 4164409 -1566677 1752833 9973644 15954303 19031058 19826843 16043375 9876461
41467 9876461 9373862 15529230 18433356 13342422 8888700 10789914 10372436 833577
41459 833577 -7848116 -5048598 407911 -6446729 -21425642 -27511648 -21078423 -13377430
41451 -13377430 -9343781 -3736846 2860124 3095850 -767813 2679450 13961514 19389965
41443 19389965 11928165 595771 -5168791 -6191886 -4230911 3236959 12809736 13605817
41435 13605817 3194114 -7048153 -9183159 -8985723 -11894962 -11939522 -4409420 2326562
41427 2326562 -414498 -6015058 -1986555 11119198 21540228 22787172 18271940 12566907
41419 12566907 7061463 2779183 623440 -282088 -653406 -132275 -610184 -5035350 -9995709
41410 -9995709 -6900367 4681002 12791727 8810780 42120 -1204886 5557347 11999491
41402 11999491 15170682 18528629 22037700 21092741 14521900 6239818 -224849 -3045344
41394 -3045344 -131983 7897368 14838230 15273141 12178677 12366573 16170808 17785042
41386 17785042 14761739 11308292 11988194 16230503 19244474 16462153 8573008 2919548
41378 2919548 6000712 13654819 14945127 8053931 4113565 10398912 18441829 16658664
41370 16658664 7362821 1573760 2379309 3763046 2421918 746897 127425 171278 2825394
41361 2825394 9272390 14839188 14597517 11190758 9322313 6458833 -1543256 -9471460
41353 -9471460 -8738477 -1846710 1199836 -380018 2028526 9612880 12947132 8565775
41345 8565775 5450887 9608925 14048045 11434023 6767777 8491950 14078094 14089219
41337 14089219 7043828 1763768 5321563 14128009 17938375 10818213 -1881327 -7995511
41329 -7995511 -1903116 8182388 10217075 3792024 -640699 2492243 6522104 2923504
41321 2923504 -7545666 -17310161 -20737847 -17690462 -12254715 -9863792 -12304233 -15080423
41313 -15080423 -13595551 -10934952 -13478581 -19442674 -19804877 -11952684 -4071188 -2768706
41305 -2768706 -4098638 -1683261 2589973 1954979 -4845666 -11713025 -12250268 -5958462
41297 -5958462 1434285 3147396 -1652551 -7268836 -10003432 -13224709 -19025346 -20568732
41289 -20568732 -12137432 -2200678 -3396067 -11324728 -8773037 7097954 18056831 11077955
41281 11077955 -3784516 -10289820 -7340890 -3155455 58465 3781132 5053667 2583092
41273 2583092 2962937 9447694 12618257 4395724 -6613203 -7578577 -2280742 -3822446
41265 -3822446 -11438600 -12008445 -3539487 247484 -8197244 -18603618 -18598718 -9744482 -1854517
41256 -1854517 430788 -162482 673299 4583043 8605120 6942094 -1284407 -7718561
41248 -7718561 -4026288 6717508 14881644 17812659 19866118 21448454 18712240 13423102
41240 13423102 11955875 13840297 12382983 7799066 7759704 12338420 11080969 103210
41232 103210 -9751739 -8988060 -3749357 -5862665 -16312698 -26646914 -30755861 -28010946
41224 -28010946 -20066534 -11340587 -7920840 -9886110 -9429323 -2220975 4807162 3464523
41216 3464523 -3166698 -5697228 -1887770 2712101 4933595 6976432 10013901 11430611
41208 11430611 9152217 4631888 1174087 1238125 3965495 4168527 -2739705 -12993041
41200 -12993041 -16558067 -10108629 -2431784 -2249972 -6054578 -4350920 4250413 12453887
41192 12453887 15331219 14945845 14798229 15432159 15552634 13623330 8911625 3303453 -133431
41183 -133431 -2248011 -7135010 -13737023 -14352275 -6271972 1921916 2580828 821409 5149533
41174 5149533 12312259 12877021 7716311 5880556 7825148 4804339 -3844979 -6789694
41166 -6789694 1664094 12240347 14845866 11415197 7983320 3935708 -2353993 -5332992
41158 -5332992 479703 10312052 15145104 13871000 11255721 7833495 1200546 -5032866
41150 -5032866 -3512561 5484180 13541220 16190025 17672155 21311612 22442765 15415426
41142 15415426 2913521 -6543319 -8259025 -5121942 -3097818 -5616340 -11635548 -17063530
41134 -17063530 -17892153 -12968705 -4428623 3866698 8278258 7508959 3994572 1497835
41126 1497835 -3049 -4225561 -10940798 -12555869 -3933408 7555550 10178410 5236982
41118 5236982 5956641 16412450 23066585 14701783 510270 -3493459 1203138 154780
41110 154780 -8253483 -9433451 2005434 11294547 7031051 426582 7197525 21511599
41102 21511599 25155640 16171637 9574315 11348241 11119512 3712064 -936642 2743507
41094 2743507 3575012 -6955571 -16505507 -8826614 9962167 19151587 13205842 6675390
41086 6675390 9599362 14495477 12170611 6531195 5737777 8128904 5867609 -2411451
41078 -2411451 -9932124 -10512543 -4457773 2435882 3302508 -3715713 -12171507 -13499978
41070 -13499978 -7626001 -2826104 -3748043 -5677350 -3621474 -551186 -1532135 -4928872
41062 -4928872 -5510993 -2660101 209774 1204896 -571085 -7426686 -18200940 -24006902
41054 -24006902 -17121235 -3155624 3962643 -200072 -5811203 -3696146 3001090 6095900
41046 6095900 4416962 2667185 2688500 2163485 -29697 -2387718 -3658511 -3079386 1011781
41037 1011781 8643351 15175625 15139897 9064873 2677894 -607764 -2293464 -3590073
41029 -3590073 -2430047 2308962 7468348 9185389 7019254 2278318 -4512973 -11368864
41021 -11368864 -13308711 -7797238 -68702 2054992 -1614505 -3566255 416493 5120438
41013 5120438 3303271 -4394248 -10287923 -8464670 68865 9630237 14461078 11942015
41005 11942015 4247322 -2649581 -3629059 779523 5026170 4747816 1827001 1961918
40997 1961918 6811267 10552841 7058701 -370991 -1367584 7522162 16628999 15713782
40989 15713782 7927563 3702567 3994643 42147 -9930486 -15286899 -8766642 2143880
40981 2143880 6535014 4916967 4689794 7232920 8818372 9799932 12857194 14540397
40973 14540397 8428806 -3788550 -12944942 -14126366 -10277572 -4713823 1823201 6724147
40965 6724147 6674004 4188854 5030686 8347846 7863821 3764645 3533641 8481378 10043001
40956 10043001 4315335 -2412 4349879 9756245 3983293 -11207495 -21316674 -17123927
40948 -17123927 -3892682 6864565 9112193 5750262 4151152 8360986 14507350 15703639
40940 15703639 11404082 7244978 5085908 394698 -7680399 -11873086 -7907533 -2328207
40932 -2328207 -1851897 -1987009 4156065 11309651 8200252 -3878713 -10744843 -4998206
40924 -4998206 4356242 5670294 -53461 -3006696 1061804 5884007 3211874 -6752291
40916 -6752291 -14750695 -12826021 -4272767 165 -4670751 -11457945 -12411608 -7767011
40908 -7767011 -1363448 5842054 11658652 9570601 -1489490 -10426595 -7167832 2574227
40900 2574227 6781882 6214145 10280404 17380939 15858869 4846671 -2748063 -1593559
40892 -1593559 -1793466 -9117446 -13210122 -5148842 6667993 9602698 4928703 1204147
40884 1204147 -910671 -4540628 -5496390 694084 6418739 952707 -11675503 -17532485
40876 -17532485 -13285245 -8116875 -6179786 -1838619 5676900 7258276 -903581 -8656185
40868 -8656185 -5643735 4532866 11009882 10359927 7630085 6667872 5856739 2336246
40860 2336246 -3234874 -5899443 -245273 12598144 22869044 21798680 12690124 6266542
40852 6266542 5344535 2543450 -5094918 -9218802 -3394488 5406302 6694863 1910228
40844 1910228 931281 6496789 11055872 8338056 627830 -5885497 -7459435 -4461884
40836 -4461884 -1315307 -3989111 -12787844 -18966928 -14155662 -2076797 5578820 4538303
40828 4538303 1795372 3092225 4722856 1645915 -3025286 -2562109 3142760 7454888
40820 7454888 5434327 -1724647 -9506074 -13911362 -13062870 -7554827 461644 8656087
40812 8656087 13828252 11270342 -539632 -13982833 -16941234 -6776889 5005494 6092307
40804 6092307 -2852878 -12085170 -15724488 -14593633 -9943432 -2272454 4873365 7176596
40796 7176596 5442143 3189718 -343975 -7329352 -12389779 -6235184 9495310 20151924
40788 20151924 15449627 1871959 -7025447 -6359646 -957621 3282002 3230906 -1169067
40780 -1169067 -4691155 129992 11799281 17210764 7647673 -7531364 -12070361 -3826652
40772 -3826652 5325078 7860163 7361935 7154219 4276990 -2047537 -6265799 -5499954 -4242745
40763 -4242745 -5269368 -3943940 2623263 8151474 6052836 -34683 -2026400 818887
40755 818887 3501403 5024923 8159490 11206457 8332708 -1080629 -9508678 -8986847
40747 -8986847 1873929 17798618 29761115 29815370 18593823 7146861 5751545 11541765
40739 11541765 13077501 6453456 -246031 831438 7940430 14537215 16718772 13447355
40731 13447355 6017568 339468 3036128 11481360 14550675 7901687 1131339 3288152
40723 3288152 8679538 6398816 -1565612 -3112426 5472361 15212573 18603919 17140033
40715 17140033 13154641 5294553 -3606255 -4111899 7464717 21061912 24064275 15944578
40707 15944578 6192856 2054280 3935954 9185936 14638682 17811573 19733601 23574538
40699 23574538 27447144 24106813 12729127 4619590 9483953 20956693 24839458 18200780
40691 18200780 10273776 6469352 2759528 -3250400 -6375450 -2472947 5007066 10671418
40683 10671418 13178740 13201763 11641973 11871687 17028528 22688480 19208247 4696455
40675 4696455 -10487884 -15426076 -9319071 1632197 11210960 14291279 8536152 -669875
40667 -669875 -3509672 1877430 6701649 4940153 1830557 4052717 9353044 12333574
40659 12333574 13318037 14388089 13393322 9499906 8188666 12563844 16041515 12706188
40651 12706188 8868005 14011065 25155855 31149877 28815352 23853933 18782579 11546652
40643 11546652 4267972 1686284 1461682 -2845016 -9184523 -8494341 457533 8483744
40635 8483744 9906220 8986940 10204273 11453290 9826579 6560722 4235552 5277317
40627 5277317 12429272 23110992 26087941 14601725 462142 1379343 14945827 21159753
40619 21159753 12606914 4269550 7736499 14087642 12666017 10112414 16419133 25196590
40611 25196590 24309051 17103535 16135974 21244186 20452259 10746300 2885962 4532290
40603 4532290 10846464 14155951 13374533 11331841 10186511 11638050 16016720 19798190
40595 19798190 18371932 11555956 2985182 -4519381 -9209016 -8605890 -2500118 4016106
40587 4016106 5310469 1749121 -2073517 -3304620 -1485941 3684199 11099651 17301866
40579 17301866 20046563 20060038 17800820 13680007 12555666 19290104 26812146 20106713
40571 20106713 -1079922 -15833016 -9272415 5204994 5336962 -7865811 -15181499 -10082863
40563 -10082863 -4298756 -4102228 -1780416 5832907 8994714 2122440 -5873560 -6052928
40555 -6052928 -1761890 833047 2994783 6504166 7031767 2641620 -228226 2676352
40547 2676352 5350332 2070049 -2137395 -307849 4523090 5698507 5189156 9313554
40539 9313554 16203064 17354721 10031352 439443 -4261069 -1462303 7002065 15123111
40531 15123111 15857958 9330577 4445622 7008125 10827804 7412730 -306495 -2909461
40523 -2909461 233460 1282296 -1002828 2372941 15723038 28688342 27112941 9942417
40515 9942417 -9220584 -15711455 -6638350 8137145 15804863 11869721 2479474 -3615400
40507 -3615400 -3167372 2009553 9282779 15281495 15088344 6947210 -3375568 -8096279
40499 -8096279 -6829508 -5582067 -6680289 -5514206 1258670 9475044 12362434 8484075
40491 8484075 2274110 -1195023 -109736 3654270 6456393 6292133 4755752 4558474
40483 4558474 5815866 6934763 8227997 11438686 16157274 20339139 24000424 28048167
40475 28048167 29733803 25245081 18033044 17492273 25560283 31366354 25526574 14436801
40467 14436801 11916469 19591692 25327810 21288201 13697737 11193908 11907756 8448635
40459 8448635 497431 -4512876 -1161155 8712330 18959138 23171257 17904847 6543872
40451 6543872 -1797576 -1977389 564132 -1558972 -4908290 521613 14407588 23512612
40443 23512612 19775174 11751762 11111611 15339147 13835208 6676340 4985770 12209179
40435 12209179 16996771 9976726 -1571729 -4041167 3244274 9035508 8345482 8557820
40427 8557820 14640092 18506557 10990674 -1937316 -5396584 3773842 13304239 13958956
40419 13958956 11030503 12351590 14796245 11741974 6823250 8785950 16116888 18548060
40411 18548060 13044547 6960200 4596538 2181207 -1324018 -195673 6567530 10888855
40403 10888855 9317099 10674026 21413760 32391725 30739367 18369993 7855101
40396 7855101 4738628 4866873 5745296 9108492 13457435 14429520 12611343 12158598 12001962
40387 12001962 7268451 -584174 -4046381 -764657 4020009 7217277 11266056 15801267
40379 15801267 14909925 6832650 -719750 32492 6908068 11438556 9420432 4461218
40371 4461218 2921898 7374380 14144737 17144417 14745472 10924199 8597529 6223841
40363 6223841 3759169 5755514 12855410 16485016 10118007 386323 -2518866 -364666
40355 -364666 -1504589 -4583567 -1278472 7217339 11255026 9687798 10591822 14541111
40347 14541111 13511595 8697335 11825996 23881307 30511370 25982350 23368959 30551181
40339 30551181 34566007 24511055 13218674 17179005 27983336 25649902 11987490
40332 11987490 7242981 16553113 23077741 17102385 10671930 15573816 24044400 22851019
40324 22851019 15059216 15060793 27150903 39918747 41443286 32694058 23714573 20292443
40316 20292443 18346347 12445468 6356835 9374992 22032918 32950859 33784660 30305018
40308 30305018 32276796 38482373 40440839 36824371 34217615 35035768 34348970 29477113
40300 29477113 24529282 23545664 25758745 29715921 36371249 45330082 52032208 51539146
40292 51539146 43714157 33870028 28905977 31572265 37607189 40703271 40705456 42762495
40284 42762495 47880151 51245635 52196525 56705605 64682549 65184359 53663707 44319592
40276 44319592 51686004 66666044 67281449 50678890 37149577 40691778 52305638 58047087
40268 58047087 58514437 60942394 63522638 59694385 51918990 49921737 57133255 67284963
40260 67284963 74062160 77581614 80601828 83372017 84274445 82875565 80284761 77711472
40252 77711472 76870878 81560850 95112336 113425975 124271432 120104685 110073693 110599854
40244 110599854 123625459 135210014 138635859 144774228 160843543 173127996 166108199
40237 166108199 148809840 143789851 155503571 168845783 176450983 186519082 201764658
40230 201764658 211620006 212029320 214504682 226205136 237267582 239235142 241742255 256986912
40222 256986912 278381037 289727281 289117679 289552245 299082422 312703041 323024242 328955441
40214 328955441 333148376 337711422 343004133 346765644 345928539 342089525 341338400 345174306
40206 345174306 346832576 341746766 336496436 340739042 353839210 365875042 369130075 362709111
40198 362709111 348389853 328351659 306584727 288281038 277643886 276807113 283324453
40191 283324453 287746909 279995099 261888421 247577023 246786415 252848262 252464182 242259483
40183 242259483 229770519 222201217 220147164 219328860 213618449 199489277 181427875 169048793
40175 169048793 165406416 163175565 155746641 145474561 136623552 127988057 118571765 112586645
40167 112586645 111388861 108332447 99978667 94028101 96023722 96835643 86305734 72088201
40159 72088201 69710502 78768160 85329847 85165492 86878428 91846238 89562785 77250047
40151 77250047 67324036 68302572 72695082 72142184 71502953 77565255 84363178 81511735
40143 81511735 70230767 60279015 55858664 54338414 55089050 59734783 65192357 64949848
40135 64949848 57641185 48796764 44190476 45202195 49262671 51387212 47638074 40779089
40127 40779089 39568650 48127274 58998072 61761284 55934608 49824987 48696878 50323942
40119 50323942 51460206 52356581 53872848 55119802 55565955 55983041 56313497 55656213 54758537
40110 54758537 55138656 55428798 52737187 48801205 50136375 59081278 68513488 69974319
40102 69974319 64972015 63169032 69828808 80354548 88252880 92641588 94509023 91448049
40094 91448049 83081069 78108309 86294412 103091448 112276831 107491429 101237178 105609933
40086 105609933 113669358 111456432 101991657 102145659 116747618 131459062 135053823 134102528
40078 134102528 137729705 140774343 134493949 125469184 129027605 146418153 161834603 163212132
40070 163212132 155138149 148580192 147377220 149307908 152848445 156897574 158447160 156039617
40062 156039617 153048773 153511416 156622260 158367616 156592840 151796589 145126777 138468342
40054 138468342 134592109 134310895 134959341 133968003 131793145 128678032 121497854 108430584
40046 108430584 95061628 90189684 94940054 100681669 99267556 91582932 84021318 79737216
40038 79737216 76184049 69727046 60445930 52687419 51284797 56252022 61637489 61621648
40030 61621648 57203230 54121353 55020523 57713886 60394023 62486581 59904697 47725922
40022 47725922 31224605 25474697 36353739 48693118 43541509 23476905 9592979
40015 9592979 14302939 28452524 36991051 36324064 31548411 25854935 19690222 14714608
40007 14714608 12224323 11013452 10893278 14445474 21729979 27735494 28989544 28335794
39999 28335794 29337245 30651978 30086364 29174724 28971675 26462429 20606409 16656142
39991 16656142 17967932 18622699 12040119 2719933 422770 5342329 8494322 5859046
39983 5859046 2955715 4796440 9444679 12946088 13887119 11976817 8213263 6899921
39975 6899921 11284130 17110236 17087829 11663239 8181639 9471944 11319141 11514717 12365738
39966 12365738 13192558 10379564 7125936 12126396 24245981 29628929 20555110 6903408
39958 6903408 1060679 1469999 916596 1529205 8605661 16423412 14923513 7178150 5658438
39949 5658438 12076334 15380379 11145244 8600620 14076332 20499548 20063344 16351637
39941 16351637 15835317 16598460 14651652 13695976 18187204 22447772 18056464 8607834
39933 8607834 5240203 8550874 7100869 -4215364 -15647556 -16965134 -10864756 -5790904
39925 -5790904 -3047616 1216279 6384939 7905829 4865378 278294 -4192562 -7756408
39917 -7756408 -7020250 301879 9777726 15095516 17041409 20360553 23302740 19510636
39909 19510636 10186686 4009045 3326604 1659606 -1813590 1686690 12990753 16797355
39901 16797355 3096009 -13658822 -12033467 6295389 20321508 19900631 14420813 11496197
39893 11496197 5985446 -4444788 -9901433 -4076200 3398643 1235010 -6503631 -8404045
39885 -8404045 -3076707 2065190 3328169 1798409 -2927863 -9772171 -11296540 -2390848
39877 -2390848 9428421 12839373 8929325 7542778 9838285 7252544 -2194792 -9927885
39869 -9927885 -11918713 -15060166 -23145681 -27842791 -21298681 -8901079 -1016646 1131266
39861 1131266 2581959 3371283 339950 -2777105 2302111 15252108 24925824 23033514
39853 23033514 13994110 7963362 8417145 10367739 8553361 3731771 717924 1997070
39845 1997070 4366850 2245423 -5995628 -15979664 -21665841 -20362624 -13323840 -3735462
39837 -3735462 4726639 9620221 11727868 13507891 14555149 11730572 5503527 1648850
39829 1648850 2717061 2342691 -5576810 -15302483 -15292225 -4882351 4489115 6178470
39821 6178470 6319101 10490996 12729659 6526605 -1280287 297840 7506548 5896491
39813 5896491 -6582032 -14547273 -8030423 2192771 1118458 -7949770 -9311742 1403536
39805 1403536 11886350 11110028 1798761 -6958772 -10212430 -7019254 1688050 10105832
39797 10105832 9407456 -1240253 -10609959 -8581575 825189 6019076 3537513 -438902
39789 -438902 -1382011 -214876 3305182 11210542 19496507 18894147 7591390 -4421714
39781 -4421714 -8493896 -7586438 -7545783 -5543406 3799696 15728504 19368548 12762342
39773 12762342 4109510 -1534422 -6613535 -11027156 -8843109 384186 6622961 2533682
39765 2533682 -5639255 -7758904 -4355444 -3149486 -5568672 -6009376 -2238358 2447660
39757 2447660 6659785 12071794 16860245 15906960 8852781 1213186 -3449882 -5754798
39749 -5754798 -4685751 1830004 8651152 5295507 -9180136 -21474742 -20396464 -10933705
39741 -10933705 -5120542 -5298382 -4957218 -1387690 2250779 5074121 8921347 10883545
39733 10883545 4590608 -9066717 -20065899 -21186068 -15976563 -11625897 -9203692 -5622104
39725 -5622104 -1849899 -3353865 -12006014 -21509926 -23536543 -17367136 -10353035 -7736534
39717 -7736534 -5822694 415269 6252230 2297016 -8971305 -12474057 -1746217 9154389
39709 9154389 4706510 -8673743 -11376179 781327 11176602 6873223 -4807306 -9056671
39701 -9056671 -2464630 7202616 12321158 10017881 1311310 -8143215 -10631902 -4879072
39693 -4879072 1459200 1663694 -1816250 -2985126 -1577792 -1609455 -4247290 -7495097 -10470574
39684 -10470574 -12943795 -12479473 -7020930 374425 3559097 444461 -4188827 -3208035
39676 -3208035 6134995 18678544 24237015 16430097 -418186 -15157187 -20567898 -17887871
39668 -17887871 -12199764 -8168416 -9428495 -15713049 -20088287 -15668646 -5629708 1040099
39660 1040099 3982868 11190214 22072418 23901766 11976065 694181 3734718 13633957
39652 13633957 14333819 5782240 486494 844477 -2751265 -12161905 -16945636 -12735863
39644 -12735863 -9297415 -14330628 -21202956 -19965738 -11505104 -3633218 18611 855333
39636 855333 602341 1235820 5090111 10689375 12752544 9552896 5311995 2560975 -1548822
39627 -1548822 -7685304 -10259256 -6509295 -3197668 -7097408 -13821579 -14164436 -8204155
39619 -8204155 -4579083 -7184360 -11055247 -12045347 -12675084 -15530378 -17217183 -13667469
39611 -13667469 -7823855 -6613891 -10919466 -13255680 -7246273 3617658 9955805 8076759
39603 8076759 3536893 2393485 3284853 1225165 -4223143 -9114086 -11451067 -12485780
39595 -12485780 -12704816 -11488502 -10616191 -13410505 -19876697 -26268746 -29005251 -25597027
39587 -25597027 -14315130 952578 8122008 -1447846 -18513071 -23356875 -10463351
39580 -10463351 4138648 4723661 -5031928 -11861177 -12379349 -12454872 -13592593 -11818786
39572 -11818786 -7629474 -6244665 -8103928 -8143680 -5081250 -3198196 -3641217 -1753553
39564 -1753553 4374533 9325468 7836777 1937514 -3027456 -5871215 -9168613 -13203176
39556 -13203176 -13945043 -7872822 2364809 8814491 6510929 175335 -966041 4492906
39548 4492906 8327151 5654497 3068181 7998176 15902447 16762104 10453030 5328037
39540 5328037 3341629 -1573890 -9242821 -9926450 -246899 8557279 5998083 -2661679
39532 -2661679 -5828745 -3124059 -2727207 -5535510 -4292002 1852195 3892109 -2391972
39524 -2391972 -8236972 -4691556 3264201 3347165 -6677559 -16394350 -17293581 -12700994
39516 -12700994 -10663701 -12489664 -13082726 -9813310 -5475995 -2410336 1186615 6570491
39508 6570491 9695908 5544180 -3598073 -8509883 -3456148 6255021 9790569 3184801
39500 3184801 -6428381 -9821942 -6564058 -4067535 -6557901 -9553847 -7958987 -5608813
39492 -5608813 -10556097 -21537467 -26485573 -17852081 -3786878 1412577 -5287276 -13709520
39484 -13709520 -14213065 -7116361 1593090 7658020 9505282 6825712 1875426 -488293
39476 -488293 2519273 7931591 10276992 7828557 3928522 2510949 3797278 4823734
39468 4823734 3674355 2285359 3922303 7927076 9146023 4180571 -3522943 -7238381
39460 -7238381 -4662972 321058 2869295 1728885 -911909 -1693083 1509021 7243761
39452 7243761 10841175 8969250 3272861 -1983497 -4389016 -3828878 -1098482 1104169
39444 1104169 -1164782 -7425190 -10728635 -6271380 875820 2690837 -125899 -1092852
39436 -1092852 -69063 -2551983 -7418341 -6638274 577914 4569416 605554 -3075434
39428 -3075434 1194417 8619323 11210953 10219254 10426428 9755214 4747966 150759 2042958
39419 2042958 6181727 4534864 -390884 6038 4092589 1570618 -8237665 -12872840
39411 -12872840 -4831581 7933658 14019141 11712068 5570217 -1441169 -6847277 -6863899
39403 -6863899 -1602121 3049710 3204196 1724478 1856406 2125626 1423075 2554008 5719548
39394 5719548 5022570 -2190102 -8362003 -5671525 1581284 2840890 -3403193 -8782690
39386 -8782690 -8160792 -4922591 -2732580 -417703 2190009 376485 -8614535 -19071290
39378 -19071290 -22381865 -17603741 -12206072 -12266680 -15499801 -15676854 -11617077 -8569493
39370 -8569493 -10640613 -15080835 -16093302 -11997062 -5633137 690050 6751002 11596708
39362 11596708 13558246 13532800 14076793 14321007 10129123 1002054 -7294562 -9304791 -5616308
39353 -5616308 31414 5540126 9641282 10001760 5952427 1058645 -111536 3345853
39345 3345853 8583731 11585767 9252411 2231909 -3447843 -1593954 6189071 12297978
39337 12297978 13700468 14409124 15654996 11849946 1074157 -8383093 -9189765 -6366211
39329 -6366211 -9220410 -16709266 -19662309 -14233463 -4550712 5235344 12827888 14196325
39321 14196325 7624465 185261 841860 7438647 9583212 4284793 -824694 -433570
39313 -433570 2244474 3905946 5829211 7228165 3645677 -3942141 -7470264 -4002936
39305 -4002936 -859478 -2833873 -2982101 5998275 18086834 20859484 12249034 2025923
39297 2025923 -1464188 1063072 4416525 5021060 2279013 -1927427 -4785719 -5678355
39289 -5678355 -6640697 -8490759 -9370962 -8831559 -9535971 -12384844 -14005151 -12169539 -9607835
39280 -9607835 -9009485 -8511737 -6058066 -3906133 -4340957 -5066999 -3679914 -2644231 -4613450
39271 -4613450 -6748889 -5228447 -1523443 1478423 5020589 9292107 7642434 -4748824
39263 -4748824 -19570627 -23057725 -13973436 -4062916 -903156 -920744 -642392 -3376378
39255 -3376378 -10379091 -15388039 -14124556 -11396297 -12398756 -13914096 -11118271 -6930169
39247 -6930169 -6548864 -7497761 -3808309 3251299 7800776 10644303 17850879 27746295
39239 27746295 29704735 19442712 6761912 2574979 5182328 6150329 4117326 4001178
39231 4001178 5509946 2442968 -5741077 -10562507 -6222448 2107812 6014332 4156083
39223 4156083 -196925 -6561404 -15150934 -21005157 -18559978 -11111007 -7736897 -10225457
39215 -10225457 -10781638 -4621591 2777618 4624028 2335209 1310611 2673899 4693318
39207 4693318 7844762 12225170 13353967 7449854 -855689 -2825647 2623651 7532736
39199 7532736 6066147 1757953 1641495 6899297 11762303 10139367 2282491 -4565568
39191 -4565568 -3200096 4397580 7057790 -3231962 -20502235 -30308678 -25404910 -11938174
39183 -11938174 -618639 3198492 -162828 -8452915 -17560781 -21070771 -14927334 -2979437
39175 -2979437 5268161 4108356 -2429383 -5784309 -3479532 -1933146 -7374356 -16589039
39167 -16589039 -20129440 -13571656 -1668545 8112794 11560417 7524720 -1885471 -9232598
39159 -9232598 -6613551 3799794 10150717 6079461 -943417 -2059416 -653123 -4756735
39151 -4756735 -11274365 -9151558 3312779 15157127 17577305 12756274 6493347 1069788
39143 1069788 -1952806 -304952 3805429 4319192 1100987 2022172 10309510 16521712
39135 16521712 10190592 -4900587 -14868676 -13641153 -9440535 -12044218 -19139616 -19468165
39127 -19468165 -7903524 6988436 12707566 7673893 1678669 1595088 3105295 64391
39119 64391 -4465372 -3548196 1783395 4851694 5229780 8800233 16238982 21021629 20256674
39110 20256674 18362837 17612637 13915725 5339451 -3606340 -9958536 -16085981 -21168941
39102 -21168941 -18199372 -6060137 3885008 1756054 -6855332 -9922834 -6685496 -6130508
39094 -6130508 -10867746 -13276611 -8244313 -1086570 -127768 -6551577 -13725071 -13789605 -4534302
39085 -4534302 8004796 14228870 9877466 -904620 -11546479 -18206978 -18267607 -10372907
39077 -10372907 353198 4007464 -1295535 -4603762 2497198 11622149 8461005 -5997771
39069 -5997771 -16180714 -12726573 -2007747 5610983 6854955 2848510 -5039130 -12633750
39061 -12633750 -13741885 -7838286 -1481207 703300 416450 -1225946 -7089107 -15790154
39053 -15790154 -17820760 -7610623 5581885 7602266 -1918752 -9267924 -5175162 4289487
39045 4289487 8026341 4581449 1198071 1651482 1662967 -2743271 -7564886 -5476787 3842126
39036 3842126 12518114 14075344 10346971 7050045 6087823 5654106 5394114 6723494 8644085
39027 8644085 7880756 4004353 540954 -323177 -349785 -384820 3317123 13661499 25461393
39018 25461393 28848997 21013945 10448291 6769407 9156364 8974853 2612188 -3707207
39010 -3707207 -3445803 929910 2215574 -1155792 -4149763 -3136822 373595 3781177
39002 3781177 5992426 5238645 -619584 -9706840 -16128827 -16358347 -12352521 -7211896
38994 -7211896 -1888003 2234350 2150338 -2463352 -7088438 -6923107 -1115043 8057223 16192353
38985 16192353 17004231 7942362 -2916437 -2818173 9715055 21869085 23001849 16399461
38977 16399461 10114217 5105971 -162180 -1682884 3635111 9334127 7360894 333376
38969 333376 -3680052 -4198837 -5757298 -6339858 -317759 9070222 12102549 7103290 1668553
38960 1668553 -514218 -3194176 -7518361 -9378228 -8010026 -7082963 -6329502 -2384519
38952 -2384519 1770102 -62560 -3981889 858836 13517583 20054356 15238747 10369774
38944 10369774 12887723 13785567 5304469 -3437509 -1832491 3231597 -690156 -9510831
38936 -9510831 -9186070 908021 7745343 5594320 1582749 163028 -3435053 -11599625
38928 -11599625 -18541655 -19948556 -18432487 -15850163 -9571182 -447909 4286549 1328737
38920 1328737 -2718926 -1399827 1419932 -2299897 -12392737 -20458220 -20361722 -13672430
38912 -13672430 -5306835 1993262 8056006 12711066 14474488 11995744 6727652 3094162
38904 3094162 4343749 8417204 9829601 6113399 791752 -828901 2397381 6858866
38896 6858866 9028044 9313048 9896279 9819729 5608298 -1835141 -5038706 1048333 10969343
38887 10969343 15754575 15639712 17473587 20446073 15690666 2904893 -4834796 132488
38879 132488 7492418 5250479 -1076236 1186371 9472948 10034279 1429486 -2989698
38871 -2989698 2604972 7811042 4332213 -1330919 -760228 3024203 3974154 4666884 9381867
38862 9381867 13231323 8986330 -258544 -5180664 -3372306 551583 4403684 8551379
38854 8551379 9493753 3670959 -3419259 -2302499 5688649 8623138 881921 -9485890
38846 -9485890 -13240061 -10618253 -5272602 3215403 13756440 18147603 10313533 -2650478
38838 -2650478 -7412177 -791426 8376294 12868631 14703498 18020572 21355091 20294258
38830 20294258 13774388 5180002 -337203 1028422 7968991 13059222 9688703 742671
38822 742671 -4248489 -1614419 2403511 2152977 545354 2059822 3704652 -265402
38814 -265402 -8224411 -12978185 -11947817 -8831370 -6051965 -2412980 1510833 2462637
38806 2462637 679722 1061659 5545334 9138015 6666520 -208837 -5927462 -8346032
38798 -8346032 -10057128 -13808513 -18958190 -22154090 -20687485 -15379898 -9630479 -5164703
38790 -5164703 -769690 3495224 4614619 2577280 3606664 11279912 18036931 14015389
38782 14015389 2521524 -3237028 793838 4322621 -676289 -8431401 -9406473 -3108382
38774 -3108382 4771522 10330029 11031916 5041498 -3038780 -3490255 5167925 12452116
38766 12452116 12346485 13237766 21549032 26220282 14293683 -5631565 -13068277 -5321163
38758 -5321163 750029 -3243180 -6208093 709702 8887047 8069139 3842352 7396186
38750 7396186 16747866 20289436 14363454 6674126 3893365 4305088 3148224 -293073
38742 -293073 -2245286 861186 7170149 9435918 3328513 -4941916 -4615479 5535846
38734 5535846 15425767 17170311 12954556 7116367 -635437 -8976197 -10698292 -2794836
38726 -2794836 5585909 4335862 -2926627 -4780879 397867 2949677 -2510724 -9895481
38718 -9895481 -11961803 -9479546 -6381791 -2238064 5180402 13190317 15162813 8088387
38710 8088387 -3405626 -11244327 -11430669 -7013235 -3609423 -3110336 -3429237 -3220090 -2880636
38701 -2880636 -556100 7462672 19416397 26033412 20682773 8433588 30373 -666033
38693 -666033 1919701 3884026 5723340 7942765 8694391 6723687 2629610 -2853900
38685 -2853900 -8042834 -8738636 -2528785 5601392 7392830 1739947 -3976191 -3779296
38677 -3779296 692088 4950110 7445731 8698224 9119649 9617040 10564674 9281199 3113643
38668 3113643 -4350159 -6011900 -1567652 1483320 -748811 -3456407 -2558799 -898974
38660 -898974 -209137 4075140 12690421 16264088 9369923 2910482 9343164 21447244
38652 21447244 21577100 9223296 1588053 5620748 8283048 501152 -7294047 -3885250
38644 -3885250 4226307 6454874 6957445 13692043 19227479 11358260 -3563425 -7904890
38636 -7904890 -947632 182483 -11048378 -20600273 -16848005 -5727307 3758232 12294447
38628 12294447 19548947 16671037 1720766 -10395310 -7033498 3285496 4589748 -2972895
38620 -2972895 -7676100 -6509829 -5008038 -2370943 6195457 14768189 11186228 -3343354
38612 -3343354 -14345791 -15311922 -14284068 -16644262 -16003738 -7538060 2244527 5626470
38604 5626470 3629892 346447 -3304428 -5161000 -770507 7807563 11514984 8252237
38596 8252237 7729733 15939216 24473600 23228640 15012156 8885250 6840154 6141358
38588 6141358 7503400 11038216 10534476 2245478 -5999988 -4985555 1438968 2933253
38580 2933253 -851320 -2284169 -641977 -1767676 -4556990 -1762438 4862794 3952403
38572 3952403 -7559989 -18293949 -19182979 -15274671 -14439611 -14405598 -9663423 -3879486
38564 -3879486 -5525743 -14549465 -21730799 -20178739 -11535026 -1816799 3888584 3547037
38556 3547037 -199940 -682695 6501170 17386967 22820051 18202477 7813909 -700563
38548 -700563 -3615429 -2106167 1482741 5674063 8528802 7186496 977793 -5951325
38540 -5951325 -7914231 -4172828 207768 1050257 154667 1835940 6420226 9614928
38532 9614928 7399701 64185 -7421724 -8367666 -167108 11620792 17843571 15706389
38524 15706389 10689182 7593660 5305905 2938737 3910580 8541238 9781975 4176840
38516 4176840 494312 7071855 15944203 12789964 29722 -5177629 2932310 10250049
38508 10250049 5345742 -4374330 -7530603 -6640725 -9398742 -12379251 -7728831 128617
38500 128617 -334766 -7999736 -9178135 981528 10254121 7215537 -3138830 -8344355
38492 -8344355 -5381471 -881652 767363 1318244 2374509 2622408 2100008 3310101 5937401
38483 5937401 5344683 -19109 -3380880 2751718 15020358 21387231 16113888 6615287
38475 6615287 2000783 577921 -4826305 -13010271 -14798668 -7286330 877511 1351577
38467 1351577 -3588888 -6732542 -6311159 -5447991 -5198818 -3956345 -1860689 -664117 76871
38458 76871 2470004 6039031 7266734 3655190 -3724271 -11247546 -14605658 -10877681
38450 -10877681 -1219145 8898500 14064900 13518901 10543737 8220053 6816272 4527314
38442 4527314 72501 -4708977 -5348182 67164 6798905 8080341 3988702 1346783
38434 1346783 3829493 7441815 8276593 9102901 13569006 18203361 16145162 6793586
38426 6793586 -3409710 -8733303 -8627524 -5727103 -3273385 -3573801 -5880443 -7029307
38418 -7029307 -6415590 -7363039 -10385224 -9241703 754667 13562018 18219017 12416459
38410 12416459 3906593 -625039 -1261663 433984 5029806 11576803 16163867 16496141
38402 16496141 13697148 8546114 899601 -6068081 -6909990 -1618005 2927603 2029373
38394 2029373 -1176121 -2127867 -1743850 -2756934 -3749768 -2132124 267704 363789 392214
38385 392214 5006436 12214986 13631133 5824115 -3474679 -4181950 3718705 10561326
38377 10561326 9147446 2583096 -1404672 -768241 -335390 -4001266 -9971407 -14448774
38369 -14448774 -15884671 -13569192 -6274945 3851135 9451795 5232722 -4692014 -11794543
38361 -11794543 -13944596 -15386731 -16917763 -13507482 -3292304 7736063 13055612 12402250
38353 12402250 8568448 3038277 -1631504 -814451 5579506 9973446 6442538 -197268
38345 -197268 -723214 5603316 10999876 10614409 7406201 5803702 6731147 9529400 12995565
38336 12995565 13636136 8964511 4026196 7786699 19698690 26736851 19648844 6696418
38328 6696418 3291397 11063291 16571820 10893818 832129 -3128146 -1742762 -2805109
38320 -2805109 -7067959 -7056232 934602 11090065 15784834 13697057 8555180 4354796
38312 4354796 3724981 6941431 10480114 10299667 8242688 10489263 17247811 19795307
38304 19795307 12486858 2423519 358858 5709206 8802399 6223022 4608584 8091699
38296 8091699 11041787 7516037 998386 -1146373 1399376 2712638 363081 -1435091
38288 -1435091 1380567 7040077 10473116 9044042 4211070 -1200613 -5637290 -8771603
38280 -8771603 -10331144 -10118719 -8472201 -5269169 663173 8653653 13501695 10106414
38272 10106414 1658070 -2060531 2689647 7926603 5057676 -3627403 -10293039 -13245559
38264 -13245559 -15550499 -15982734 -10745275 -2321340 2714666 3709693 4498679 3340561
38256 3340561 -4514747 -14217153 -14213044 -4533783 789490 -5403437 -12814468 -11031059 -5160743
38247 -5160743 -4566943 -6902021 -5215167 -2532201 -6356562 -14235050 -17384909 -14977025
38239 -14977025 -13074009 -12224743 -7620402 140378 5209900 6206246 5889712 2924559
38231 2924559 -5445646 -13840415 -13217397 -4897292 926285 1204568 3178609 9901195
38223 9901195 14183097 10540440 3066700 -2642183 -6364935 -8162750 -5260702 1438730
38215 1438730 5520042 4041841 1353164 760268 252182 -306699 3231998 10064620 11854992
38206 11854992 4902327 -3691041 -7791054 -11093137 -17228639 -20350861 -14820721 -6409775
38198 -6409775 -3585256 -4215675 -1862764 583408 -3844831 -11149137 -10199311 -697754
38190 -697754 5876899 4593825 3679489 9137990 14453180 12116613 6217579 5238826 8322857
38181 8322857 7627034 1664697 -2125343 1327153 7422718 8774372 5471349 4254783
38173 4254783 8221729 11622802 7526463 -1700359 -6225561 -1587122 5103272 4808862
38165 4808862 -1286675 -3953277 1665637 11057788 17735800 20508074 21322380 19742357
38157 19742357 13586956 4320474 -1918414 -869677 3714025 3781918 -2552158 -8123672
38149 -8123672 -7021076 -3473070 -4561181 -7296384 -2247848 9760230 15427781 8021362
38141 8021362 -1151005 1823179 13955231 20785294 16125906 5994458 -3879272 -13029134
38133 -13029134 -19155078 -17242111 -8464440 -1316460 -640096 -2464055 -2325023 -1576137
38125 -1576137 -2106555 -1681408 897983 1538679 -3246790 -10084436 -12641506 -8767034 -785351
38116 -785351 7646105 12160187 9674317 3548328 2460615 9660732 17187355 15798228
38108 15798228 7271385 1178758 2029844 5744231 7291824 5532883 1069733 -4426698
38100 -4426698 -6400084 -1062788 7876869 12035308 9859006 9110455 14300937 17832980
38092 17832980 10199166 -4697221 -12534148 -6827420 3177638 5489732 358667 -2489113
38084 -2489113 1881445 8066171 8890640 4660538 1754634 4423299 10210664 12970319
38076 12970319 9370802 2496338 -1028350 2030678 7902780 10004680 6059207 -314916
38068 -314916 -4300614 -4174466 -1484191 609318 -661248 -4780160 -7240934 -4661708
38060 -4661708 -382978 -1083875 -7409872 -12617664 -12003022 -8596522 -6805894 -5732184
38052 -5732184 -3217799 -1779742 -4445878 -7962854 -7056953 -3801651 -5521847 -13266311
38044 -13266311 -19183082 -17003480 -9389379 -2468220 2017608 5866692 9236301 9832343
38036 9832343 5858576 -2015400 -10294262 -13818138 -9923060 -2446067 1251180 -1221048
38028 -1221048 -4381466 -2306294 3560831 6706596 4237996 349974 799971 5682827
38020 5682827 9042355 5835206 -1808081 -7018829 -6658062 -4318129 -3726028 -3330062 -1162358
38011 -1162358 -1247575 -8692047 -19811571 -24537176 -19760948 -13327536 -11847400 -10997935
38003 -10997935 -3098974 10198151 19326014 19302748 14817491 12257371 11567361 8545123
37995 8545123 2366999 -2743250 -3279045 -1035308 -190280 -1588695 -2990285 -4330210
37987 -4330210 -8148988 -13272500 -13134495 -4467112 6412380 11524621 12239666 15435642
37979 15435642 20769329 20542831 12809782 5545208 4479696 4825916 394542 -5538826
37971 -5538826 -5322584 1055011 5904680 4146667 -1865868 -6954743 -7785112 -3283158
37963 -3283158 5225869 13453572 16591477 13441783 7092525 1643821 -929252 -1448351
37955 -1448351 -2030923 -3387054 -3591440 -778494 3417700 5255756 3221429 -1630990
37947 -1630990 -8476615 -15673532 -17946051 -10825654 1229817 7653488 4751582 -640580
37939 -640580 -2869865 -4863020 -9303631 -10996487 -5829289 -364318 -2523743 -7412757
37931 -7412757 -3607716 8694944 17576374 17701534 16911439 21414278 25512022 22418310
37923 22418310 16481468 15924410 18823285 15912978 5690974 -2158321 -58845 7376298
37915 7376298 9944649 4208902 -4875990 -12145669 -17016670 -20102976 -19911541 -15572060
37907 -15572060 -9798459 -5559768 -1628791 4416487 9758098 8111447 -1128625 -10386383
37899 -10386383 -12770253 -9383971 -5304620 -2440593 64012 1948950 2838033 4706195
37891 4706195 9021913 13276381 14513244 14527733 16896533 19956926 17773130 8319408
37883 8319408 -3511671 -11783954 -14963867 -14712311 -12376043 -8321081 -3285616 807241
37875 807241 1640206 -979301 -3492484 -1984748 2027930 2682861 -1633893 -5214346 -3957749
37866 -3957749 -2558619 -6922407 -13035372 -11424345 -2131036 2845311 -5325701 -20462943
37858 -20462943 -28447791 -23059708 -11402463 -4813223 -7013409 -11922503 -12321373 -8658534
37850 -8658534 -7115662 -10238328 -13982591 -14681244 -13552536 -12024693 -8343473 -2523229
37842 -2523229 1180550 1584632 4315942 12169193 18121453 15890536 11202500 12402694
37834 12402694 15299049 10026944 -320876 -2479427 5640594 11010645 5681798 -2606217
37826 -2606217 -4400216 -454707 5691917 14384240 21841627 17771097 959301 -12794744
37818 -12794744 -9677675 2770957 6817778 -870136 -7957948 -6207669 -409370 1833521
37810 1833521 -829603 -5423167 -8024287 -4816513 3969049 11482323 11254953 5677066
37802 5677066 1963594 1719144 1125909 -357394 711470 4166871 5545561 3745244
37794 3745244 2579143 3486173 2932725 -1226280 -6184922 -8668484 -8301965 -5272788 589796
37785 589796 6882735 9303928 7227709 4950716 5645871 7276613 6191736 2238191
37777 2238191 -1162394 -557310 4195851 9053504 9405342 5822997 3511598 4089226 2566280
37768 2566280 -3261124 -6077339 571357 9527205 8076688 -2923471 -9536820 -5335736
37760 -5335736 529503 -253319 -2341903 2372747 10388055 12440635 7690905 2746830
37752 2746830 243083 -2851561 -7463479 -10757836 -11655523 -11756279 -11233167 -9108492 -6732323
37743 -6732323 -5691779 -3189250 4686778 15071735 19373768 13534737 3011121 -3895040
37735 -3895040 -4581547 -3022125 -4392404 -9392252 -12873763 -9277151 -330127 5964369
37727 5964369 6118761 5906536 10020621 13257548 10045578 7189029 14901922 27268291
37719 27268291 26297563 8190849 -8837442 -9605983 -1654473 -72780 -4567240 -5511535
37711 -5511535 -4095873 -9037912 -16480495 -11391962 8369368 25192122 24939234 14167020
37703 14167020 6664399 4225556 732563 -3534882 -3693880 -1497968 -3118274 -7423491
37695 -7423491 -6702393 834998 8048911 9410486 6990529 4370430 1402494 -2680529
37687 -2680529 -6644843 -10198556 -14905405 -20201007 -22750174 -21154141 -16921120 -10124003
37679 -10124003 140800 9802626 11541899 5586268 1505513 4431984 6614775 -506610
37671 -506610 -12218805 -17579354 -16008453 -15981874 -18848059 -15770669 -3039789 9955576
37663 9955576 12948953 7186579 181224 -5355710 -10912665 -15328323 -15466788 -11229163
37655 -11229163 -4516171 4113202 12528567 14176080 5209022 -7280769 -11649122 -6250370
37647 -6250370 -761500 -2554518 -8773267 -13263975 -14048481 -11175166 -4228723 3663606
37639 3663606 5178574 -2733281 -13817638 -19922934 -19013077 -12485832 -1112347 10643192
37631 10643192 13056820 2468021 -10515465 -13231636 -7586534 -4770364 -7270348 -8457405
37623 -8457405 -8032519 -13025381 -21491024 -20420471 -5911193 8030650 9215506 4048208
37615 4048208 4493699 8747192 7448448 1387242 -969443 866440 -34981 -3938004
37607 -3938004 -4182805 -936299 -2635251 -11676503 -19671707 -20163833 -16686310 -14610535
37599 -14610535 -13337685 -10641327 -7621894 -5146974 -1244795 4197929 7216617 5520682
37591 5520682 2207937 1536011 5044510 12535169 21425059 24740354 17079269 4412288
37583 4412288 118611 7841141 15637937 11679904 -829453 -9558743 -8148972 105272
37575 105272 8854202 13074948 10119552 1697935 -6750794 -11416882 -12469429 -10149960
37567 -10149960 -3629688 4207966 6968859 3236010 -721195 -145620 2341567 3655046
37559 3655046 5839578 9734066 10488576 6086743 3510058 8505557 15114345 14086440
37551 14086440 6780012 1475728 -50473 -2525825 -6785978 -9323778 -10304429 -12324093
37543 -12324093 -12578726 -6305598 2434722 3694281 -3679345 -9875420 -8237333 -2335720
37535 -2335720 3105957 8703200 13985392 13356264 4307651 -6514284 -11019765 -9271919
37527 -9271919 -7310598 -9205024 -14388035 -18990354 -17406044 -7132706 5462135 9479200
37519 9479200 2828638 -4093866 -1903339 6233031 11641056 13032178 14754457 15822875
37511 15822875 10139373 -2020639 -11183999 -10595414 -4811493 -1862649 -1417358 2905056
37503 2905056 11323009 15451520 9972185 382989 -5392104 -7999834 -12277455 -15326560
37495 -15326560 -9076263 4393534 10782472 2151679 -11028027 -13971064 -6977452 -1616493
37487 -1616493 -2573105 -4182787 -2891817 -1917117 -2771171 -2266900 -305202 -1723008 -7172491
37478 -7172491 -10243334 -7669775 -5130000 -8162553 -13691470 -15867924 -14789259 -13482862
37470 -13482862 -10800673 -4185595 3083615 4335657 -992820 -5760913 -4279324 568718
37462 568718 1357620 -4325075 -10488652 -9689549 -2258750 4177348 5163534 5203226 9330879
37453 9330879 13034129 7835040 -4490299 -11812481 -7420749 1854856 6561129 6594372
37445 6594372 7475310 10600353 13333263 14891052 15887848 14205696 7125645 -2960685
37437 -2960685 -9385195 -8090640 -1374975 4628715 4638131 -1914534 -9728762 -12004524 -7738740
37428 -7738740 -2911105 -3101902 -7411622 -11199497 -11852474 -9818544 -6890970 -5628176
37420 -5628176 -7453753 -9334363 -6113439 1309868 4615924 -1201712 -9992592 -12558022
37412 -12558022 -9146765 -7476101 -10250548 -11726614 -7107848 671340 5334715 4131847
37404 4131847 -1414897 -8165058 -12998915 -14478827 -14425494 -15813158 -18295065 -18352871 -14907845
37395 -14907845 -11667710 -11540072 -11326942 -5860233 3330647 7877622 2763297 -6766782
37387 -6766782 -11739527 -10649495 -9376426 -10516025 -9183460 -2398135 3124078 -994608
37379 -994608 -11421391 -15044876 -5340458 8689037 12577572 2381977 -11520958 -15103282
37371 -15103282 -4364837 10561298 15556021 7899396 -979432 -667853 4561365 3308544
37363 3308544 -5157637 -10185758 -6928422 -3740838 -8273687 -15183411 -14650325 -6929808
37355 -6929808 -498567 682525 181036 870430 1198102 474651 1609184 5693665 8008087
37346 8008087 3709265 -3772619 -4724795 4341616 13821992 11924973 1177284 -3611187
37338 -3611187 4038599 12606355 9561104 -848693 -6924470 -8945212 -14784116 -20752984
37330 -20752984 -15062498 -1051127 2487982 -9613687 -17836889 -6814447 10725787
37323 10725787 13502760 2831306 -2936676 2721534 9141405 8910714 7119954 9404586
37315 9404586 13954859 17573698 19722565 19176516 14985183 10966354 11483430 13688793
37307 13688793 11987704 8294555 8469122 10256679 5555759 -5565169 -14045983 -15755537
37299 -15755537 -15385992 -15138207 -11019147 -3356080 316108 -2608015 -5283956 -4480604
37291 -4480604 -7790700 -20151658 -31931375 -30047716 -15575549 -1312931 4677364 4748584
37283 4748584 3089819 -117887 -5240341 -10028614 -12119758 -11745713 -10745711 -10468351
37275 -10468351 -10921841 -10842906 -8545551 -3332106 3674308 9492508 10120541 3869156 -4476852
37266 -4476852 -6094264 1488418 9263201 7258785 -2059365 -7590649 -5495338 -2905639
37258 -2905639 -4739092 -5821937 -463839 7356929 9647508 5996564 3479307 6841292
37250 6841292 13321390 16585992 13197622 5933476 1728904 4588782 10260791 10882229
37242 10882229 4955506 -1671838 -5182758 -7941456 -10900924 -9024294 -150657 6956294
37234 6956294 1838521 -11969367 -18818274 -10383761 3311175 6626003 -1820011 -7960779
37226 -7960779 -1011590 12204527 15739405 4686421 -9240201 -13388358 -9358010 -7936608
37218 -7936608 -13115208 -18259084 -17457115 -13507959 -12005815 -12432721 -9344271 -644494
37210 -644494 8832708 12575829 9671578 5259130 3368382 1641748 -3650339 -9156216
37202 -9156216 -7327296 1338600 6573401 2699232 -2904301 -1827652 2320168 1566950
37194 1566950 -2221207 -1912522 733673 -1678319 -7079822 -5940572 1437626 3759824
37186 3759824 -2503999 -6991644 -2927604 2212044 288141 -4808456 -6060903 -4717773
37178 -4717773 -4016036 -751060 7113231 12351038 8560523 2009036 2717353 9022037
37170 9022037 12098751 11428279 13491529 17493047 15533929 7924626 6134845 16385011
37162 16385011 29626065 33213729 25966999 16187997 9546220 5023248 742355 -2134627
37154 -2134627 -2643955 -3637555 -8874806 -16494647 -18334940 -8517959 8195047 19823215
37146 19823215 19294788 10504877 2172126 -996876 -270518 535625 -1120534 -3989915
37138 -3989915 -3893171 1039109 7331495 11328141 14485348 18201064 16964611 5560375
37130 5560375 -8717619 -12364536 -5278606 -2151259 -10741718 -20806909 -20585274 -12785690
37122 -12785690 -6151420 -1578733 3558683 6059613 2756890 -893894 1503683 6481041
37114 6481041 7043745 4178897 2784653 2355435 1495223 4696605 13275438 16711571 6709417
37105 6709417 -5925335 -3839540 11116681 20555418 15940611 6145928 -587501 -5053142
37097 -5053142 -5864599 2562929 15907901 19662663 9728352 -397970 -66726 3868298
37089 3868298 947304 -6308158 -9309124 -7247710 -4333725 -838752 4028930 6357334
37081 6357334 2448695 -5394944 -13140862 -18599113 -16909717 -2496009 18012906 25866791
37073 25866791 12959604 -5102618 -9846282 -4686237 -5183760 -12236929 -12185277 -1084757
37065 -1084757 8403243 6868345 782304 580053 6976579 14224356 18419420 17775530
37057 17775530 11698383 3901077 446791 1284315 -218433 -6249778 -9997071 -6467184
37049 -6467184 -1161967 -1954934 -7562456 -10891968 -10101662 -9009391 -8587304 -5691056 -457168
37040 -457168 1831705 -1672705 -6982638 -9050861 -8062858 -6998095 -6029560 -3180640 954971
37031 954971 3051161 1770240 -267206 -70396 2186470 4142000 4209214 2626020 849832
37022 849832 888206 4095664 9492936 13972568 14893212 11632551 4314938 -6895360 -19574905
37013 -19574905 -27948854 -27017684 -17887323 -7071020 -265847 1810946 1685714 1406157
37005 1406157 1466022 1959742 2955164 3309521 407957 -6737721 -13469337 -11460405 1718317
36996 1718317 16345273 18959211 7914632 -4452083 -7140829 -2509752 574465 -120229
36988 -120229 -162709 2318849 5009689 7513821 11649127 15470765 13830367 6344994 -868908
36979 -868908 -3140485 -1993538 -447886 1265579 2982609 2338237 -1522577 -5274884
36971 -5274884 -5517500 -3351356 -2517266 -4526963 -7170486 -6824409 -2097471 3497933 3746790
36962 3746790 -2916403 -10193634 -11799335 -10023620 -10846435 -13210566 -11699284 -8957605
36954 -8957605 -14277481 -26764324 -31320786 -18797367 -1173690 3328378 -5461695 -11297486
36946 -11297486 -5013479 4784486 5906494 -1916848 -10057403 -13444679 -14458571 -16663920
36938 -16663920 -19407067 -19572352 -16542237 -13226384 -11681625 -9788314 -4916997 275396
36930 275396 -4908 -6227189 -12022522 -13193375 -13485362 -17808171 -23719578 -24412227 -17825973
36921 -17825973 -8419812 -1447374 886523 -720753 -3095387 -2489815 847772 2302506
36913 2302506 223611 -87004 5210198 9795475 4574417 -7685384 -13812275 -7780719
36905 -7780719 1250227 2213193 -3104871 -4128855 3703882 14024445 17682579 11020489
36897 11020489 -3073383 -17759456 -25480033 -22502746 -12125046 -1786251 3675516
36890 3675516 4538081 2535503 -1901785 -7330059 -9622327 -6266617 -907695 385921
36882 385921 -2707619 -4373615 -1387865 2081433 1035932 -2607911 -2821783 2118567
36874 2118567 8157139 11230582 10537267 6695021 694525 -5068972 -8032584 -8142309
36866 -8142309 -7018943 -5273670 -3364323 -3468486 -6628452 -9637981 -9462914 -9067210 -12837202
36857 -12837202 -17468212 -15104038 -6093972 -383436 -3687882 -9972650 -11434425 -8886616
36849 -8886616 -7381545 -7553398 -6773903 -4305644 -511785 4805671 9267971 8159904
36841 8159904 2086832 -1229133 2259079 6448956 5357192 3246940 6510859 11306278
36833 11306278 9241176 1609481 -2601388 -1026283 259738 -1099108 -124854 5416229
36825 5416229 10592978 11629249 10647473 9086300 3874513 -5690731 -13364238 -13123518
36817 -13123518 -7055739 -2162844 -2023300 -4451426 -5131658 -1518947 4936404 9320787
36809 9320787 7945186 2806811 -744514 -298510 2165428 3784944 2442111 -3116229
36801 -3116229 -10100035 -10722125 -889881 11128455 12241048 1352215 -8946592 -9199580
36793 -9199580 -3725954 -1190523 -2321025 -2606684 -1333807 -1123070 -1657822 -65955 3711777
36784 3711777 6597986 6815934 5257608 2909372 -453425 -5012484 -9556456 -11160944
36776 -11160944 -6736918 3123346 12420735 15012242 11472785 7231076 4478574 1007667
36768 1007667 -2817188 -2616497 2191259 5573513 3727470 1093042 2674220 5146367
36760 5146367 1531783 -8218614 -16793570 -17855621 -10639983 1243294 10982650 11014238
36752 11014238 -121557 -14152743 -20702151 -17800149 -11318520 -6042577 -2270394 108619
36744 108619 56195 -1555253 -2006355 -702244 573105 1414030 2710126 2863772 -867384
36735 -867384 -6248637 -6620440 -61422 6645086 6653766 1830356 -1305085 -1293412 -2030378
36726 -2030378 -4806678 -6043683 -3832190 -1415575 -1579210 -1758342 1475961 5928976
36718 5928976 6377883 2292008 -1778259 -3181706 -3512246 -3359144 -421320 4594256 5660056
36709 5660056 -441841 -7751092 -8327158 -2946130 1294631 2013129 3458399 7901458
36701 7901458 11902549 12290992 10170590 7592900 5355509 5151594 8381759 11522838
36693 11522838 8638919 297807 -6329319 -8354264 -10688446 -15224636 -15102244 -6320564
36685 -6320564 2501623 1084410 -6931421 -9471476 -4175444 -348225 -3163279 -6510516
36677 -6510516 -4126525 1042963 3004751 1841304 1899715 4960173 9094982 11545598
36669 11545598 10315155 5814550 2466069 4820085 10321804 10672242 3324043 -3315194
36661 -3315194 -864734 6758047 8309450 863723 -6050517 -3149181 6635408 11630079
36653 11630079 4609868 -9706731 -19590415 -17665766 -7832764 -1277410 -5192914 -15543629
36645 -15543629 -21549761 -16882042 -5404833 3809646 5584069 2152883 -1197561 -2165465
36637 -2165465 -2137564 -1891387 423437 5114517 7450399 3129684 -3158739 -1044074 10761712
36628 10761712 19306977 13273859 -553786 -5476487 2537371 11144354 11618036 10311492
36620 10311492 14143136 16284741 7825426 -4090482 -4553698 5474546 9434368 819226
36612 819226 -6848307 -1989137 6877810 5536284 -3636477 -6937739 -975411 4555373
36604 4555373 3474535 -371710 -3689404 -9028170 -16561299 -20417329 -17531788 -12608263
36596 -12608263 -10154161 -8158295 -3802004 525664 1321272 -918506 -4472602 -9148235
36588 -9148235 -12477654 -9031661 1250709 9384879 8353444 3365224 3719473 7766750
36580 7766750 5055795 -6828567 -16652386 -14125210 -3691398 1453706 -3970815 -11933630
36572 -11933630 -12217889 -4575762 2836743 4991291 5485755 9360989 14900256 17037209
36564 17037209 16367192 18535753 24736953 29132322 27215358 20665098 11612812 -1110262
36556 -1110262 -15677279 -23709425 -19760556 -10083665 -4705896 -3661415 1006401 10751535
36548 10751535 16636577 11970563 2058668 -2854475 -753227 468038 -5938160 -15929295
36540 -15929295 -18532318 -9644388 1261947 2403965 -4234156 -5481531 3280143 10382388
36532 10382388 5396917 -4593803 -5953558 702163 2971976 -3112347 -8750634 -8635256
36524 -8635256 -8243910 -11409022 -12852317 -9035691 -5780656 -7600764 -8884336 -4685128
36516 -4685128 -1860548 -8167433 -16529180 -13638710 -1649088 2821358 -7283305 -19542420
36508 -19542420 -20698400 -13532495 -7660608 -3280544 4994617 13768120 12832190 1096772
36500 1096772 -10114931 -12110150 -8588983 -6803214 -6834919 -5444608 -4461586 -7667714
36492 -7667714 -12420039 -11974001 -5391906 1218361 3276182 1886984 -463422 -2403659
36484 -2403659 -1514605 3815156 9024493 6602975 -2891289 -9782154 -8700771 -6142858
36476 -6142858 -9488552 -14877832 -13105556 -3191752 7366579 13022814 13740523 10285899
36468 10285899 3314820 -3546022 -6158899 -5350398 -4894835 -5181002 -4192253 -3015881 -4068310
36459 -4068310 -5349405 -3452244 -1047175 -3420746 -8041032 -6466365 2313367 9446316
36451 9446316 9493187 7433543 8980189 12267450 13727105 14448931 15171617 11953769 3169460
36442 3169460 -5115821 -7277814 -6316695 -7157107 -6937772 -4019 11155851 18499761
36434 18499761 19918855 19980446 20128911 16233905 6835286 -2832010 -6939616 -4716137
36426 -4716137 827890 5834710 7168357 5159487 4607002 8864461 13659750 12005027
36418 12005027 4948342 1146533 4428696 8098129 4850484 -2647194 -5546632 -325429
36410 -325429 7807916 12002666 10870131 8122850 7035767 6671249 4244528 511712
36402 511712 -143551 3286388 4793418 -980420 -9806756 -12538785 -7853389 -3357097
36394 -3357097 -3159287 -2257678 3259820 8150841 6504293 2388819 3742421 9032016
36386 9032016 9245900 2501456 -2687108 -855673 2122969 -1169952 -8107944 -10472638
36378 -10472638 -6475574 -1644973 418189 1616992 3625796 4413107 2290626 -640746
36370 -640746 -1105988 2021939 8008368 14570506 16884459 10729891 -534354 -6113348
36362 -6113348 755518 13920771 21302600 18818799 12448146 7992247 5174948 2407030
36354 2407030 831322 875278 30278 -2413470 -2872771 250292 1989220 -2216261 -8218901
36345 -8218901 -8233137 -2527766 829050 -2173269 -6854491 -8497884 -8747794 -10174695 -10709657
36336 -10709657 -8401788 -6790634 -9495589 -12846217 -10552786 -3819891 83089 -1246676
36328 -1246676 -2867971 -1673763 -942129 -3300132 -5616617 -4700400 -2726133 -2629714 -2764628
36319 -2764628 -898865 878295 732510 2283134 8357710 13137636 9200845 674426
36311 674426 -628355 6641367 9194598 -2214174 -17888673 -20051644 -4547540 14632161
36303 14632161 20977688 11362475 -2685503 -6893555 1659660 11515004 10136092 -231469
36295 -231469 -5291236 1789293 11088583 10487073 2440548 -1195853 3450809 8671492
36287 8671492 7416532 1341182 -3844620 -4932834 -1899208 3394209 7702659 8271179
36279 8271179 4701899 -2220436 -11588320 -20279621 -23233436 -19480948 -14602981 -12783825
36271 -12783825 -9970080 -598829 11905758 18015158 13762608 3510982 -6949537 -13764430
36263 -13764430 -13829891 -7789778 -2849170 -5039070 -9921041 -8993950 -3895796 -4439625 -12384030
36254 -12384030 -17852707 -14480046 -8218122 -6869491 -9393133 -10709602 -10188556 -10008059
36246 -10008059 -10109243 -9096617 -6452532 -1864616 3244314 3318885 -5456176 -16389516
36238 -16389516 -17859534 -9365616 -2681922 -4016187 -5020528 3408523 17544990 27119646
36230 27119646 27404761 19495054 6455943 -5061395 -7336837 -1813193 712739 -4726595
36222 -4726595 -10821344 -11879648 -12666281 -15625322 -11980203 2786239 15870132 13819906
36214 13819906 3311970 8235 4206161 4314526 -1065870 -2727570 284246 -337940
36206 -337940 -4727516 -4373661 -659402 -5792335 -20560300 -27881165 -16159844 4251559
36198 4251559 15790799 13944430 5797383 -1404966 -3079643 2244922 8504032 6185464
36190 6185464 -3662586 -8429000 -2345328 4612800 3519217 969035 5995012 12088778
36182 12088778 6464902 -7870966 -14376959 -7234288 -175832 -7116418 -23401907 -32353220
36174 -32353220 -25407630 -9943022 1321271 3932252 3224676 4789083 7300465 6235049
36166 6235049 1406422 -3188022 -5513817 -6920459 -7931124 -7331724 -5539742 -4260853
36158 -4260853 -2714264 945301 4595955 4289561 1743375 3287665 10075573 15599342
36150 15599342 14654594 8921459 2452289 -1911398 -737596 7371687 15394670 12954548
36142 12954548 1263626 -5730867 346511 11525363 16419819 14906419 12637751 9356371
36134 9356371 2182096 -5298954 -6797482 -2554942 2874885 7973468 11978670 10328564
36126 10328564 1503627 -5601281 -1334885 9756616 13598550 5668214 -3917786 -5172474
36118 -5172474 209271 4017042 1674080 -5135990 -11490918 -13140037 -9923050 -5213957
36110 -5213957 -727738 4823182 9681978 7801596 -950584 -5934225 458123 9632250
36102 9632250 8068121 -2069541 -5892735 2148874 12142915 15416303 14258682 11956763
36094 11956763 6082946 -2476173 -5306605 688350 5265283 -1382414 -13432558 -17043964
36086 -17043964 -8766037 1870683 5149911 -683953 -11602431 -21086187 -22488480 -14186177
36078 -14186177 -2184297 6206404 9599030 10052045 7130922 253706 -6028354 -6533693
36070 -6533693 -4193625 -6576433 -13003024 -13017932 -1028018 13781121 17152124 5863922
36062 5863922 -10276309 -19994220 -19629715 -12365759 -3626143 2005761 3083013 2112098
36054 2112098 1771601 -325660 -9545025 -24685834 -34313664 -27838274 -9309362 5431358
36046 5431358 6665638 757231 -469633 5046986 10492064 12380966 13590367 14341635
36038 14341635 9078692 -3379650 -13285095 -10654597 551979 6354367 494172 -8734133
36030 -8734133 -11102961 -7268461 -4656074 -5567789 -5805886 -2890356 1174695 5262099
36022 5262099 10635907 15642926 15467932 10301645 7343479 9849270 10531704 3131402
36014 3131402 -5046403 -2618754 6797111 7840564 -3064374 -10943589 -4803754 5461217
36006 5461217 4906838 -3043595 -2732675 8380247 15136314 6955378 -7460907 -12740210
35998 -12740210 -5729690 4237803 8442529 5882958 36615 -5804814 -9769012 -10928850
35990 -10928850 -8605847 -2430836 5625820 9957824 5581748 -4812170 -11201101 -6714806
35982 -6714806 3619608 7974087 1864241 -5918559 -4012205 6437310 11843990 3118091
35974 3118091 -11789021 -17459080 -10856211 -4230302 -7411135 -15217412 -16545679 -9157415
35966 -9157415 527773 6932445 7673309 964065 -11070348 -19338012 -16715400 -8636097
35958 -8636097 -6278803 -10257198 -10805455 -4845615 -2179830 -10572640 -23379090 -27859432
35950 -27859432 -20017249 -6242072 4868171 7917297 2720740 -4488553 -5696038 -601731
35942 -601731 2725638 -205946 -3574098 -1240576 2718895 786280 -5180000 -6524940
35934 -6524940 -1097722 4617595 6447392 7345058 9590763 9622692 4488220 -1619766 -1697641
35925 -1697641 5705842 15445478 20953566 18102589 6620836 -8558480 -18517865 -17099778
35917 -17099778 -7617538 -424232 -2362553 -10185440 -15738457 -15751680 -13772548 -13364880
35909 -13364880 -13426987 -11592037 -8704037 -6905041 -5542609 -2549676 1284567 2970043
35901 2970043 1686084 -861892 -4024824 -8525066 -13213362 -15261390 -14056794 -11432050
35893 -11432050 -7768254 -1891067 4530252 6957662 3821203 -1695064 -6989060 -12453252
35885 -12453252 -16814133 -15763128 -8854909 -2651199 -2137160 -3210898 567645 6955277
35877 6955277 7413632 -652582 -10160223 -13117497 -8402638 -565021 4775203 3863840
35869 3863840 -2793453 -9977387 -12584638 -11049379 -9198790 -7895828 -5398929 -3432173
35861 -3432173 -6492777 -13203811 -14630674 -5635842 6597978 10989861 6846339 3554622
35853 3554622 6816127 11801624 11851661 8234851 6946257 9205534 10386795 7414810
35845 7414810 2278269 -2437049 -6952444 -11133950 -11803357 -6889019 -137740 2338948
35837 2338948 -345341 -3174425 -2138190 1527381 4699907 6677256 8136374 7935932
35829 7935932 3742042 -4123154 -11144135 -12210366 -7053232 -1084138 808557 727574
35821 727574 4940000 14017709 20343958 18463687 13308161 12565770 14406536 10667007
35813 10667007 1127140 -4402037 -230461 7210442 9579889 7801755 7459884 8677135
35805 8677135 7539183 4277663 3024926 4649189 5798666 4914094 4358652 6331349
35797 6331349 10476307 15508871 19676309 19777948 13521984 3544664 -3787358 -4302028
35789 -4302028 987583 8101872 12666009 11076964 2917562 -7003891 -12022297 -10316788
35781 -10316788 -6311640 -4801133 -6078584 -8025794 -10456180 -14607978 -19016993 -18881362
35773 -18881362 -11330431 -366839 5831197 3520792 -2362414 -4175886 -135439 5603034
35765 5603034 9588394 11262002 8990589 130278 -12389808 -19107595 -14538393 -5167146
35757 -5167146 -1611868 -5058141 -7310509 -3343637 2716590 5410498 5750813 7557368
35749 7557368 9934382 8424651 2612374 -2127063 -1796468 757955 459992 -2037204
35741 -2037204 -1571512 2160212 1974536 -6557650 -16769619 -18926068 -14187600 -12886408
35733 -12886408 -18698899 -22820035 -17075717 -5592748 1803667 2295039 144021 -1657317
$$ [...]
##END NTUPLES=NMR SPECTRUM
##END=
