##TITLE=31Pdec_SR146_k2
 CDCl3, 124 sc
 26.10.2022
##JCAMPDX= 6.0         $$ Bruker NMR JCAMP-DX V2.0
##DATA TYPE= NMR SPECTRUM
##DATA CLASS= NTUPLES
##ORIGIN= UXNMR, Bruker Analytische Messtechnik GmbH
##OWNER= root
$$ XWIN-NMR		Version 3.5
$$ Wed Oct 26 16:37:56 2022 Russian Standard Time (UT+4h)  she@DPX200
##.OBSERVE FREQUENCY= 81.013821
##.OBSERVE NUCLEUS= ^31P
##.ACQUISITION MODE= SIMULTANEOUS
##.ACQUISITION SCHEME= undefined
##.AVERAGES= 124
##.DIGITISER RES= 16
##SPECTROMETER/DATA SYSTEM= spect
##.PULSE SEQUENCE= zgpg30
##.SOLVENT NAME= CDCl3
##.SHIFT REFERENCE= (INTERNAL, CDCl3, 0, 248.564)
##AUDIT TRAIL= $$ (NUMBER, WHEN, WHO, WHERE, WHAT)
$$ ##TITLE= Audit trail, XWIN-NMR		Version 3.5
$$ ##JCAMPDX= 5.01
$$ ##ORIGIN= Bruker BioSpin GmbH
$$ ##OWNER= she
$$ F:/spectra/data/she/nmr/P31/1/pdata/1/auditp.txt
$$ ##AUDIT TRAIL=  $$ (NUMBER, WHEN, WHO, WHERE, WHAT)
(   1,<2022-10-26 16:37:20.75 +0400>,<she>,<DPX200>,
      <continue with go, POWCHK disabled, PULCHK disabled
       configuration hash MD5:
       00 E9 B6 7A A2 85 ED C7 34 08 36 98 17 FE 4E 26
       data hash MD5: 32K
       E1 F7 20 3D A6 A8 FF CB 35 A9 8C 69 E8 52 EA 0A>)
(   2,<2022-10-26 16:37:24.53 +0400>,<she>,<DPX200>,
      <Start of raw data processing
       efp BC_mod = 2 LB = 1 FT_mod = 6 PKNL = 1 PHC0 = -10339.27 PHC1 = 263.2559 SI = 64K 
       data hash MD5: 64K
       5E B1 DE BC 97 D1 0E 83 17 D2 0F E4 B7 71 24 66>)
(   3,<2022-10-26 16:37:32.59 +0400>,<she>,<DPX200>,
      <abs ABSG = 5 
       data hash MD5: 64K
       79 92 8C 92 EB D7 E3 AF 3D 7D E6 11 32 15 A5 56>)
$$ ##END=
$$ 
$$ hash MD5
$$ 6E CB 7F 6A 8B 9D B2 6F F4 BE D0 2B A1 74 4F DA
##$RELAX= 
##$RELAX= 
##$RELAX= 
##$RELAX= 
##$RELAX= 
##$RELAX= 
##$RELAX= 
##$RELAX= 
##$RELAX= 
$$ Bruker specific parameters
$$ --------------------------
##$DU= <F:/spectra>
##$EXPNO= 1
##$NAME= <P31>
##$PROCNO= 1
##$TYPE= <nmr>
##$USER= <she>
##$AMP= (0..31)
100 100 100 100 100 100 100 100 100 100 100 100 100 100 100 100 100 100 
100 100 100 100 100 100 100 100 100 100 100 100 100 100 
##$AQSEQ= 0
##$AQ_mod= 1
##$AUNM= <au_zg>
##$AUTOPOS= <>
##$BF1= 81.014009
##$BF2= 200.13
##$BF3= 200.13
##$BF4= 200.13
##$BF5= 200.13
##$BF6= 200.13
##$BF7= 200.13
##$BF8= 200.13
##$BYTORDA= 1
##$CFDGTYP= 0
##$CFRGTYP= 5
##$CHEMSTR= <none>
##$CNST= (0..31)
1 1 145 1 1 1 1 1 1 1 1 1 1 1 1 1 1 1 1 1 1 1 1 1 1 1 1 1 1 1 1 1 
##$CPDPRG= <waltz16>
##$CPDPRG1= <>
##$CPDPRG2= <waltz16>
##$CPDPRG3= <>
##$CPDPRG4= <mlev>
##$CPDPRG5= <mlev>
##$CPDPRG6= <mlev>
##$CPDPRG7= <mlev>
##$CPDPRG8= <mlev>
##$CPDPRGB= <>
##$CPDPRGT= <>
##$D= (0..31)
0 1 0 0 0 0 0 0 0 0 0 0.03 2e-05 3e-06 0 0 0 0 0 0 0 0 0 0 0 0 0 0 0 0 
0 0 
##$DATE= 1666787674
##$DBL= (0..7)
120 120 120 11 120 120 24 19 
##$DBP= (0..7)
150 150 150 150 150 150 150 150 
##$DBP07= 0
##$DBPNAM0= <>
##$DBPNAM1= <>
##$DBPNAM2= <>
##$DBPNAM3= <>
##$DBPNAM4= <>
##$DBPNAM5= <>
##$DBPNAM6= <>
##$DBPNAM7= <>
##$DBPOAL= (0..7)
0.5 0.5 0.5 0.5 0.5 0.5 0.5 0.5 
##$DBPOFFS= (0..7)
0 0 0 0 0 0 0 0 
$$ [...]
##$SUBNAM3= <"">
##$SUBNAM4= <"">
##$SUBNAM5= <"">
##$SUBNAM6= <"">
##$SUBNAM7= <"">
##$SUBNAM8= <"">
##$SUBNAM9= <"">
##$SW= 501.771253377433
##$SWIBOX= (0..15)
0 1 3 0 0 0 0 0 0 0 0 0 0 0 0 0 
##$SW_h= 40650.406504065
##$TD= 32768
##$TD0= 1
##$TE= 0
##$TE2= 300
##$TE3= 300
##$TEG= 300
##$TL= (0..7)
0 120 53 12 22 120 120 120 
##$TP= (0..7)
150 150 150 150 150 150 150 150 
##$TP07= 0
##$TPNAME0= <>
##$TPNAME1= <>
##$TPNAME2= <>
##$TPNAME3= <>
##$TPNAME4= <>
##$TPNAME5= <>
##$TPNAME6= <>
##$TPNAME7= <>
##$TPOAL= (0..7)
0.5 0.5 0.5 0.5 0.5 0.5 0.5 0.5 
##$TPOFFS= (0..7)
0 0 0 0 0 0 0 0 
##$TUNHIN= 0
##$TUNHOUT= 0
##$TUNXOUT= 0
##$USERA1= <user>
##$USERA2= <user>
##$USERA3= <user>
##$USERA4= <user>
##$USERA5= <user>
##$V9= 5
##$VALIST= <valist>
##$VCLIST= <CCCCCCCCCCCCCCC>
##$VD= 0
##$VDLIST= <DDDDDDDDDDDDDDD>
##$VPLIST= <PPPPPPPPPPPPPPP>
##$VTLIST= <TTTTTTTTTTTTTTT>
##$WBST= 1024
##$WBSW= 4
##$XGAIN= (0..3)
0 0 0 0 
##$XL= 0
##$YL= 0
##$YMAX_a= 5612
##$YMIN_a= -5460
##$ZGOPTNS= <>
##$ZL1= 120
##$ZL2= 120
##$ZL3= 120
##$ZL4= 120
##$ABSF1= 248.5645
##$ABSF2= -253.2056
##$ABSG= 5
##$ABSL= 3
##$ALPHA= 0
##$AQORDER= 0
##$ASSFAC= 0
##$ASSFACI= 0
##$ASSFACX= 0
##$ASSWID= 0
##$AUNMP= <proc_1d>
##$AZFE= 0.1
##$AZFW= 0.5
##$BCFW= 0
##$BC_mod= 2
##$BYTORDP= 0
##$COROFFS= 0
##$CY= -3
##$DATMOD= 1
##$DC= 0
##$DFILT= <>
##$DTYPP= 0
##$F1P= 0
##$F2P= 0
##$FCOR= 1
##$FTSIZE= 65536
##$FT_mod= 6
##$GAMMA= 0
##$GB= 0
##$INTBC= 1
##$INTSCL= 6.047779e-11
##$ISEN= 30
##$LB= 1
##$LEV0= 0
##$LPBIN= 0
##$MAXI= 10000
##$MC2= 0
##$MEAN= 0
##$ME_mod= 0
##$MI= 50
##$NCOEF= 0
##$NC_proc= -9
##$NLEV= 6
##$NOISF1= 182.463
##$NOISF2= 159.3651
##$NSP= 0
##$NTH_PI= 0
##$NZP= 0
##$OFFSET= 248.5645
##$PC= 4
##$PHC0= -10339.27
##$PHC1= 263.2559
##$PH_mod= 1
##$PKNL= yes
##$PPARMOD= 0
##$PSCAL= 0
##$PSIGN= 0
##$REVERSE= no
##$SF= 81.0140089999694
##$SI= 65536
##$SIGF1= 159.3651
##$SIGF2= -187.1042
##$SINO= 113.3802
##$SIOLD= 16384
##$SREGLST= <1H.CDCl3>
##$SSB= 0
##$STSI= 65536
##$STSR= 0
##$SW_p= 40650.406504065
##$SYMM= 0
##$S_DEV= 0
##$TDeff= 32768
##$TDoff= 0
##$TI= <>
##$TILT= no
##$TM1= 0
##$TM2= 0
##$TOPLEV= 0
##$USERP1= <user>
##$USERP2= <user>
##$USERP3= <user>
##$USERP4= <user>
##$USERP5= <user>
##$WDW= 1
##$XDIM= 65536
##$YMAX_p= 180657597
##$YMIN_p= -512680476
$$ End of Bruker specific parameters
$$ ---------------------------------
##NTUPLES= NMR SPECTRUM
##VAR_NAME=  FREQUENCY,     SPECTRUM/REAL,   SPECTRUM/IMAG
##SYMBOL=    X,             R,               I
##VAR_TYPE=  INDEPENDENT,   DEPENDENT,       DEPENDENT
##VAR_FORM=  AFFN,          ASDF,            ASDF
##VAR_DIM=   65536,         65536,           65536
##UNITS=     HZ,            ARBITRARY UNITS, ARBITRARY UNITS
##FACTOR=    0.620285442955139, 1,           1
##FIRST=     20137.2065510682, 0,            0
##LAST=      -20513.1999529968, 0,           0
##MIN=       -20513.1999529968, -512680476,  0
##MAX=       20137.2065510682, 180657597,    0
$$ Real data points
##PAGE= N=1
##DATA TABLE= (X++(R..R)), XYDATA
$$ [...]
12802a382180J477928K366825K193734j633016o979701q929339o785029k015700
12794b1686478N722701J2350869P805043p300487j3758805L06940J5306109N025264
12786C771156k0473021k5105354r22022J8406274Q015319j2505513j1733166P379112
12778c3167215J6779593N528786r995958j2294376l78118J6355750K6819281K2099947
12770C1747690L328164j4566388j6673658m612035Q318615J4368056J4388452
12763C6298896Q620641l000855j3403312j3873633o815612j443446K171980J0570560
12755A9125219J8122613R245290j3743697k3803318m913198K0048051J7793378
12748D1874338p423289j9259913k800134J4050969L742277j9406487k1897243
$$ plain form
12802 -1382180 95748 2462573 4656307 3023291 -3956410 -12885749 -19670778 -21686478
12794 -21686478 -15963777 -3612908 4192135 -3108352 -16867157 -16560217 -1254108 3771156
12786 3771156 -16701865 -41807219 -42729241 -24322967 -16307648 -28813161 -40546327 -33167215
12778 -33167215 -16387622 -10858836 -20854794 -33149170 -33527288 -17171538 9647743 31747690
12770 31747690 35075854 20509466 3835808 -776227 7542388 21910444 36298896
12763 36298896 44919537 41918682 28515370 14641737 7826125 6382679 8554659 19125219
12755 19125219 37247832 46493122 32749425 8946107 4032909 24080960 41874338
12748 41874338 34451049 15191136 12391002 26441971 30184248 10777761 -11119482
12741a1119482j144610J3478051O463480l732068K194352J4105380J1670302j153885
12733C0761520k742870R862644J3870769m028647k3567576j6735637J1569986
12726A8990189K7138636J1439571j4276729j9147670l621880O116222j943484
12719B4694855j1992458q866887M85525L788190L809112O894933N825848o386674
12711A8252444j6285007o657682J2137811J2664304p674818k0369381p042427
12704a4974756J6003878K3677039J2633429m389078j6502833j6081742l79187
12697a3250J6067605R172204j9845660l5951932j5214682J8924050K7007008P227352
12689G372695q695648m310222N947375Q041639O739161P284708K996702q441570
$$ plain form
12741 -11119482 -12264092 1213959 7677439 3945371 6139723 20245103 31915405 30761520
12733 30761520 28018650 37881294 51752063 47723416 24155840 7420203 18990189
12726 18990189 46128825 57568396 43291667 24143997 20522117 26638339 24694855
12719 24694855 12702397 3835510 4321035 8109225 11918337 18813270 24639118 18252444
12711 18252444 1967437 -4690245 7447566 20111870 12437052 -7932329 -14974756
12704 -14974756 1029122 24706161 37339590 32950512 16447679 365937 -13250
12697 -13250 16054355 25226559 5380899 -30571033 -45785715 -26861665 145343 7372695
12689 7372695 -1322953 -5633175 314200 8355839 15095000 22379708 25376410 16934840
12681A6934840j4711740p193290L392459K324174o331018n076113J1051271K4622694
12673B5013277J6156415j0575575l1077961k9549154j6792267j0104501m891099
12666f1820865J4258114L7567549L3308904l341603l2466248k0937448J0499288
12659b2932309J8287096k447083j8571854j1455925M185095J1748796J1743548
12652i442636O285172o887147j8470443j1305343J1207289K2769178R743644j0851674
12644f951960j8105038j2728095n526896J340766Q796227J1093323M837563k032548
12636a9276658l65150Q398169J6153768J6166044N314431j1600582k0054450j1237074
12628a6501502K038058P93186j0933206j2755755k579426J110059n396369k761748
$$ plain form
12681 16934840 2223100 -4970190 -1577731 746443 -5584575 -10660688 390583 25013277
12673 25013277 41169692 30594117 -483844 -30032998 -46825265 -56929766 -61820865
12666 -61820865 -47562751 -9995202 23313702 19972099 -12494149 -33431597 -22932309
12659 -22932309 -4645213 -7092296 -25664150 -37120075 -32934980 -21186184 -9442636
12652 -9442636 -3157464 -10044611 -28515054 -39820397 -28613108 -5843930 3899714 -6951960
12644 -6951960 -25056998 -37785093 -43311989 -41971223 -33174996 -22081673 -17244110 -19276658
12636 -19276658 -19641808 -11243639 4910129 21076173 26390604 14790022 -5264428 -16501502
12628 -16501502 -14463444 -13670258 -24603464 -37359219 -39938645 -38828586 -44224955 -46986703
12620d6986703J4626151K3257242Q263541j0052038q303541M130850N195828k438750
12612a2307420k72076J2184165J7907520J0074361j689562q166876p302623M57250
12604A0884739J0262417J3348749R768916R478864J1370802r56618k8258498m1633586
12596e734215k1165751J0424101J8822469O207867j086918J865219k49642o495703
12588B587427k305468N585948l728454k1688348j4615953J9193001L6929280J3609900
12580C5567333j8887180k0078845J140103P364045q722852j9816928q874628J1267771
12572b1041181K1667541J7004240M07684k1276855l3432622k2216876N753927
12565e3134142K4448904J6975949m707541j5558517p214557N787847P275653j393566
$$ plain form
12620 -46986703 -32360552 -9103310 -839769 -10891807 -19195348 -15064498 -9868670 -12307420
12612 -12307420 -12579496 -395331 17512189 27586550 25896988 17730112 10427489 10884739
12604 10884739 21147156 34495905 44264821 53743685 65114487 64157869 35899371 -5734215
12596 -5734215 -26899966 -16475865 2346604 8554471 7467553 9332772 9083130 2587427
12588 2587427 281959 5867907 2139453 -19548895 -34164848 -14971847 21957433 35567333
12580 35567333 16680153 -3398692 -2258589 5105456 -3617396 -23434324 -32308952 -21041181
12572 -21041181 626360 17630600 18038284 -3238571 -36671193 -58888069 -53134142
12565 -53134142 -28685238 -11709289 -16416830 -31975347 -39189904 -33402057 -26126404 -27519970
12557b7519970o535356j252047P232682R001025L757677j318153j323319K951792
12549a5005669P980587R788124O278546Q18666l12389K460809N24659r676167
12541B857166j8389058j5133748l938122K881571J692700q85660N51842O194190
12533b4169119J4010636J7402867O108846j8195748l3158660j8563848J4717028
12526d1847998L4892207K7605776P712000o921131j4098846j6160173j0125879
12519a8944044J642790O767430k243o758099j825369Q874486J1860801N122362
12511F738114k575723n223583m237016l929040p250024j1506385p177613J0763926
12503b4397344K9860808L0524731J1752452p116822j3444043j3493467j2343288
$$ plain form
12557 -27519970 -34055326 -35307373 -28074691 -19073666 -15315989 -16634142 -17957461 -15005669
12549 -15005669 -7025082 2763042 9041588 9860254 9547865 12008674 12533333 2857166
12541 2857166 -15531892 -30665640 -34603762 -31722191 -30029491 -30915151 -30363309 -24169119
12533 -24169119 -10158483 7244384 13353230 -4842518 -38001178 -56565026 -41847998
12526 -41847998 -6955791 20649985 28361985 21440854 7342008 -8818165 -18944044
12519 -18944044 -17301254 -10533824 -10536067 -17294166 -19119535 -10245049 1615752 6738114
12511 6738114 4162391 -1061192 -5298208 -9227248 -16477272 -27983657 -35161270 -24397344
12503 -24397344 5463464 35988195 47740647 40623825 27179782 13686315 1343027
12496A343027k289109J6620647K4588908R167580j1263304j2279308M72099L235748
12488B9596288o565087r111346K473628J1471473N796737n102859q103931l651126
12480A6803777J269131K717672k311741j3195336j7789708m044343J6505176J6635534
12472A6590162p294283k4836041j3071774J1218175J8819858R766454M584912
12465A5777463P055803L483498o523615p293099L189813P204149k686649j1435682
12457H771681q580926m595519p376098m828470J0635494K0023815M693128j8653775
12449H9330j8166401N047506J8659453Q445352m100562j97701Q269524L204524
12441B1251025r913811j4528851q938917j900450M900460J2411184J2985005J752323
$$ plain form
12496 1343027 -946082 15674565 40263473 49431053 38167749 25888441 26360540 29596288
12488 29596288 23031201 13919855 16393483 27864956 33661693 28558834 20454903 16803777
12480 16803777 18072908 20790580 18478839 5283503 -12506205 -16550548 -45372 16590162
12472 16590162 9295879 -15540162 -28611936 -17393761 1426097 11192551 15777463
12465 15777463 22833266 26316764 19793149 12500050 15689863 22894012 20207363 8771681
12457 8771681 190755 -4404764 -11780862 -16609332 -5973838 14049977 18743105 89330
12449 89330 -18077071 -13029565 5629888 14075240 9974678 9776977 18046501 21251025
12441 21251025 11337214 -3191637 -12130554 -14031004 -9130544 3280640 16265645 18017968
12433A8017968r048479n142475O898858R613597J628368m068317m026592n867938
12425H004990q118664l96623J4570907J9869370R429102m514017j2466444j6530335
12417I848286j4663057N32301J9611514J8322253m521745j6275697K768441K5478112
12409D1100408J7545695q685961j4689912J634936M481893j8069639l2365721
12402i048301j3853920J2313797J0694211j0445886j6180975p53195Q345184j315124
12394b0244209q420693M223418K0863240J8321495J542517o276716J137543P539436
12386A8686031O00101j2821779j9050423j2755730J891415J4894628J4456622
12379E900865j931219j9111758j8316249j779368R045888L396104n063574j821525
$$ plain form
12433 18017968 8969489 3827014 10725872 20339469 21967837 17899520 13872928 8004990
12425 8004990 -113674 -510297 14060610 33929980 43359082 38845065 26378621 9848286
12417 9848286 -4814771 -4282470 15329044 33651297 29129552 12853855 15622296 41100408
12409 41100408 58646103 49960142 35270230 36905166 41387059 23317420 -9048301
12402 -9048301 -22902221 -10588424 105787 -10340099 -26521074 -27274269 -18929085 -20244209
12394 -20244209 -28664902 -24441484 -3578244 14743251 16285768 10009052 11146595 18686031
12386 18686031 19286132 6464353 -12586070 -25341800 -23450385 -8555757 5900865
12379 5900865 3969646 -15142112 -33458361 -35237729 -26191841 -22795737 -27859311 -29680836
12371b9680836N879368L041922p382155r001678K796996J5204696J6530754Q474778
12363E863845j89291k954143J105247O360946M981139k204001m509194K514318
12355A0968866Q369246M367120j627781q40208k223314j5843904k7627432j6521619
12347d0979026P928110J4700539q31624r863842J334528R296571l366017j4076950
12339c5857711L123256L0840546L1869690O340446r776561J040J2453753N735308
12331D4729767q446908p804705N982919J3265373N402248q688725j9391407k5058563
12323a0001k4671738j4911573J040044J0954640P626856Q17420N561807J9146690
12315E554145K1106525J436574k1623028k2723565j765935J7822762J9555810
$$ plain form
12371 -29680836 -23801468 -20759546 -28141701 -37143379 -34346383 -19141687 -2610933 5863845
12363 5863845 5674554 2720411 3825658 10186604 15167743 12963742 8454548 10968866
12355 10968866 19338112 23705232 22077451 21237243 19013929 3170025 -24457407 -40979026
12347 -40979026 -33050916 -18350377 -19182001 -29045843 -27711315 -18414744 -21780761 -35857711
12339 -35857711 -32734455 -1893909 29975781 36316227 26539666 26540706 38994459 44729767
12331 44729767 36282859 28478154 34461073 47726446 53128694 44439969 25048562 -10001
12323 -10001 -24681739 -39593312 -38553268 -27598628 -19971772 -19154352 -13592545 5554145
12315 5554145 26660670 28097244 6474216 -16249349 -18015284 -192522 19363288
12308A9363288Q148395n451857j6490575k0602368j2417591K272642P351162r47566
12300a8774470n251019P177040K1831184J6201178n715278j6704972m029761J3402502
12292H136404J2672512q86870k858998J2113110J8518474l423204l2098982k8140584
12284a5968138P268417K6886841L822862k6055728j6755102J6624705K1488470
12277A7312327r114445k7167948p387829J6424114J0662703p910235q972031K412718
12269a3740626O615209P816369J5703393J5108410p505945k8427282j8143303
12262b2573775P735492J1036553o684960q337566J6050784L3700528K0275812
12255E1202868r614511k9641793k9177829r231939J9826381L3049829J2961786
$$ plain form
12308 19363288 27511683 22059826 5569251 -15033117 -27450708 -25178066 -17826904 -18774470
12300 -18774470 -24025489 -16848449 4982735 21183913 15468635 -1236337 -5266098 8136404
12292 8136404 20808916 19922046 17063048 29176158 47694632 44271428 12172446 -15968138
12284 -15968138 -8699721 18187120 22009982 -4045746 -20800848 -4176143 17312327
12277 17312327 8197882 -18970066 -26357895 -9933781 728922 -7181313 -16153344 -13740626
12269 -13740626 -7125417 690952 16394345 31502755 23996810 -4430472 -22573775
12262 -22573775 -14838283 -3801730 -10486690 -18824256 -2773472 30927056 51202868
12255 51202868 41588357 11946564 -17231265 -26463204 -6636823 26413006 39374792
12248C9374792j8991365k2469123N628195K5748655J3427055r378748j2959315
12241B0380146o18811O505337K865742j660909j114025J434513k66836j0235390
12233A7289767k2551795k1787585l788473J1764478Q092773m26069P418885J9428494
12225A5440475R330383j2703972j2424963P907838J0292065j1833549j9383714
12218a3375437M100950K2176269Q016921j1784554p432736M984171J530169l269272
12210D946481R840971K0491802M186162j7575305j1306144Q482910M258304j7463798
12202E861383j6851633J0734500K7821178J4831800p954411j9875895k1302126
12195f735204j3643485M858204K0635497J5987814K57767k193001O511647K958335
$$ plain form
12248 39374792 20383427 -2085696 3542499 29291154 42718209 33339461 20380146
12241 20380146 19761335 26266672 29132414 27471505 26357480 27791993 27525157 17289767
12233 17289767 -5262028 -27049613 -30838086 -19073608 -10980835 -11406904 -3988019 15440475
12225 15440475 24770858 12066886 -358077 7549761 17841826 6008277 -13375437
12218 -13375437 -9274487 12901782 20918703 9134149 1701413 6685584 8215753 4946481
12210 4946481 14787452 35279254 39465416 21890111 10583967 19066877 23325181 5861383
12202 5861383 -10990250 -255750 27565428 42397228 34442817 14566922 -6735204
12195 -6735204 -20378689 -15520485 5115012 21102826 21360593 19167592 25679239 28637574
12187B8637574j2625069j5167671p16041N756618n051624j2365124m692906K817190
12179a3407053J251697K712077R823730N653919j1208113j6337838j878508M853828
12171a8536261j3262434l1079932k0187657P329052K1815763K0126476J8542497
12164a5252496J9792383J5092790N988577m52047p083173j6263347j6643155j482712
12156a6303180J2720366Q032015o409488j0183634m215242l189555n409647K730590
12148b2227775J7651521K0670378P893210n778719j2078442j5898799j6322950
12141b6091576n417038J0550252J2741412o8501n528443P192329J7429507M175584
12133A4983526j9593548k4245045n543436J2160980J2049861L398974M78731J793601
$$ plain form
12187 28637574 16012505 844834 128793 5885411 833787 -11531337 -16224243 -13407053
12179 -13407053 -12155356 -9443279 380451 6034370 -5173743 -21511581 -23390089 -18536261
12171 -18536261 -31798695 -62878627 -83066284 -75737232 -53921469 -33794993 -15252496
12164 -15252496 4539887 19632677 25621254 25169207 18086034 1822687 -14820468 -16303180
12156 -16303180 -3582814 4449201 -1960287 -12143921 -16359163 -19548718 -24958365 -22227775
12148 -22227775 -4576254 16094124 23987334 18208615 6130173 -9768626 -26091576
12141 -26091576 -31508614 -20958362 -8216950 -8285451 -13813894 -6621565 10807942 14983526
12133 14983526 -4610022 -28855067 -34398503 -22237523 -10187662 -6788688 -6309957 -4516356
12125d516356N09652Q32311Q502666J4037509M533523j0625073p491816J4367695
12117B0150111K3969732K681174k3748916j8956967J1177805K6834670J1096823
12110E3204432j0695463j3278682n762977r698745k3022918k4534031m859841
12103c8648225K1692090L2541812J7339442j1232423k4592545o528260K3191743
12096A3763634K7689705l11073k8358333k8662474j1885684k126423R25158J1255054
12088a7710436K2655526J5388581o991380j6293727n76595J7510395J4254976
12081B8237340j985881p055018J537063L295608j0701832k1213331q409502J6566789
12073B71236K4693187J0413292o63593Q061477J7594192M598569j7926498j8557050
$$ plain form
12125 -4516356 -4006704 -3174393 5328273 19365782 23899305 13274232 5782416 20150111
12117 20150111 44119843 46801017 23052101 4095134 15272939 42107609 53204432
12110 53204432 42508969 29230287 23467310 13768565 -9254353 -33788384 -38648225
12103 -38648225 -16956135 15585677 32925119 21692696 -2899849 -9428109 13763634
12096 13763634 41453339 41142266 12783933 -15878541 -27764225 -29890648 -28965490 -17710436
12088 -17710436 4945090 20333671 13342291 -2951436 -3528031 13982364 28237340
12081 28237340 26251459 19196441 20733504 24029112 13327280 -7886051 -16295553 271236
12073 271236 24964423 35377715 34714122 42775599 60369791 64968360 47041862 28484812
12065B8484812K223595J1621987l981854j9380692j2345136M447347R461610N004741
12057B5536410L869777L738000l526905j2609292j4612455j2588247j0089816
12050b0282528l043J7297452K2550087N522289j3339796j2592709l041015m640352
12042h529615q886599K879865J9022360J3188637r193979j8686919j0317879m855624
12034b5379753n330016N008452K0552107J4740101r395775j6495824N54732M998901
12026a0747075j8520924l1139053l301315L2020992K9860310K442763p511608
12019f895910L402337N348947n295033l508588J2559302J5481510j643053j1535600
12011G913912J385668J7592909J7369008P796458Q33340p429369j9295722k1708441
$$ plain form
12065 28484812 30708407 42330394 38348540 18967848 6622712 11070059 20531669 25536410
12057 25536410 29406187 33144187 29617282 17007990 2395535 -10192712 -20282528
12050 -20282528 -20285571 -2988119 19561968 25084257 11744461 -848248 -3889263 -8529615
12042 -8529615 -17416214 -14536349 4486011 17674648 8480669 -10206250 -20524129 -25379753
12034 -25379753 -30709769 -25701317 -5149210 9590891 195116 -16300708 -15745976 -10747075
12026 -10747075 -29267999 -60407052 -63708367 -31687375 -1827065 615698 -6895910
12019 -6895910 -3493573 1855374 -3439659 -6948247 5611055 21092565 19449512 7913912
12011 7913912 9299580 26892489 44261497 52057955 52891295 45461926 26166204 4457763
12003D457763q212547N113790L583277l307532n88518O616157N378504r50545
11995A2090349j732999j018994q179145j4676563m550799J5448926K1214455P878384
11987B6473614l578952j463647n4221j0241163j7622192q049827M805863J037879
11979h692646j0767702q143304M452471J501367j6952701j8931688Q184071L1730976
11971a7619156K0307802q583462j5206974M563577J9374175J2685525O15604k017864
11963A4119227l302311j1658161j5786548l285564J5712251J9997305N382770
11956B1178969j1371124j4192943m822459J993076k923206j1252708p747209O522951
11948b2614653J2178192O94699q188312M569909K2907659J6175262j1593683k4361726
$$ plain form
12003 4457763 -3754784 1359006 4942283 1634751 1046233 7662390 13040894 12090349
11995 12090349 10357350 9338356 1159211 -13517352 -18068151 -2619225 18595230 26473614
11987 26473614 22894662 21431015 21376794 11135631 -6486561 -14536388 -9730525 -8692646
11979 -8692646 -19460348 -27603652 -23151181 -21649814 -38602515 -57534203 -49350132 -17619156
11971 -17619156 2688646 -5894816 -21101790 -16538213 2835962 15521487 16137091 14119227
11963 14119227 10816916 -841245 -16627793 -19913357 -4201106 15796199 21178969
11956 21178969 9807845 -4385098 -9207557 -7214481 -10137687 -21390395 -29137604 -22614653
11948 -22614653 -10436461 -9741762 -17930074 -13360165 9547494 25722756 14129073 -10232653
11940a0232653q753581P264184J536374r082633k515168J0032885O278254p558403
11932a3030741r392965K61585K598882m441052m349876P068074J4944260J0906708
11924D564875L412720l90390m215697j0005081j1435260m849999M374700R187689
11916i356443P237685J315486o77547P460210J7080225J0313469j1322374k0776316
11908A274395m236593J3056305M156264j4871104j0922238R418441J0764981q708150
11900f7699j2531765J0148260K2721946R58154k6930896k5681961l862857J0108453
11892b5138365J3819687J9854193K1946142P771001r685789q176963N950990Q130669
11884C4471565l004912o317233L068493P238374p70890o142656r12737K593099
$$ plain form
11940 -10232653 -18986234 -11722050 -10185676 -19268309 -21783477 -11750592 -5472338 -13030741
11932 -13030741 -22423706 -22162121 -19563239 -24004291 -28354167 -21286093 -6341833 4564875
11924 4564875 7977595 7587205 3371508 -6633573 -18068833 -22918832 -18544132 -9356443
11916 -9356443 -2118758 -803272 -1480819 5979391 23059616 33373085 22050711 1274395
11908 1274395 -2962198 10094107 14250371 -620733 -11542971 -2124530 8640451 -67699
11900 -67699 -12599464 -2451204 20270742 21228896 -5702000 -31383961 -35246818 -25138365
11892 -25138365 -11318678 8535515 30481657 38252658 28566869 20389906 26340896 34471565
11884 34471565 31466653 25149420 28217913 35456287 34685397 28542741 27630004 30223103
11876C0223103m298038j1129886p202217J355939L392069j861304q873910j3328688
11868a1722932j0269383K411500J4113625R831943n814318r089089Q906627K4800503
11860B3168476J3943828j3476660k5763908j3310422Q39975l837043j7021686
11853c5457440j4683167N677157K1840131J8424081O946769N649670J0131408
11846A8528609J234120j9935695k6053876k035646K8063819K9745484L399663
11839C2946478j8390232j4689293J684519O970905m698874j9433947j9693743
11832c5304187j72447K4121646K8149640N540280j8481799j7447512k0332N153443
11824h461268m191159k448247J5519385J8855666r601006l8158297k8224906Q711601
$$ plain form
11876 30223103 25925065 14795179 7592962 8948901 12340970 10479666 1605756 -11722932
11868 -11722932 -21992315 -19580815 -5467190 4364753 -1449565 -10538654 -1632027 23168476
11860 23168476 37112304 23635644 -2128264 -15438686 -14598711 -18435754 -35457440
11853 -35457440 -50140607 -44463450 -22623319 -4199238 2747531 8397201 18528609
11846 18528609 19762729 -172966 -26226842 -28262488 -198669 29546815 32946478
11839 32946478 14556246 -133047 1551472 8522377 3823503 -15610444 -35304187
11832 -35304187 -35476634 -11354988 16794652 22334932 3853133 -13594379 -13614711 -8461268
11824 -8461268 -12652427 -15100674 418711 19274377 9673371 -28484926 -56709832 -47998231
11816d7998231K7651905J3358186n150134k770379Q770413N706455j1061887j8747341
11808c0241013l570467K1829449L1161701J2395823j6986880k6718810q417791
11801b0547988J4241551J6172802J348382q874361p827222o294708q438327n534706
11793b5754577M522341R983617L844611m438419l415908M425199Q247076L269356
11785F83296n460301q580021j4075J5175508K1381775Q994051j1000318j8914844
11777B265071j1434199k762822j739339k803390j617585l365389r657426j1683384
11769d2798463m006231O805778J3719240J7270243J6611099P033586o320216q211828
11761A03208L165298Q624892l037632j4563830n610687J5339005K4281015J5906888
$$ plain form
11816 -47998231 -20346326 -6988140 -12138274 -14908653 -6138240 -431785 -11493672 -30241013
11808 -30241013 -33811480 -11982031 19179670 31575493 14588613 -12130197 -20547988
11801 -20547988 -6306437 9866365 11214747 2340386 -5486836 -11781544 -20219871 -25754577
11793 -25754577 -21232236 -11248619 -7404008 -11842427 -15258335 -10833136 -2586060 683296
11785 683296 -4777005 -13357026 -13371101 1804407 23186182 32180233 21179915 2265071
11777 2265071 -9169128 -11931950 -13671289 -16474679 -18092264 -21457653 -31115079 -42798463
11769 -42798463 -46804694 -39998916 -26279676 -9009433 7601666 14635252 8315036 103208
11761 103208 3268506 11893398 8855766 -5708064 -11318751 4020254 28301269 44208157
11753D4208157L070201q900135k2746969k9128085j3302931J5705017K8229114
11746A7134369J4087578k412771J301356J4108036J0962059r215237k3889968
11739B2075422j9437306o393331q21534k693376N58569J3642423K4359720J8518071
11731D9808658P6643j1921259q177696j129722n626761j7057930j9655804r680198
11723b3364069K684884J0046886J2827856J0736111L320263k784409q68944L549116
11715A6147694J234519l452389j8921P245348N524225k093821j521685L843439
11707B6908409l446251k0060055k0760097n32018J3587042O424341j730496N312032
11699E702907R160041o971273k1505541q475557J5582023J7189933J21454o837958
$$ plain form
11753 44208157 47278358 38378223 15631254 -13496831 -26799762 -11094745 17134369
11746 17134369 31221947 28809176 30110532 44218568 55180627 45965390 22075422
11739 22075422 2638116 -3755215 -4576749 -7270125 -6711556 6930867 31290587 49808658
11731 49808658 49885301 37964042 29786346 28656624 23029863 5971933 -13683871 -23364069
11723 -23364069 -20679185 -10632299 2195557 12931668 16251931 13467522 12598578 16147694
11715 16147694 17382213 13929824 13910903 21156251 26680476 24586655 23064970 26908409
11707 26908409 23462158 3402103 -17357994 -17890012 -4302970 2121371 390875 5702907
11699 5702907 14862948 7891675 -13613866 -22089423 -6507400 10682533 10803987 3966029
11691C966029k013369n998482j3635563R5068K6462222K5481279r074517l4847637
11683i564970k6087747p755369l997347J214696K1780415L0627686M442212k5763633
11675a5104057j6617927J6620944K1600119q686463k6164756l541015K6690947
11668e202208K4400341l144796k0216423j2730074L173995R869991O459422J904270
11660D514518J390235P86520o368013j5623718j2356422O558916K1177694J3227533
11652A3307263n425460q693902M253281R128874l973034j6865261j4456240m753364
11644b7477843J537359P453641J3564759Q990248n408333q128859Q145014J5612111
11636A4288097p107533l2033504j7013971K6206838M1135157P089743l0519820
$$ plain form
11691 3966029 1952660 -4045822 -17681385 -17586317 8875905 34357184 25282667 -9564970
11683 -9564970 -35652717 -43408086 -47405433 -46190737 -24410322 6217364 10659576 -15104057
11675 -15104057 -31721984 -15101040 6499079 -2187384 -28352140 -31893155 -5202208
11668 -5202208 19198133 16053337 -4163086 -16893160 -13719165 -3849174 2610248 4514518
11660 4514518 5904753 6691273 323260 -15300458 -27656880 -21097964 79730 13307263
11652 13307263 7881803 -812099 3441182 12570056 8597022 -8268239 -22724479 -27477843
11644 -27477843 -25940484 -18486843 -4922084 4068164 -1340169 -9469028 -1324014 14288097
11636 14288097 7180564 -24852940 -41866911 -15660073 25475084 32564827 2045007
11629B045007k6755072J562544Q994140r071121j6194870N056426K8517072K5472293
11621A9626419K902029j2601269j0966590k773169K089251L416663K188668k454774
11613A427228o888224m880981J604428K896201l540390p863836l077945L323363
11605a7000156J728210k836160J361502J1830147J3527887K416463p516759n871622
11597b360488k99504o62561k045370L479854R048878L531638p464803r681126
11589f453482m750686n569921q588011M090661K9581136L7903852J4536494j4698167
11581D6051876k0696437j1374511r667708j0745277M402859K4374815J7753136
11574D0098753j1529022k1786737J702257K0255028K443345k5124866k0630534
$$ plain form
11629 2045007 -24710065 -23147521 -14153381 -23224502 -39419372 -34362946 -5845874 19626419
11621 19626419 22528448 9927179 -1039411 -3812580 -1723329 1693334 3882002 1427228
11613 1427228 -5460996 -10341977 -8737549 -5841348 -9381738 -17245574 -20323519 -17000156
11605 -17000156 -15271946 -18108106 -16746604 -4916457 8611430 11027893 3511134 -2360488
11597 -2360488 -2659992 -3322553 -5367923 -1888069 7160809 10692447 3227644 -6453482
11589 -6453482 -11204168 -16774089 -25362100 -21271439 8309697 46213549 60750043 46051876
11581 46051876 25355439 13980928 4313220 -6432057 -2029198 22345617 40098753
11574 40098753 28569731 6782994 8485251 28740279 31183624 6058758 -14571776
11567a4571776O876069J4534678o749404k3727071j5349742L033774J3006815
11560b2946657J5969483J5401068P061834l374174o43432J1943984J1756263m956264
11552C0212105j3231822j989786M989238q212378j7276952J679642K5497600J6344041
11544C8011688j6733786l0634315j4277688J367042l83071N20085J5756515K1737843
11536A5364313M16666k4052806j8170575J1085964K8245043J9863398N057917
11529C7809920m30065l730484j3505408k1096358j5444060l697113j731707q897822
11521c0723097p607587Q966814K2618324J4098564p911603j7853873r455247q75322
11513b8743027j788248R22898J4333511K0951019Q256461n132559R52537J1187397
$$ plain form
11567 -14571776 -7695707 6838971 89567 -23637504 -38987246 -35953472 -22946657
11560 -22946657 -6977174 8423894 15485728 12111554 11468122 23412106 35168369 30212105
11552 30212105 16980283 14990497 19979735 11767357 -5509595 -3829953 21667647 38011688
11544 38011688 21277902 -9356413 -23634101 -22267059 -22650130 -22130045 -6373530 15364313
11536 15364313 15780979 -8271827 -26442402 -15356438 12888605 32752003 37809920
11529 37809920 37379855 33649371 20143963 -952395 -16396455 -20093568 -21825275 -30723097
11521 -30723097 -38330684 -29363870 -6745546 7353018 -558585 -18412458 -27867705 -28743027
11513 -28743027 -30531275 -29608377 -15274866 5676153 13932614 8800055 9752592 20939989
11505B0939989N39835j7092308p354730K2613373K7281299n131796k9898599j3666076
11497a769013J6825256K1258043N305465o34425N143440K129401r855211j2640753
11489B5762203n098726k413838n215628q11092P520461K652302j4112526k0606660
11481a2323504p830096P332335R236047L671225M333638J3442969K0836484J4074707
11473E2773805q811039l0058520k5881749K46457J4642504N67842j3118825K500099
11465g139426K4684778J3227853j9516064k3954164N147407J8902757l697442
11458G655699k1232407k450519J8810178P46619l4540290l4402288L335733L1089456
11450c0987819K3059341K952465P4261J2302208J9461036J0685557p538639j7815693
$$ plain form
11505 20939989 21479824 4387516 -2967214 19646159 46927458 41795662 11897063 -1769013
11497 -1769013 15056243 36314286 41619751 40985326 46128766 48258167 38402956 25762203
11489 25762203 20663477 18249639 13034011 12222919 19743380 22395682 8283156 -12323504
11481 -12323504 -20153600 -12821265 -3585218 86007 4419645 17862614 38699098 52773805
11473 52773805 43962766 13904246 -11977503 -11731046 2911458 3479300 -9639525 -7139426
11465 -7139426 17545352 30773205 11257141 -12697023 -7549616 11353141 7655699
11458 7655699 -13576708 -16027227 2782951 3529570 -31010720 -65413008 -62077275 -30987819
11450 -30987819 -7928478 -4976013 -4901752 7400456 26861492 37547049 30008410 12192717
11442A2192717p389740J3582677J8164460k085715k1984240j7622270O03557R704224
11434E165670J0563492J5844975J7080566k552802l0365726l3859939q234731
11427b6358495J6670623J9587687R749852J661040m794997j1907383j5102513
11420a0494186j3651153j1359733l737426J4942325L1261220K4216041l11046
11413C0866042j3567697o975713j923002q804997q456657J0455451K5731520J4888560
11405D2213507r807991k2281927j9035492j2267623m302921P145099J2036990
11398f300358N83815j6222446j9491890q503675L159796Q330612O988579k219315
11390c3674882j3635131j0383831J1564439K7871337J7304684l113418j245563
$$ plain form
11442 12192717 4802977 18385654 36550114 34464399 12480159 -5142111 -4538554 5165670
11434 5165670 15729162 31574137 48654703 46101901 15736175 -18123764 -26358495
11427 -26358495 -9687872 9899815 19649667 21310707 16515710 4608327 -10494186
11420 -10494186 -24145339 -35505072 -39242498 -24300173 6961047 31177088 30866042
11413 30866042 17298345 10322632 8399630 -405367 -8862024 1593427 27324947 42213507
11405 42213507 32405516 10123589 -8911903 -21179526 -25482447 -18337348 -6300358
11398 -6300358 -5716543 -21938989 -41430879 -49934554 -46774758 -38444146 -31455567 -33674882
11390 -33674882 -47310013 -57693844 -46129405 -18258068 -953384 -4066802 -5312365
11383e312365K0555972K9177902J1318186j0102662j3547863n576954k461103
11376B4051113p534266j5174760j9248961j1610389J0373658L0244813K4974420
11369C6075628l453817k7069352k7660921j4573810j931345R362907J7643683
11362a1607027J1915229p368030j8307192o224068J2937408J5833948M793430
11355A973698j864626j213134n020809j3740419j4087025k978972N851270L796040
11347b7283977K79151O307789J6170618J5064599K22527j4360552j5511424p429475
11339b6540744m565784r083926n705885J4319070L4563658L3127162J4196002
11332E0309553O84231j443788p299367j9400735j8725506p66020Q184211q968558
$$ plain form
11383 -5312365 15243607 44421509 55739695 45637033 32089170 26512216 24051113
11376 24051113 16516847 1342087 -17906874 -29517263 -19143605 11101208 36075628
11369 36075628 32621811 5552459 -22108462 -36682272 -38613617 -29250710 -11607027
11362 -11607027 308202 -7059828 -25367020 -31591088 -18653680 -2819732 1973698
11355 1973698 109072 -1104062 -6124871 -19865290 -33952315 -36931287 -31080017 -27283977
11347 -27283977 -27004826 -20697037 -4526419 10538180 10760707 -3599845 -19111269 -26540744
11339 -26540744 -31106528 -40190454 -45896339 -31577269 2986389 36113551 50309553
11332 50309553 50993784 49549996 42250629 22849894 4124388 3358368 11542579 2574021
11324B574021k8395422j9773767O943352J9009741J0807851L852618N863956L805640
11316D687990n046406p851774l437544m445759r575579l730607J0250896J1376197
11308g772586j743582n713762N773293R780646k164807n301206J1749141J8570537
11300B3177674p154893l3455234j8793600J9202555K5953791q799624l7579565
11293c7448896k5091296Q324025K3410789J1165093q055461j2876688K524667
11286c8047767K4714449K9035024O311209j8895015j5690622R399041K0518063
11279A7344382N092181j0520096n070150P568554O860814j987463l534250J77139
11271A5931111j606499o391009n076363Q356J018553j66526K366391N565640K976045
$$ plain form
11324 2574021 -25821401 -45595168 -38651816 -19642075 -8834224 -4981606 882350 4687990
11316 4687990 -358416 -8210190 -11647734 -16093493 -25669072 -29399679 -19148783 -7772586
11308 -7772586 -9516168 -15229930 -9456637 324009 -1840798 -7142004 4607137 23177674
11300 23177674 16022781 -17432453 -36226053 -17023498 8930293 130669 -37448896
11293 -37448896 -62540192 -54216167 -30805378 -19640285 -27695746 -40572434 -38047767
11286 -38047767 -13333318 15701706 22012915 3117900 -12572722 -3173681 17344382
11279 17344382 22436563 11916467 6846317 14414871 21275685 19288222 15753972 15931111
11271 15931111 14324612 7933603 2857240 2865596 3884149 3717623 6084014 11649654 14625699
11262A4625699m549879j3602024k3011562k5199792q677290J8271547K5258525
11255a6884776J32990k6089531j9318222P369754J4029215m440045j2220190R819147
11247d7601658L4496255K9311326J392677j6875042j1528040K250285O573557
11240a980640K416399K502148J0296168J3273228Q73577j6006251j6585051k144626
11232g355048L064997q258950r696132J5326121L6845721J8746243k0069973k7334503
11224A268476M034194K4933156N604110k2496661j9818348M812776J7977726J1736909
11216B8052338j27275j2584769k5000758k4032330k148753J9170063J4472450
11209b199034o529402j3066370Q75725J3300367J1928375O310448L160712k594844
$$ plain form
11262 14625699 10075820 -3526204 -26537766 -51737558 -60414848 -42143301 -16884776
11255 -16884776 -16751786 -42841317 -62159539 -54789785 -40760570 -45200615 -57420805 -47601658
11247 -47601658 -13105403 16205923 17598600 723558 -10804482 -8554197 -1980640
11240 -1980640 435759 2937907 13234075 26507303 27380880 11374629 -5210422 -7355048
11232 -7355048 -4290051 -12549001 -22245133 -6919012 29926709 48672952 28602979 1268476
11224 1268476 5302670 30235826 35839936 13343275 -6475073 -1662297 16315429 28052338
11216 28052338 27925063 15340294 -9660464 -33692794 -35841547 -16671484 -2199034
11209 -2199034 -8728436 -21794806 -20919081 -7618714 4309661 10620109 13780821 11185977
11201A1185977r280674o256264M509239O832589l912684j3730510j4385779j4306108
11193c9344214j7453273j1797887Q886448K8074085K6035626O502390q597876
11186g694701n093645J1300332K3490434J7512306n780111k8220585k8892415
11179b3378385o037512J9499400K5525818R596582j1578497j8829531o606473
11172a1808598J2469451J9560434R992089j874818k713783K506483K130974k523350
11164B7738882l112992k037840o455378j0115568j999418R719547N858101j0677108
11156H918226j5199481j60435J1836828M194031r164254j0227965n182668o955341
11148b1941059q761111J368517J3271648P786193r262263j1412109R369126K9197649
$$ plain form
11201 11185977 1905303 -4350961 158278 6990867 3078183 -10652327 -25038106 -39344214
11193 -39344214 -56797487 -68595374 -59708926 -31634841 -5599215 903175 -7694701
11186 -7694701 -12788346 -1488014 22002420 39514726 33734615 5514030 -23378385
11179 -23378385 -29415897 -9916497 15609321 25205903 13627406 -5202125 -11808598
11172 -11808598 660853 20221287 30213376 28338558 25624775 28131258 30262232 27738882
11164 27738882 24625890 22588050 16132672 6017104 4017686 13737233 19595334 8918226
11156 8918226 -6281255 -6441690 5395138 9589169 424915 -9803050 -14985718 -21941059
11148 -21941059 -30702170 -29333653 -16062005 -8275812 -17538075 -28950184 -19581058 9616591
11140I616591K3953909m58415j8006654j4542881j348864K381629n322931p986955
11132a1714571L884015J5947235R922006o804173j0156767L301899J0553545p99964
11124A4133225j2770595o378564R676649J5747213R795560K138290l808335q179741
11116B0353702n471513L730047M918700q289054j7830444o924973J1180385J2449208
11108A4116058k141623j3766803j6866044j6999721r199398J1127789K4553018
11101i176724R300579j7522780j7033775J1958754K8692784J2888084p202969
11094A1903953m370792O110355j446995j8227315j7432121J879854J5803120J1995686
11086F215745J895918l14233O203565J3327340J3534238N506293m659308j0099192
$$ plain form
11140 9616591 33570500 33112085 15105431 562550 -786314 1595315 -3727616 -11714571
11132 -11714571 -7830556 8116679 18038685 11234512 1077745 4379644 14933189 14133225
11124 14133225 1362630 -5015934 4660715 20407928 30203488 32341778 28533443 20353702
11116 20353702 14882189 18612236 23530936 15241882 -2588562 -9513535 1666850 14116058
11108 14116058 11974435 -1792368 -18658412 -35658133 -44857531 -33729742 -9176724
11101 -9176724 123855 -17398925 -34432700 -22473946 6218838 19106922 11903953
11094 11903953 7533161 13643516 12196521 -6030794 -23462915 -21583061 -5779941 6215745
11086 6215745 8111663 7797430 14000995 27328335 40862573 46368866 41709558 31610366
11078C1610366j1318610j1960786r922018l371427j95217n286953m908351J3061404
11070b291592K8656078J1739996k4557245l1113057M882835L5094302J9833323
11063D2244640j4792439k1349580j311136Q301929l638845j6026407j7595404
11056b4167242j5351468q287346R469746K3019142J0962207j4764909j8602924
11049c7722794N817444K5890628J8903985q85141j2239682j4036323j1388317
11042b5660200j984232J0616691J3464291O309624N436576J4419752J4412390
11035C7014892l161629j8017399j2320652R21914J042684p033040n563391L840013
11027c276608N138137l140920o875537r41436N325934O718193Q703134J3498468
$$ plain form
11078 31610366 20291756 8330970 -1591048 -4962475 -5157692 -10444645 -15352996 -2291592
11070 -2291592 26364486 38104482 13547237 -17565820 -12682985 22411317 42244640
11063 42244640 27452201 6102621 4791485 13093414 9454569 -6571838 -24167242
11056 -24167242 -39518710 -47806056 -38336310 -15317168 -4354961 -19119870 -37722794
11049 -37722794 -31905350 -6014722 12889263 12004122 -235560 -14271883 -25660200
11042 -25660200 -27644432 -17027741 -3563450 2746174 8182750 22602502 37014892
11035 37014892 33853263 15835864 3515212 4437126 5479810 -1553230 -7116621 -3276608
11027 -3276608 1861529 -1279391 -8154928 -9096364 -3770430 2947763 11650897 25149365
11019B5149365J3906449M809014q924286j8659377j9227367r775338N194546J5111337
11011G584343J0873632m498242j7047398j5756556l381271P205565O736633o76716
11003h960010l110978K756298N707547l817308j6845603j6123484j088094J0986391
10995c0495241J0163604N260627M972339L038292p323851j6769595j1873364L257510
10987c9769679J1574697O588852j048885p13137M718094N973436J667313l6650
10979a1045959O024823J1927482N328334j0689879j6414798k645359J1268335
10972f247021L016568j6110832j4147295J1803906K6880070R752305j4680183
10965B67518j3322753O962176J5557191O882255K113738Q412578Q031381p871230
$$ plain form
11019 25149365 39055814 43864828 34940542 16281165 -2946202 -12721540 -7526994 7584343
11011 7584343 18457975 13959733 -3087665 -18844221 -22225492 -15019927 -8283294 -8960010
11003 -8960010 -12070988 -9314690 -3607143 -7424451 -24270054 -40393538 -41481632 -30495241
10995 -30495241 -20331637 -15071010 -10098671 -7060379 -14384230 -31153825 -43027189 -39769679
10987 -39769679 -28194982 -21606130 -22655015 -23368152 -18650058 -12676622 -11009309 -11045959
10979 -11045959 -5021136 6906346 12234680 1544801 -14869997 -17515356 -6247021
10972 -6247021 -3230453 -19341285 -33488580 -21684674 5195396 14947701 267518
10965 267518 -13055235 -6093059 9464132 16346387 18460125 26872703 34904084 27032854
10957B7032854k1219498j3797415O337562J7536671J2120718L76867o251768p118138
10949A5017853r321560j6314515j9970850q340843J4548116K4983481P524915
10942H126597j9319465k2482763J421804K0660003J2505864o578405p659409Q934453
10934d391321J7532419O072564r205012j0351320j812744J209781l231761n075736
10926i253130k465433m986056j4208651j5893410j148951J5681242J4409453j786574
10918a9651510j0615207k373275R467680J1483618P315480N695760O609336P101384
10910A5033266P606321N146814n906660j8777381j6178870K688384J4680655N783570
10902A0076099o654892k590073P800800L283992j0958647j2659245j58798P827279
$$ plain form
10957 27032854 5813356 -7984059 -1646497 15890174 28010892 28387759 22135991 15017853
10949 15017853 5696293 -10618222 -30589072 -38929915 -24381799 601682 8126597
10942 8126597 -11192868 -33675631 -32253827 -11593824 912040 -5666365 -13325774 -4391321
10934 -4391321 13141098 19213662 10008650 -342670 -2155414 -945633 -4177394 -9253130
10926 -9253130 -11718563 -16704619 -30913270 -46806680 -47955631 -32274389 -17864936 -19651510
10918 -19651510 -30266717 -32639992 -23172312 -11688694 -4373214 1322546 7931882 15033266
10910 15033266 22639587 27786401 21879741 3102360 -13076510 -10388126 4292529 10076099
10902 10076099 3421207 831134 8631934 11915926 957279 -11701966 -11860764 -4033485
10894d033485N608975N606756J1080992J0574266J168097p010550j0814260j5128033
10886b947242j4440629M44835J7382000J4181735k932729n045050J0011084J1235054
10878B7889058j0463170k0828966J555836K4852200J1937298k0688551k9753238
10871a5499533j0512039M670892J548479j503202Q093690J8490961J7056454O465057
10863B8810759o436280j6932290j7204884m820699N239160k035871j5213422j0936477
10855c9530004P485592J3606718J601730l696867J1072235K4773796J6082342
10848C1395542l735810j1809653q481516r338056j5346137j3520275j425429Q848246
10840b3413088R760093N451929j97925q358574j5567104j1693713O164279K5274776
$$ plain form
10894 -4033485 1575490 7182246 18263238 28837504 30005601 22995051 12180791 -2947242
10886 -2947242 -17387871 -16943036 438964 14620699 11687970 6642920 16654004 27889058
10878 27889058 17425888 -3403078 -1847242 23004958 34942256 14253705 -15499533
10871 -15499533 -26011572 -21340680 -19792201 -21295403 -13201713 5289248 22345702 28810759
10863 28810759 22374479 5442189 -11762695 -16583394 -11344234 -13380105 -28593527 -39530004
10855 -39530004 -32044412 -18437694 -16835964 -20532831 -9460596 15313200 31395542
10848 31395542 27659732 15850079 7368563 -1969493 -17315630 -30835905 -32261334 -23413088
10840 -23413088 -13652995 -8201066 -8398991 -16757565 -32324669 -44018382 -37854103 -12579327
10832a2579327K9768959J8393943L754827n110555j2002229k1606814k5605107
10825b4986303j2250880J1176429K0615929O972702q424079l201205J2945190
10818B847783J3299545m688342j5968912n605171J2456507J9378643J3777423
10811C5497476K393450j1922018k2251536j6407063K310784J0057701n094671
10804e415877k0865738j1152094J3711275K1151271L699858j3765018j3177476
10797b5813799m197681r02616o32846L376807O302153J767150m874663n527116
10789c0502611k280913o13679J695026P750119J1287525N567499k837377j904988
10781a1839399P069669J1050477M908706k565288m022838l800789q192661j3892585
$$ plain form
10832 -12579327 17189632 35583575 39338402 34227847 22225618 618804 -24986303
10825 -24986303 -37237183 -26060754 -5444825 1527877 -6896202 -10097407 2847783
10818 2847783 16147328 11458986 -4509926 -10115097 2341410 21720053 35497476
10811 35497476 37890926 25968908 3717372 -12689691 -10378907 -321206 -5415877
10804 -5415877 -26281615 -37433709 -23722434 -2571163 1128695 -12636323 -25813799
10797 -25813799 -30011480 -30914096 -31546942 -28170135 -21867982 -20100832 -24975495 -30502611
10789 -30502611 -32783524 -33397203 -31702177 -23952058 -12664533 -7097034 -9934411 -11839399
10781 -11839399 -4769730 6280747 11189453 8624165 4601327 800538 -7392123 -21284708
10773b1284708j2469293k035795J0492802J6646870J3115156L194985o403062
10766A256955j1080295j0714427n866689M755272J8525517K4386932J2966323
10759C4229588q657044k1237900j5102757p3606Q988126Q145255J819084o474770
10751A635976j3459429j3387479m860643M056603N344207J906061J996078P111734
10743i656892J2709353J6087914J5418895O517226r285772j9380517j4301057
10736a890850l615232l062971r018363l555161J4431294K3251753J0303211q605765
10728A8237916j3257912o739811m087430n285329J528631J5264516J9598713P635541
10720C2894835o286214o070716M402592P507517l784138j6045201j2721490L335302
$$ plain form
10773 -21284708 -33754001 -35789796 -25296994 -8650124 4465032 7660017 1256955
10766 1256955 -9823340 -20537767 -26404456 -21649184 -3123667 21263265 34229588
10759 34229588 25572544 4334644 -10768113 -10841719 -1853593 6291662 8110746 1635976
10751 1635976 -11823453 -25210932 -30071575 -26014972 -20670765 -18764704 -16768626 -9656892
10743 -9656892 3052461 19140375 34559270 41076496 31790724 12410207 -1890850
10736 -1890850 -5506082 -8569053 -17587416 -21142577 -6711283 16540470 26843681 18237916
10728 18237916 4980004 -1759807 -5847237 -11132566 -9603935 5660581 25259294 32894835
10720 32894835 26608621 20537905 24940497 32448014 28663876 12618675 -102815 3232487
10712C232487J2315421L872181q445609p580288Q50575j468397j3262116j2812297
10704b3298043O126075K0203479J1430445l704789n45770J2940547Q137664j7187415
10696A4102193l1973812j6343070J1110746K1330287J1588710k37945n059693
10689D517416q430111j2426610r471703K888362J4154467J5044567J1192295J3085950
10681C0554633J6768013P478234j5289939k9964512j9946558J590843Q698188
10674a11098j495943q425184k470744K127399m938302j0920430k420105J0458425
10666a8195982J0248343N1255l859920J125337L960057J300003l09919l25773
10658f006599l353343m110520P157527K3241354K3663129M521508j3023605j1333137
$$ plain form
10712 3232487 15547908 19420089 10974480 3394192 4244767 2776370 -10485746 -23298043
10704 -23298043 -17171968 3031511 14461956 10757167 10211397 23151944 31289608 14102193
10696 14102193 -17871619 -34214689 -23103943 -1773656 9815054 9577109 4517416
10689 4517416 -3912695 -16339305 -25811008 -22922646 -8768179 6276388 17468683 30554633
10681 30554633 47322646 54800880 39510941 9546429 -10400129 -8809286 -111098
10674 -111098 -1607041 -10032225 -12502969 -10375570 -15313872 -26234302 -28654407 -18195982
10666 -18195982 -7947639 -7896384 -11756304 -10630967 -6670910 -5370907 -5680826 -6006599
10658 -6006599 -9359942 -13470462 -6312935 16928419 40591548 45113056 32089451 20756314
10650B0756314J414641N773816m175342j9014525k7392260k3403792q134759R333326
10642d4842581J7964086J6020990J0923304O678698J07564q211777r832847p37742
10634a1930305J0920599J5480375J3097542Q676774K314767q120749j9263362
10627A1175641k3946634j9307460r286156m401N262598P269676P738277N684013
10619a5414446l24784n896257l321018O054798J0004648K757136m574816j044618
10611a1759357N457674R74278r898677j0250613J036278P060675N57172n321039
10603b2143609M04463J0113625J2199473Q246501O012054N845151L379455j925082
10595B2132031q187776j4316112j6547832r456599M041062J1197161M393839q034191
$$ plain form
10650 20756314 22170955 27944771 23769429 4754904 -22637356 -46041148 -54175907 -44842581
10642 -44842581 -26878495 -10857505 65799 6744497 6852061 -1359716 -11192563 -11930305
10634 -11930305 -1009706 14470669 27568211 36244985 38559752 30439003 11175641
10627 11175641 -12770993 -32078453 -41364609 -41369010 -36106412 -28836736 -21098459 -15414446
10619 -15414446 -15739230 -21635487 -24956505 -18901707 -8897059 -6139923 -10714739 -11759357
10611 -11759357 -6301683 -5327405 -15226082 -25476695 -24440417 -17379742 -16822570 -22143609
10603 -22143609 -21739146 -11625521 573952 8820453 14832507 20677658 24057113 22132031
10595 22132031 13944255 -371857 -16919689 -26376288 -22335226 -11138065 -6744226 -14778417
10587a4778417j1865833m067790M944659M216007n284621j1307977m746853P390591
10579c5500234J0033416K215440o13966P635112J0872595l183209j8947051j4127633
10571d1615530O288033J9159824J7495007J1831021N002080p444574j6643074
10564e927213r658630K632982k270382j8276852j6023781P805792K1944444J0334751
10556i438889m748928k956481M571304L161612M07896M212291M647140j399153
10548a543208L010626K0394283K1690557p834943l4225452k1394617J1066194
10541h836560J6241022r269605k4870672j1012512O101245J028746j3265119r941480
10533e3824935R833183J8307094k6227k4419343k1158894J0957000L3614668J8982476
$$ plain form
10587 -14778417 -26644250 -30712040 -25767381 -21551374 -26835995 -38143972 -42890825 -35500234
10579 -35500234 -25466818 -23251378 -23865344 -16230232 -5357637 -8540846 -27487897 -41615530
10571 -41615530 -35327497 -16167673 1327334 13158355 18160435 10715861 -5927213
10564 -5927213 -15585843 -12952861 -15223243 -33500095 -49523876 -41718084 -19773640 -9438889
10556 -9438889 -14187817 -17144298 -12572994 -9411382 -9003486 -4791195 -144055 -1543208
10548 -1543208 1467418 21861701 43552258 35717315 1491863 -19902754 -8836560
10541 -8836560 7404462 -1865143 -26735815 -37748327 -31647082 -30618336 -43883455 -53824935
10533 -53824935 -43991752 -25684658 -25710885 -50130228 -71289122 -60332122 -26717454 -7734978
10525g734978r705545j1897772R483364J6995395J777805p079397Q37626P95945
10517f527557j4215558j4983716Q252855K1341454M802669j1491801l575435N382079
10509a1015010n329918j2920174j14467N761620j1748522j6938689J1661224K9404061
10501a1239875J286727k7491016q187153K1651010P566536k0398665j1530105
10494d8342541q50791l7169668o3273645j1006459L3490817n7871300j94070643
10487c79094230j33586246J40063016L30162007K23113050j7736671j06555195
10481E6365731k5225196L2221378n566850k9186529J4977518M2026256K898619
10474H8510927l1186326p404810K0487786M93088k8292428j5981448J2377162
$$ plain form
10525 -7734978 -17440523 -29338295 -19854931 -2859536 -1081731 -8161128 -7323502 -6527557
10517 -6527557 -20743115 -35726831 -27473976 -6132522 -1329853 -12821654 -16397089 -11015010
10509 -11015010 -16344928 -29265102 -29379569 -23617949 -35366471 -52305160 -40643936 -11239875
10501 -11239875 -9953148 -37444164 -45631317 -23980307 -16413771 -36812436 -48342541
10494 -48342541 -49193332 -86363000 -149636645 -160643104 -127152287 -185023587 -379094230
10487 -379094230 -512680476 -372617460 -42455453 180657597 162920926 56365731
10481 56365731 31140535 63361913 57795063 28608534 43586052 85612308 88510927
10474 88510927 57324601 49919791 70407577 70900665 42608237 26626789 39003951
10467C9003951J1566934p487249j0751355j088957J209208j408331r5144j555335
10459B9393722n366348N355934K6693272K5283031q176385l4494315k2052925
10452A6635986P529353J7191485N356331q896927k1003202l1192363k5974481
10445d0353818n15904K0859162J5472159k858168n854339O913981J3077265L872300
10437A0612638q075718j1219988o555440r809L817437L302812J927782L823534
10429b376752N754414K753740M6554M861729Q861956j488630j8076372j8531702
10421a8195063k149301Q039915L573149K147308J2539743J7730472O180973q022707
10413B1844489j1757776j3052068j8003399j4114189L819473J6445204J0141520
$$ plain form
10467 39003951 50570885 43083636 32332281 31243324 32452532 31044201 30949057 29393722
10459 29393722 24027374 29383308 56076580 81359611 73183226 38688911 16635986
10452 16635986 24165339 41356824 46713155 37816228 16813026 -14379337 -40353818
10445 -40353818 -40869722 -20010560 -4538401 -7396569 -13250908 -6336927 6740338 10612638
10437 10612638 2536920 -8683068 -15238508 -15248317 -11430880 -8128068 -6200286 -2376752
10429 -2376752 3377662 6131402 6177956 11039685 19901641 18413011 336639 -18195063
10421 -18195063 -20344364 -12304449 -8731300 -6583992 5955751 23686223 29867196 21844489
10413 21844489 10086713 -2965355 -20968754 -35082943 -31263470 -14818266 -4676746
10406d676746R85531N667804J1804728K849919r555771p118071P69412m021660
10398c294854j1417737L6560K0744019K1003102l54206j3602478n199544N423189
10390A3338051J513055p387002o557068K086356Q755065Q975044J735262j0073819
10382A2384944j4558251l109402J0591705L712580j9953779k8946521o854807
10375d6733531K3802774L1465559J2774165j1670361k4251695k0584998n016882
10368d0214969J1073842J5108137P910116M278539J0904025J5175878O597421
10361C0832989l442123Q31282J1818054P838252j3011237k7576399j9082525J661942
10353a0129765J2446047N931456o813218j1597162m119847P888616J2249285N414866
$$ plain form
10406 -4676746 -3691215 1976589 13781317 16631236 7075465 -42606 726806 -3294854
10398 -3294854 -14712591 -14676031 6067988 27071090 26716884 13114406 7914862 13338051
10390 13338051 14851106 7464104 907036 2993392 11748457 20723501 22458763 12384944
10382 12384944 -2173307 -5282709 5308996 9021576 -10932203 -39878724 -46733531
10375 -46733531 -22930757 8534802 21308967 9638606 -14613089 -35198087 -40214969
10368 -40214969 -29141127 -14032990 -6122874 -1844335 9059690 24235568 30832989
10361 30832989 27390866 28222148 40040202 47878454 34867217 7290818 -11791707 -10129765
10353 -10129765 2316282 8247738 1434520 -10162642 -14282489 -6393873 5855412 11270278
10345A1270278k026189J631615J1986407J3327873J222336j1009039j2457211
10338A3946070r614130j3307234k0696612k1176869j3086327k584758Q763675
10331e7756185K1549645K6585322J1819386j5483612k8152664r692639K3084864
10324b8045883L7465555K1190903o006008j6082430k321992J6054085J6539102
10317C8793332k149009k0620561k2603522j1428380K30727Q073756J4404261J5642422
10309B0343026N624959j0220881j7785534j2882972n070955j676480p19139j428487
10301b3816463o998024j2502833n728555J2026856K0672201Q013786j0409197
10294a8742229j1490236M148885J5277473J0001082r04160j148455R900562J7116279
$$ plain form
10345 11270278 9244089 10875704 22862111 36189984 37412320 26403281 13946070
10338 13946070 4331940 -8975294 -29671906 -50848775 -63935102 -66519860 -57756185
10331 -57756185 -36206540 -9621218 2198168 -13285444 -41438108 -51130747 -28045883
10324 -28045883 9419672 30610575 24604567 8522137 6200145 22254230 38793332
10317 38793332 36644323 16023762 -6579760 -18008140 -17777413 -9703657 4700604 20343026
10309 20343026 25967985 15747104 -2038430 -14921402 -19992357 -21668837 -22387976 -23816463
10301 -23816463 -30814487 -43317320 -49045875 -37019019 -16346818 -8333032 -18742229
10294 -18742229 -30232465 -26083580 -10806107 -805025 -1709185 -2857640 7042922 24159201
10286B4159201Q648562p719947j2307468m9604J0340557L526985p578576k783592
10278A6236118R152959K994218j7525816k0733864P82336J5135508K615506j3562085
10270d905120j0001873k378438j1847656k2303699q475829J6053847J9484189
10263b4374579M533351p07942O573423N204717l922300K682456K4072492K9711414
10255D3773032R371908r983089r083914l832588j2487382k4546172k0517233j621942
10247b8927380J5588878J8887726N895986j4571866k2690756p310910J2766186
10240b0362136Q759225j5318419k5067368m838362K2188979K9717249J7971272
10233A3050440j18208j6251774k1459097r108603P817417P842033l598222R41429
$$ plain form
10286 24159201 32807763 25087816 12780348 12730744 23071301 26598286 19019710 16236118
10278 16236118 25389077 28383295 10857479 -9876385 -9094049 6041459 8656965 -4905120
10270 -4905120 -14906993 -17285431 -29133087 -51436786 -59912615 -43858768 -24374579
10263 -24374579 -19841228 -20549170 -13975747 -8771030 -12693330 -10010874 14061618 43773032
10255 43773032 53144940 43161851 34077937 30245349 17757967 -6788205 -27305438 -28927380
10247 -28927380 -13338502 5549224 11445210 -3126656 -25817412 -33128322 -20362136
10240 -20362136 -11602911 -26921330 -51988698 -56827060 -34638081 -4920832 13050440
10233 13050440 12932232 -3319542 -24778639 -33887242 -26069825 -18227792 -21826014 -20884585
10225b0884585K2736625K8555297M974815j5493450n250667J4692327J0554955
10218C9885317j2089788k3547795j6320965n061725L418682J0538634R565026
10211F387386l459165j3383398n683446Q274882R268299J270787l60948P64946
10203C079343q376628j9822059j3882166N387001J2906469J112973j0083632n273374
10195c4952073O730548J0782452N520180p30596k050783J594270N351316L310461
10187d444225l344977n943836j593951P79103m830586j0008245m819523O643412
10179b7562828J3564729J2686576O563900k372976p840555k106552R167132R099153
10171A1198579m447793j2942656p810627m716081j1757922q904624J6604210L7730139
$$ plain form
10225 -20884585 1852040 30407337 35382152 19888702 14638035 29330362 39885317
10218 39885317 27795529 4247734 -12073231 -17134956 -13716274 -3177640 6387386
10211 6387386 2928221 -10455177 -16138623 -7863741 1404558 2675345 2314397 3079343
10203 3079343 -5297285 -25119344 -39001510 -33614509 -20708040 -19595067 -29678699 -34952073
10195 -34952073 -28221525 -17439073 -11918893 -12649489 -14700272 -13106002 -7754686 -4444225
10187 -4444225 -7789202 -13733038 -15326989 -14547886 -19378472 -29386717 -34206240 -27562828
10179 -27562828 -13998099 -1311523 5252377 2879401 -4961154 -7067706 2099426 11198579
10171 11198579 6750786 -6191870 -14002497 -18718578 -30476500 -39381124 -22776914 14953225
10163A4953225K2813328j2973063k6944044j0712354L684313k318474r455180
10156b0952249K288236K1207930K2556493K765154j7289219j6625896K754429
10149c295122J5753152K643996k1077682j9284413J3119973L6179993J9694250
10142D3734147j2218654j8136335K85560R559725Q87037m633919r69834n904509
10134A2603218k1631644k4236833k750497K1453914K5912491J3945341Q43973
10127B6139963o052127n787967n82279O62063q014973j6058657j0513433k58239
10119b0465649l043063j2194569n254386J4474540J8107556j202651j4471285
10112b4049507k988795J3094850R847366l758891n489916M702029J0964512Q450245
$$ plain form
10163 14953225 37766553 24793490 -2150554 -12862908 -9178595 -11497069 -20952249
10156 -20952249 -18664013 2543917 25100410 27865564 10576345 -6049551 -3295122
10149 -3295122 12458030 15102026 -5975656 -25260069 -12140096 24039897 43734147
10142 43734147 31515493 13379158 13664718 23224443 24111480 19477561 18507727 12603218
10134 12603218 -9028426 -33265259 -36015756 -14561842 11350649 25295990 26139963
10127 26139963 20087836 14299869 13717590 14379653 6364680 -9693977 -20207410 -20465649
10119 -20465649 -23508712 -35703281 -40957667 -26483127 -8375571 -9578222 -24049507
10112 -24049507 -27038302 -13943452 -4096086 -7854977 -13344893 -8642864 2321648 10771893
10104A0771893L712402j181542p308588r367788k402215P255203R160486K637794
10096A3277645m390525n751084o51475P716710J3027838J0252325J423327p450502
10088B7454259j3945458j7924945j6875239j0856282o666448p221611m258548
10081e0294272O283122J1681057J949716q464234k86200J7384660J8741305J553909
10073a450937j0811999o193346M060620R928380J3428701J2819571K451025r005497
10065A5226518o430648L281677j429905j7808956j7982099N609601K5015772J8773707
10057B4255667J033274n155148O25432M889493l5593j4873729l2085930l1118555
10049e2465089J83792L5881603L4557151j607318k4985332j0668595J1282201
$$ plain form
10104 10771893 14484295 13302753 5994165 -3373623 -5775838 1479365 10639851 13277645
10096 13277645 8887120 3136036 2484561 10201271 23229109 33481434 34904761 27454259
10088 27454259 13508801 -4416144 -21291383 -32147665 -38814113 -46035724 -50294272
10081 -50294272 -44011150 -32330093 -30380377 -38844611 -39130811 -21746151 -3004846 -1450937
10073 -1450937 -12262936 -18456282 -14395662 -4467282 8961419 21780990 24232015 15226518
10065 15226518 8795870 12077547 10647642 -7161314 -25143413 -19533812 5481960 24255667
10057 24255667 25288941 20133793 20759225 25648718 25613125 10739396 -21346534 -52465089
10049 -52465089 -52281297 -16399694 18157457 16550139 -8435193 -19103788 -7821587
10042g821587R106766l883701j858572Q467597P318100l90642K44418K694638
10034A3877017n562533j3330620l000258J5470991J7870877L737761o041120k692037
10026B0330078L533280M626980J995583l511919j1428486j5486108j0893645k721994
10018a3556231K127259L297405J338081l898912m733033P155618K0420566J3367673
10010B5518426r897371j9538300n906571N337343j847581p690177M019747J4488699
10002D484215M941027q530395o307542j993457j2821098k0541954j691535K5450566
9994a7010173K6748477Q047967J693055R879140O435903j1187527j6361970r82959
9986G261913J1110679M677595o132897n357989L226851R262194R297617K702471
$$ plain form
10042 -7821587 1285179 -2598522 -4457094 4010503 11328603 10937961 11182379 13877017
10034 13877017 8314484 -5016136 -8016394 7454597 25325474 29063235 23022115 20330078
10026 20330078 23863358 28490338 30485921 26974002 15545516 59408 -10834237 -13556231
10018 -13556231 -11428972 -8131567 -6793486 -10692398 -15425431 -8269813 12150753 25518426
10010 25518426 15621055 -3917245 -9823816 -4486473 -6334054 -14024231 -10004484 4484215
10002 4484215 9425242 894847 -5412695 -7406152 -20227250 -40769204 -42460739 -17010173
9994 -17010173 9738304 17786271 19479326 29358466 35794369 24606842 8244872 7261913
9986 7261913 18372592 23050187 16917290 11559301 14786152 24048346 33345963 36048434
9978C6048434q675597j5767650j1483493j481205O197379J2744162J6965282P886139
9970D2433451j3146851k1233840j772946K1998684K0742470R58377j1813272j3221706
9962B4944367j3468533r303045L563377P741231r624610k4573517r434950J7563995
9954a2591685J8554896j872873p391139P303888J3816472M965292J969070P061450
9946C1815371r00019j9193384j8362860N018484J8469355P088829n885826l355129
9938A4694821J737124j138989k760941j409242r766911k2760802j5937651J1524818
9930b5817773K8634594K0008764N780600J916081k728358j5225396j9701709o724040
9922a3857237Q141719R735192J860104p614036j4367553q542862J2359087K4286993
$$ plain form
9978 36048434 27372837 11605187 121694 -1359511 4837868 17582030 34547312 42433451
9970 42433451 29286600 8052760 6279814 28278498 49020968 49979345 38166073 24944367
9962 24944367 11475834 2172789 5736166 13477397 3852787 -20720730 -30155680 -12591685
9954 -12591685 5963211 4090338 -3300801 4003087 17819559 22784851 24753921 31815371
9946 31815371 30915352 11721968 -6640892 -1622408 16846947 23935776 18049950 14694821
9938 14694821 16431945 15292956 12532015 11122773 1355862 -21404940 -37342591 -25817773
9930 -25817773 2816821 22825585 28606185 30522266 27793908 12568512 -7133197 -13857237
9922 -13857237 -5715518 4019674 5879778 -1734258 -16101811 -24644673 -12285586 12001407
9914A2001407N631761k0344758j4798907J1385665J3097419j1580104j8964042
9907b3571559K165346J4328971L023128j863750Q310934K453270k2152665k3299681
9899d0606006P918743K2734068m01848j7686715j390542J3702757L699749q29742
9891a2859536J2885765N701022k7196790k5956478K0068427K8527830l1410003
9884c0239763o2253369p814839J8545974p9023027j67476886n5298774J82155803
9877b01404881K67111284J11929069o6938007p7614605M831099K0244876k5321198
9870C2837637k8499838J1850176J6884807j6119164j8537118J8254506L2172046
9863D8843052J722327k5700366j7794313M189645J4882562J4500131O190712r920609
$$ plain form
9914 12001407 17633168 -2711590 -17510497 -6124832 6972587 -4607517 -23571559
9907 -23571559 -21406213 -7077242 -4054114 -5917864 2393070 4846340 -17306325 -40606006
9899 -40606006 -32687263 -9953195 -10355043 -28041758 -29432300 -15729543 -12029794 -12859536
9891 -12859536 26229 5727251 -21469539 -47426017 -27357590 1170240 -30239763
9884 -30239763 -92493132 -100307971 -81761997 -160785024 -328261910 -383560684 -201404881
9877 -201404881 65706403 177635472 110697465 33082860 37913959 58158835 32837637
9870 32837637 4337799 16187975 33072782 16953618 -1583500 16671006 48843052
9863 48843052 50565379 24865013 7070700 11260345 26142907 40643038 46833750 36913141
9855C6913141k0086463j1452221K255416J039786p629631o160103q53773n817554
9847a1791402j1489353l426597O804010M386307L307645J7615674K3826333l174726
9839B6057891l6505908k9933722Q614941K7991088J1868027o014718m209833L69423
9831a762811m356425m586093M236467M045244q171587q005676J2667479K5098362
9823A9164960Q763318j3835087j2676047M409510R097694k731627j1212579o932882
9815e952740J45145K412020M242720Q580183R176355Q08634j0800798j3449120
9807d837601j298000J6745564K2593016P582283j4547055k0508976n473666J0004782
9799A0260347O307003r691165j4926446k334167J0116682O558504k842322J730537
$$ plain form
9855 36913141 16826678 5374457 7629873 8669659 1040028 -5120075 -5973848 -11791402
9847 -11791402 -23280755 -26707352 -19903342 -15517035 -12209390 5406284 29232617 26057891
9839 26057891 -10448017 -40381739 -31766798 -3775710 8092317 2077599 -2132234 -1762811
9831 -1762811 -6119236 -10705329 -6468862 -2423618 -10595205 -18600881 -5933402 19164960
9823 19164960 27928278 14093191 1417144 5826654 14924348 12192721 980142 -5952740
9815 -5952740 -5807595 -3395575 847145 9427328 18603683 19412317 8611519 -4837601
9807 -4837601 -6135601 10609963 33202979 40785262 26238207 5729231 255565 10260347
9799 10260347 16567350 6876185 -8050261 -10384428 -267746 6290758 3448436 5178973
9791E178973J5607401J2443591j3931585l2753697j8371375R084693J1349108
9784a1392891j0659563j9718468m32586K0809879K1126914J1864183R400859P109191
9776B8107518l086330r008526j754548L356241n815054j2826455j416966J2613160
9768A0169040Q156851l420709k69560R389453N174017m122054K496646J3950223
9760D1523907M032642j7300428j7125144J443971M247389j0404425q163978J4382625
9752A2636559J7494947r447162k2013417L602358K4237052N98532l3076280k2478746
9744b8446157J8563706L1570577M800144j7527584j0724741R46871m115424j2096955
9736a7029563p787003l234158j1791420k0437014r748791J4667655K9155225K1960184
$$ plain form
9791 5178973 20786374 33229965 19298380 -13455317 -31826692 -22741999 -11392891
9784 -11392891 -22052454 -41770922 -42203508 -21393629 -266715 11597468 20998327 28107518
9776 28107518 25021188 16012662 14258114 17614355 11799301 -1027154 -2444120 10169040
9768 10169040 18325891 14905182 14635622 24025075 29199092 25077038 27573684 41523907
9760 41523907 45556549 28256121 11130977 12574948 16822337 6417912 -1746066 12636559
9752 12636559 30131506 20684344 -1329073 2273285 26510337 27108869 -5967411 -28446157
9744 -28446157 -9882451 21688126 26488270 8960686 -1764055 -817184 -4932608 -17029563
9736 -17029563 -24816566 -28050724 -39842144 -60279158 -70027949 -55360294 -26205069 -4244885
9728d244885L513120q346704n410268N693086J1184854M454842p568454j3930275
9720a4654684j1428110l758298M636778R052890O475547K426363O462236J5105540
9712A4318262J2112045n730012j8378104j0654366N297557J1495962J0976647
9705A9437991J2462198N828890j8387179l7979554k2611122J5851285L2339835
9698F942344J1040470j5372538j7383889o316113n026496j0277404o533624L446813
9690c9480437N554760m77479l477991q19007J206717J967042O803089J5047335
9682a3675971J8747451J2960346J453581o435403l117169Q342775J3346187K470483
9674C4092280j2165951j0401691N425736J0580650n786956k2435352j5705413
$$ plain form
9728 -4244885 -731765 -9078469 -14488737 -8795651 2389203 6844045 -724409 -14654684
9720 -14654684 -26082794 -29841092 -25204314 -16151424 -9675877 -7249514 -787278 14318262
9712 14318262 26430307 20700295 2322191 -8332175 -3034618 8461344 19437991
9705 19437991 31900189 37729079 19341900 -18637654 -41248776 -25397491 6942344
9698 6942344 17982814 2610276 -14773613 -21089726 -26116222 -36393626 -42927250 -39480437
9690 -39480437 -33925677 -34403156 -37881147 -38700154 -37493437 -35526395 -28723306 -13675971
9682 -13675971 5071480 18031826 19485407 13050004 9932835 18275610 31621797 34092280
9674 34092280 21926329 11524638 16950374 27531024 21744068 -691284 -16396697
9667a6396697P042374J8625431P936431r701346j4192392j718278J4664162J9127447
9659B5387132Q601305m482319p874452m531253l764248k885323O823319J8590723
9651C5864884J5161647k380367j2781710p674980l559184j1081693j6083960n884777
9643h420140P549856Q637105K813813R49310j874334j0361122j0326820Q108050
9635b924282K4393943J4164338r307487j2202619P145877J5883806j684810k1359619
9627A4109147j6653670N706109J9995852J4276608k103162j3223895j1340745
9620A0766244k721717J0884m378012k412516J1183474J8967800N342122j5292551
9612B1465728j7055914j908159N137017l077196p742915O51680P088746Q58899
$$ plain form
9667 -16396697 -9354323 9271108 17207539 7506193 -6686199 -8404477 6259685 25387132
9659 25387132 33988437 29506118 21631666 17100413 13336165 10450842 17274161 35864884
9651 35864884 51026531 48646164 35864454 28189474 24630290 13548597 -2535363 -8420140
9643 -8420140 -870284 7766821 10580634 11529944 9655610 -705512 -11032332 -2924282
9635 -2924282 21469661 35633999 26326512 14123893 21269770 37153576 35468766 14109147
9627 14109147 -2544523 3161586 23157438 37434046 35330884 22106989 10766244
9620 10766244 8044527 8055411 3677399 1264883 12448357 31416157 36758279 21465728
9612 21465728 4409814 2501655 7638672 4561476 -3181439 -2529759 4558987 5417886
9604E417886n201765K180896J3579946J2103636j240933j1427644j0688784n003209
9596b79971l670333q931439j3536332p540515Q885503K2129630K0370477P458927
9588B4885947n230270j3266894j6565881j2437516l323042m88800o328062o290967
9580c9045485N745979J1549926q25234j0795984J502054J6531295P517564p508039
9572a5327924O765601L5854914L1415819q165299l1829700j7363723P02428q82721
9564A169395N24534J5959022J3689411j8857426l7447249r270106K8942702K9208246
9556B3918529O741697L980638J6404446J0874173r602246j6561953j1302411j4809630
9548I643243j9144657k444780K1245233K0055252O88226n568416j718102j4395361
$$ plain form
9604 5417886 216121 2397017 15976963 28080599 26839666 15412022 4723238 -279971
9596 -279971 -3950304 -12881743 -26418075 -33958590 -25073087 -2943457 17427020 24885947
9588 24885947 19655677 6388783 -10177098 -22614614 -25937656 -26426456 -32754518 -39045485
9580 -39045485 -33299506 -21749580 -22574814 -33370798 -31868744 -15337449 -7819885 -15327924
9572 -15327924 -8562323 27292591 58708410 50543111 18713411 1349688 2052116 1169395
9564 1169395 1693929 17652951 31342362 12484936 -24962313 -34232419 -5289717 23918529
9556 23918529 30660226 34640864 51045310 61919483 52317237 35755284 24452873 9643243
9548 9643243 -9501414 -11946194 9299039 29354291 30042517 24474101 22755999 8360638
9540H360638l3451018k2603619J1596532K3042429L077081o654404J1143188K2470787
9532A6981614P435095n569680L989707J1618458k979665j6622489o189274R402751
9524A8066517N738691m126935J014021R037615j102756j8474474j9068794n832154
9516a4748269K309201M197736R628948J4239166Q538899j604264o872373j1600399
9508D088645j7801671j1607952J0104824K0429549p34484k8225669k2969229J0101943
9500c6614044K8810213J2996990j3190842j8231806J111406K2725002K2594101
9493B0201020k308749k5504627j6282734J7761589L3327334J0458639j7235968
9486B0416504j4233128L660808J797690j2789224p829195J3212674J6426952j431738
$$ plain form
9540 8360638 -25090380 -47693999 -36097467 -13055038 -9977957 -16632361 -5489173 16981614
9532 16981614 24416709 18847029 22836736 34455194 31475529 14853040 8663766 18066517
9524 18066517 23805208 19678273 20692294 29729909 28627153 10152679 -8916115 -14748269
9516 -14748269 -12439068 -8241332 1387616 15626782 24165681 22561417 15689044 4088645
9508 4088645 -13713026 -25320978 -15216154 5213395 4478911 -23746758 -46715987 -36614044
9500 -36614044 -7803831 5193159 -7997683 -26229489 -25118083 -2393081 20201020
9493 20201020 17892271 -7612356 -23895090 -6133501 27193833 37652472 20416504
9486 20416504 6183376 9844184 11641874 -1147350 -8976545 4236129 20663081 19231343
9478A9231343p340871Q421899J5666094l82900j2502518o35641J1986559j098675
9470C3345290k4687800k7381555r799838K478305m34924o313529n922909r34952
9462c9651912P787887J9875700K6577418J8633503J378745j0395135j0416702
9455A3789504m229650J308525K597492k024035r200225j0388336k450577O345129
9447d252173P378568K278394l881524j1086627j7490117j4040140J674051J4591933
9439b4827635J0197393k311360j686818J2773891J8510819K731511j8556342k2766621
9431b5935162r463885M167008Q733411J0529991J5263505J5883925L205748j6338205
9423F046336k3095604q204082J1386207J1890019m609774j0642007O890276K2862700
$$ plain form
9478 19231343 11890472 20312371 35978465 35595565 23093047 22457406 34443965 33345290
9470 33345290 8657490 -18724065 -28523903 -26045598 -26480522 -32794051 -38716960 -39651912
9462 -39651912 -31864025 -11988325 14589093 33222596 34601341 24206206 13789504
9455 13789504 9559854 10868379 13465871 11441836 2241611 -8146725 -10597302 -4252173
9447 -4252173 3126395 5404789 1523265 -9563362 -27053479 -41093619 -39419568 -24827635
9439 -24827635 -14630242 -16941602 -18628420 -5854529 12656290 15387801 -3168541 -25935162
9431 -25935162 -35399047 -31232039 -22498628 -11968637 3294868 19178793 22384541 6046336
9423 6046336 -17049268 -25253350 -13867143 -1977124 -6586898 -17228905 -10338629 12524071
9415A2524071P202018k7620603l7874504q839233K3353480K2566134O63073p747127
9407a5772691N12540L45874j2299713j1461234J2014686K9032214J5636480r209875
9399H798281j3626517m38112M162954l534241l131734R368644J2582770k889982
9391A1292063j7081929j2486813O26937N678560O301649J3191478K0238705J4685537
9383D2446187J296275m324277j444737l657856j4011694j9086685j0647176K338652
9375g091311Q777611J0157525J2762029J4118501O490807r275189k0787412j6308711
9367a156150K367518K0114653K1807651O097863j4156100k4671585k1044902p927661
9359a8568713P960206K0506206K3473468J3395412m933978j8768708j7124711
$$ plain form
9415 12524071 19726089 -7894514 -45769018 -54608251 -31254771 -8688637 -8025564 -15772691
9407 -15772691 -15260151 -14914277 -27213990 -38675224 -26660538 2371676 18008156 8798281
9399 8798281 -4828236 -5266348 -1103394 -4637635 -7769369 1599275 14182045 11292063
9391 11292063 -5789866 -18276679 -17649742 -11971182 -5669533 7521945 27760650 42446187
9383 42446187 43742462 39418185 37973448 34315592 20303898 1217213 -9429963 -7091311
9375 -7091311 1686300 11843825 24605854 38724355 45215162 35939973 15152561 -1156150
9367 -1156150 1211368 21326021 43133672 49231535 35075435 10403850 -10641052 -18568713
9359 -18568713 -10608507 9897699 33371167 46766579 41832601 23063893 5939182
9352E939182k446659R128737M065252j1207391j5950332j740479J5012160J4997936
9344A7798406J898334o148781m182544k793477o037900o313578k528834l445519
9336a1753893q176715l611189J0606768J4914320k35774j6328372j4192034k313129
9328c1090018Q02920k198219M080928J8261675K3780971J4961847J440233r601952
9320B0438385j6860292j4609391R11773J6579039J3908354l857936j4768794r314119
9312g572981K65289L904787O627975J1446672Q762993o179738j9810164j6773680
9304a9328847r83316J0570259R220666J279197k901563K19084O030363P792756
9296A1898599M146138k37630k667448o471739j2804482j4722642p025547L771664
$$ plain form
9352 5939182 3492523 12621260 16686512 5479121 -10471211 -12211690 2800470 17798406
9344 17798406 19696740 13547959 9365415 6571938 534038 -5779540 -8308374 -11753893
9336 -11753893 -19930608 -23541797 -12935029 1979291 1743517 -14584855 -28776889 -31090018
9328 -31090018 -30287098 -32485317 -28404389 -10142714 13638257 28600104 30040337 20438385
9320 20438385 3578093 -11031298 -10119525 6459514 20367868 16509932 1741138 -7572981
9312 -7572981 -7307692 -3402905 3225070 14671742 23434735 17254997 -2555167 -19328847
9304 -19328847 -20312163 -9741904 -521238 757959 -2143604 -1924520 4105843 11898599
9296 11898599 16044737 15807107 13139659 6667920 -6136562 -20859204 -27884751 -24113087
9288b4113087Q197014O586450L494715k708029j2058480j3658105q00204J2342505
9280b2717221R133236j131339K683008J5526824J1483283j1623745k4941630j4225105
9272c5812689q16825k469273m434915Q671958K0595066J1925526j726658N737310
9264A669500K3399687J8081233r670557k2981990n618819J4177821Q856285r548949
9256A8364211j3892185k570835N700134K949670l354485p922975j0771215p899277
9248a9396957L465755J3124344Q605735l017720j925580J3014522J8477697J134166
9240C3481962j9391158j7305536J928839J0864790J204060o590758K502565J5117820
9232B1812584J1144959o848620j9548722j7041121n818864M376044Q271743L674005
$$ plain form
9288 -24113087 -15916073 -9329623 -5834908 -8542937 -20601417 -34259522 -35059726 -22717221
9280 -22717221 -13583985 -14715324 -12032316 3494508 14977791 3354046 -21587584 -35812689
9272 -35812689 -36629514 -39098787 -43533702 -34861744 -14266678 -2341152 -4067810 1669500
9264 1669500 25069187 43150420 33479863 10497873 4879054 19056875 27913160 18364211
9256 18364211 4472026 1901191 7601325 10550995 7196510 -726465 -11497680 -19396957
9248 -19396957 -15931202 -2806858 5798877 2781157 855577 13870099 32347796 33481962
9240 33481962 14090804 -3214732 -1285893 9578897 10782957 4192199 6694764 21812584
9232 21812584 32957543 26108923 6560201 -10480920 -16299784 -11923740 -3651997 22008
9224B2008n688992q488251J547140J2988646Q695467r496995k0457568j1370645
9216c2249190N318477R182965j160426p057136M941995K3834093K5922364N356082
9208C4089224j5711691j5324474k492663l438881j9453669k1984210K321325K6260726
9200a5734313J9871985o303953j9312167j0163707M120614J3202946J8971900
9193D653305J6154276j145058j6840231q881289J2482191J5629842j398503p407197
9185A3247336P572257J4161377m525513k1454897j0309576J1505451J3929682
9178B4126117J528867k439576J649828k844875j3333966j2479807J0655Q149230
9170D366473N836403j424790j2200346k3072649j8113842Q790444L1447484K1223730
$$ plain form
9224 22008 -5666984 -14155235 -12608095 380551 9076018 -420977 -20878545 -32249190
9216 -32249190 -26930713 -17747748 -18908174 -25965310 -21023315 2810778 28733142 34089224
9208 34089224 18377533 3053059 560396 -2878485 -22332154 -44316364 -41995039 -15734313
9200 -15734313 4137672 -2166281 -21478448 -31642155 -27521541 -14318595 4653305
9193 4653305 20807581 19662523 2822292 -6058997 6423194 22053036 20654533 13247336
9185 13247336 20819593 34980970 30455457 9000560 -1309016 10196435 24126117
9178 24126117 25654984 23215408 24865236 22020361 8686395 -3793412 -3782757 4366473
9170 4366473 10202876 8778086 -3422260 -26494909 -44608751 -35818307 -4370823 16852907
9162A6852907q141776j7567640K05790J4702901Q466435k485237m938362r426938
9154b331920k1287306k2285409r56225K2448818K2725480M953939o590368k722899
9146f045890N395774P242848L339685j484691l820689k459494N07295K152315
9138D827153M077849R306290J3642155R563172m28336n687720m524821o775483
9130B4000259j5743257k0337754j0655715R034161K6573094L0930993J4526929
9123E8328710j8416029m3481356l4372753K924969L0845157K4151339k221874
9116A7758163j8376031j5539974m459779N954730J1813154Q398937j684509l797712
9108F6979R031263K0222070J0677718j1176820j9101912n659918R034048O042266
$$ plain form
9162 16852907 8711131 -8856509 -8650719 6052182 14518617 12033380 7095018 -2331920
9154 -2331920 -23619226 -45904635 -46860860 -24412042 -1686562 3267377 -3322991 -6045890
9146 -6045890 -650116 6592732 9932417 8447726 4627037 2167543 2674838 4827153
9138 4827153 8905002 18211292 31853447 41416619 40988283 35300563 30775742 24000259
9130 24000259 8257002 -12080752 -22736467 -13702306 12870788 43801781 58328710
9123 58328710 39912681 -3568675 -37941428 -35016459 -4171302 19980037 17758163
9116 17758163 -617868 -16157842 -20617621 -14662891 -2849737 5549200 3864691 66979
9108 66979 9098242 29320312 39998030 28821210 9719298 4059380 13093428 19135694
9100A9135694j0125547k1259793j6601960j063213J1059832R962874J630962R91780
9092f269371R947409J2293708q07709j3138804o804402Q200183R677316P27026
9084A3825356L706248J7435910J2848418j7782535l8359208j8686630J6489054
9077a0523387J9513301j0913795k7833520m896883K6944428K6660948N67719j2470844
9069G047967J260701J6364171J0466355o196094j1849550m024418L960066M297244
9061B1326442j275316r641457j5467022j0141108M867213J1361550k885682k1371072
9053b3226452j7862969N750152K2135151J8210678Q128149L196969m686335j9282800
9045g637457k5038618j2343606L361304O416888N723862J3486891J7644234K418224
$$ plain form
9100 19135694 9010147 -12249646 -28851606 -29914819 -18854987 -8892113 -7261151 -6269371
9092 -6269371 3678038 15971746 15164037 2025233 -4779169 3421014 13098330 13825356
9084 13825356 17531604 34967514 47815932 30033397 -8325811 -27012441 -10523387
9077 -10523387 8989914 -1923881 -29757401 -34654284 -7709856 18951092 19518811 7047967
9069 7047967 8308668 24672839 35139194 28943100 17093550 13069132 17029198 21326442
9061 21326442 20051126 10409669 -5057353 -15198461 -10331248 1030302 -1855380 -23226452
9053 -23226452 -41089421 -35339269 -13204118 5006560 13134709 16331678 11645343 -7637457
9045 -7637457 -32676075 -45019681 -41658377 -35241489 -29517627 -16030736 1613498 4031722
9037D031722j7368828j3561396J0097659K0958405N606836j3496970j3616701
9030a7349273J221043J4912286J8840781J0365973p830136k0894498j4236019
9023a4969843K011272K464597j4063466j9680150j633306J5619073R085102o844761
9015b8011482n666321R638379J6040855Q129549J37315j734181m054748o849293
9007a2369927k317831P261584R743015K709621l189558j937732O93496j034214
8999d41546n611097r274767q377210J171494J6591063K3947834J2847243p780418
8991B3072596j9949306j8571007j1551633l965350L578158O265353R88657l084669
8983b3217201L790799J3685179J1603201r9815o868402o819942q603143q468068
$$ plain form
9037 4031722 -13337106 -26898502 -16800843 4157562 9764398 -3732572 -17349273
9030 -17349273 -16128230 -1215944 17624837 27990810 20160674 -733824 -14969843
9023 -14969843 -12958571 -10493974 -24557440 -44237590 -45870896 -30251823 -21166721 -28011482
9015 -28011482 -33677803 -24039424 -7998569 130980 268295 -1465886 -5520634 -12369927
9007 -12369927 -14687758 -7426174 2316841 5026462 1836904 -100828 592668 -441546
8999 -441546 -6052643 -15327410 -23704620 -22533126 -5942063 18005771 30853014 23072596
8991 23072596 3123290 -15447717 -26999350 -30964700 -27386542 -21121189 -20132532 -23217201
8983 -23217201 -19426402 -5741223 5861978 5762163 -1106239 -7926181 -16529324 -24997392
8975b4997392M393739K0144612J4872654j0515835k6582220j8269563k967450
8968d3921455M124057J1619316K3570403K1317570k797037k1185599r410521J3095100
8960c588166J2509985o199010j0652714M588402J1975366j590312j5319963r877044
8952a8153456M765569Q104707k924739j5530346j8351613r225862O145993J8464747
8944b6705000K2343307J9382608J0944592m601867k0709626k0387288J577299
8937a8155975K3983574K2952047K600804j4296933j7968943j5232263r226337
8930b5344026K278754J2114739R131810k455144q160505n816695m583210m769489
8922b7603766J235256J0710327J3549006J0342110P771705K063732j0532904j5389556
$$ plain form
8975 -24997392 -20603653 -459041 14413613 3897778 -22684442 -40954005 -43921455
8968 -43921455 -39797398 -28178082 -4607679 16709891 13912854 -7272745 -16683266 -3588166
8960 -3588166 8921819 2722809 -7929905 -3341503 8633863 7043551 -8276412 -18153456
8952 -18153456 -13387887 -5283180 -8207919 -23738265 -42089878 -51315740 -45169747 -26705000
8944 -26705000 -4361693 15020915 25965507 21363640 654014 -19733274 -18155975
8937 -18155975 5827599 28779646 31380450 17083517 -885426 -16117689 -25344026
8930 -25344026 -23065272 -10950533 -1818723 -4273867 -12434372 -18251067 -22834277 -27603766
8922 -27603766 -26368510 -15658183 -2109177 8232933 16004638 18068370 7535466 -7854090
8914g854090M35451J8029901J0024275j1943376j2006798J0293361J9438252N792022
8906C2208998j218233P788230K924588k4107965l3249468k767834K6009735J2397242
8898A9985293j7377333j6273685O214508Q042490r231359p648650J6253674K5294201
8890B5259139N004263j7430667k1393746j6089635j0573222n06023R432168O568680
8882a9729043j674945L886953J5523042P054617j5449916j5102651J3686906K9597080
8874A7792043Q986323j6622721j2958747N234627O432980m959977m280582P147741
8866F771687Q435431j171123l223244N327311Q214144r45027j0424127j2208830
8858G76222j1007154r051618m67408J3558969J8412849L891587j8585406k5496807
$$ plain form
8914 -7854090 -7418639 10611262 20635537 8692161 -3314637 6978724 26416976 32208998
8906 32208998 30990765 38778995 41703583 17595618 -15653850 -18421684 7588051 19985293
8898 19985293 2607960 -13665725 -7451217 591273 -8640086 -16288736 -35062 25259139
8890 25259139 30263402 12832735 -8561011 -24650646 -35223868 -35729891 -26297723 -19729043
8882 -19729043 -21403988 -17517035 -1993993 5060624 -10389292 -25491943 -11805037 17792043
8874 17792043 26778366 10155645 -2803102 2431525 8864505 3904528 -376054 6771687
8866 6771687 15207118 14035995 10812751 16140062 24354206 23409179 12985052 776222
8858 776222 -10230932 -19282550 -19749958 -6190989 12221860 16113447 -2471959 -27968766
8850b7968766q448470J3795081J6796605K326400l633456R876286J9122909K503967
8842B4370556j9715722j2510691J5916647K2001236m492507k2011046l341701
8835B16772K0594444J1579695j5174106j9058333O63429J0125417j270199j1467938
8827c790819j0947320j4793850k3715412j3595270J9414029L7823056J3049813
8820C444227k6852891l0960150M398643L1453629J7739333j2890887j9338081
8813c3006177m30735J1276321K341772m961986O374086J8755552R682455r635362
8805C95926j1079517O110367J5934025O541136p458608j4116417j7217707j6118991
8797c7009786k136056J6170289J4129763r073875k1011274m193745J5650814J1968903
$$ plain form
8850 -27968766 -36417236 -22622155 -5825550 -3499150 -7132606 2743680 21866589 24370556
8842 24370556 4654834 -7855857 8060790 30062026 25569519 3558473 216772
8835 216772 20811216 32390911 17216805 -1841528 -1178099 8947318 7677119 -3790819
8827 -3790819 -14738139 -29531989 -53247401 -66842671 -47428642 -9605586 3444227
8820 3444227 -23408664 -54368814 -49970171 -18516542 -777209 -13668096 -33006177
8813 -33006177 -33436912 -22160591 -19818819 -24780805 -18406719 348833 10031288 395926
8805 395926 -10683591 -4573224 11360801 17901937 10443329 -3673088 -20890795 -37009786
8797 -37009786 -39145842 -22975553 -8845790 -17919665 -38930939 -43124684 -27473870 -15504967
8789a5504967r43130K084988J1532024L914732j1475512p157851J2856536J9286578
8781A4593398Q118254L656331J1078230P771643j0966633j8146266j531410J2388033
8773B6961580J242419j7050411j5606044j774647j081064j4027087j7318521j161684
8765c9815459J8991820K6629182K1151320R543967l766861j4797471j7815582
8758A20916j0710720P69077O830675K346676o984886r048390M0527Q450621L297129
8749d888375r442289j0917265L545371J6021662J0299133o075094j2921652m122178
8741a8500687O279250L200751j0937666j8928173q924651R902184J5841265P06280
8733b1361447j8392446j9078262k26016J9620280K6001826K0682802J2216637
$$ plain form
8789 -15504967 -16448097 -14363109 -2831085 1083647 -10391865 -17549716 -4693180 14593398
8781 14593398 22711652 26367983 37446213 45217856 34251223 16104957 14573547 26961580
8773 26961580 28203999 11153588 -4452456 -6227103 -7308167 -21335254 -38653775 -39815459
8765 -39815459 -20823639 5805543 26956863 36500830 32733969 17936498 120916
8758 120916 -10589804 -9820727 -2990052 -643376 -7628262 -16676652 -16636125 -8185504 -4888375
8749 -4888375 -14330664 -25247929 -21702558 -5680896 4618237 -1456857 -14378509 -18500687
8741 -18500687 -12221437 -9020686 -19958352 -38886525 -47811176 -37908992 -22067727 -21361447
8733 -21361447 -39753893 -58832155 -59058171 -39437891 -13436065 7246737 19463374
8726A9463374M919571j628889q959597j6066904j6568568m618907J2494383J7484736
8718F519199O530218k494855L007325R160025j013450j6559742j4983473J38317
8710i696436O388297K256952P742386K3749774K3972662k829287l0975378l2403299
8702a1794329j0972549J0579172J8640355J2762369L02877l925677Q107948J7656954
8694D1357120j851021l8138599m3870880l524689L6018319K8128874q052660j8945887
8686h879423N861624K6325589J5265600q366489j4750169l405999L990757m395646
8678A1645844j7093514j4453910O145109K3072847J5561182o470724j3255852
8671E150982L013090J8482317J5789298O758342M878169J917380r434913j5271175
$$ plain form
8726 19463374 24382945 22754056 13794459 -2272445 -18841013 -23459920 -10965537 6519199
8718 6519199 13049417 10554562 13561887 22721912 21708462 5148720 -9834753 -9696436
8710 -9696436 -3308139 -1051187 6691199 30440973 54413635 51584348 20608970 -11794329
8702 -11794329 -22766878 -12187706 6452649 19215018 19517895 15592218 23700166 41357120
8694 41357120 39506099 1367500 -42503380 -46028069 -10009750 18119124 10066464 -8879423
8686 -8879423 -3017799 23307790 38573390 30206901 15456732 12050733 16041490 11645844
8678 11645844 -5447670 -19901580 -13756471 9316376 24877558 18406834 5150982
8671 5150982 8164072 26646389 42435687 49194029 54072198 55989578 46554665 31283490
8663C1283490o054261J178220p796706j5852868m819252Q365597K50085j4974515
8655h420210r439949P243267N018725j0273724n913087J6947395K1804454L1025
8647A6997896j3205259K139964K0650695J6810698J500396o188408r047787j3100460
8639A6557735r559392L266041O838466q031990k2103025j7357818l501852L306386
8631c0585449O352924J4210810K0382408J5569178M069257o399209j4851532j6948897
8623h200510n156580J1538117J1796414m260711j2183640m326094j799994j1750370
8615b4343368j0140925J1624321K2245820K677130j4918638J420882K6449081
8608A5014303J7806350j2918402k0035676J739027J4520026K182127j1117102
$$ plain form
8663 31283490 25229229 26407449 18610743 2757875 -2061377 6304220 6554305 -8420210
8655 -8420210 -17860159 -10616892 -5598167 -15871891 -21784978 -4837583 16966871 16997896
8647 16997896 3792637 5932601 26583296 43393994 44894390 38705982 29658195 16557735
8639 16557735 6998343 10264384 17102850 9070860 -13032165 -30389983 -33891835 -30585449
8631 -30585449 -24232525 -10021715 10360693 25929871 29999128 23599919 8748387 -8200510
8623 -8200510 -13357090 -1818973 9977441 5716730 -6466910 -10793004 -12592998 -24343368
8615 -24343368 -34484293 -22859972 -614152 2062978 -12855660 -11434778 15014303
8608 15014303 32820653 19902251 -133425 1605602 16125628 18307755 7190653
8601G190653q292627j626003k259068m107477m006981o641505o448970N921497
8593b0270481J9161268J3783576k543678m817105N944602N071747r799255j3872807
8585g342133o57732O991800m52092m022823M880281P905946l829449j2244506
8577h770708o684024j692091m876220j914078R746853R195220o502355q559222
8569b0056625J1408715J7160629j1336677l3664960r288291L2169773L3668964
8562B0061528J3116j3768611P600173K1121670J144136k1639024j4714117O649676
8554F468547J0158472l420863q684257K631212J2350005L398771j7535090k5782438
8546b0415641n926838K4797045K9003973m243440l7368958k9251002P758931K4777303
$$ plain form
8601 7190653 -1101974 -2727977 -4987045 -9094522 -13101503 -19743008 -26191978 -20270481
8593 -20270481 -1109213 12674363 10130685 5313580 11258182 16329929 6530674 -7342133
8585 -7342133 -7999865 -1008065 -1460157 -5482980 -602699 7303247 3473798 -8770708
8577 -8770708 -15454732 -17146823 -22023043 -23937121 -14190268 -4995048 -11497403 -20056625
8569 -20056625 -8647910 8512719 -2823958 -36488918 -45777209 -13607436 20061528
8562 20061528 20074644 6306033 13906206 35027876 36172012 14532988 -181129 6468547
8554 6468547 16627019 13206156 4521899 7153111 19503116 22901887 5366797 -20415641
8546 -20415641 -26342479 -1545434 27458539 23215099 -14153859 -43404861 -35645930 -10868627
8538a0868627O550085j0859963L50542J8988888J3393067r222688j9781696j3555519
8530b5005911q713895r887735m071679R799322J5594448Q211946K547559O143868
8522e382077M969025r823469j9336247j879229K9061552L5691198O304629k6155824
8514A3449558k5915105N24180J6572070M647617j5491297j8085942l842834P396112
8506b0745641N048610l440218p953240p716908n843969p98525R569237J8416254
8498a3464400J3606165m296128j5116577j755480K2537370K6094147K678259j6175015
8490A4108341o127492J2803301Q325078j1176194j1123519Q327501Q974816j9702613
8482D409219l5486132p654877L0795039K9782245n092339k6048435j4025935N101010
$$ plain form
8538 -10868627 -4318542 -15178505 -14827963 4160925 17553992 8331304 -11450392 -25005911
8530 -25005911 -33719806 -43607541 -47679220 -37879898 -22285450 -14073504 -11525945 -5382077
8522 -5382077 -413052 -10236521 -29572768 -31451997 -2390445 33300753 39605382 13449558
8514 13449558 -12465547 -11941367 4630703 9278320 -6212977 -24298919 -28141753 -20745641
8506 -20745641 -15697031 -19137249 -27090489 -34807397 -40651366 -41449891 -31880654 -13464400
8498 -13464400 141765 -4154363 -19270940 -21026420 1510950 27605097 30283356 14108341
8490 14108341 7980849 20784150 29109228 17933034 6809515 15137016 24111832 4409219
8482 4409219 -31076913 -38731790 -7936751 21845494 16753155 -9295280 -23321215 -18220205
8474a8220205J0033611R604494J3416669J1380314l885445j8536821j6465059
8467a2672442j720435R424367Q598129K64582n521049j715362P803236R840798
8459A4301824j146123j2453272r887387J408711O401296L541802K380004M004881
8451H551736K155663j177673q3551P69109m276441n120866P767640J8288246N023751
8442C1897614j9056343k1195036j526483O810977o287625j3322839j227641N697286
8434a8210090n445241p144323J9111045M1728328K5013638j1978169k3634324
8427A9440864n409233P925376l17834j2769300j4074901p204391M459842J9314723
8419A1365146K2694323Q12709k9080260l2296474m732133K0127073J8063757J787209
$$ plain form
8474 -18220205 -8186594 1417900 14834569 26214883 22329438 3792617 -12672442
8467 -12672442 -14392877 -4968510 3629619 3894201 -1626848 -3342210 4461026 14301824
8459 14301824 13155701 702429 -9184958 -7776247 -1374951 2166851 4546855 8551736
8451 8551736 10707399 9529726 9446175 10215284 5938843 817977 8585617 26873863 31897614
8442 31897614 12841271 -8353765 -9880248 -3069271 -9356896 -22679735 -23907376 -18210090
8434 -18210090 -23655331 -30799654 -11688609 30039719 55053357 43075188 19440864
8427 19440864 14031631 21957007 21639173 8869873 -5205028 -12409419 -7949577 11365146
8419 11365146 34059469 34872178 5791918 -26504556 -31236689 -11109616 6954141 8741350
8411H741350o838173p534403j0831954j4865028r132685O844010J9781004J5810540
8403A974661m315449k1170797j3921047J2036945K5351828Q168219j7946274k2817000
8395c2638914r517439l18763N402991K4086303M4631166L3475142r968243m1466263
8387A3685980l1128529j937769R551034J971752l631351o79942L634221P354644
8379a179960R217929J331423j3023861j2107695J1562203L0109721J8117790o584728
8371C7442822j1083131m12611m673039k2878841k3363477j399051Q326309j0223941
8363b8264960k4807942o610769K1982380K2482094k34018r023895O690416J8714050
8355I27356O623426j3985367j8315832n239066Q570274J2680025Q830334J596905
$$ plain form
8411 8741350 1903177 -5631226 -16463180 -31328208 -40460893 -33616883 -13835879 1974661
8403 1974661 -2340788 -23511585 -37432632 -25395687 -43859 8124360 -9821914 -32638914
8395 -32638914 -42156353 -42475116 -37072125 -12985822 31645344 65120486 55152243 13685980
8387 13685980 -17442549 -19380318 -9829284 -7857532 -11488883 -12168825 -8534604 -1179960
8379 -1179960 8037969 9369392 -3654469 -15762164 -4199961 25909760 44027550 37442822
8371 37442822 26359691 25947080 21274041 -1604800 -24968277 -26367328 -18041019 -28264960
8363 -28264960 -53072902 -59683671 -37701291 -15219197 -15453215 -24477110 -17786694 927356
8355 927356 7550782 -6434585 -24750417 -29989483 -21419209 -8739184 91150 1688055
8347A688055n627319q785540n200519K972948J0546155J3298463R538656J116097
8339A9546996o128523o672327j173561N028951Q491113Q200884J732871j0905927
8331A8120477k0049384j3882490L740367J4132109Q184035j186107O55060Q577440
8323A8291507Q827580K086116o66618O78514l437350j1856579j2621444n215713
8315c913987l811841j2544855j5978871m106409R560797Q412667j564730k202829
8307b6150058R065146J7525651J3153502Q42445r308533j1335717m920644M012232
8299g115976O895837L009270Q10928K985532M42849r193772j0328731O980113
8291e513950K3854991J5780382p798774j3715811N249837J9061857O111823j6256597
$$ plain form
8347 1688055 -3939264 -12724804 -17925323 -14952375 -4406220 8892243 18430899 19546996
8339 19546996 13418473 6746146 5572585 10601536 19092649 27293533 29026404 18120477
8331 18120477 -1928907 -15811397 -12071030 2061079 10245114 9059007 9714067 18291507
8323 18291507 27119087 29205203 28538585 29217099 25779749 13923170 1301726 -3913987
8315 -3913987 -7725828 -20270683 -36249554 -40355963 -30795166 -22382499 -23947229 -26150058
8307 -26150058 -17084912 440739 13594241 14436686 5128153 -6207564 -11128208 -7115976
8299 -7115976 -220139 2789131 3600059 6585591 7028440 -2165332 -12494063 -5513950
8291 -5513950 18341041 34121423 26322649 12606838 17856675 36918532 43030355 26773758
8283B6773758k1208338j0623802m735582q706333j0379968l498167N380224J0011047
8275a6987161J0187189O246316r17708o400156o796899n853158o720056m102729
8267c1344362O445889J7301315J7978651J0685901N056790K042555l975460j0781582
8259A3409697j0364420l341688K947519Q753226J8159525K2494291P841567j7618395
8251D2281322k5818901p436102J2693244J2207894K552916L944607P807254p091342
8243D1140892l1361537l1657667k114707K2847926J7556483r01312m437047L852430
8235A4925461K580966r234292j3657077o517782j674546l201364J150809J3131756
8227b496069J4056910n644756k4637572j6199199J3334775K9848645J4880997
$$ plain form
8283 26773758 5565420 -5058382 -9793964 -18500297 -28880265 -32378432 -26998208 -16987161
8275 -16987161 -6799972 -553656 -1471364 -7871520 -14668419 -20521577 -27241633 -31344362
8267 -31344362 -24898473 -7597158 10381493 21067394 26124184 28166739 24191279 13409697
8259 13409697 3045277 -296411 2651108 11404334 29563859 52058150 59899717 42281322
8251 42281322 16462421 9026319 21719563 33927457 36480373 40424980 48232234 41140892
8243 41140892 9779355 -21878312 -23993019 -1145093 16411390 15510078 11073031 14925461
8235 14925461 17506427 8272135 -5384942 -11902724 -13577270 -16778634 -15627825 -2496069
8227 -2496069 11560841 5916085 -18721487 -34920686 -21585911 8262734 23143731
8220B3143731j1147629j6043369K446794J4459065n25230k2911403j8463340J0456977
8212a8584404K3147765o92325k5821205r996764L0102249L8217666R0533l4728897
8204A734618k3901725J1491125K4495542P471889j0030174j0112165j473872N616567
8196E291805J0018705P687247o166582k1783560k2002803o422786Q317784J2525844
8188a2534346J1401309R378542L870690l411052m875043m50657O02675n153383
8180a171265r300938l964440P537248J3899877N722339j3821505k5266444j1081343
8172c7446471J6229975K1627346m606307k7957780j8688625M150328P807191J329811
8164c7554532J3264851L1244636J8188671j6196032k0783445J0991419K2945843
$$ plain form
8220 23143731 11996102 -4047267 -1600473 12858592 12333362 -10578041 -29041381 -18584404
8212 -18584404 4563361 3871036 -21950169 -31946933 -1844684 36372982 36463515 1734618
8204 1734618 -22167107 -10675982 13819560 21291449 11261275 1149110 -324762 5291805
8196 5291805 15310510 22997757 16831175 -4952385 -26955188 -33377974 -25060190 -12534346
8188 -12534346 -1133037 8245505 12116195 8705143 3830100 3379443 3982118 -1171265
8180 -1171265 -10472203 -14436643 -6899395 7000482 12722821 -1098684 -26365128 -37446471
8172 -37446471 -21216496 410850 -4195457 -32153237 -50841862 -46691534 -38884343 -37554532
8164 -37554532 -24289681 6954955 25143626 8947594 -11835851 -844432 22101411
8157B2101411j2171672m2839479j9568486K6175490L4452316Q360350m493993
8150A2015937N241322N718525r733134j3363980P84412N687095o623301r828539
8142a0101663P807804K1699758J3676329m02328l199222l510858j2358638j9936783
$$ plain form
8157 22101411 9929739 -32909740 -52478226 -26302736 8149580 16509930 12015937
8150 12015937 17257259 22975784 13242650 -121330 663082 6350177 -273124 -10101663
8142 -10101663 -2293859 19405899 33082228 32679900 29480678 25969820 13611182 -6325601
$$ [...]
##END NTUPLES=NMR SPECTRUM
##END=
