##TITLE=31Pdec_SR146H3_Et
 D2O, 64 sc
 17.4.2023
##JCAMPDX= 6.0         $$ Bruker NMR JCAMP-DX V2.0
##DATA TYPE= NMR SPECTRUM
##DATA CLASS= NTUPLES
##ORIGIN= UXNMR, Bruker Analytische Messtechnik GmbH
##OWNER= root
$$ XWIN-NMR		Version 3.5
$$ Mon Apr 17 16:27:48 2023 Russian Standard Time (UT+4h)  she@DPX200
##.OBSERVE FREQUENCY= 81.013821
##.OBSERVE NUCLEUS= ^31P
##.ACQUISITION MODE= SIMULTANEOUS
##.ACQUISITION SCHEME= undefined
##.AVERAGES= 64
##.DIGITISER RES= 16
##SPECTROMETER/DATA SYSTEM= spect
##.PULSE SEQUENCE= zgpg30
##.SOLVENT NAME= D2O
##.SHIFT REFERENCE= (INTERNAL, D2O, 0, 248.564)
##AUDIT TRAIL= $$ (NUMBER, WHEN, WHO, WHERE, WHAT)
$$ ##TITLE= Audit trail, XWIN-NMR		Version 3.5
$$ ##JCAMPDX= 5.01
$$ ##ORIGIN= Bruker BioSpin GmbH
$$ ##OWNER= she
$$ F:/spectra/data/she/nmr/P31/1/pdata/1/auditp.txt
$$ ##AUDIT TRAIL=  $$ (NUMBER, WHEN, WHO, WHERE, WHAT)
(   1,<2023-04-17 16:26:48.35 +0400>,<she>,<DPX200>,
      <continue with go, POWCHK disabled, PULCHK disabled
       configuration hash MD5:
       00 E9 B6 7A A2 85 ED C7 34 08 36 98 17 FE 4E 26
       data hash MD5: 32K
       36 41 6A FF 91 37 04 B8 03 5F 7E 96 7D 09 1A 79>)
(   2,<2023-04-17 16:26:50.75 +0400>,<she>,<DPX200>,
      <Start of raw data processing
       efp BC_mod = 2 LB = 1 FT_mod = 6 PKNL = 1 PHC0 = -11172.78 PHC1 = 554.285 SI = 64K 
       data hash MD5: 64K
       C8 F1 1D A4 BC 2F B3 98 F8 11 04 82 22 D1 6C A3>)
(   3,<2023-04-17 16:27:03.57 +0400>,<she>,<DPX200>,
      <pk PHC0 = -18.21021 PHC1 = -18.4 
       data hash MD5: 64K
       9E ED 24 C5 E0 A9 9D 73 DA 34 84 DA 61 F3 8A E9>)
(   4,<2023-04-17 16:27:08.28 +0400>,<she>,<DPX200>,
      <abs ABSG = 5 
       data hash MD5: 64K
       5B FE A6 71 97 DB D3 86 64 AC 4F 7F 28 69 A5 EF>)
$$ ##END=
$$ 
$$ hash MD5
$$ 0D D7 E9 CB 69 AC 1C A5 09 57 08 E8 7E 73 C0 8A
##$RELAX= 
##$RELAX= 
##$RELAX= 
##$RELAX= 
##$RELAX= 
##$RELAX= 
##$RELAX= 
##$RELAX= 
##$RELAX= 
$$ Bruker specific parameters
$$ --------------------------
##$DU= <F:/spectra>
##$EXPNO= 1
##$NAME= <P31>
##$PROCNO= 1
##$TYPE= <nmr>
##$USER= <she>
##$AMP= (0..31)
100 100 100 100 100 100 100 100 100 100 100 100 100 100 100 100 100 100 
100 100 100 100 100 100 100 100 100 100 100 100 100 100 
##$AQSEQ= 0
##$AQ_mod= 1
##$AUNM= <au_zg>
##$AUTOPOS= <>
##$BF1= 81.014009
##$BF2= 200.13
##$BF3= 200.13
##$BF4= 200.13
##$BF5= 200.13
##$BF6= 200.13
##$BF7= 200.13
##$BF8= 200.13
##$BYTORDA= 1
##$CFDGTYP= 0
##$CFRGTYP= 5
##$CHEMSTR= <none>
##$CNST= (0..31)
1 1 145 1 1 1 1 1 1 1 1 1 1 1 1 1 1 1 1 1 1 1 1 1 1 1 1 1 1 1 1 1 
##$CPDPRG= <waltz16>
##$CPDPRG1= <>
##$CPDPRG2= <waltz16>
##$CPDPRG3= <>
##$CPDPRG4= <mlev>
##$CPDPRG5= <mlev>
##$CPDPRG6= <mlev>
##$CPDPRG7= <mlev>
##$CPDPRG8= <mlev>
##$CPDPRGB= <>
##$CPDPRGT= <>
##$D= (0..31)
0 1 0 0 0 0 0 0 0 0 0 0.03 2e-05 3e-06 0 0 0 0 0 0 0 0 0 0 0 0 0 0 0 0 
0 0 
##$DATE= 1681734324
##$DBL= (0..7)
120 120 120 11 120 120 24 19 
##$DBP= (0..7)
150 150 150 150 150 150 150 150 
##$DBP07= 0
##$DBPNAM0= <>
##$DBPNAM1= <>
$$ [...]
##$SUBNAM3= <"">
##$SUBNAM4= <"">
##$SUBNAM5= <"">
##$SUBNAM6= <"">
##$SUBNAM7= <"">
##$SUBNAM8= <"">
##$SUBNAM9= <"">
##$SW= 501.771253377433
##$SWIBOX= (0..15)
0 1 3 0 0 0 0 0 0 0 0 0 0 0 0 0 
##$SW_h= 40650.406504065
##$TD= 32768
##$TD0= 1
##$TE= 0
##$TE2= 300
##$TE3= 300
##$TEG= 300
##$TL= (0..7)
0 120 53 12 22 120 120 120 
##$TP= (0..7)
150 150 150 150 150 150 150 150 
##$TP07= 0
##$TPNAME0= <>
##$TPNAME1= <>
##$TPNAME2= <>
##$TPNAME3= <>
##$TPNAME4= <>
##$TPNAME5= <>
##$TPNAME6= <>
##$TPNAME7= <>
##$TPOAL= (0..7)
0.5 0.5 0.5 0.5 0.5 0.5 0.5 0.5 
##$TPOFFS= (0..7)
0 0 0 0 0 0 0 0 
##$TUNHIN= 0
##$TUNHOUT= 0
##$TUNXOUT= 0
##$USERA1= <user>
##$USERA2= <user>
##$USERA3= <user>
##$USERA4= <user>
##$USERA5= <user>
##$V9= 5
##$VALIST= <valist>
##$VCLIST= <CCCCCCCCCCCCCCC>
##$VD= 0
##$VDLIST= <DDDDDDDDDDDDDDD>
##$VPLIST= <PPPPPPPPPPPPPPP>
##$VTLIST= <TTTTTTTTTTTTTTT>
##$WBST= 1024
##$WBSW= 4
##$XGAIN= (0..3)
0 0 0 0 
##$XL= 0
##$YL= 0
##$YMAX_a= 3016
##$YMIN_a= -4755
##$ZGOPTNS= <>
##$ZL1= 120
##$ZL2= 120
##$ZL3= 120
##$ZL4= 120
##$ABSF1= 248.5645
##$ABSF2= -253.2056
##$ABSG= 5
##$ABSL= 3
##$ALPHA= 0
##$AQORDER= 0
##$ASSFAC= 0
##$ASSFACI= 0
##$ASSFACX= 0
##$ASSWID= 0
##$AUNMP= <proc_1d>
##$AZFE= 0.1
##$AZFW= 0.5
##$BCFW= 0
##$BC_mod= 2
##$BYTORDP= 0
##$COROFFS= 0
##$CY= -3
##$DATMOD= 1
##$DC= 0
##$DFILT= <>
##$DTYPP= 0
##$F1P= 0
##$F2P= 0
##$FCOR= 1
##$FTSIZE= 65536
##$FT_mod= 6
##$GAMMA= 0
##$GB= 0
##$INTBC= 1
##$INTSCL= 6.047779e-11
##$ISEN= 30
##$LB= 1
##$LEV0= 0
##$LPBIN= 0
##$MAXI= 10000
##$MC2= 0
##$MEAN= 0
##$ME_mod= 0
##$MI= 50
##$NCOEF= 0
##$NC_proc= -9
##$NLEV= 6
##$NOISF1= 182.463
##$NOISF2= 159.3651
##$NSP= 0
##$NTH_PI= 0
##$NZP= 0
##$OFFSET= 248.5645
##$PC= 4
##$PHC0= -11190.99
##$PHC1= 535.8849
##$PH_mod= 1
##$PKNL= yes
##$PPARMOD= 0
##$PSCAL= 0
##$PSIGN= 0
##$REVERSE= no
##$SF= 81.0140089999694
##$SI= 65536
##$SIGF1= 159.3651
##$SIGF2= -187.1042
##$SINO= 113.3802
##$SIOLD= 16384
##$SREGLST= <1H.CDCl3>
##$SSB= 0
##$STSI= 65536
##$STSR= 0
##$SW_p= 40650.406504065
##$SYMM= 0
##$S_DEV= 0
##$TDeff= 32768
##$TDoff= 0
##$TI= <>
##$TILT= no
##$TM1= 0
##$TM2= 0
##$TOPLEV= 0
##$USERP1= <user>
##$USERP2= <user>
##$USERP3= <user>
##$USERP4= <user>
##$USERP5= <user>
##$WDW= 1
##$XDIM= 65536
##$YMAX_p= 469183333
##$YMIN_p= -76828848
$$ End of Bruker specific parameters
$$ ---------------------------------
##NTUPLES= NMR SPECTRUM
##VAR_NAME=  FREQUENCY,     SPECTRUM/REAL,   SPECTRUM/IMAG
##SYMBOL=    X,             R,               I
##VAR_TYPE=  INDEPENDENT,   DEPENDENT,       DEPENDENT
##VAR_FORM=  AFFN,          ASDF,            ASDF
##VAR_DIM=   65536,         65536,           65536
##UNITS=     HZ,            ARBITRARY UNITS, ARBITRARY UNITS
##FACTOR=    0.620285442955139, 1,           1
##FIRST=     20137.2065510682, 0,            0
##LAST=      -20513.1999529968, 0,           0
##MIN=       -20513.1999529968, -76828848,   0
##MAX=       20137.2065510682, 469183333,    0
$$ Real data points
##PAGE= N=1
##DATA TABLE= (X++(R..R)), XYDATA
$$ [...]
39839C3645073q072903r478585J674571R501103J933264j1748828j4612133o037505
39831c195943Q46181J552720M312858J0582449Q339448o737459j7485122p303419
39823i088287J2239402J4007460n764509k0312412j0192261R359412J1999770
39816B248575k116510j0749191m707854K526516P97701j703677L373523Q541755
39808a789162M279894l810196n043362j953159m212207r584931n785874R409593
39800a8489404K2525994K0901211N901164j1790216k2149104j9748400n875132
39793b8723887R677476J4480470N315541p821832j1303517o33184J5601650K3089241
39785A9681958J4820641j597740j1819843j0429568m252722J43316L687757O423992
$$ y = [33645073, 25572170, 16093585, 17768156, 27269259, 29202523, 17453695, 2841562, -3195943, -2349762, -797042, 3515816, 14098265, 22437713, 15700254, -1784868, -9088287, 3151115, 17158575, 11394066, -8918346, -19110607, -9751195, 2248575, 132065, -10617126, -15324980, -12798464, -12000763, -13704440, -10330917, -1789162, 2490732, -1319464, -6362826, -8315985, -12528192, -22113123, -27898997, -18489404, 4036590, 24937801, 30838965, 19048749, -3100355, -22848755, -28723887, -19046411, -4565941, 749600, -7072232, -18375749, -19008933, -3407283, 19681958, 34502599, 32904859, 21085016, 10655448, 6402726, 6546042, 10233799, 16657791]
39777A6657791K937989o105325q715279O40799P994734j04354j1927021n867445
39769d488111J3670279J9082138J032252j6207477j0448792P411415J2525697
39762B2577401J282496r517293r407267l469800J038182L054813L557342L325401
39754A2441275M420104O811221N701817j505846r099027j0386693o929357l728779
39746b275285m53981M421850O206200Q33725n059841k194600N720623O258614
39738A3457305k433900q509283m195263M070996O452859J765160m625791p449473
39730a467390l469494N812837J1184108L775808j0722827j4860076j788742J3338612
39722A802836J2010754l437118j3342663o144960Q445217J3261386M559896n262013
$$ y = [16657791, 19595780, 13490455, 4775176, 5415975, 13410709, 13306355, 1379334, -4488111, 9182168, 28264306, 29296558, 13089081, 2640289, 10051704, 22577401, 23859897, 14342604, 4935337, 1465537, 2503719, 5558532, 9115874, 12441275, 16861379, 23672600, 29374417, 27868571, 18769544, 8382851, 1453494, -2275285, -2729266, 1692584, 7898784, 8732509, 3672668, 1478068, 7198691, 13457305, 11023405, 2514122, -1681141, 2389855, 8842714, 10607874, 5982083, -1467390, -4936884, 875953, 12060061, 15835869, 5113042, -9747034, -11535776, 1802836, 13813590, 10376472, -2966191, -9111151, -665934, 12595452, 17155348, 11893335]
39714A1893335m400154L399044M511906m997628j2767850p829280K192552K073506
39706e924569o481774n989674Q829427J9867297J1352532o227081j1543274k921350
39698I61534L171139L8157j393659N228742R520576K723292o043977m261899L018936
39689A2962841J305492r261047j3449470m449822O694640Q918488N577123M418195
39681A2716440M188235P16885k076865J349695O063161K969150n653632q762477
39673A1510592l351293L214364P021985J0576824J1074320R37787j5466199k1125241
39665D393139j0421898N25861j927525q270887l160378Q882569J2354981O360351
39657H736213K354323K207226j565117o746947l232499O234249P635172Q9933
$$ y = [11893335, 7493181, 10892225, 15404131, 10406503, -2361347, -10190627, -7998075, -5924569, -12406343, -18396017, -9566590, 10300707, 21653239, 15426158, 3882884, 961534, 4132673, 4170830, 2777171, 8005913, 17526489, 20249781, 14205804, 9943905, 12962841, 14268333, 5007286, -8442184, -12892006, -6197366, 2721122, 8298245, 12716440, 16904675, 17621560, 15544695, 16894390, 22957551, 25926701, 20273069, 11510592, 8159299, 11373663, 18395648, 28972472, 40046792, 40984579, 25518380, 4393139, -6028759, -5502898, -7430423, -15701310, -18861688, -9979119, 2375862, 8736213, 11090536, 13297762, 11732645, 4985698, 1753199, 7987448, 15622620, 15712553]
39649A5712553j938877N011751O357386l770784j0223263k740130N809694J854070
39641A6072400n997302l970421K240750j79789o277823k681628O298607M695895
39633A0200689o722092j0086287J316549J3927966J5274730P420678l283895j3526147
39625A4522191j7068339p761297O812197J0090280N13886m504914M249474J2328596
39617A9182074M430483j0601009j2306367J861234J4660043J3727238M669669
39610C5623365j483064l089223n478139r595323r142228L78837J2688320J4967482
39602C4870027L074014j1375461j4147469n712174J558178J394148p27215k77473
39594H656575q26822m255689m080352L971719J2187012J0327548K13753p488480
$$ y = [15712553, 13773676, 18785427, 25142813, 21372029, 11148766, 8408636, 14218330, 16072400, 10075098, 6104677, 8345427, 8165638, 1887815, -793813, 5504794, 10200689, 3478597, -6607690, -5291141, 8636825, 23911555, 31332233, 28048338, 14522191, -2546148, -10307445, -3495248, 6595032, 7108918, 2604004, 6853478, 19182074, 23612557, 13011548, 705181, 2566415, 17226458, 30953696, 35623365, 34140301, 31051078, 25572939, 15977616, 6835388, 7214225, 19902545, 34870027, 37944041, 26568580, 12421111, 6708937, 8267115, 9661263, 8934048, 8656575, 7829753, 3574064, -506288, 3465431, 15652443, 25979991, 26193744, 18705264]
39586A8705264q045303n864014m216506n55302N771443Q380309K047415p106155
39578I117151o553412N786370J5508611Q551067r001496j6912642p176354O208551
39570E527846Q247556K205153j062344k001642o768414j0745365m527049P614768
39562a509491J2389788Q570986N962007N016901k316521j1077255n971704R841470
39554B0906181J3389308j636571j2280739l826652N557574k922001j5663472j1291875
39546g768247J894138L356223m92517J0430672K6579074J7683231j4476570l0558887
39538F647117j1075033J4282312J1676635r696872j7102482j919073J5170850
39531G983454J6429064M736733o896418r356778k430932N999933P542775K849600
$$ y = [18705264, 10659961, 4795947, 579441, 24139, 5795582, 14175891, 16223306, 9117151, 2563739, 8350109, 23858720, 32409787, 23408291, 6495649, -680705, 5527846, 13775402, 15980555, 14918211, 12916569, 6148155, -4597210, -9124259, -1509491, 10880297, 19451283, 25413290, 30430191, 28113670, 17036415, 11064711, 20906181, 34295489, 32658918, 20378179, 16551527, 22109101, 19187100, 3523628, -7768247, -5874109, -2517886, -3010403, 7420269, 33999343, 51682574, 37206004, 6647117, -4427916, 9854396, 21531031, 11834159, -5268323, -7187396, 7983454, 24412518, 29149251, 22252833, 12896055, 10465123, 16465056, 24007831, 26857431]
39523B6857431j421023m447629r558408j1509741j428677J3033721J1678128p088752
39515A6115050j9025126q846881P702498J0906450O152858P082683Q388743p33616
39507B7742659j1019041p852399j46248n530701j5145726n632793J7207287K1930540
39499B1553578K181261j1434343r65359J0928667O26043j7855738j7654498o32591
39491a3252980J1265954J0588518N787124J42646o814064o375535P071930J8250726
39483B6664319R332550r589638j3112590M9514O745806j714322q405954l561060
39475F408625o67763q757775j3517057k088555J3047513J3032976O16868q431384
39467c56552r755279q789530n023986L908080J0108272N375119k416532l14008
$$ y = [26857431, 25436408, 20988779, 11430371, -79370, -1508047, 11525674, 23203802, 16115050, -2910076, -11756957, -4054459, 6851991, 13004849, 20087532, 28476275, 27742659, 16723618, 8871219, 8724971, 3194270, -11951456, -17584249, -376962, 21553578, 23734839, 12300496, 11335137, 22263804, 22889847, 5034109, -12620389, -13252980, -1987026, 8601492, 14388616, 14531262, 7717198, 1341663, 8413593, 26664319, 35996869, 26407231, 13294641, 13344155, 20089961, 18375639, 9969685, 6408625, 5740862, -3016913, -16533970, -18622525, -5575012, 7457964, 8074832, -356552, -10111831, -18901361, -23925347, -20017267, -9908995, -4533876, -6950408, -7264416]
39459g264416P411804O400097k136338l326355M339621N595127l936085p848187
39451g64732M009832J6727673J1807211n685486j5916262j1714673l195725J84864
39443d547298p04978j519170o72639J773816M692570N516720M049560M591723
39435A3180304R077150J1023667L362254r170659j3397850m770313N729458N344936
39427B0378947m305236r951003m318331M400421L765577n431902r260413N69838
39419d152102J4778114J8597409J0496165R84689l714201o566003q959804o442696
39411A5021571J574213P559324O269338J785590n23520j861079m979107q156435
39403A6689895r110649q481198n418556K468133J0569839Q773592j971195n822785
$$ y = [-7264416, 147388, 6547485, 4411147, 1084792, 5424413, 11019540, 7083455, -764732, 3245100, 19972773, 31779984, 26094498, 10178236, -1536437, -4732162, -4547298, -5252276, -6771446, -7444085, -5670269, -977699, 4539021, 8588581, 13180304, 22257454, 33281121, 36643375, 27472716, 14074866, 9304553, 15034011, 20378947, 16073711, 6122708, 1804377, 6204798, 9970375, 4538473, -4721940, -4152102, 10626012, 29223421, 39719586, 40704275, 36990074, 30424071, 21464267, 15021571, 16595784, 24155108, 30424446, 32210036, 31686516, 29825437, 24846330, 16689895, 7579246, -901952, -6320508, -3852375, 6717464, 15491056, 13519861, 7697076]
39395G697076N263439J5957898Q640621q563270j2523851J924P738972k196419
39387B2016390j4668768q988823J1030199K2012649J2146021l801372m283858
39380C5462438R931518J5544178q96236j9974525j3134506J3714156K2122428
39373F2769451n183113l5012320k7710602O552170K2773234M061530k0670059
39366G580291k2505162o693625O915513J1871041J0557653K321296q817966j0555429
39358i326388o79523M925856l708373j2760484o186869Q069785J1541548M354029
39350c770419R73167L923568K564168m841950p919408l673435j030875k982945
39342a6758129q11048Q471489J3419743M894954q944697j2761229k785437J0832317
$$ y = [7697076, 12960515, 28918413, 37559034, 28995764, 16471913, 16473837, 24212809, 22016390, 7347622, -1641201, 9388998, 31401647, 43547668, 39746296, 35462438, 45393956, 60938134, 60041898, 40067373, 26932867, 40647023, 62769451, 57586338, 22574018, -5136584, 1415586, 24188820, 28250350, 7580291, -14924871, -21618496, -14702983, -2831942, 7725711, 10047007, 1229041, -9326388, -10005911, -5080055, -8788428, -21548912, -27735781, -19665996, -8124448, -3770419, -2797252, 1126316, 3690484, -1151466, -9070874, -12744309, -13775184, -16758129, -17569177, -9097688, 4322055, 9217009, 272312, -12488917, -15274354, -4442037]
39334d442037J5879715Q120117o276238j5230971j1576266j305218L113314j471569
39326a3189153n428807n01197Q820543J2165461P148996J305080J546813N733581
39318A7601317N997967p81962q135789p724485m40049M858700L747717P76150
39310A5899566k68423k108881n212035k872951O437556J1038201K501091p598573
39302A7815551k979739J0549782J2367253l03302q139052j882826L236635m868370
39294B5795932j3695315q327554J641754j833258j3296613j1616969M486825J3104945
39286c740253M103365n228031J148178J2433456R030413o067131j1644002M74015
39278E10010J5071265J5938464N202253m947800r586019j1763005j1933488o737164
$$ y = [-4442037, 11437678, 19557795, 13281557, -1949414, -13525680, -14830898, -11717584, -13189153, -18617960, -19119157, -10298614, 1866847, 9015843, 10320923, 11867736, 17601317, 23599284, 22817322, 14681533, 6957048, 6516999, 11375699, 15123416, 15899566, 15631143, 13522262, 8310227, 5437276, 11874832, 22913033, 25414124, 17815551, 14835812, 25385594, 37752847, 37449545, 29310493, 27427667, 30664302, 25795932, 12100617, 3773063, 5414817, 3581559, -9715054, -21332023, -16845198, -3740253, 363112, -4864919, -3716741, 8716715, 17747128, 11679997, 35995, 510010, 15581275, 31519739, 36721992, 31774192, 22188173, 10425168, -1508320, -8245484]
39270h245484K336733P598780N142575K12007j126616q95611m506938j0108316
39262i592870r272868J218806J3445760J6383911P398807n396904j0635063l843126
39254b93547P769238J1664266L733908o253929o852491K15014L820103p7290m643823
39245I081449m857751l498855j984720L364982J0505122Q769249m347986j3950902
39237C080588o863918Q614618J5310631J1736575Q031411L841079r119925k4066080
39229A0564979k2031015k868417R074882O10162r847413k682881J0949304Q743671
39221B513272n048118p261721N299777J1621306K100093p093885k628832N186676
39213D688568K411791n334725m974017J255732J632901m014280n223409N03162
$$ y = [-8245484, -5908751, 1690029, 6832604, 7044611, 5917995, 5022384, 515446, -9592870, -18865738, -17646932, -4201172, 12182739, 19581546, 14184642, 3549579, -293547, 7475691, 19139957, 22873865, 16619936, 9767445, 9982459, 13802562, 13725272, 9081449, 4223698, 724843, -1259877, 2105105, 12610227, 21379476, 17031490, 3080588, -3783330, 4831288, 20141919, 31878494, 39909905, 43750984, 34631059, 10564979, -11466036, -14334453, -5259571, -4649409, -14496822, -17179703, -6230399, 2513272, -2534846, -9796567, -4496790, 7124516, 9224609, 2130724, -498108, 4688568, 7100359, 1765634, -3208383, -1952651, -319750, -4334030, -9557439, -9054277]
39205i054277M475328J924649j711717r02822L402003Q812896J4204540J5483460
39197C6634060P488786o349007j4069720r883392k436332k293455o376665l269722
39189e55447Q035265J4620898P932980k925425l846613L464211M407384n144696
39181B5988557j1541016n174088L191700r91p220468j287146J4085668J6614369
39173C4656585L99752j3369673q896472J674406J328270m967563m089859O84650
39165G420096K18495J211411J2435088J9604120L414726k2297990k3200745K711968
39157A517169J8843958N827522j0221871k970965J1828862O108818j2301760j3999039
39149D632694L180477J3166871M612180o113966o219616l213121m426861l537484
$$ y = [-9054277, -4578949, -2654300, -4366017, -5268839, -1866836, 6946060, 21150600, 36634060, 44122846, 37773839, 23704119, 13820727, 11384395, 9090940, 2714275, -555447, 7479818, 22100716, 30033696, 27108271, 23261658, 26725869, 31133253, 25988557, 14447541, 9273453, 12465153, 12464162, 5243694, 3956548, 18042216, 34656585, 35056337, 21686664, 12790192, 14464598, 15792868, 10825305, 6735446, 7420096, 7638591, 8850002, 21285090, 40889210, 44303936, 22005946, -1194799, 1517169, 20361127, 26188649, 15966778, 12995813, 24824675, 30933493, 18631733, 4632694, 7813171, 20980042, 25592222, 19478256, 13258640, 10045519, 5618658, 2081174]
39141B081174L118890N872400j669187r807554p261854K318083P584363M670109
39133F906424k276408q057877p910510N07458J1440432J4552590Q030798M56693
39125B3649600k815063m997833o883656l537793K801147J180739q172049p964207
39117f739115R133876K2544654J1508724j0679873j3548768M852708J5185132
39110C2257338K013453j4079477j0252439M381245N794691p695554j5460636o310518
39102i351897Q311008J3481298Q502584J734557j396792k67057L314035M520787
39094B8848523j358724j0570479j1354738J146598J4547010J1525473q109280
39087B4674383k4759742k0877831o90344J5513256J4004038K25084j0467135r955623
$$ y = [2081174, 5200064, 11072464, 9403277, -404277, -7666131, -5348048, 2236315, 6906424, 4630016, -3427861, -11338371, -10830913, 609519, 15162109, 23192907, 23649600, 20834537, 15836704, 8953048, 5415255, 8216402, 9397141, 1225092, -6739115, 2394761, 24939415, 36448139, 25768266, 12219498, 17072206, 32257338, 34270791, 20191314, 9938875, 14320120, 20114811, 12419257, -3041379, -9351897, -1040889, 12440409, 20942993, 22677550, 21280758, 21013701, 24327736, 28848523, 27489799, 16919320, 5564582, 6711180, 21258190, 32783663, 24674383, -85359, -20963190, -21653534, -6140278, 7863760, 8088844, -2378291, -12333914]
39079a2333914k855768K308641K954857K639787M734578Q689024J1357629R464082
39071B6958916J606824r062337j4617876r219469K529270Q618850L726953m241554
39063F299577n637571j932181l87108m77785L880957J0028395P495976l510389
39055A5759871q010416J187062R037154m34270j7296027j7609782J201717J6048973
39047a15718J1902870J157901R81576P753749P498950k37468n169178n620571
39039A8152111q066609j0788591n383532N241776P688328M44027j611625P581170
39031A3257055J2064360j633315k0168890k0350660k496584J1350709R582584
39024A605259L063426L216253N524796J957581l920189m290409n07457P14350
$$ y = [-12333914, -15189682, -12881041, -9926184, -7286397, -2551819, 6137205, 17494834, 26958916, 28565740, 19503403, 4885527, -4333942, -1804672, 6814178, 10541131, 6299577, 662006, -1270175, -1657283, -2135068, 1745889, 11774284, 19270260, 15759871, 7749455, 8936517, 17973671, 17539401, 243374, -17366408, -16164691, -115718, 11787152, 12945053, 13926629, 21680378, 29179328, 28941860, 23772682, 18152111, 10085502, -703089, -6086621, -844845, 6843483, 7287510, 5675885, 13257055, 25321415, 23688100, 3519210, -16831450, -19328034, -7977325, 1605259, 4668685, 7884938, 13409734, 15367315, 11447126, 7156717, 6649260, 7363610]
39016G363610j387433k898211l367931m709629n514412l698266j500440j061707
39008a6774419J022613P058394J0345992L599996p428629r770682k182021L222737
39000a0906019J32960k626212M147991J5369232J8452430Q612048p935731k0551679
38992D695020j9951529m580411J3338269J5749259L26135j2932974o314767J0497578
38984H26580J2778475m486550j9310146j3283354M327143J1400221K379835q108348
38976a3476144o844502L428538J1154423R490761O51672p569035p645590N05041
38968a0304836O663802L48171j3706069j7196605j301403J8457790K0128495M323267
38960G412612p211695k228101O948478M419343o542499j2136745r219469m612064
$$ y = [7363610, 5976177, 3077966, -289965, -4999594, -10514006, -14212272, -15712712, -16774419, -15751806, -8693412, 1652580, 5252576, -2176053, -11946735, -14128756, -10906019, -10773059, -13399271, -9251280, 6117952, 24570382, 33182430, 25246699, 4695020, -15256509, -19836920, -6498651, 9250608, 9576743, -3356231, -9670998, 826580, 13605055, 9118505, -10191641, -23474995, -19147852, -7747631, -5367796, -13476144, -20320646, -16892108, -5737685, 3753076, 4404748, -3164287, -10809877, -10304836, -3641034, -3292863, -16998932, -34195537, -35496940, -17039150, 3089345, 7412612, 200917, -2027184, 4921294, 9340637, 2798138, -9338607, -18558076, -23170140]
38952b3170140j23232O836351J1361261N733430m292658l975549O776568J0027127
38944I173158l629558j9395958j8567334l271423R779411J1874219P560072L020960
38936c456453K5234r98819j04530R75619J319857J933395J997870o64266l387757
38927b359850r91411L118627p66095j0638350j0814378L496516J4444720P357391
38919B847170n748762n678315L072841K298611p496404q843228J881727R784714
38911g881646Q160930O160020O606427J49582j1779088j1859748M348690J6094393
38903I999560Q096213n297812l512085Q163737R043900m825713j7695929j7305061
38895a3333190n577816Q951704J6308204Q352121j0307481k0543868j0537550
$$ y = [-23170140, -23293372, -16457021, -5095760, 637670, -3654988, -7630537, -853969, 9173158, 5543600, -13852358, -32419692, -35691115, -25911704, -14037485, -6477413, -3456453, -3431219, -4430038, -4534568, -3558949, -2239092, -305697, 1692173, 1027907, -2359850, -3351261, -232634, -998729, -11637079, -22451457, -18954941, -4510221, 2847170, -2901592, -8579907, -5507066, -3208455, -10704859, -19548087, -17666360, -7881646, 279284, 6439304, 13045731, 13195313, 1416225, -10443523, -6094833, 9999560, 18095773, 12797961, 9285876, 17449613, 26493513, 21667800, 3971871, -13333190, -18911006, -9959302, 6348902, 14701023, 4393542, -16150326, -26687876]
38888b6687876P039435J2720142P130714M013435M138354k704857j2873533r766871
38880a6991057O818194J4378831K9281j8880871j8952083k261440J0153806P893503
38872a7811836N22378N69887Q191131J3357355P725616n898380j4581939q746015
38864a6671803N115072J1240879M974899k397055k033031J98117l060023n758592
38856h391537J311188J2106162J1470367j750583j1221658n543863O774195J0272727
38848A5026998K627954n502573o763952n320260p628855j0626828m960850R585330
38840a3563036J8382152Q659982j0831775j7560055m796535Q711111O082356l119102
38832h034902K04307J2415869J2056661m872728j6608632q331862O888163J0781699
$$ y = [-26687876, -19648441, -6928299, 202415, 4215850, 8354204, 5649347, -7224186, -16991057, -10172863, 4205968, 4235249, -14645622, -33597705, -35859145, -25705339, -17811836, -17289458, -16719571, -8528440, 4828915, 12554531, 6656151, -7925788, -16671803, -11556731, -315852, 4659047, 2261992, 228961, 427078, -2632945, -8391537, -7080349, 5025813, 16496180, 14745597, 3523939, -2019924, 4754271, 15026998, 17654952, 12152379, 5388427, 68167, -7560688, -18187516, -23148366, -13563036, 4819116, 13479098, 2647323, -14912732, -19709267, -10998156, -4915800, -8034902, -7830595, 4585274, 16641935, 11769207, -4839425, -13171287, -6283124, 4498575]
38824D498575O000215M320014L316608n343499j3738007o528225J0852774J5318594
38816A8697049K39415j4085927j0893988O21863L959772M12888R26360M428745
38808D306177J769692m078807M96293J6712739K6395063J4485711j0135443k4285699
38800B5665726j7753313l675646j29086o899609p487963N943736J9131525J4415855
38792B9211225m101472j6051156j2552303m323222j154062J055739O903148R671380
38784H659277K855511p273968j0809028p322659j246645O263610J1988987Q397759
38776A1512844k527953n415578N428452J2362070Q85743j3568939q010836R360338
38768A0026141J0519412p007052j6565586o188883M542993K6467p358870k951306
$$ y = [4498575, 10498790, 14818804, 18135412, 12791913, -946094, -7474319, 3378455, 18697049, 18936464, 4850537, -6043451, -5421588, -1461816, -1048928, -122568, 4306177, 6075869, 1997062, 2493355, 19206094, 45601157, 60086868, 49951425, 25665726, 7912413, 4236767, 4107681, -2791928, -10279891, -4336155, 14795370, 29211225, 25109753, 9058597, -3493706, -7816928, -8970990, -7915251, -1012103, 8659277, 11514788, 4240820, -6568208, -13890867, -15137512, -8873902, 3115085, 11512844, 8984891, 3569313, 8997765, 21359835, 22245578, 8676639, 665803, 10026141, 20545553, 13538501, -3027085, -9215968, -4672975, -4646508, -12005378, -14956684]
38760a4956684M774366K378630m107766j923444N889177Q755703P195899O204570
38752A4210451J535149r899732j6298119o149896J0976610J6874794J0700865
38745B1950122M446368k09790r790245j8516733j2506062N472793J6227676J1616725
38737A8690854L049551l04963k755670o865853o178627o49135j211029r211338
38729e436210q866892O634958J7666337M727153j8839298k1739578J745817K3357981
38721g49732J8378966m943638j9998120j4023234K887160J4219299J3636419O629497
38713A6036617J666005J506186K045153j145842o645382r247504o946702k807286
38705e538755N1114K208573N651362R761197J0892626N860902l377303q716540
$$ y = [-14956684, -10182318, -7803688, -11911454, -13834898, -7945721, 809982, 8005881, 14210451, 15745600, 5845868, -10452251, -16602147, -5625537, 11249257, 21950122, 26396490, 26186700, 16396455, -2120278, -14626340, -9153547, 7074129, 18690854, 21740405, 21435442, 18679772, 11813919, 5635292, 4986157, 3775128, -5436210, -14303102, -7668144, 9998193, 14725346, -4113952, -25853530, -24107713, -749732, 17629234, 12685596, -7312524, -21335758, -18448598, -4229299, 9407120, 16036617, 17702622, 19208808, 21253961, 20108119, 13462737, 4215233, -2731469, -5538755, -5487641, -3279068, 2372294, 12133491, 23026117, 28887019, 25509716, 16793176]
38697A6793176l397426P186456P691682p627937k2272077j5378471Q766867K2695550
38689A4457820J1139137r583429j6176325q815304l004542k170824K024795P491925
38681d636747K278145j1220110j4225561m14816J2507050R848352J047799J098023
38673c717865O411774N013057j198127j665531L242322M208189o22631n156299
38665F514889o477825m597741K311816J0738798Q959370m977814j2999882j572136
38657b100525J4346410J2242341l082464r448440l889942k034996o213458m212897
38649d393971J832297k632482j1702407k047078K3994438L2861288J0336890j4875887
38641C3373088j5414933k911543n85847n794931m456481J76450j033371j580237
$$ y = [16793176, 13395750, 20582206, 28273888, 20645951, -1626126, -17004597, -8237730, 14457820, 25596957, 16013528, -162797, -8978101, -11982643, -14153467, -12128672, -4636747, -2358602, -13578712, -27804273, -28219089, -15712039, -5863687, -4815888, -3717865, 2693909, 7706966, 6508839, 4843308, 8085630, 12293819, 11671188, 6514889, 37064, -4560677, -2248861, 8489937, 17449307, 12471493, -528389, -2100525, 12245885, 24488226, 21405762, 11957322, 8067380, 6032384, -181074, -4393971, -2561674, -5194156, -16896563, -18943641, 5050797, 37912085, 48248975, 33373088, 17958155, 15046612, 14460765, 8665834, 4209353, 4385803, 3352432, 1772195]
38633A772195O017476J0672823J783124q077208l627640N308631J578654q055418
38625G372637n983533M174047N629862j390873l993850k390933n456438q786763
38617a0825844k945338M477030J012534m936318K275059J4649076J2685503Q87143
38609A7278845o17448N735706o05408j7955669k1994719p497261M242293L879143
38601a7534518N502265J3285840J1335531l344222j0901151l374961K400963j343011
38593c973264K03863R638842M481571k0525098l3048727j2150057J3625982R830887
38585c1916001q623275m202774J9817487K5277696J610960j8603941j0691630
38578b7331478R790730J6678210Q739195Q86240j770690m602371p834115n256779
$$ y = [1772195, 7789671, 18462494, 20245618, 12168410, 8540770, 13849401, 15428055, 7372637, 1389104, 5563151, 11193013, 9802140, 5808290, 3417357, -2039081, -10825844, -13771182, -9294152, -8281618, -13217936, -10942877, 3706199, 16391702, 17278845, 16661397, 22397103, 21791695, 3836026, -18158693, -25655954, -21413661, -17534518, -12032253, 1253587, 12589118, 9244896, -1656255, -5031216, -2630253, -3973264, -3769401, 5869441, 10351012, -10174086, -43222813, -55372870, -41746888, -31916001, -40539276, -44742050, -24924563, 353133, 1964093, -16639848, -27331478, -17540748, -862538, 7876657, 8762897, 6992207, 2389836, -5444279, -10701058]
38570a0701058L237311Q224433K808026p031819r260608k117618K973093j695881
38562a3564121p576442k614446R273799J3671235P662765K282864L017102K493649
38554A4646405m542394j2163497j3109492o945442L491632J3108616J2839136
38547G324964M3487j1351736p116021L631052J287979r741640n490809J5742475
38539e670249K5400331Q723648j1186941r021795P242210J4536599P867472k935443
38531C4955832j1652561j3804625l717893J0661252Q625600j1650098k3157884
38524i740377r646977P950822O728405p29968P521953K0851038J4484471n709091
38516C1710276j3319385o478205o296678j5400016j4466621j58735Q036957K876639
$$ y = [-10701058, -7463747, 760686, 3568712, -3463107, -12723715, -14841333, -11868240, -13564121, -21140563, -23755009, -14481210, -809975, 6852790, 9135654, 12152756, 14646405, 10104011, -2059486, -15168978, -22114420, -18622788, -5514172, 7324964, 7368451, -3983285, -11099306, -7468254, -6180275, -15921915, -21412724, -5670249, 19730082, 28453730, 17266789, 8244994, 15487204, 30023803, 37891275, 34955832, 23303271, 9498646, 5780753, 16442005, 25067605, 13417507, -9740377, -19387354, -11436532, -4708127, -5438095, 2083858, 22934896, 37419367, 31710276, 18390891, 11912686, 5616008, -9784008, -24250629, -24409364, -16372407, -13495768]
38508a3495768l70730N053184N699891m128369r855601k723000N541742N120146
38500i158505L034872M416996O18162j0363194j1967982N314080K2882484J7965470
38492B2742383k519499j1883408j805009Q592043K501279j1768874j4695133k819810
38484a1656028P996946N206059m142348n475804J373349L578326k644129n784071
38476a1547700L68610M499727l330254j2685666p172885R708373J8323619R236847
38468G400671p048037j5178934r902303K421920J0062207O710078K18146L338083
38460a978169J2526872R553914q666204j9429917o998070J1379419J1239179k226556
38452E400468o084166K747430P154209P55741n571488n617290m267480l170664
$$ y = [-13495768, -13866498, -8813314, -3113423, -7241792, -17097393, -19820393, -14278651, -9158505, -6123633, -1706637, -1088475, -11451669, -23419651, -18105571, 4776913, 22742383, 20222884, 8339476, 6534467, 15126510, 17627789, 5858915, -8836218, -11656028, -3659082, 1546977, -2595371, -8071175, -6697826, -3119500, -5763629, -11547700, -11179090, -6679363, -10009617, -22695283, -29868168, -20159795, -1836176, 7400671, 352634, -14826300, -24728603, -22306683, -12244476, -5534398, -5316252, -1978169, 10548703, 20102617, 11436413, -7993504, -14991574, -3612155, 7627024, 5400468, -683698, 2063732, 9217941, 9973682, 4402194, -1215096, -5482576, -8653240]
38444h653240P98760M476189K885158Q84371L986487M679233l938218j0350275
38436e231535k006301R434046N062294q423520j0481203k761858k537870p119206
38428b4065153Q33335J6160776J5654548o40512r194174n217973o493583j2022414
38420b4985150L95218K6680067L1224864M861685j4963631l220573J4127167O622442
38412D0742089j2957798j7668494j0580741p573131m308671O571809J0630446
38405D855509k429119j1500080K346759J7225117L833185k1281422j8501611J0487926
38397a4963736K4975652Q581541j0923150q997352M419958R696774M669634l077431
38389A4381890r284354j0277194l914188K834273K014960n73234M585587R781487
$$ y = [-8653240, -7854480, -3378291, -493133, 391238, 4377725, 9056958, 5118740, -5231535, -7237836, 2196210, 7258504, -1165016, -11646219, -14408077, -16945947, -24065153, -23231818, -7071042, 8583506, 7942994, -1251180, -6469153, -12962736, -24985150, -24589932, 2090135, 33314999, 38176684, 23213053, 19992480, 34119647, 40742089, 27784291, 10115797, -464944, -8038075, -12346746, -5774937, 4855509, 2426390, -9073690, -6726931, 10498186, 14331371, -6950051, -25451662, -14963736, 10011916, 18593457, 7670307, -1327045, 3092913, 12789687, 17459321, 14381890, 5097536, -5179658, -9093846, -6259573, -4244613, -4817847, -232260, 9549227]
38381I549227M19164j5878455j5199572M966801J8580317R026576p824205r608012
38373e968159J678910Q555713N051836L92285J840507N506974L450746n837956
38365A4670856j4459719j2247154J436655J4869749J6241686O211595n314139
38358B1409529j0866362r321266l026937L214282M513958K067678J929378M088916
38350A4009176P94881r433613j6137968j2283707m967979k405053r18886N193045
38342b6150104J1292113J0888734O929731M224461Q56067l001172l15980P688332
38334A2412182O670061o843883j3401196k83958J4076286P950083p337077o422855
38326F819643P167300Q647410m456232r693494L9693N985688j979291r717582
$$ y = [9549227, 9968391, -5910064, -21109636, -16142835, 2437482, 11464058, 3639853, -5968159, -4289249, 4266464, 9318300, 9710585, 11551092, 17058066, 20508812, 14670856, 211137, -12036017, -10599362, 4270387, 20512073, 26723668, 21409529, 10543167, 1221901, -1805036, 1409246, 5923204, 7990882, 9920260, 14009176, 14804057, 5370444, -10767524, -23051231, -28019210, -30424263, -31343149, -26150104, -14857991, -3969257, 2960474, 7184935, 8041002, 5039830, 4723850, 12412182, 19082243, 12238360, -1162836, -1446794, 12629492, 20579575, 13242498, 6819643, 13986943, 22634353, 18178121, 8484627, 8524320, 14510008, 12530717, 2813135]
38318B813135o112478m00060j808620l482300K195465R672435J1204640P312481
38310B1394698m4746j0313265j6313436r325731M096919P324894r18129m757963
38302h856759J348760M074188l203087p587854K50191R351357P087418j640206
38294H24008n786145m401799o20600O389719J2804725Q043692p148691j4839673
38286d734764m809034Q394964P263251k710022m905469J196804K519538m196836
38278a981568q657486m632866K566900O102948M924300J426151p14514K100647
38270A134512Q131938R288235J228868q890097j0547830k566201P341099J2248079
38262A7368603J0593389M688974q48709k131429o38367j657544o382780j0001872
$$ y = [2813135, -3299343, -3699403, -5508023, -8990323, -6794858, 2877577, 14082217, 21394698, 21349952, 11036687, -5276749, -14602480, -10505561, -3180667, -4098796, -8856759, -7507999, -3433811, -6636898, -14224752, -13974561, -4623204, 2464214, 824008, -4962137, -9363936, -9984536, -3594817, 9209908, 17253600, 10104909, -4734764, -9543798, -1148834, 6114417, 3404395, -1501074, -304270, 2215268, -1981568, -10639054, -15271920, -12705020, -6602072, -1677772, -251621, -966135, 1134512, 9266450, 18554685, 19783553, 10893456, 345626, -2220575, 5120524, 17368603, 27961992, 32650966, 31802257, 29670828, 29032461, 27374917, 20992137, 10990265]
38254A0990265q997243n073437q36313K333956J629709m366424r359528m675961
38246a8354976P087861J2849590O397954l721574o725755j501008O733511J2670881
38238A5436484J0977748k98226j2826753j3923507l156480O114168N034649q38439
38230F519644l383203k784901j795082M25541L271025K908359J97729Q39355L845372
38221A0043839J055072p280445q887334J756556J2648784J0504033j750106j1353419
38213F736980j1352632l829559M240868L977210p135891j6832001r626578J0125984
38205b3695619K1034776J4657478N607216M928670K924086r256033j9268208j2014455
38197a5082089N074678J3232006R386966N127404N606399N162691j31408p817929
$$ y = [10990265, 1993022, -3080415, -3916728, -1582772, 46937, -4319487, -13679015, -18354976, -11267115, 1582475, 7980429, 4258855, -2466900, -3967908, 2765603, 15436484, 26414232, 26116006, 13289253, -634254, -3790734, 2323434, 7358083, 6519644, 3136441, 351540, -1443542, -1018001, 2253024, 5161383, 5359112, 6198467, 10043839, 11098911, 3818466, -5068868, -3312312, 9336472, 19840505, 18090399, 6736980, -4615652, -8445211, -4204343, -227133, -7363024, -24195025, -33821603, -23695619, -2660843, 11996635, 17603851, 22532521, 25456607, 16200574, -3067634, -15082089, -10007411, 3224595, 12611561, 17738965, 23345364, 28508055, 28376647, 20558718]
38189B0558718j3664079j3352068n625659J581452j076344o480827K142435J9816824
38181C900452J8284384r783741l0102956j3920733J6143890J8595582m527885
38174a411007j4455125K162788J6551754O862806j0809386j2189141J039643J1337981
38166i09687J0953069M461435j648069k933820K9596o29045q955798j3162398
38158a2794717j53703J9386823K0578019J155161j3248572o915854M794338K659594
38150A5461089q164495j1640657o495138k043864K874L422218N099635r7951o741043
38141a1197332m462276N703453J1253751M701138o954718j0324742m45984J2477425
38133G50715J2512195k419810j4321438o966195R794126J1479566n446270j6917928
$$ y = [20558718, 6894639, -6457429, -12083088, -10501636, -11577980, -18058807, -15916372, 3900452, 22184836, 12401095, -17701861, -31622594, -15478704, 3116878, -1411007, -15866132, -13703344, 2848410, 9711216, -1098170, -13287311, -12247668, -909687, 10043382, 14504817, 12856748, 9922928, 9952524, 9323479, 367681, -12794717, -12948420, 6438403, 27016422, 28171583, 14923011, 8007157, 12801495, 15461089, 7296594, -4344063, -10839201, -12883065, -12880191, -9457973, -4358338, -4456289, -11197332, -15659608, -9956155, 1297596, 5998734, -955984, -11280726, -11726710, 750715, 13262910, 10843100, -3478338, -10444533, -650407, 10829159, 5382889, -11535039]
38125a1535039o055139J2615026J5476793K842334n768406j551900M294816l11553
38117A0006932j2208117j8230389j0576352M352103J1248429K659552j0099285
38110b2847127r732754L416763J1688538O626264O85500M743335R133373J057309
38102D771201j1104220r112366N976876J4878734Q552386j975431n355244l028097
38094C603839P65588O421675J0472538M156668j0744839j7173566n266978J0279777
38086B514702Q959208n869718j1618089Q18476J4866323J2756407j321945j0656345
38078A0449019q788562k554452J445247K050805j854457j0199988j5084135o927382
38070c1463905R714224J7459250Q813676k470804r16832Q568551R445548j189540
$$ y = [-11535039, -17590178, -4975152, 10501641, 13343975, 7575569, 6023669, 10318485, 10006932, -2201185, -20431574, -31007926, -26655823, -15407394, -12747842, -22847127, -32579881, -29163118, -17474580, -10848316, -10162816, -5419481, 3713892, 4771201, -6333019, -15445385, -9468509, 5410225, 13962611, 11987180, 6631936, 3603839, 4369427, 10791102, 21263640, 25420308, 14675469, -2498097, -7765075, 2514702, 11473910, 5604192, -6013897, -5195421, 9670902, 22427309, 21105364, 10449019, 1660457, -893995, 551252, 2602057, 747600, -9452388, -24536523, -31463905, -21749681, -4290431, 4523245, 2052441, 1135609, 9704160, 19149708, 17960168]
38062A7960168r472027o028669K229536M560848O85402k469585j778716m66275
38054E220682k878891r645696j5961048j4599178m228844O165984O709430J39623
38046b9077938j152460P211377J4799840J1098191J52743n702476k707849O53651
38038d724921l469919j0932432r901577M104620J9923514K1012387N032847j1456881
38030I587638j2149981o45120O033601P54821o601080o043991j062945j03304
38022a0230361k382054l94665O718191J0409852M544453n209961p527248K61509
38014c810284Q089621N810174l312485p538969l810990j219261n142218q272442
38006a9206854l904911J819421R91743j368985L364690J0113672P480011j585822
$$ y = [17960168, 8488141, 2459472, 4689008, 9249856, 9935258, 7465673, 5686957, 5220682, 2341791, -7303905, -23264953, -37864131, -42092975, -35926991, -29217561, -29077938, -30230398, -23019021, -8219181, 2879010, 3031753, -2670723, -5378572, -4724921, -8194840, -19127272, -29028849, -24924229, -5000715, 16011672, 21044519, 9587638, -2562343, -3207463, 2826138, 3580959, -3020121, -9064112, -10127057, -10230361, -12612415, -13007080, -6288889, 4120963, 8665416, 3455455, -4071793, -3810284, 4279337, 10089511, 6777026, -761943, -4572933, -5792194, -10934412, -19206854, -23111765, -21292344, -20300601, -21669586, -18304896, -8191224, -711213, -2297035]
37998b297035l358181L670565O864477J747054j698015J085320R84320o203478
37990G95027r747120k123683P196369O689385n85053n340694n785961l483420
37982a2385150K912261R943513P394083n344165j3284352p507349P20263M60462
37974a7090434L14781R762050J6562522N838966j0106932q294824N640538N008061
37966G634728j1889685j5506720P378594K9791883K3703174r97444j6009046j4501708
37958I603776r332719m463023O796574J9590245J7521745j464656j7438624j4147134
37950F666184N34505Q395452N472252J873405K130540j217199j2089166j9671630
37942g905657j1305752Q084024J9448167J2904380j280392p800359l909638L220319
$$ y = [-2297035, -5655216, -1984651, 4879826, 6626880, 4928865, 6014185, 6998505, 795027, -8952093, -11075776, -3879407, 2809978, 2224925, -3115769, -8901730, -12385150, -9472889, 470624, 7864707, 2520542, -10763810, -18271159, -17550896, -17090434, -16775653, -7013603, 9548919, 15387885, 5280953, -3013871, 2626667, 7634728, -4254957, -19761677, -12383083, 17408800, 41111974, 40114530, 24105484, 9603776, 271057, -4191966, 2604608, 22194853, 39716598, 38251942, 20813318, 6666184, 7200689, 15596141, 21068393, 22941798, 25072338, 23855139, 11765973, -7905657, -19211409, -11127385, 8320782, 21225162, 19944770, 12144411, 8234773, 11455092]
37934A1455092Q582714J0522985N793226o373460j7607884j7064652m592425R159262
37926a25142J4487542R222221k641130j2096514r647752K781092R407471P6827
37918A1464615j3397218j2970954r95462N008127P54068q60885N369493Q608891
37910B980675L189253j371423Q84954J733681l918389p334883l017890L72516
37902f481506k168876n46075J0070462J4909562L255577r504766m419060R566168
37894A4681486R853171l882198j2349002q797582m100336l317228j054994J393090
37886g573593k613980p269239p86365J0724668R841599j434216l625770N502173
37878B765277O948226l256424m702811R659440J7499087M998676q778221o008413
$$ y = [11455092, 20037806, 30560791, 36354017, 29980557, 12372673, -4691979, -9284404, -125142, 14362400, 23584621, 20943491, 8846977, -800775, 1980317, 11387788, 11464615, -1932603, -14903557, -15899019, -10890892, -10136824, -10997709, -5628216, 2980675, 6169928, 4798505, 5683459, 7417140, 3498751, -3836132, -6854022, -6481506, -8650382, -9196457, 874005, 15783567, 19039144, 9534378, 5115318, 14681486, 24534657, 20652459, 8303457, -494125, -4594461, -7911689, -8966683, -7573593, -10187573, -17456812, -18243177, -7518509, 2323090, 888874, -2736896, 2765277, 9713503, 6457079, 1754268, 11413708, 28912795, 33911471, 25133250, 19124837]
37870A9124837o15795r246780j7294520m817336J4223152J3276102j091471j417365
37862A2140824J2015639J2834996l930397j3641711m865934M595016K378450r2915
37854B1433968M635526L822163q800599j6273283n975703P892343P591379j176390
37846A3149404l920897k153118m021058m395866M940655J5382998J1863694l186012
37838B7659800j3515604j1976784n313235r68483j803142q156165j3509202n825758
37830c3408573J4233454K5585696J2238708j2069092k1629958j3417886n038137
37823c3505788m482180l799866k07993l69123j947388O547457K1972293K3751314
37815G958726M236700j6223935j6364737j405981R475869J0526190R051607O509657
$$ y = [19124837, 18509042, 9262262, -8032258, -12849594, 1373558, 14649660, 13558189, 12140824, 24156463, 36991459, 33061062, 19419351, 14553417, 19148433, 21526883, 21433968, 26069494, 29891657, 21091058, 4817775, -1157928, 6734415, 14325794, 13149404, 9228507, 7075389, 3054331, -1341535, 3599120, 18982118, 30845812, 27659800, 14144196, 2167412, -3145823, -4114306, -5917448, -14073613, -27582815, -33408573, -19175119, 6410577, 18649285, 6580193, -15049765, -28467651, -33505788, -37987968, -41787834, -41995827, -42364950, -44312338, -37764881, -15792588, 7958726, 12195426, -4028509, -20393246, -21799227, -12323358, -1797168, 7254439, 13764096]
37807A3764096k432438j3906695j4099543R11392J5714208J3868321k43205p364997
37799F211139j25670P202721J299850q382917m089948R671570J0095406o964593
37791A4917558j6611971k883827J4310992R543124q454098j2809854j792084L625923
37783a54237j039506L42011R194688O574895r695631j4783090K421338J7887766
37775A0748234J0326879n819082p617800p37803k848193q563393r46209J4046281
37767H588914J5114421J465230p584687o131479p090638j3647185j2528596n35516
37759b2349536P135499K955940o92130M851968Q741162Q76366q949146o598871
37751a4028748M117148Q967189M503508j121960k652631j921765j134693l04720
$$ y = [13764096, 11331658, -2575037, -16674580, -15763188, -48980, 13819341, 13576136, 6211139, 6085469, 13288190, 14588040, 6205123, 2115175, 11786745, 21882151, 14917558, -1694413, -4578240, 9732752, 19275876, 10821778, -1988076, -3780160, -154237, -1193743, -851732, 8342956, 14917851, 5222220, -9560870, -7139532, 10748234, 21075113, 15256031, 7638231, 6900428, 4052235, -4511158, -5457367, 8588914, 23703335, 25168565, 17583878, 11452399, 4361761, -9285424, -21814020, -22349536, -15214037, -12258097, -12950227, -8098259, 642903, 1519269, -7429877, -14028748, -9911600, -944411, 3559097, 2437137, -215494, -2137259, -3271952, -3576672]
37743c576672J080762M557368J0907437J5443626J1783584K553101k703606k837112
37735C7208488o520917j4250188j3702018j107110Q641984N586497K487541J1781389
37727C0125666J9588025O407641j6233195j8280105K235841J4725348K852361
37720D1421582j2958202j1283832j773037l395251j1427648q616439M130684J0825808
37712F923665O478921j22959m346535p582636n574557N985642J6733113J1695701
37704C0190355m545940j2516703o897415j321884k446416p25527P341719R348865
37696A8427054n99962q848306m254497L385180J192160n194899l673952K817587
37688C250365L455644j341259m145075n775739j0198881j1237244j067565J3072428
$$ y = [-3576672, -2495910, 2061458, 12968895, 28412521, 40196105, 42749206, 40045600, 37208488, 30687571, 16437383, 2735365, 1628255, 10270239, 15856736, 18344277, 30125666, 49713691, 56121332, 39888137, 21608032, 23843873, 38569221, 41421582, 28463380, 17179548, 15406511, 12011260, 583612, -8032827, -3902143, 6923665, 13402586, 13279627, 8933092, 1350456, -4224101, 1761541, 18494654, 30190355, 25644415, 13127712, 6230297, 4908413, 2461997, 1736470, 9078189, 18427054, 17827092, 8978786, 4724289, 8109469, 9301629, 4106730, 432778, 3250365, 6706009, 5364750, 1219675, -4556064, -14754945, -25992189, -27059754, -13987326]
37680a3987326J6686979Q830478O60765k517142l377387j635675L748010O084282
37672A4492984K55424m756497O60787P172011L85116j1437358p569642R773062
37664H975887J6646491N520188n145756m602766m755794j1608716j0063933P020319
37656A985920J9673902J0477771p146245j1226523m138112j125492j513286M214998
37648A1202933J0518303N749335k766392J531146J3680043J1979402o340704j9007310
37640B6546756j2711398q34948Q32612l320310j778237L556731L408333j802291
37632A3897248l996320j473679N39012J191844N289531J1981002J1358311j974472
37624C6812477j7287740j8094092l552678R593371R725859M940542O749536R331758
$$ y = [-13987326, 2699653, 11530131, 12190896, 9673754, 6296367, 4660692, 8408702, 14492984, 14748408, 9991911, 10652698, 17824709, 18209825, 6772467, -797175, 8975887, 25622378, 31142566, 25996810, 21394044, 16638250, 5029534, -5034399, 1985920, 21659822, 32137593, 24991348, 13764825, 9626713, 8501221, 6987935, 11202933, 21721236, 27470571, 24704179, 26235325, 39915368, 51894770, 45554066, 26546756, 13835358, 13000410, 13833022, 10512712, 8734475, 12291206, 15699539, 13897248, 9900928, 8427249, 8966261, 10158105, 15447636, 27428638, 38786949, 36812477, 19524737, 1430645, -2122033, 7471338, 17197197, 22137739, 28887275, 38219033]
37616C8219033J66433j4674430j5900996k012646O490293j78886n848903K539634
37608H799532J1347271L796904r535708o850187Q518455J3105834J541002n101553
37600B5621550O444189K0037530J3491277r747464k4830048j6517215L743198
37593A8243017J2547402J362356j5253724j8352521o411495O857833J2065852
37586A1058720J1428240Q343156K854056r47026K907650R009131M207913j0605926
37578C8255914j8353938j1563200k450554O81531O509946J8335282K0638244M899241
37570E6952466j1504627j1797686n788682p896911r459739J191276J0300530Q56060
37562B2852687j3068111p531129R244317J1780756K675156L911569J1923267M895370
$$ y = [38219033, 38385466, 23711036, 7810040, 5797394, 12287687, 12108801, 6259898, 8799532, 20146803, 23943707, 14407999, 7557812, 16076267, 29182101, 30723103, 25621550, 32065739, 52103269, 65594546, 55847082, 31017034, 14499819, 18243017, 30790419, 32152775, 16899051, -1453470, -7864965, -1007132, 11058720, 22486960, 30830116, 33684172, 32737146, 35644796, 44653927, 48861840, 38255914, 19901976, 8338776, 5888222, 6569753, 13079699, 31414981, 52053225, 56952466, 45447839, 33650153, 27861471, 19964560, 10504821, 11696097, 21996627, 22852687, 9784576, 2253447, 11497764, 23278520, 25953676, 29865245, 41788512, 46683882]
37554D6683882r642457k537929J9547519J5805620j8223382l3869882n381576
37547A2381795K5727006J5090114j6473901j9921064O696518K3977254J4955683
37540F2433405O98034j529721J012940q77416l407275k447105j332501j522031
37532E3028330R53948P031765J1522215Q973406j718010j4826899j8184695m983782
37524D1796278J2766723J5257260K308091o011237m17879N194615r9025o586414
37516F4208412l630089K950856N973077R805417J5131485J1661026L48570o182
37508A06442572J4682550J9532262N72052j6457117m637194J9736021K3692102
37501A63563248R593440M501861J1456519J0294269M4401J406861J6716814K3067149
$$ y = [46683882, 37041425, 34503496, 54051015, 69856635, 51633253, 17763371, 12381795, 38108801, 53198915, 36725014, 16803950, 23500468, 47477722, 62433405, 63131439, 61601718, 62614658, 61737242, 58329967, 55882862, 54550361, 53028330, 53982278, 61014043, 72536258, 81509664, 79791654, 64964755, 46780060, 41796278, 54563001, 69820261, 72128352, 66117115, 65699236, 70893851, 70794826, 64208412, 60578323, 63529179, 69502256, 79307673, 94439158, 106100184, 106448754, 106442572, 121125122, 140657384, 141229436, 124772319, 120135125, 139871146, 163563248, 173156688, 177658549, 189115068, 199409337, 199453738, 200860599, 217577413, 240644562]
37493B40644562J0473459l600712m599230N28593K189057K807607N543741P064248
37485B61051325O533460O241681K824594o164585j0151190J238621J7219557J9166547
37477B97960010J0061696P452214J2407760J1958162P782823J2440320J9583310
37470C79646295J1058112n950986m932522J2441639J3687480q767835j8868405
37463C78313778O635239L8459134L7343453Q431729j4366666j6846857j0363016
37456D27606794n356956l953759p674210j2768608q532141M713950R944592l22962
37448D03656700r712803n719565j667812j1223967k1330312j5153191m377202
37441C34471848j0481529k6855986k8724184j2417312K948374P039743N307207
$$ y = [240644562, 251118021, 247517309, 242918079, 243446672, 245635729, 248443336, 253987077, 261051325, 267584785, 273826466, 276651060, 270486475, 260335285, 261573906, 278793463, 297960010, 308021706, 315473920, 327881680, 339839842, 347622665, 360062985, 379646295, 390704407, 384753421, 379820899, 392262538, 405950018, 397182183, 378313778, 384949017, 423408151, 460751604, 469183333, 454816667, 437969810, 427606794, 422249838, 418296079, 410621869, 397853261, 389321120, 394035070, 403979662, 403656700, 393943897, 388224332, 386556520, 375332553, 354002241, 338849050, 334471848, 323990319, 297134333, 268410149, 255992837, 258941211, 265980954, 271288161]
37434B71288161o14150j3266020k3101852j7399008m146353k779269j2290382
37427A97691127j3524653l087266J626961n671583r907649l165074J510069n068397
37419A60403535j1813193q031813j600368l337038r021266j0062956q707455r905232
37411I7924214r438453k420816N660908P287777M227457J482100j635098n914551
37403I7173538o633204k290923m06318n953322j2503277j3225943j1387708j0935247
37395C3837596p057500K795953Q854881L533487l099662K042009J2326245J1003240
37387F4236249j180961p332878k193271J419408l430637p179082l741816k485472
37379C8111540r485365j3067866k585763J0904239R955281j319319l428409P232077
$$ y = [271288161, 270674011, 257407991, 234306139, 216907131, 212760778, 209981509, 197691127, 184166474, 181079208, 182706169, 177034586, 167126937, 163961863, 165471932, 160403535, 148590342, 140558529, 138958161, 135621123, 126599857, 116536901, 107829446, 97924214, 88485761, 86064945, 91725853, 99013630, 103241087, 104723187, 103088089, 97173538, 90540334, 88249411, 87843093, 81889771, 69386494, 56160551, 44772843, 33837596, 26780096, 29576049, 38430930, 41964417, 38864755, 40906764, 53233009, 64236249, 63055288, 55722410, 53529139, 54948547, 51517910, 44338828, 40597012, 38111540, 28626175, 15558309, 12972546, 23876785, 33832066, 32512747, 29084338, 36316415]
37371C6316415J2453896Q87682j3868253j2325103M738589J9100563J8200573
37364F5504362O584399l310567m872295j741644k223393r618462j7608714j7235250
37356A5478436q301778L65568K686430J659531J655116R15431l207598o711244
37348D539892l487698M939578J0373755Q016837J160223l668622l041743R12098
37340A9744320K194836k799040r048432p070999L899810J2406044R347680N78120
37332B9252339k004736K592684M962961Q2430p375348j1742419j2088414q926905
37324e247408k603560L907814O539947N369760L890352L733079M362644N757096
37316B5709724O531116L094512l313285l968548M658494J1423826M925752p872262
$$ y = [36316415, 48770311, 49657993, 35789740, 23464637, 28203226, 47303789, 65504362, 72088761, 68778194, 63905899, 62164255, 59940862, 50322400, 32713686, 15478436, 7176658, 7542226, 10228656, 11888187, 13543303, 14458734, 11251136, 4539892, 1052194, 5991772, 16365527, 24382364, 25542587, 21873965, 18832222, 19744320, 21939156, 19140116, 10091684, 3020685, 6920495, 19326539, 28674219, 29252339, 27247603, 29840287, 34803248, 34885678, 27510330, 15767911, 3679497, -5247408, -7850968, -3943154, 2596793, 7966553, 11856905, 15589984, 19952628, 25709724, 32240840, 35335352, 32022067, 28053519, 32712013, 44135839, 49061591, 41189329]
37308D1189329j1432992o064200n558530j1827971j1563074j264636M739246q70493
37300b653321m548056N191076J7144317J4696982J691796m939085m55481N010377
37292C1138605M349235N57779j853531j938711j56048J508558k76775m765223
37284B8563889o516911m277365l258111m610818k988644K41936m645152j5468424
37276a2959600j2923599R583020K7158914J5641342j0152503j6314802q4732R653693
37268I601733Q85249n036825O171722J5466282K933151j6912509j6462074K394954
37260i58317J2529797K860739q932212o823069J768207K942566j341567r66373
37252A079771K694396O44971m292298R56207J6067904K1841814P559594j0251939
$$ y = [41189329, 29756337, 23692137, 18133607, 6305636, -5257438, -6522074, -1782828, -2653321, -7201377, -2010301, 15134016, 29830998, 31522794, 26583709, 26128228, 31138605, 35487840, 36045619, 34192088, 32253377, 32097329, 33605887, 33329112, 28563889, 22046978, 17769613, 14511502, 9900684, 6912040, 7153976, 2508824, -12959600, -25883199, -16300179, 10858735, 26500077, 16347574, 32772, -51960, 9601733, 10486982, 5450157, 11621879, 27088161, 30021312, 13108803, -3353271, -958317, 11571480, 14432219, 5500007, -1323062, 445145, 3387711, 2046144, 1079771, 3774167, 4419138, 126840, 1083047, 17150951, 38992765, 46552359, 36300420]
37244C6300420j0878344k75649M22184r797811j2279007l562573k192075j3657261
37236a5920116j6625050Q67847J7285349J0975243m621871n389641K648496j640544
37228a2420287j2411528n920958J4460574K0057499N159643l374778P489607J6229832
37220B9269604O209235o533243m373962R36854p596389j9099142j2654583O490740
37212g350886J5012747P326359o72658M29904K988522n77631o693632q293447
37204B169278k641634Q105298J6283404J2294103l235669j5762414j3385089j674644
37196B152633N575934L687530k491483p440521n859652N975691K0001456J7810371
37188C9411959n442508k8104101k6910027o678401R241208J0313714M565936n38837
$$ y = [36300420, 25422076, 25146427, 25568611, 15770800, 3491793, -70780, -2262855, -15920116, -32545166, -31677319, -14391970, -3416727, -8038598, -13428239, -10779743, -12420287, -24831815, -30752773, -16292199, 3765300, 8924943, 5550165, 13039772, 29269604, 35478839, 28945596, 24571634, 25508488, 17912099, -1187043, -13841626, -7350886, 7661861, 14988220, 14315562, 14745466, 17733988, 17156357, 10462725, 2169278, -472356, 7632942, 23916346, 36210449, 32974780, 17212366, 3827277, 2152633, 7728567, 11416097, 8924614, 1484093, -4375559, 1600132, 21601588, 39411959, 33969451, 5865350, -21044677, -27723078, -18481870, -8168156, -3602220, -4141057]
37180d141057n151921p605184l931130L676029R802218J4142315J6212939R018787
37172C2022996q096086j8814569r816463O197293P880161j307915j394135P141881
37164A3813163M040658j1799978j5554783K378636J8092996J1891961k172388
37157B0690265l879414p04077r311822k0402677j0949254J6032941L1315558J9441598
37149D2233118l064503j3347451q637832r74582J241023j361283m532156m740271
37141F816063j409894K213594K609755P08131K82018J986266K113460k377308
37133A2942085r288885j2002224n839290M526734O646722n186581j8886280j6542185
37125d3629904K270444J9013766K0096635J1157296L314512k175310p319042p416046
$$ y = [-4141057, -9292978, -16898162, -20829292, -17153263, -7351045, 6791270, 23004209, 32022996, 23926910, 5112341, -4704122, 1493171, 9373332, 8065417, 6671282, 13813163, 17853821, 6053843, -9500940, -7122304, 10970692, 22862653, 20690265, 16810851, 16106774, 6794952, -13607725, -24556979, -8524038, 22791520, 42233118, 39168615, 25821164, 17183332, 16208750, 17449773, 16088490, 11556334, 6816063, 5406169, 7619763, 10229518, 10937649, 11219667, 13205933, 15319393, 12942085, 3653200, -8349024, -14188314, -9661580, -3014858, -8201439, -27087719, -43629904, -41359460, -22345694, -2249059, 8908237, 12222749, 10047439, 2728397, -4687649]
37117d687649o0207M537016l241829j3648199p536981J4644692K8012555J3086853
37109C1106251j8117432l3347913j5681734J7014728L0954539J4239592r794560
37102A6373471j2361670M027555J1796873p30937j3716727p871390P010416J0356237
37094A4883828K954677J302941Q309202J0170370R7314j2577809j7376933j2687635
37086d924045j294942J1052337J4026894L067027j0167407j1043427l022742n94720
37078b901025m656897l431170L737735M975055J4712K708824J3663943J4001471
37070B8112648l034954j6594797r140682O633398R393934J130991k329502M17931
37062A4588967p42310n024294k745688M768802O472226J63553o791696j1882704
$$ y = [-4687649, -4747856, -210840, -3452669, -17100868, -24637849, -9993157, 18019398, 31106251, 12988819, -20359094, -36040828, -19026100, 11928439, 26168031, 16373471, 4011801, 8039356, 19836229, 19105292, 5388565, -2482825, 4527591, 14883828, 17838505, 19141446, 27450648, 37621018, 37718332, 25140523, 7763590, -4924045, -6218987, 4833350, 18860244, 21927271, 11759864, 716437, -2306305, -2901025, -7557922, -10989092, -7251357, -2276302, -2261590, 447234, 14111177, 28112648, 25077694, 8482897, -657785, 5975613, 15369547, 16500538, 14171036, 14588967, 13846657, 8822363, 6076675, 10845477, 17317703, 17481256, 10689560, -1193144]
37054a193144j6186756j2999651L577534K1304152K1168196N962464k899647J496057
37046B0229205L794781l722475p465205O61880N511529n564371j7740007j0516361
37038a4811024Q215793J3032157o42637j2100832q379592o2810M6779m712390
37030a9414556n650403k925654M79709O792190J4805999J3633867j750242j6021719
37022a0050809j0040289J0601735J9550291M866222j4501142j4809021J874684
37015a2508329J4443051J2213889L660773j634189n003370r308027r790880k091217
37007a0018299P886098J0326250M174454k849097m110016J215669R707942J4097167
36999C0430168O006135j3654886k9225671k4447347k518896J6370214J8805197
$$ y = [-1193144, -17379900, -30379551, -26802017, -5497865, 15670331, 21632795, 18733148, 20229205, 24023986, 20301511, 12836306, 13498186, 19009715, 13445344, -4294663, -14811024, -6595231, 6436926, 5794289, -6306543, -14686135, -14748945, -14702166, -19414556, -25064959, -27990613, -27510904, -20718714, -5912715, 7721152, 5970910, -10050809, -20091098, -9489363, 10060928, 14927150, 426008, -14383013, -12508329, 1934722, 14148611, 17809384, 16175195, 11171825, 1863798, -7927082, -10018299, -2132201, 8194049, 12368503, 9519406, 5409390, 6625059, 16333001, 30430168, 36436303, 22781417, -6444254, -30891601, -33410497, -17040283, 1764914]
36992A764914J0795069M312014J246526k708244o179202l814839L241195P048702
36984A5706135K773921o618248j4607914j5346082n896008R530168J9026190J3699628
36976A8267790j082129j1556843j2336449r796074q682086n337880K280569P788330
36968b0454772O220213K611873K759034K576872l468601r196439m219145Q216475
36960a4954490J3775257P463078p78729k589953j113531r11821J17767L156867
36952D164445L409238p71609l087887j66679K199839M17767K88321M776332N858023
36943A7087790j169485o814028l490165o55704p723517j3041911p14306J9375205
36935B853879K2217231N218176r420599r987904p418905q418970l109843J0993052
$$ y = [1764914, 12559983, 16871997, 18118523, 15410279, 9231077, 5416238, 8657433, 15706135, 18480056, 11861808, -2746106, -18092188, -23988196, -14458028, 4568162, 18267790, 17185661, 5628818, -6707631, -16503705, -25185791, -30523671, -28243102, -20454772, -14234559, -11622686, -8863652, -6286780, -9755381, -18951820, -23170965, -14954490, -1179233, 6283845, 5505116, 2915163, 1801632, 889811, 1007578, 4164445, 7573683, 6802074, 3714187, 3547508, 5747347, 6165114, 6453435, 11229767, 17087790, 15918305, 9104277, 5614112, 4958408, -2765109, -15807020, -16521326, 2853879, 25071110, 30289286, 20868687, 10880783, 3461878, -4957092, -8066935, 2926117]
36927B926117J7277701O097041p951257r205288k879405N36790L924406J0138629
36919B0864734Q580337n487858j5219354p206036L626193j826825j2433220m845903
36911a3947932J4731251J8228163O53576j3782399j0865153k300423J054533L888286
36903b340098P910674M548937n383388q178857j830340j054628r073852r078890
36895b4480442M581369J2122086J223282r799892j898108J2816124J2684192K464224
36887I712835J128058O590432J401394j2866617j5370735j10456J4354451J2771369
36879A7610731N39939j0539579j5469552j0872711N292992K2417710K2217056
36872C1196586L699730j0962632n510749P655357N890291j1559221k3857586j7341442
$$ y = [2926117, 20203818, 26300859, 18349602, 9144314, 6264909, 6801699, 10726105, 20864734, 29445071, 23957213, 8737859, 1531823, 5158016, 3331191, -9102029, -13947932, 783319, 19011482, 19665058, 5882659, -4982494, -7282917, -6228384, -2340098, 5570576, 10119513, 4736125, -3442732, -5273072, -6327700, -15401552, -24480442, -19899073, -7776987, -6553705, -16353597, -18251705, -5435581, 7248611, 9712835, 10840893, 17431325, 18832719, 5966102, -9404633, -9515089, 4839362, 17610731, 18150670, 7611091, -7858461, -18731172, -13438180, 8979530, 31196586, 34896316, 23933684, 18422935, 26078292, 31968583, 20409362, -3448224, -20789666]
36864b0789666q81688Q648925O225224k11539k225660J235097O307696R275413
36856G583802Q035250K144983n681523r931194p431009j265180L560722O828792
36848C844643J0787552J2582523O387837n684581j2638316q206365J253536O579599
36840A4906428O704649M733015O45930m584717m217727N056597J3436798Q668093
36832D5349066n091979j0503516p45731J0855390R967430J211627L86235J1107310
36824F2535832J9636169J4862648M460688L383749J0805568J0462989l530202
36817A22617441j3795414k745635K0125328K8754688J5158973k262683n989088
36810A61863610J259518R047018J4941808J8502927J3203626l130053j8804068
$$ y = [-20789666, -21671354, -13022429, -6797205, -7008744, -9234404, -7999307, -1691611, 7583802, 15619052, 17764035, 12082512, 2151318, -5279691, -6544871, -2984149, 3844643, 14632195, 27214718, 33602555, 27917974, 15279658, 7073293, 8326829, 14906428, 21611077, 26344092, 26990022, 22405305, 18187578, 23244175, 36680973, 45349066, 40257087, 29753571, 29007840, 39863230, 49830660, 51042287, 51428522, 62535832, 82172001, 97034649, 101495337, 104879086, 115684654, 126147643, 122617441, 108822027, 106076392, 126201720, 154956408, 170115381, 167852698, 161863610, 163123128, 172170146, 187111954, 205614881, 218818507, 215688454, 196884386]
36803A96884386k1113880j2654327n308502m374793p470029j2027356j4641239
36796A19294260j0383977k173592k360456j4470503k3023473j4756495m86042
36789E1639722P23767q384327q574151M064455J2145918M448135q625069j1603992
36781C5834458k196081J1009178J7833391J1533222m642820j5640943j0739135
36774D2991270L8062n65912r413750p191287Q867774J7749548O957289q065751
36766E1367243q390319J243428M096294k379978p569448o732365m373713l248590
36758B4012552k438229l528176q214655j1565007o638734M731898J2477877R494882
36750A8332408j593929j1413017j1100635K16245J2706841J4354625M404912n870403
$$ y = [196884386, 175770506, 163116179, 157807677, 153432884, 145962855, 133935499, 119294260, 108910283, 106736691, 104376235, 89905732, 66882259, 52125764, 51639722, 52363489, 43979162, 35405011, 39469466, 51615384, 56063519, 47438450, 35834458, 33638377, 44647555, 62480946, 74014168, 69371348, 53730405, 42991270, 43029332, 42463420, 33049670, 25858383, 34726157, 52475705, 59432994, 51367243, 42976924, 44220352, 48316646, 45936668, 38367220, 31634855, 27261142, 24012552, 21574323, 18046147, 9831492, -1733515, -8372249, -3640351, 8837526, 18332408, 16738479, 5325462, -5775173, -5558928, 7147913, 21502538, 25907450, 20037047]
36742B0037047p244046j848559L003326L397075j186876q976136j3546426p789175
36734a4153770N422155J3396764R108450J98485k092061L077569P989926O905704
36726B9853222L82127o580621p931249k625263J885474j620445q365438p493880
36718b496073L36774L101227k865479o637238q65881P080768Q629630N906282
36710A2190010K792295k937143r941379r043768J004905O461049p15984p712005
36702g902020m76865J2886059J4296717K273846r717624j3947130j1708052l140557
36694a7435626R848631J6660316J0206427J71856j473438j52229n828443j0014288
36686A983206P90693J5556491J0714973r925779j7210506k284235J0262918L888339
$$ y = [20037047, 12793001, 10944442, 13947768, 17344843, 16157967, 7181831, -6364595, -14153770, -8731615, 4665149, 13773599, 13972084, 11880023, 14957592, 22947518, 29853222, 30235349, 23654728, 15723479, 13098216, 14983690, 13363245, 4997807, -2496073, -2159299, 941928, -1923551, -8560789, -9426670, -2345902, 6283728, 12190010, 14982305, 12045162, 2103783, -6939985, -5935080, 525969, -190015, -7902020, -8378885, 4507174, 18803891, 21077737, 11360113, -2587017, -14295069, -17435626, -7586995, 9073321, 19279748, 19451604, 17978166, 17825937, 11997494, 1983206, 2773899, 18330390, 29045363, 19119584, 1909078, -375157, 9887761, 13776100]
36678A3776100n583148k209511K022099o970276j5485165m803527J3580599J4651498
36670H978669P21387m302886L965917N558564o285603j2087474P15800J6342514
36662A3606888J5714192L711940l909871n746009r507659j2204846m760304Q092101
36654D996432J0735065j2563r922929q614292j944237J945720N733071J2961091
36646A5877358J5577349M323373j3629317k0643287j1415182J642797O633697
36639a633212M462338J57246o057963j2314700j0287998K793938J4458272J1231266
36631B809187j528695o792294j105125J909863m350569p680518J661730J1352431
36623c723990M163985j2379245j2512810J0285644L0443179K3585393j513796
$$ y = [13776100, 8192952, 5983441, 8005540, 1035264, -14449901, -19253428, -5672829, 8978669, 9700056, 5397170, 9363087, 14921651, 8636048, -3451426, -2735626, 13606888, 29321080, 33033020, 29123149, 23377140, 13869481, 1664635, -3095669, 4996432, 15731497, 15718934, 5796005, -2818287, -4762524, -2816804, 2916267, 15877358, 31454707, 35778080, 22148763, 1505476, -9909706, -8266909, -1633212, 2829126, 2986372, -3071591, -15386291, -25674289, -22880351, -8422079, 2809187, 1280492, -5511802, -6616927, -4707064, -9057633, -16738151, -15076421, -3723990, 439995, -11939250, -24452060, -14166416, 16276763, 39862156, 38348360]
36616C8348360j7507847j4719498n640125J009405R311270J7436576J2271466
36609D0509607p092939j9652018j1620913O00807m108857j6617666j2803207M767447
36601b6017739J0085130k201620p365993P236648K0657316J3617988j421056n256832
36593I333842l810744j0469397j5486588k302384J7606714J7271383l197260j6218617
36585g273051r000988J833020K075558j1409N507532J1729526R189023J880149
36577A5929360k173146l170551l610136k491422k289506q356705j5093874q205978
36569b9461958J1217673K1637053J1171855l659749l495338M998211L690538o262952
36561I835333r471714m071356j763426l305764K840218J5022524J3922089p407746
$$ y = [38348360, 20840513, 6121015, 480890, 1490295, 10801565, 28238141, 40509607, 33416668, 13764650, 2143737, 2744544, -1364313, -17981979, -30785186, -26017739, -15932609, -18134229, -25500222, -18263574, 2393742, 16011730, 14590674, 9333842, 5523098, -4946299, -20432887, -22735271, -5128557, 12142826, 8945566, -7273051, -16274039, -14441019, -12365461, -12376870, -6869338, 4860188, 14049211, 15929360, 13756214, 10585663, 6975527, 4484105, 2194599, -6162106, -21255980, -29461958, -18244285, 3392768, 14564623, 10904874, 7409536, 12407747, 16098285, 9835333, 363619, -3707737, -5471163, -8776927, -5936709, 9085815, 23007904, 15600158]
36553A5600158k6949173k0964048L527537J8828999J3715242M652226Q481698
36546A6892639J8126695J4726323l593805j8031719j4854535l014267O99452m885325
36538F065458p958895m756557l288871n422251q86594J3499660K1562618P489407
36530B6303975j8731184k9322735j2119569J4566220K3761031R896405p718614
36523F635529r027036M221066J2887299N473214p944249j0654143j510338O847233
36515F928575P782038O073286L983749l564450j5570838k0256286j1441961J273562
36507b4792325O728081O521945O944006P078035M592900L218615L917539p65983
36499A3442813j1522211j3322195K494924J8292268J2472404o442096j1540656
$$ y = [15600158, -11349015, -32313063, -28785526, -9956527, 3758715, 8410941, 16892639, 35019334, 49745657, 46151852, 28120133, 13265598, 10251331, 10950783, 6065458, -1893437, -6649994, -9938865, -15361116, -16247710, -2748050, 18814568, 26303975, 7572791, -21749944, -33869513, -19303293, 4457738, 14354143, 6635529, -2391507, 1829559, 14716858, 20190072, 12245823, 1591680, 81342, 6928575, 14710613, 20783899, 24767648, 21203198, 5632360, -14623926, -26065887, -24792325, -18064244, -11542299, -4598293, 2479742, 7072642, 10291257, 14208796, 13442813, 1920602, -11401593, -8906669, 9385599, 21858003, 15415907, 3875251]
36492C875251J029524Q605003P22158o780671l715658l786701j6084919k2856186
36484c8992199p261612J4758690J5562001k260551j1116057p28843J0819733R534349
36476i684489M027124M256570L862128l337198o726053M106193J7377405J3348544
36468B7230224m933989j4453591n646116N489657L460731n483854p761220m032600
36460f130758k732633k133491M531996J1441992N902283q616027j3246313j655957
36452a2638908R853829P895869J433117L627722Q430545K236016j0253943j1351889
36444g67642J245576J0031254L745420q059158j1464540o011439O78453N573853
36436e028223R337313R748810M107104n024388j1880772j3399904j0390297n379070
$$ y = [3875251, 4904775, 13509778, 14231936, 7451265, 3735607, -51094, -16136013, -38992199, -46253811, -31495121, -15933120, -18193671, -29309728, -30038571, -19218838, -9684489, -5657365, -1400795, 2461333, -875865, -7601918, -3495725, 13881680, 27230224, 22296235, 7842644, 2196528, 7686185, 11146916, 5663062, -2098158, -6130758, -8863391, -10996882, -6464886, 4977106, 10879389, 2263362, -10982951, -12638908, -2785079, 5110790, 6543907, 10171629, 18602174, 20838190, 10584247, -767642, 477934, 10509188, 14254608, 6195450, -5269090, -11280529, -10602076, -5028223, 4309090, 14057900, 18165004, 13140616, 1259844, -12140060, -22530357, -27909427]
36428b7909427j045703J687723M495171Q070092R248276N787543J584449J416689
36420C334813L253133K737269J629892K638248L20661r866577j6909065o060660
36412a8922286J4246539J7506149k993064k1647780j6484244J514991R784668
36405a6995027P298776O826111P999733J463238q034405o419124M698710R500993
36397F339005L838446q66989j45183k027970p225447m751490O585778J1906157
36389A3652307L775735n713477n645023k141730l034100l221815K135965N352481
36381E160343J325108L8999P688665R970890n290592k1078038j1874205J4990384
36373I31554K5677138P797910j3858840j5264122l132243L526420J589844r54504
$$ y = [-27909427, -28955130, -27267407, -22772236, -14702144, -5453868, 333675, 1918124, 3334813, 6587946, 9325215, 10955107, 13593355, 13914016, 4047439, -12861626, -18922286, -4675747, 12830402, 9837338, -11810442, -28294686, -26779695, -16995027, -9696251, -2870140, 5129593, 6592831, -1441574, -7860698, -3161988, 6339005, 10177451, 9310462, 9165279, 7137309, -88138, -4839628, 1746150, 13652307, 17428042, 11714565, 6069542, 3927812, 893712, -2328103, -192138, 5160343, 6485451, 6524450, 14213115, 24184005, 18893413, -2184625, -14058830, 931554, 26608692, 34406602, 20547762, 5283640, 2151397, 5677817, 7267661, 6313157]
36365F313157k897629o856291q377032l120480K050541o56895m241724L500428
36357a4285925J7738402K0021808N217956r961091j0573459k750682p50512m694008
36349c7511l585514M043149O348666k948565j3450207j2451840k666328L226307
36341b1521843J289591o05976K632757O266635N533122K980788J851221O86405
36333h87300n45026K238290P639908O206199m033230r661899j451647P863930
36325G369225J481663j3115129j3495025L074566J5955747J3573143P323136P122925
36317B9290251M993591n729943j3852051p973029L585466N865792o24355n213004
36309A0342718n011110l757734j015544M320024O994098L376975j394424l952484
$$ y = [6313157, 3415528, -3440763, -11817795, -14938275, -12887734, -13544629, -17786353, -14285925, 3452477, 23474285, 28692241, 18731150, 8157691, 5407009, 4656497, -37511, -3623025, 420124, 6768790, 3820225, -9629982, -22081822, -24748150, -21521843, -20232252, -20838228, -18205471, -11938836, -6405714, -3424926, -1573705, -887300, -1432326, 805964, 8445872, 14652071, 10618841, 956942, -494705, 7369225, 8850888, -4264241, -17759266, -14684700, 1271047, 14844190, 22167326, 29290251, 34283842, 28553899, 14701848, 6728819, 10314285, 16180077, 15555722, 10342718, 5331608, 1573874, 558330, 4878354, 11872452, 15249427, 13855003, 9902519]
36301I902519r185118j5600172r393036J1653446K4695738J2695305o517102o872568
36293A1379012M181434Q64770j4441396j5683887m07435N805192m229934o822399
36285a9354643Q297590J8193793P804232l261439L273570J1943824L265279r960249
36277B0201957n701973Q019216P984361m585129r914797m954912k883858m112411
36269D052454K924433J4800352J4313981p18237j3570912j4589913r836033l808606
36261f432481M942403J0536343M103436o860862n297044O847529R589456j538020
36253A5890760p339429J609429P975297k292680j4632216r162469O631310R635635
36245H315637l340804j2439794n200575P416524R259272J173212k637494M185713
$$ y = [9902519, 717401, -14882771, -24275807, -12622361, 12073377, 24768682, 18251580, 11379012, 15560446, 16425216, 1983820, -13700067, -14107502, -8302310, -12532244, -19354643, -11057053, 7136740, 14940972, 11679533, 14953103, 26896927, 30162206, 20201957, 14499984, 22519200, 30503561, 25918432, 16003635, 11048723, 8164865, 4052454, 6976887, 21777239, 36091220, 35372983, 21802071, 7212158, -2623875, -6432481, -1490078, 9046265, 13149701, 6288839, 991795, 7839324, 17428780, 15890760, 8551331, 10160760, 18136057, 15843377, 1211161, -7951308, -1319998, 8315637, 4974833, -7464961, -12665536, -5249012, 4010260, 5183472, 2545978, 6731691]
36237F731691J0697811L732681j2031371j8114860p901002L104787L36995p895448
36229b1338716m975568O702578J0937651M839368L49325M20106m241796j2323362
36221a9630414q692530Q575448J8969655Q545483r197243j3792982m830404L760868
36213a6292119M373218q39233p065518p994978L60030J0346278R097390o76228
36205h691160k537930M805567J738908j7424888k7148225p618214K1245017K7109745
36197h521180J0871712j849367k833158n191243j1639717r543452K016323P997676
36189a8692406M279505M116211J1761732J2664963r15123j4248705j1448225K410932
36181a0071116J1287105R154565J852932l537283m040052j457507r56528l643444
$$ y = [6731691, 17429502, 21162183, 9130812, -8984048, -16885050, -13780263, -13443268, -21338716, -26314284, -19611706, -8674055, -3834687, -3485362, -3065256, -7307052, -19630414, -28322944, -19747496, -777841, 7767642, -1429601, -15222583, -20052987, -16292119, -11918901, -12758134, -19823652, -27818630, -27458600, -17112322, -8014932, -8691160, -11229090, -6423523, -4684615, -22109503, -49257728, -56875942, -35630925, -8521180, 2350532, 501165, -2331993, -7523236, -19162953, -28706405, -26690082, -18692406, -14412901, -10296690, 1465042, 14130005, 13214882, -1033823, -12482048, -10071116, 1215989, 10370554, 12223486, 8686203, 4646151, 3188644, 2232116, -1411328]
36173a411328k400142O152793J0202552k392110k0982979k2267674l870249J2072374
36165b4896763J2105350P088381P877934P294860j571504q563845l972279K337779
36157b300087l305922j4614939j4624128j325773J1498309J3884907P071562l709285
36149g425356j1978881j0496628K07871Q963108Q915915P704740J2324939J4052050
36141B2267758L283060r722217p802546M835598P979713k429207q932498k240259
36133G239402M856731J123677m443338K8336P805301M594033p934148j4818574
36125a548580r579765J19501O607818R583484R192591L532838m034418n275955
36117H597514N44888L656959p48792l048733N063228J2927764L825989j6866988
$$ y = [-1411328, -3811470, 2341323, 12543875, 10151765, -10831214, -33098888, -36969137, -24896763, -12791413, -5703032, 2174902, 9469762, 7898258, -665587, -4637866, -2300087, -5606009, -20220948, -34845076, -36170849, -24672540, -10787633, -3716071, -7425356, -19404237, -29900865, -29692994, -20729886, -11813971, -4109231, 8215708, 22267758, 25550818, 15828601, 8026055, 12861653, 20841366, 18412159, 9479661, 7239402, 12096133, 13219810, 8776472, 8804808, 16610109, 21204142, 13269994, -1548580, -11128345, -11008844, -4401026, 5182458, 14375049, 17907887, 13873469, 8597514, 9142402, 12799361, 12050569, 9001836, 14065064, 26992828, 30818817, 13951829]
36109A3951829k4048593p899593J0593169R545327l646317p874840j840277p17593
36101a1936888o069352m009057O157373O981584o217293j3320642j117158J3755904
36093a5775529J0736974k829967o208853J121786L204483k570638l086208M633602
36085a0774350P181554k064039j1374123q391789L403302J1531975Q706177k945788
36077d727081j4056974j3605916k17763J2921057J2850529L943183j9242K775083
36069a37124K289724l867735o777659l076101j08875j359076j249196J987310
36061a2298732K523138p3837J319966O101945M077289n196392p587044K725227
36053h408440J1636564P030595k936297n999709n690402r882149j2244777l223975
$$ y = [13951829, -10096764, -17996357, -7403188, 2142139, -1504178, -9379018, -11219295, -11936888, -18006240, -22015297, -15857924, -8876340, -15093633, -28414275, -29531433, -15775529, -5038555, -7868522, -14077375, -12955589, -9751106, -12321744, -15407952, -10774350, -3592796, -5656835, -17030958, -25422747, -22019445, -10487470, -1781293, -4727081, -18784055, -32389971, -32607734, -19686677, -6836148, -2892965, -2912207, -137124, 2152600, -1715135, -8492794, -11568895, -11677770, -13036846, -14286042, -12298732, -9775594, -9849431, -8529465, -2427520, 1649769, -3546623, -11133667, -8408440, 3228124, 10258719, 7322422, 1322713, -4367689, -14249838, -26494615, -29718590]
36045b9718590R456867J0229990M49911m439240L4465K739735k129811n754736
36037a9131409l52098Q425643J0468497M724665j074074l57670M686476M527595
36029A1917625o131206j7609532j3915201M119102J5279596N925923r774778j0081881
36021b0270352M017332J4689489J5200473J2958135R778289K96571j0865317j1484910
36013A4319710l434410j657862p834080o406164O397696J1808374j330275j5839905
36005c976916j2060921J713567L863287o800222j2213276l984789P877262J3127021
35997a2454987J1707506O065329k484426q280924m804271L914802O144353n13757
35989g06375m815133J439468J0844156J0220830j935293j3273012j1687614J027705
$$ y = [-29718590, -20261723, -10031733, -9581822, -14021062, -13986597, -11246862, -13376673, -19131409, -19483507, -11057864, -589367, 4135298, 3061224, 2703554, 7390030, 11917625, 5786419, -11823113, -25738314, -21619212, -6339616, -413693, -10188471, -20270352, -16253020, -1563531, 13636942, 26595077, 36373366, 36669937, 25804620, 14319710, 10885300, 9227438, 1393358, -5012806, 1384890, 13193264, 11862989, -3976916, -16037837, -14324270, -10460983, -17261205, -29474481, -33459270, -25582008, -12454987, -747481, 5317848, 2833422, -5447502, -10251773, -6336971, -192618, -706375, -5521508, -4082040, 6762116, 16982946, 15047653, 1774641, -9912973, -8885268]
35981h885268J0440172N485103p556159j1858567j910844R224117R232572L901874
35973H073000N351339J0654832O769668o155918j2534835m696736N973407O649456
35965B0084213m79036o343162q723928r086626m714458N514122J3569642J1105279
35957B0926046K202992k415561j134427j505746o219812r643349q970511q263198
35949a5023566q354721k824790R853499J8341783J1633922l999287j0913250k438437
35941c724847R556420J1757370N870782K115495K257431j161297r385014j1824314
35933E462026j347178J2253747J3295391J788480o423288k395359L566527j639751
35925B4560595j3484995j6238543o490015J550793l137847j1945857q286970Q812272
$$ y = [-8885268, 1554904, 7040007, -516152, -12374719, -14285563, -5061446, 4171126, 8073000, 13424339, 24079171, 30848839, 24692921, 12158086, 7461350, 13434757, 20084213, 19605177, 13262015, 4538087, -4548539, -9262997, -3748875, 9820767, 20926046, 23129038, 20713477, 19579050, 18073304, 11853492, 2210143, -6760368, -15023566, -23378287, -26203077, -16349578, 1992205, 13626127, 9626840, -1286410, -3724847, 5831573, 17588943, 23459725, 25575220, 27832651, 26671354, 17286340, 5462026, 4114848, 16368595, 29663986, 31452466, 25029178, 22633819, 26200346, 24560595, 11075600, -5162943, -11652958, -10102165, -13240012, -25185869, -33472839, -24660567]
35917b4660567K1381599J4241836n601507j6197838o285681J1520205J6442414
35910A0840461M882999o900096n705894J930381J832945o232796r528074k447272
35902a1327346N833397N908381N13693k254654n43532J809908J830240j327282
35894D42805o656467r129526l406780O277598P772158j519586p593433P93050
35886a3020181J3968182J4641687L177157m721280k219220K139361J623475n39486
35878A5049695k144849n906336q686534k172057J0056063J1808908j050903j0819151
35870F134836m380683N435471P69753j1161436r043811P717032J6647824N349112
35862A7468098j1702270j4756253l133391Q881210J0700008L402732m809702o376226
$$ y = [-24660567, -3278968, 10962868, 5361361, -10836477, -17122158, -5601953, 10840461, 15723460, 8823364, 3117470, 5047851, 6880796, 648000, -8880074, -11327346, -5493949, 414432, 928125, -1326529, -1870061, -60153, 1770087, 442805, -6213662, -15343188, -18749968, -12472370, -4700212, -6219798, -13813231, -13020181, 948001, 15589688, 18766845, 14045565, 11826345, 13965706, 15589181, 15049695, 12904846, 6998510, -1688024, -3860081, 6195982, 18004890, 16953987, 6134836, 1754153, 7189624, 7959377, -3202059, -12245870, -4528838, 12118986, 17468098, 5765828, -8990425, -12123816, -3242606, 7457402, 10860134, 6050432, -325794]
35854c25794j131587L389827J725919j747237o66293J766918j282830o176920
35846d447997l723316K677313m92577j3036250j6352873r39523J6391369J5490108
35838d433746J505827n081289L77712L353319l739593r876200m643203N091393
35830a7445780O716394Q86261j695978J949792L672728r36939m126083K337254
35822h642351J3141302J4671198K728170j1830388j6080596q087787M540557J3412211
35814C852316J3851480O205590l141844o372886l498138k232804n542289o755014
35806c633589k257153M96266l166249l191694R124972K1041239J3308278q011175
35798B3710895j6294952l347054Q646565K394507q623295m341247Q979591R854325
$$ y = [-325794, -1457381, 1932446, 3658365, 1911128, 1244835, 3011753, 1728923, -4447997, -8171313, -5494000, -5986577, -19022827, -35375700, -36315223, -19923854, -4433746, -2927919, -8009208, -7631496, -4278177, -8017770, -17893970, -22537173, -17445780, -10729386, -9843125, -11539103, -9589311, -5916583, -6853522, -10979605, -8642351, 4498951, 19170149, 21898319, 10067931, -6012665, -14100452, -9559895, 3852316, 17703796, 23909386, 20767542, 14394656, 10896518, 8663714, 3121425, -3633589, -5890742, -5394476, -8560725, -11752419, -2627447, 18413792, 31722070, 23710895, 7415943, 4068889, 12715454, 15109961, 6486666, 2145419, 11125010, 20979335]
35790B0979335m272244j4519990r282777K234315O580818K632370j696332j82985
35782B472510O965971J3320523J0909756m10095j0111086q924797p27149L572143
35774A7067776L65105n538623j0121265j1919247q097795J381422P949944L175823
35766e736860p694184j1147675l861700M633508P416434O812731M927232L42331
35758d308183l140962J805929J0542648P228280j0061443j9422299m458002J8066162
35750c747870J8995490r26397j1941587L28580J4720720Q779298p428669j0091997
35742H687568j07472J404446r401039j2807144r07883O521009n272505j9107705
35734c0990725j2026684P110189J1263769j902330q319543K187875J1636281O291729
$$ y = [20979335, 16707091, 2187101, -7095676, -4861361, 1719457, 4351827, 2655495, 2472510, 9438481, 22759004, 33668760, 33258665, 23147579, 14222782, 13495633, 17067776, 17432881, 11894258, 1772993, -10146254, -18244049, -16862627, -8912683, -5736860, -13431044, -24578719, -28440419, -23806911, -16390477, -9577746, -4650514, -4308183, -7449145, -5643216, 4899432, 12127712, 2066269, -17356030, -21814032, -3747870, 15247620, 14321223, 2379636, 2708216, 17428936, 26208234, 18779565, 8687568, 8580096, 9984542, 583503, -12223641, -13131524, -6610515, -11883020, -30990725, -43017409, -35907220, -24643451, -26545781, -34865324, -32677449, -21041168, -14749439]
35726a4749439k140208Q9421N889940L722512r88277R90712K755112n268567j3120099
35717b2818893m724711J3352207J9172331Q711761j27756K453954N388743j242685
35709B0164951j0346822j1940764q097234n026035k260314J696753L048394N19835
35701a2241236J062705R298977J7893998J6570002O008795m258964q456025r218668
35693A6659584j1712316j6927826j9580694j2214409N154616K0401205K0749766
35686B529926Q948345o0998K61614P76476o233895j3400514r686337K344620J0273206
35677d247557Q438971J989495k915559m542754k449279L122957P944493O227463
35669A3568230j780319q841829q801744k531973M663028Q138983N867954n53445
$$ y = [-14749439, -16889647, -16800226, -10910286, -7187774, -8176051, -7185339, -4430227, -9698794, -22818893, -27543604, -14191397, 4980934, 13692695, 13564939, 16018893, 21407636, 20164951, 9818129, -2122635, -10219869, -15245904, -17506218, -15809465, -12761071, -12241236, -11178531, -1879554, 16014444, 32584446, 38593241, 34334277, 25878252, 16659584, 4947268, -11980558, -31561252, -43775661, -38621045, -18219840, 2529926, 11478271, 11417273, 11678887, 12455363, 6221468, -7179046, -16865383, -14520763, -4247557, 4191414, 6180909, 3265350, -1277404, -3726683, -603726, 7340767, 13568230, 11787911, 2946082, -5855662, -8387635, -3724607, 4414376, 10282330, 9728885]
35661I728885n051248j388341Q139674J1783773J669695j3701208j7644846o933177
35653a3396793L304649P38659p018959n368542M382888Q250896K464261k072130
35645h715071P03595L265764j67597l702348j861745J117253J179530J026134
35637g154485L5493p361166j4936266n008244K0895041L1796498Q398728k3213777
35629C451822k5396569k664852R565069J086524m051696O195985J3747437O908942
35621H842662J101769Q139026J3519313K993422j1687324j3535402p510353o592032
35613d728919p034673J032035J0747686P955630m135321r019800j405335P732932
35605A144235P585297k031038j2319728j0420571Q587559K8026953K2009133q513282
$$ y = [9728885, 4677637, 3289296, 11428970, 23212743, 24882438, 11181230, -6463616, -13396793, -10092144, -9353485, -16372444, -21740986, -17358098, -9107202, -6642941, -8715071, -8011476, -4745712, -4913309, -8615657, -10477402, -9360149, -8180619, -7154485, -7118992, -14480158, -29416424, -34424668, -13529627, 18266871, 26665599, 3451822, -21944747, -24609599, -15044530, -13958006, -18009702, -11813717, 1933720, 8842662, 9944431, 18083457, 31602770, 34596192, 22908868, 9373466, 1863113, -4728919, -11763592, -10731557, 16129, 7971759, 3836438, -5183362, -6588697, 1144235, 8729532, 6698494, -5621234, -16041805, -7454246, 20572707, 42581840, 34068558]
35597C4068558k9184694j6933305O570703P368063j0878830j7192484l265879
35590b9447868Q744469O565221M236269J1936279J7111341P782948o603930j1281635
35582I043094p180278l031825M31980N635047P920523K828267l607026k930144
35574I109638K754672N293860L085085L06470k140877n899914q318236n196732
35566a006034Q81849K894558k61369l033921l087396m181508p224303o515122
35558b1533246P9377M260698j028260p620535j272895J5481507K2657936R925091
35550B0949673p962137j2073199m667664l11194n60301M404474J2942822J1386026
35542B4108500j615905r708464l961815M020658K332600l915614n272543k961500
$$ y = [34068558, 4883864, -12049441, -5478738, 1889325, -8989505, -26181989, -29447868, -20703399, -14138178, -9901909, 2034370, 19145711, 26928659, 20324729, 9043094, 1862816, -1169009, -737029, 4898018, 12818541, 15646808, 12039782, 9109638, 11864310, 17158170, 20243255, 20549725, 18408848, 12508934, 4190698, -1006034, -124185, 2770373, 2509004, -524917, -3612313, -7793821, -15018124, -21533246, -21453869, -17193171, -18221431, -25841966, -27114861, -11633354, 11024582, 20949673, 12987536, 914337, -3753327, -4064521, -4624822, -220348, 12722474, 24108500, 22492595, 12784131, 8822316, 12842974, 15175574, 11259960, 5987417, 3025917]
35534C025917k74892O323016J4728620J0617991j0326800k6338077j5468578J0692333
35526g020470J9928452K352108j9261731k2131312q537260N388576J1288133J2060690
35518e932814J1926188R520809L17349j3799202j9224276l823967K1881348K9532242
35510C0397677P580753k0935160k7146138j1823792K289545L814709J127337L426720
35502a1268349J0318634J7387599J8611561P361906j2589811k3418134j4108525
35495g705119K292206O692898N11092k381637p67184l062725o930220l653651
35487a5004340K907569L413351K968355J0915392J7528370P461992q929494p660663
35479A3600532Q081315J1609964k071936r378220j410348J981264q225821j2426647
$$ y = [3025917, 2751025, 9074041, 23802661, 34420652, 24093852, -2244225, -17712803, -7020470, 12907982, 15260090, -4001641, -26132953, -34670213, -29281637, -17993504, -5932814, 5993374, 15514183, 15831532, 2032330, -17191946, -21015913, 865435, 30397677, 37978430, 17043270, -10102868, -21926660, -19637115, -15822406, -14695069, -11268349, -949715, 16437884, 35049445, 42411351, 29821540, 6403406, -7705119, -5412913, 1279985, 1791077, -590560, -1357744, -4420469, -11350689, -15004340, -12096771, -8683420, -5715065, 5200327, 22728697, 30190689, 21261195, 13600532, 21681847, 33291811, 31219875, 21841655, 20431307, 22412571, 14186750, 1760103]
35471A760103o3553Q535445j715083j3240974p893604J326254k927225q529507
35463b2748144L057897J9534075J5878311l292931j1158781j318065O286874k52961
35455E986275j0046295j0521940l309840L801834O650810N021578K460837L870198
35447C913457P353784N204137k134309n047972l399320q782849j9071707j3053492
35439c5018271J3589522L0670247J5278309j0502361j3076740P3533k915925k1609653
35431b3511339k4253675k670070J4726342J1092413N053710J3386570K2101325
35424A5925276J3483689k862913p033519R8991K617122m493037j2054426j2845676
35416g164493p855447m09550O423310R224094P034682K550884j833414n528569
$$ y = [1760103, 1696550, 10231995, 8516912, -4724062, -12617666, -11291412, -14218637, -22748144, -19690247, -156172, 15722139, 12429208, 1270427, -47638, 6239236, 5986275, -4060020, -14581960, -17891800, -14089966, -7439156, -2417578, 43259, 3913457, 11267241, 16471378, 14337069, 9289097, 5889777, -2893072, -21964779, -35018271, -21428749, 9241498, 24519807, 14017446, 940706, 1014239, -1901686, -23511339, -47765014, -50435084, -35708742, -24616329, -19562619, -6176049, 15925276, 29408965, 26546052, 19512533, 19611524, 22228646, 17735609, 5681183, -7164493, -15019940, -15429490, -9006180, 217914, 7252596, 9803480, 7970066, 2441497]
35408B441497o870928l875801J892444O621955P953934L926997o264815j5293256
35400i467973j0663823O266658J5122625L644676j1406862q260454N828853P538204
35392a398096l568976o566215L191004P448290r66536o272733P07177P590741
35384A64656N062247K180960N620420O130274j965660q672930p618779o580793
35376e679605p458235R54169J6770145J7312750m040340j8802221m806538J6440943
35368A0691068J2209298j0821353k0597692j0760288l198742o390050n424752
35361c4292511O092599J4582792J1543837N095828J497699l171979q448206o785526
35353a3885467K02019J545798l394793l510076K678904L588384l379919o116154
$$ y = [2441497, -4429431, -8305232, -6412788, 209167, 8163101, 12090098, 5825283, -9467973, -20131796, -13865138, 1257487, 4902163, -6504699, -14765153, -8936300, -1398096, -4967072, -11533287, -8342283, -893993, -1860529, -8133262, -7426085, 164656, 5226903, 7407863, 13028283, 19158557, 17192897, 8519967, 901188, -5679605, -13137840, -12183671, 4586474, 21899224, 17858884, -943337, -5749875, 10691068, 22900366, 12079013, -8518679, -19278967, -22477709, -28867759, -34292511, -28199912, -13617120, -2073283, 3022545, 4520244, 1348265, -7099941, -13885467, -13683448, -12137650, -15532443, -19042519, -16363615, -12775231, -16155150, -22271304]
35345b2271304K59156N055921K232816o8289K334582J184179n688237o524951
35337b3486127L094838R797679N037032m62038J833145J849850p428257j1253102
35329b1016980K589030J7411726J0700396q857936j4505419l000609N621459N128604
35321e929729R118010J8937623J6761739j449925j4289406q375764J363668m92442
35313A5643774m929138L49237N550564k853528j4526436j1145627J305428K383305
35305h222421p624889r724571j018029Q64902q511214r991250O248365K1930354
35297a6048753J8847452N355603j523300k760238p242264r860393j577223Q865472
35289e943644O469899l022496j495369R088374Q081240p930277j6681562n845275
$$ y = [-22271304, -22012148, -16956227, -14723411, -14791700, -12457118, -11272939, -16961176, -23486127, -20391289, -10593610, -5556578, -6018616, -4185471, -2335621, -9763878, -21016980, -18427950, -1016224, 9684172, 826236, -13679183, -16679792, -11058333, -5929729, 3188281, 22125904, 38887643, 37437718, 23148312, 14772548, 16136216, 15643774, 10714636, 11063873, 16614437, 13760909, -765527, -11911154, -10605726, -8222421, -15847310, -25571881, -26589910, -25725008, -34236222, -44227472, -37979107, -16048753, 2798699, 8154302, 6631002, 3870764, -3371500, -13231893, -14809116, -5943644, 526255, -2496241, -3991610, 5096764, 13178004, 5247727, -11433835, -17279110]
35281a7279110P358364N546703j903423K64538M469361l217302j1395392K128979
35273a4027282K8515895L2014099J989831k7437328k4086699j038481P390519
35266C320554l460473q012497N438952J7220721P911232j3867278k6094844k1290227
35258c8833860p850454N957696J6037563J7093419P181622m399995n725095J470432
35250i068672M709274R0948k924076J505458N807018K263699l894503l161098
35242d671952L447733P309004N387742J838952o71738l060942m751225l573843
35234A253731L7336L849624O445079M540952o524074k1886368k3959374l448112
35226c9691206K0923570K1089314j599024j5666197l332154J5344605J5017765
$$ y = [-17279110, -9920746, -4374043, -6277466, -6012928, -1543567, -4760869, -16156261, -14027282, 14488613, 46502712, 48492543, 21055215, -3031484, -4069965, 3320554, -139919, -8152416, -2713464, 14507257, 22418489, 8551211, -17543633, -38833860, -46684314, -40726618, -24689055, -7595636, -414014, -4814009, -10539104, -9068672, -4359398, -4268450, -7192526, -5687068, 119950, 2383649, -1510854, -4671952, -1224219, 6084785, 11472527, 13311479, 12639741, 9578799, 4827574, 1253731, 1291067, 5140691, 11585770, 16126722, 9602648, -12283720, -36243094, -39691206, -18767636, 2321678, 722654, -14943543, -18275697, -2931092, 12086673]
35219A2086673K928288K932404J3902036J1416023j0492711k6579983j7815042
35212a1622312J027346N929139j326977j901502P103507J0546831L061170k765934
35204A0051268N52186L508651j335450n443969j267766J598493o761517j4814230
35196a3912334m574599J7449689K5983623J3152274k721995p745886r259279j3807286
35188D564207j1393670L191124J3412015N417575o711791l330571O494270O62623
35180A2305782j4875448j2808493R113568K1709900J0618303l329687k478597
35173B0255328l49053j1710816k1513540r853634J1520298J6123380L334869n888994
35165A917838n050591n475354q402973k563179R835054J1760076M94502o191352
$$ y = [12086673, 15014961, 17947365, 31849401, 43265424, 32772713, 6192730, -11622312, -10594966, -4665827, -5992804, -7894306, -790799, 9756032, 12817202, 10051268, 10603454, 14112105, 12776655, 7332686, 6064920, 7663413, 901896, -13912334, -18486933, -1037244, 24946379, 38098653, 35376658, 27630772, 18371493, 4564207, -6829463, -3638339, 9773676, 15191251, 8479460, 5148889, 11643159, 12305782, -2569666, -15378159, -6264591, 15445309, 26063612, 22733925, 20255328, 19906275, 8195459, -13318081, -23171715, -11651417, 4471963, 7806832, 1917838, -3132753, -8608107, -17011080, -19574259, -9739205, 2020871, 2515373, -3675979]
35157c675979N07734P427782M267524m2414L192710N997714J4669p312211o986567
35148C390962m530479p040507p145573L609978J5588876J2806852k566534j3642026
35140D71549j2338477m691852L585136J1842148J6413089J1825430P47906q002668
35132A9852261j0975290j0462256o390768J341897N958490J952158k856136K143708
35124E64064J0144870M728862j1594028j6457612r10430J5653409J4045481J561804
35116A7736420m036769k023743k796436n400336j109025O188453L852412o171300
35108F239676p938357J566044N629017m548988j3530339n516633J0096198J3597028
35100E593646N405228K336881Q009590P822858m595834j5696459j4109261p325882
$$ y = [-3675979, -3168245, 4259537, 8527061, 8484647, 11677357, 17675071, 17689740, 10377529, 3390962, -1139517, -8180024, -15325597, -11715619, 3873257, 16680109, 14113575, 471549, -11866928, -16558780, -12973644, -1131496, 15281593, 27107023, 27854929, 19852261, 8876971, -1585285, -7976053, -6634156, -675666, 1276492, -1579644, 564064, 10708934, 15437796, 3843768, -12613844, -13524274, 2129135, 16174616, 17736420, 13699651, 11675908, 8879472, 3479136, 2370111, 8558564, 12410976, 6239676, -1698681, -132637, 5496380, 947392, -12582947, -18099580, -8003382, 5593646, 10998874, 13335755, 21345345, 29168203, 24572369, 8875910, -5233351, -12559233]
35092a2559233n326189k669082P944628J6330566Q382492p891986j1106547M45187
35084f450164O164894l460315j2593248p390134K492662K757144j933432M83442
35076a9929151O947949O127047p93220l596826j358331p17725o60432M412821
$$ y = [-12559233, -17885422, -20554504, -12609876, 3720690, 12103182, 4211196, -6895351, -6450164, -285270, -3745585, -16338833, -23728967, -21236305, -18479161, -20412593, -19929151, -12981202, -6854155, -7647375, -11244201, -12602532, -13320257, -13980689, -9567868]
$$ [...]
##END NTUPLES=NMR SPECTRUM
##END=
