##TITLE=31Pdec_SR146H3HCl
 D2O, 24 sc
 11.4.2023
##JCAMPDX= 6.0         $$ Bruker NMR JCAMP-DX V2.0
##DATA TYPE= NMR SPECTRUM
##DATA CLASS= NTUPLES
##ORIGIN= UXNMR, Bruker Analytische Messtechnik GmbH
##OWNER= root
$$ XWIN-NMR		Version 3.5
$$ Tue Apr 11 16:23:25 2023 Russian Standard Time (UT+4h)  she@DPX200
##.OBSERVE FREQUENCY= 81.013821
##.OBSERVE NUCLEUS= ^31P
##.ACQUISITION MODE= SIMULTANEOUS
##.ACQUISITION SCHEME= undefined
##.AVERAGES= 24
##.DIGITISER RES= 16
##SPECTROMETER/DATA SYSTEM= spect
##.PULSE SEQUENCE= zgpg30
##.SOLVENT NAME= CDCl3
##.SHIFT REFERENCE= (INTERNAL, CDCl3, 0, 248.564)
##AUDIT TRAIL= $$ (NUMBER, WHEN, WHO, WHERE, WHAT)
$$ ##TITLE= Audit trail, XWIN-NMR		Version 3.5
$$ ##JCAMPDX= 5.01
$$ ##ORIGIN= Bruker BioSpin GmbH
$$ ##OWNER= she
$$ F:/spectra/data/she/nmr/P31/1/pdata/1/auditp.txt
$$ ##AUDIT TRAIL=  $$ (NUMBER, WHEN, WHO, WHERE, WHAT)
(   1,<2023-04-11 16:22:20.73 +0400>,<she>,<DPX200>,
      <created by zg, POWCHK disabled, PULCHK disabled
       configuration hash MD5:
       00 E9 B6 7A A2 85 ED C7 34 08 36 98 17 FE 4E 26
       data hash MD5: 32K
       36 2F BB 5A 7B 12 5A FA 04 7A 7B 7A 8A 66 D7 4D>)
(   2,<2023-04-11 16:22:27.20 +0400>,<she>,<DPX200>,
      <Start of raw data processing
       efp BC_mod = 2 LB = 1 FT_mod = 6 PKNL = 1 PHC0 = -11206.48 PHC1 = 557.0854 SI = 64K 
       data hash MD5: 64K
       39 01 86 7D D1 35 08 96 DB F0 08 07 4F D0 56 93>)
(   3,<2023-04-11 16:22:45.54 +0400>,<she>,<DPX200>,
      <pk PHC0 = -6.002464 PHC1 = 0 
       data hash MD5: 64K
       DD 54 B8 E6 8A A4 1F 18 9F C0 3A B5 AC 56 DB 77>)
$$ ##END=
$$ 
$$ hash MD5
$$ C2 72 BC 79 F8 EC 10 C3 21 A1 F1 5C D0 44 7C F3
##$RELAX= 
##$RELAX= 
##$RELAX= 
##$RELAX= 
##$RELAX= 
##$RELAX= 
##$RELAX= 
##$RELAX= 
##$RELAX= 
$$ Bruker specific parameters
$$ --------------------------
##$DU= <F:/spectra>
##$EXPNO= 1
##$NAME= <P31>
##$PROCNO= 1
##$TYPE= <nmr>
##$USER= <she>
##$AMP= (0..31)
100 100 100 100 100 100 100 100 100 100 100 100 100 100 100 100 100 100 
100 100 100 100 100 100 100 100 100 100 100 100 100 100 
##$AQSEQ= 0
##$AQ_mod= 1
##$AUNM= <au_zg>
##$AUTOPOS= <>
##$BF1= 81.014009
##$BF2= 200.13
##$BF3= 200.13
##$BF4= 200.13
##$BF5= 200.13
##$BF6= 200.13
##$BF7= 200.13
##$BF8= 200.13
##$BYTORDA= 1
##$CFDGTYP= 0
##$CFRGTYP= 5
##$CHEMSTR= <none>
##$CNST= (0..31)
1 1 145 1 1 1 1 1 1 1 1 1 1 1 1 1 1 1 1 1 1 1 1 1 1 1 1 1 1 1 1 1 
##$CPDPRG= <waltz16>
##$CPDPRG1= <>
##$CPDPRG2= <waltz16>
##$CPDPRG3= <>
##$CPDPRG4= <mlev>
##$CPDPRG5= <mlev>
##$CPDPRG6= <mlev>
##$CPDPRG7= <mlev>
##$CPDPRG8= <mlev>
##$CPDPRGB= <>
##$CPDPRGT= <>
##$D= (0..31)
0 1 0 0 0 0 0 0 0 0 0 0.03 2e-05 3e-06 0 0 0 0 0 0 0 0 0 0 0 0 0 0 0 0 
0 0 
##$DATE= 1681215739
##$DBL= (0..7)
120 120 120 11 120 120 24 19 
##$DBP= (0..7)
150 150 150 150 150 150 150 150 
##$DBP07= 0
##$DBPNAM0= <>
##$DBPNAM1= <>
##$DBPNAM2= <>
##$DBPNAM3= <>
##$DBPNAM4= <>
##$DBPNAM5= <>
##$DBPNAM6= <>
##$DBPNAM7= <>
##$DBPOAL= (0..7)
0.5 0.5 0.5 0.5 0.5 0.5 0.5 0.5 
##$DBPOFFS= (0..7)
$$ [...]
##$SUBNAM2= <"">
##$SUBNAM3= <"">
##$SUBNAM4= <"">
##$SUBNAM5= <"">
##$SUBNAM6= <"">
##$SUBNAM7= <"">
##$SUBNAM8= <"">
##$SUBNAM9= <"">
##$SW= 501.771253377433
##$SWIBOX= (0..15)
0 1 3 0 0 0 0 0 0 0 0 0 0 0 0 0 
##$SW_h= 40650.406504065
##$TD= 32768
##$TD0= 1
##$TE= 0
##$TE2= 300
##$TE3= 300
##$TEG= 300
##$TL= (0..7)
0 120 53 12 22 120 120 120 
##$TP= (0..7)
150 150 150 150 150 150 150 150 
##$TP07= 0
##$TPNAME0= <>
##$TPNAME1= <>
##$TPNAME2= <>
##$TPNAME3= <>
##$TPNAME4= <>
##$TPNAME5= <>
##$TPNAME6= <>
##$TPNAME7= <>
##$TPOAL= (0..7)
0.5 0.5 0.5 0.5 0.5 0.5 0.5 0.5 
##$TPOFFS= (0..7)
0 0 0 0 0 0 0 0 
##$TUNHIN= 0
##$TUNHOUT= 0
##$TUNXOUT= 0
##$USERA1= <user>
##$USERA2= <user>
##$USERA3= <user>
##$USERA4= <user>
##$USERA5= <user>
##$V9= 5
##$VALIST= <valist>
##$VCLIST= <CCCCCCCCCCCCCCC>
##$VD= 0
##$VDLIST= <DDDDDDDDDDDDDDD>
##$VPLIST= <PPPPPPPPPPPPPPP>
##$VTLIST= <TTTTTTTTTTTTTTT>
##$WBST= 1024
##$WBSW= 4
##$XGAIN= (0..3)
0 0 0 0 
##$XL= 0
##$YL= 0
##$YMAX_a= 1296
##$YMIN_a= -1708
##$ZGOPTNS= <>
##$ZL1= 120
##$ZL2= 120
##$ZL3= 120
##$ZL4= 120
##$ABSF1= 0
##$ABSF2= 0
##$ABSG= 0
##$ABSL= 0
##$ALPHA= 0
##$AQORDER= 0
##$ASSFAC= 0
##$ASSFACI= 0
##$ASSFACX= 0
##$ASSWID= 0
##$AUNMP= <proc_1d>
##$AZFE= 0.1
##$AZFW= 0.5
##$BCFW= 0
##$BC_mod= 2
##$BYTORDP= 0
##$COROFFS= 0
##$CY= -3
##$DATMOD= 1
##$DC= 0
##$DFILT= <>
##$DTYPP= 0
##$F1P= 0
##$F2P= 0
##$FCOR= 1
##$FTSIZE= 65536
##$FT_mod= 6
##$GAMMA= 0
##$GB= 0
##$INTBC= 1
##$INTSCL= 6.047779e-11
##$ISEN= 30
##$LB= 1
##$LEV0= 0
##$LPBIN= 0
##$MAXI= 10000
##$MC2= 0
##$MEAN= 0
##$ME_mod= 0
##$MI= 50
##$NCOEF= 0
##$NC_proc= -8
##$NLEV= 6
##$NOISF1= 182.463
##$NOISF2= 159.3651
##$NSP= 0
##$NTH_PI= 0
##$NZP= 0
##$OFFSET= 248.5645
##$PC= 4
##$PHC0= -11212.48
##$PHC1= 557.0854
##$PH_mod= 1
##$PKNL= yes
##$PPARMOD= 0
##$PSCAL= 0
##$PSIGN= 0
##$REVERSE= no
##$SF= 81.0140089999694
##$SI= 65536
##$SIGF1= 159.3651
##$SIGF2= -187.1042
##$SINO= 113.3802
##$SIOLD= 16384
##$SREGLST= <1H.CDCl3>
##$SSB= 0
##$STSI= 65536
##$STSR= 0
##$SW_p= 40650.406504065
##$SYMM= 0
##$S_DEV= 0
##$TDeff= 32768
##$TDoff= 0
##$TI= <>
##$TILT= no
##$TM1= 0
##$TM2= 0
##$TOPLEV= 0
##$USERP1= <user>
##$USERP2= <user>
##$USERP3= <user>
##$USERP4= <user>
##$USERP5= <user>
##$WDW= 1
##$XDIM= 65536
##$YMAX_p= 114969703
##$YMIN_p= -279156874
$$ End of Bruker specific parameters
$$ ---------------------------------
##NTUPLES= NMR SPECTRUM
##VAR_NAME=  FREQUENCY,     SPECTRUM/REAL,   SPECTRUM/IMAG
##SYMBOL=    X,             R,               I
##VAR_TYPE=  INDEPENDENT,   DEPENDENT,       DEPENDENT
##VAR_FORM=  AFFN,          ASDF,            ASDF
##VAR_DIM=   65536,         65536,           65536
##UNITS=     HZ,            ARBITRARY UNITS, ARBITRARY UNITS
##FACTOR=    0.620285442955139, 1,           1
##FIRST=     20137.2065510682, 0,            0
##LAST=      -20513.1999529968, 0,           0
##MIN=       -20513.1999529968, -279156874,  0
##MAX=       20137.2065510682, 114969703,    0
$$ Real data points
##PAGE= N=1
##DATA TABLE= (X++(R..R)), XYDATA
$$ [...]
15143 243471 3049560 5062433 6213789 4607651 601796 -1929603 -1080308 -151881 -2299711
15134 -2299711 -4955856 -3533565 1184808 3706065 1491167 -1930280 -2251957 284119
15126 284119 2373253 2470598 2189735 3292061 4554422 2481400 -4321531 -11980051 -14480009
15117 -14480009 -10811559 -6706620 -7040500 -8687478 -4944123 3747623 8720024 4399057
15109 4399057 -3962390 -7416781 -4742342 -1884798 -1914309 -1559888 1539091 3787250 1014635
15100 1014635 -4747276 -7762609 -5971820 -2363143 -234449 -606420 -3510858 -7865103
15092 -7865103 -9995708 -6489386 281245 3407410 285114 -3450411 -1855011 2709576
15084 2709576 3199386 -1877309 -6923327 -7640027 -5929745 -5121948 -4648473 -2219889 1442802
15075 1442802 3178716 1651752 -1184601 -2463182 -921448 2382665 4880230 4680489
15067 4680489 2727188 2019298 4142968 7588020 9941685 10302847 8812038 5523647
15059 5523647 1102436 -2628585 -4188077 -3614913 -1484734 1667660 4113443 3418835
15051 3418835 -48781 -2258858 -561693 2317828 2291577 283581 776794 4599136 7350136
15042 7350136 5906964 3025374 3602889 8435394 13398394 13864227 9147634 3282361
15034 3282361 1273771 3622460 5494555 3008311 -1249054 -2123184 47160 66620 -3278212
15025 -3278212 -4564742 -62340 6307500 8824290 7610200 6090061 4269325 -66455
15017 -66455 -5497279 -8120364 -8034534 -9183523 -12209996 -12698060 -8190589 -2349099 483939
15008 483939 1183756 3105053 6155662 7284039 5532139 3134701 1858525 1184688 581218
14999 581218 1155862 3802083 7083651 8379275 6769611 3856848 1818631 1489145 2518612
14990 2518612 4319464 5782094 4850314 503269 -4414322 -4712937 940319 6992294
14982 6992294 6810106 818480 -4021777 -2919329 1621359 4430616 4483324 4606374 6006606
14973 6006606 6150269 2449825 -3859176 -8621964 -8995368 -6035572 -3043921 -1919716
14965 -1919716 -1850397 -1463625 -926850 -1054681 -1542552 -1633602 -1732447 -2480648 -2746929 -763870
14955 -763870 2775471 5034186 4716817 3190521 1593217 -573645 -3162540 -4411089
14947 -4411089 -3606135 -2227724 -983237 1546388 5305230 6717888 3230907 -2373545
14939 -2373545 -5572612 -6180652 -7101640 -8498606 -7702832 -4560839 -2299248 -2390628 -2695159
14930 -2695159 -1861563 -1537622 -2400457 -1927983 1078919 3063794 434896 -4475396 -6019558
14921 -6019558 -2601642 2264879 5624661 7884876 9559631 8974706 4987985 -378779
14913 -378779 -3805999 -3749070 -683174 3788836 6774953 5273853 -161115 -4499102 -3759489
14904 -3759489 -548159 -875910 -5594031 -8722155 -5692034 110431 1927815 -1313529
14896 -1313529 -4207981 -2759693 572432 1112436 -1357402 -2808903 -1091801 983820
14888 983820 -47741 -2688938 -1899976 3580890 8265327 6651786 997796 -1469068
14880 -1469068 1322667 3649399 1041729 -2669298 -1002715 5789714 11622053 12970056
14872 12970056 11578505 9733564 7779073 6394636 6600349 6663547 3317675 -2729996
14864 -2729996 -6540390 -5681813 -3476396 -3898173 -6835834 -10081926 -12289706 -12061575 -8032443
14855 -8032443 -2250701 400046 -1064647 -1439563 2935117 7970717 7510009 2068123
14847 2068123 -2679488 -3790653 -2781580 -1128593 1292316 3943778 5667529 6704343
14839 6704343 7913685 8778643 8431896 7244031 5495807 2832933 914422 2857501
14831 2857501 7213941 7223058 473321 -5656482 -4226942 402783 -156500 -4116220 -2446548
14822 -2446548 5711239 11295122 9802061 7176021 8318399 9084537 4506847 -2402730
14814 -2402730 -5470180 -3663708 28792 3552565 5640336 4795470 1985569 732476
14806 732476 1866247 2250821 929533 1475643 5373562 8447293 7561672 5725906 6285538
14797 6285538 6897815 4164700 121048 -1005557 780673 2755242 4357778 6076977
14789 6076977 6403794 4416824 2780184 3826589 5121388 3130817 -1018780 -3513727
14781 -3513727 -3438060 -2600757 -1855406 -1098395 -972785 -1602976 -1724952 -1229106 -1620976 -2247813
14771 -2247813 -364563 3016471 2865939 -1436547 -3854594 -1701332 -545294 -3819398
14763 -3819398 -5589411 -1188648 2779733 -1184558 -7802831 -7147889 -1262102 80069
14755 80069 -3243280 -2376540 3671704 6098751 2452546 891657 4908911 6694302 1084421
14746 1084421 -5249692 -5223151 -2374701 -3226654 -6501732 -7396214 -6259248 -5803455 -4755633
14737 -4755633 -1023483 2909118 3775183 3159148 3996466 4859290 2910909 -340362 -1003996
14728 -1003996 1785904 6132293 10419131 12926273 11520150 6886818 2955355 1473419
14720 1473419 -70158 -2701260 -3115311 62127 2536089 1319730 243025 3060059
14712 3060059 5816738 2566238 -4900234 -9784836 -10177198 -9535644 -9021222 -6052312 -87959
14703 -87959 5849728 9479475 10495610 8009831 1541246 -5457935 -7515213 -3271884
14695 -3271884 3296821 7649134 8021067 4995236 905804 -1027492 210920 2045814
14687 2045814 2178931 1823366 2376896 1758732 -1782678 -4697059 -2185062 4067119 7397546
14678 7397546 4912200 -94308 -4150908 -7059181 -8897721 -8331015 -5357187 -2337378
14670 -2337378 -1083319 -1353391 -2421266 -3525794 -3073353 -452832 1654170 86498
14662 86498 -3838445 -5621636 -3845343 -1611356 -1492064 -2640050 -3510424 -3928022 -3422072
14653 -3422072 -750901 3430615 5987209 4958513 2092698 614199 1656275 3444505
14645 3444505 3150972 -224932 -3974478 -3742762 1192290 6224127 6833741 3915081 1423261
14636 1423261 834978 979614 1347396 1938258 1545791 -15836 167543 3751399 6836836
14627 6836836 5232379 2035452 3520763 8579460 9746194 5141973 1535077 3434701
14619 3434701 6604369 5826762 2394912 -394840 -3111345 -6410898 -6723888 -1800196
14611 -1800196 3461705 3208033 -130710 577201 5922367 9036795 5919288 477321
14603 477321 -2171219 -2261109 -2726103 -3721958 -2983168 117550 3424794 4329324 1769340
14594 1769340 -3507554 -9276401 -12514357 -11041139 -5347592 1433603 6098512 8082523
14586 8082523 9077094 10071263 10165866 8828210 7316427 6236488 3703730 -1347842 -5695577
14577 -5695577 -5446938 -2325266 -1890985 -5211386 -7062222 -3929823 779915 2135900
14569 2135900 347255 -1242884 -1554718 -1379492 -125475 2907145 5645102 5750659 5019995
14560 5019995 7140153 11324865 12365640 7914797 2194912 672615 3442218 6022262
14552 6022262 5446283 3361178 2966597 4471536 4983133 2824793 268538 493396 2948637
14543 2948637 4259280 3490120 3336641 5237499 6679076 5399692 3282620 3131551 3883007
14534 3883007 2527031 -669986 -2499761 -1634627 344478 2356455 4729656 6629777
14526 6629777 6213084 4174930 3828845 6328393 8787171 8791344 7883578 8247002 8533131
14517 8533131 6306695 3054958 2747071 5375740 5851604 1039773 -5079216 -6182908
14509 -6182908 -1994774 1520621 251168 -3323188 -4949854 -4977810 -6694342 -9984401
14501 -9984401 -10795486 -7337031 -3214058 -2623721 -4915979 -6119355 -4286888 -1115056
14493 -1115056 796517 223722 -2568205 -5987525 -7548993 -5986789 -3201326 -2587302
14485 -2587302 -4889707 -6911961 -5156595 -26023 4626004 6069375 5758505 6939441
14477 6939441 9804966 10918212 8154102 4142359 2737878 3616765 3388659 1240320
14469 1240320 -302963 -335118 -986810 -2658740 -2347296 780215 2513951 82679 -2370567
14460 -2370567 172374 5049762 5511324 1225818 -1619213 -639725 -458904 -3728802 -5855167
14451 -5855167 -2600053 2578842 3854123 1661304 428488 564897 -979557 -3382014
14443 -3382014 -1804848 4422262 9105728 7130692 1037846 -3101980 -3218843 -1549883
14435 -1549883 168819 2095799 3806580 3877314 2265299 642222 -247583 -1637595 -4382218
14426 -4382218 -7181227 -8344161 -8309972 -9000725 -10840562 -11589538 -8762890 -2871641 2480848
14417 2480848 4119346 2479151 594848 339061 1032016 1778875 2960918 4037153 2019188
14408 2019188 -4928455 -13125836 -15868489 -10857774 -2611620 3170587 4949193 4111923
14400 4111923 1762773 -746726 -703546 2982857 6840618 6279434 1638589 -2252821 -2534082
14391 -2534082 -1242118 -1242558 -2259851 -2365240 -1151172 210685 562335 -803986 -3765895
14382 -3765895 -6281223 -5486397 -1582614 984318 -1429723 -6314149 -7323544 -2077936
14374 -2077936 4704366 6806558 3466911 -752185 -1893216 -314158 1471467 2339344
14366 2339344 2425335 1014040 -2688365 -6638320 -6819830 -2713780 442706 -2297125 -8528818
14357 -8528818 -10896270 -6534056 -594613 892956 -1475834 -2554224 99 3693822
14349 3693822 5719129 6169731 6121191 5250713 3127957 1300906 1874899 4234830 5032783
14340 5032783 2121636 -2585500 -5121530 -3887368 -1248272 -740924 -3144411 -5389037
14332 -5389037 -3460556 3055657 9400471 9910560 4408445 -1325438 -2595306 -1108236
14324 -1108236 -928295 -1558135 513187 4358601 4370704 -1195568 -6530597 -5773716 -79718
14315 -79718 5688351 9244037 10286137 7599465 1479045 -3794299 -4681927 -3343088 -3468190
14306 -3468190 -4012200 -2419633 -1227173 -4595316 -9916881 -10442688 -5941680 -2990645
14298 -2990645 -3857503 -3114421 2301201 7239066 6428653 2152986 -554292 -1173644 -1657235
14289 -1657235 -1629020 -345711 151605 -1634372 -3120621 -1502450 1598338 3187076 3912225
14280 3912225 6082142 8927345 9647812 7492641 3750056 -458863 -3783125 -4297158
14272 -4297158 -2010844 658676 2732150 5561936 8083737 6124724 -327136 -4499006
14264 -4499006 -2099388 1849753 1057179 -2021769 -1136713 2842123 4016758 1824848
14256 1824848 826155 1435093 -545527 -5060599 -6718988 -3861847 -1298442 -2053089 -3073581
14247 -3073581 -1507173 813302 1747690 2204755 2451118 300555 -3986263 -5790109 -2548384
14238 -2548384 1935378 2997771 1445877 949700 2048205 2378628 1055860 -264371
14230 -264371 153022 2354462 4565062 4291206 1101536 -1760469 -958748 1907203 2025343
14221 2025343 -1859493 -6170449 -8324658 -9455507 -10323358 -9271205 -6310989 -4903244
14213 -4903244 -6999910 -9885777 -10386302 -8784700 -6401693 -3232585 -589278 -1807616
14205 -1807616 -6774194 -9634948 -6134869 19698 2497935 1047861 19843 775581
14197 775581 1208682 1391421 3733756 7461997 8389990 5352774 2312444 2330201 3257352
14188 3257352 1671494 -1860988 -4119983 -4030127 -3550426 -4462778 -6278352 -7346703 -6765679
14179 -6765679 -4941652 -2979263 -1784623 -1366516 -750430 1165859 4314242 7173012
14171 7173012 8293274 7924488 7164226 5575509 1474974 -4529733 -8367768 -6915151
14163 -6915151 -2122463 1602504 2781004 2805432 1940108 -530632 -2596133 -769682 3883533
14154 3883533 5543076 1642901 -2982907 -3043604 -468557 -1119986 -5976485 -10043753 -9563638
14145 -9563638 -6362190 -4245029 -4082251 -4188738 -3840513 -4038527 -4629896 -2777445 3477489
14136 3477489 10526699 11236425 3462874 -6074317 -9390797 -6664385 -4227513 -4777342
14128 -4777342 -4795428 -1626203 2441615 4629466 5261324 4815573 2048994 -2162078 -3388169
14119 -3388169 448510 5171828 5908314 3531740 1911241 1574261 388699 -1405435
14111 -1405435 -1350018 704669 1945962 598299 -1815974 -2192088 1373074 7448414 11097305
14102 11097305 8178528 1283072 -1605970 3208630 9769956 9947158 3636630 -2300379
14094 -2300379 -3262808 -933290 777051 -102788 -3096531 -5859710 -5659719 -2626700 -460120
14085 -460120 -1551917 -3152128 -1484730 2002226 2392932 -1457903 -5297776 -5256199 -2204822
14076 -2204822 172634 -304938 -2124221 -1310382 4096575 10200401 10572481 4936726 853906
14067 853906 3751471 9148517 9351954 4549941 1308324 2045097 2617258 93024 -3284434
14058 -3284434 -4817663 -4786442 -3837512 -1533901 847398 16311 -4783755 -9602458 -9678342
14049 -9678342 -3853583 4997718 11972860 13224679 9556716 6089015 5909143 6037264
14041 6037264 3146260 423771 3027162 8568709 9296467 3730161 -1209407 -1046007
14033 -1046007 465516 -970189 -3458654 -3789268 -3336685 -4445684 -5431711 -4035179 -2315329
14024 -2315329 -3196496 -4775533 -2898627 2243211 6410493 7147142 5535052 2881131
14016 2881131 -686077 -4205158 -5405861 -3137387 1105784 4567304 5705954 5407321
14008 5407321 5559551 5865619 3266754 -3414838 -9530294 -9029571 -2778766 1816716 538809
13999 538809 -2681441 -2591262 -200198 -282398 -4367587 -9680384 -12988237 -12522561 -7953833
13990 -7953833 -1428973 2757884 2164262 -1120023 -3538935 -4145302 -3764582 -2245112 760569
13981 760569 3716039 4598562 3656225 2782584 2827547 2993525 2102128 -425142 -3561348
13972 -3561348 -4178130 227854 7482406 12053193 11565650 9031914 7278302 5034516
13964 5034516 1156322 -1137754 1614468 7125098 9581409 6623597 950046 -3610684
13956 -3610684 -4695929 -1839243 2354096 2927370 -2085189 -8108755 -9008186 -4574623
13948 -4574623 -12774 773176 -1897772 -5937904 -9014218 -8353229 -3008580 3586175
13940 3586175 6647539 5726641 4441391 4787325 5007260 3269490 229839 -2647628 -4550367
13931 -4550367 -4576205 -2173204 1021293 2123114 447413 -1966681 -3580728 -4914008
13923 -4914008 -6417963 -7041747 -5887770 -3678417 -1643054 -12100 1727965 3710005
13915 3710005 5083111 4404904 1269224 -2209109 -2901096 -409904 2245195 2543929 1004947
13906 1004947 -1284225 -4736802 -8562420 -8943391 -3543975 3928161 7275292 4853803
13898 4853803 112134 -3405733 -4425452 -3030300 -1028974 -1709647 -5486764 -7509606
13890 -7509606 -3748646 2511595 5227087 4656487 5652798 8169758 6970110 1326225
13882 1326225 -2619152 -1380095 882022 -16783 -1946802 -1577729 -225179 -167864 86805
13873 86805 2185311 3746514 2641691 1756622 4331607 7652166 6796243 2308551 -1277681
13864 -1277681 -2804853 -4933969 -8279586 -10303443 -9681619 -7333379 -3799561 -75897
13856 -75897 116162 -5394252 -10933838 -7492541 4881361 15179517 14743340 7286000
13848 7286000 2029312 1593607 1791956 214630 -1094208 -721306 -214442 -545402 -459853
13839 -459853 261765 -637811 -4146776 -7474739 -7548858 -5090779 -2869085 -1419361 730209
13830 730209 3357235 4144838 2378529 481157 721520 2103315 1752416 -1575355 -6033848
13821 -6033848 -7794063 -3611711 5831275 14666819 16264671 10264455 3189113 620619
13813 620619 1137143 170410 -2674122 -3713126 -1241607 2369024 4472317 4727646 3612103
13804 3612103 1282026 -1515587 -3760196 -5732124 -8136999 -9752092 -8454580 -4622477
13796 -4622477 -937609 1191082 2324146 2382807 708542 -1102154 -102088 3479035
13788 3479035 6028835 5689318 4266372 3348516 2463294 1979950 3302595 4699805 1940623
13779 1940623 -4580026 -8468008 -6201492 -2240275 -1415106 -1624279 665810 2868450
13771 2868450 1173951 -1113973 1582138 6400319 5247298 -1813748 -5726747 -2542510
13763 -2542510 676087 -2230030 -6654614 -5041363 1251753 4655375 2648392 -126622
13755 -126622 415576 3500309 6609205 8286232 7472978 3893133 -39542 -783019 1754633
13746 1754633 3643620 2112605 -837694 -1521659 454727 2363780 2609468 2416280 2978549
13737 2978549 3115314 1258009 -1528256 -2579800 -1364535 -97765 -355330 -1158287 -1231155
13728 -1231155 -1100177 -1594270 -2091410 -1920212 -1874556 -2550422 -2875694 -2349318 -2858315 -5602493
13718 -5602493 -8032333 -7239781 -4979271 -5335627 -8233500 -9662134 -8156349 -6318187
13710 -6318187 -5337724 -2997391 1286687 4263984 4220054 4260796 7048157 9916496 8888870
13701 8888870 4635076 643589 -2171696 -5193701 -8302341 -10119623 -10631396 -10212475
13693 -10212475 -7723351 -3139524 -143112 -1724869 -4699508 -3539536 1224848 3825690
13685 3825690 2233477 386555 653618 391744 -1666639 -1722651 2488423 6586984 5994291
13676 5994291 3353557 3800241 6006665 4629191 1616 -1956523 190271 644463
13668 644463 -4041922 -9057716 -8900912 -5696901 -4866111 -6137154 -4802103 -104549 3698986
13659 3698986 4518246 4924686 6186519 5098534 -322345 -6001743 -6623658 -2981948 -527271
13650 -527271 -1652167 -3331681 -2546096 -482076 -833 -1441448 -2801908 -2673778 -1235776
13641 -1235776 872837 2935422 3611421 1659234 -2229342 -5398596 -5861765 -4338594
13633 -4338594 -2881629 -2212988 -1799753 -2068764 -4251280 -7389630 -8019078 -4808930 -1586452
13624 -1586452 -2937937 -7988162 -11762369 -12031976 -10991923 -10089028 -7661499 -3241287
13616 -3241287 -56134 -617548 -3015966 -4304857 -4622530 -5108955 -4779639 -2913705 -1707431
13607 -1707431 -2594396 -2531851 1525916 6711215 7882927 5427464 3888811 4066277 2603128
13598 2603128 -937441 -2987610 -2516895 -2485634 -3803023 -4079776 -3675887 -6155928 -10495486
13589 -10495486 -10037249 -2861075 3644075 3314967 35144 381052 3253240 3731798 2637290
13580 2637290 4453388 8582948 10261619 8565043 6615556 5082395 2180481 -810157
13572 -810157 -777706 965064 349336 -1752403 -492689 3933484 5609196 2664370 439564
13563 439564 2356185 4508066 2967131 330077 415511 1455307 -262614 -3541348 -4168981
13554 -4168981 -1438182 1568742 2626513 1691326 -956837 -4524946 -6711391 -5825239
13546 -5825239 -3205870 -1382389 -803491 -261282 696845 1721418 2859488 3977188 4002765
13537 4002765 2313064 17977 -1141175 -145351 3311346 8181118 11075967 8803435
13529 8803435 2972033 -884473 -167905 1897226 1781312 388423 -97350 -353836 -1565078
13520 -1565078 -2178366 -934427 -438733 -3351333 -7008806 -6405082 -1339906 3721921 6100497
13511 6100497 6934677 7175578 5939251 3465519 2059492 2861738 4066303 3204271 -303495
13502 -303495 -4836599 -7565246 -6709513 -4230717 -4383755 -7519269 -8103162 -2501871 4027994
13493 4027994 3515477 -3054065 -6651016 -3103739 1451210 262113 -4633246 -6531913
13485 -6531913 -3546802 459285 2162483 1871111 1178460 864392 1238161 2295181 3056607
13476 3056607 2082771 -763696 -3476081 -3289066 524290 5056043 6088482 3005005
13468 3005005 136274 1576264 5914552 8434676 7468263 5489129 4305281 2692730
13460 2692730 -465290 -3685968 -4844799 -3633160 -1200857 990398 1614882 524043
13452 524043 -613427 -395138 231827 95034 623803 3205276 5130411 2973970 -619853
13443 -619853 492052 5882178 7788929 3037035 -1017899 2712112 9860514 10747662
13435 10747662 4257605 -1514081 -1177276 2174727 3697834 3466718 4138196 5874935
13427 5874935 6477388 4821552 2037348 -251112 -1770588 -3539739 -6069656 -8156114
13419 -8156114 -8529739 -8263750 -9331512 -10632867 -8589583 -2888014 1869501 2534471 1999276
13410 1999276 4144962 7347369 7333931 4165394 1425585 -47850 -2212527 -4155072
13402 -4155072 -2229221 3130095 6158819 3710084 126627 1080729 5699530 8313251
13394 8313251 6278300 2747382 2022053 4495833 6674362 5303788 1169403 -1436356
13386 -1436356 457617 4854094 7349653 6745146 5855438 6672910 7444891 5765859 2380315
13377 2380315 56611 -89870 567118 421386 -573895 -1178450 -213620 2169719 4326032
13368 4326032 4663349 3423061 2263366 2072896 2017758 787913 -2035974 -5749319 -8701696
13359 -8701696 -8981026 -6253978 -2863839 -1646998 -2577692 -3133135 -2149624 -1402545 -2604926
13350 -2604926 -4673264 -5382892 -4470847 -3368492 -2420563 -257584 3520643 6335402 4825116
13341 4825116 -732532 -5508928 -5018495 -430856 2827685 1832236 -822240 -1576957 -647203
13332 -647203 -24492 719347 3119477 5629907 4693233 43425 -4390507 -5376987 -3410069
13323 -3410069 -533483 1950074 3043927 2278064 1290384 2573890 5815763 8056211
13315 8056211 8048691 7343968 6282013 2791284 -2954045 -6425306 -4131753 1684653 6382381
13306 6382381 8110778 6899830 1918344 -6231818 -12972110 -14218870 -11971092 -10955006
13298 -10955006 -11082927 -8504995 -3524309 -1313015 -3566638 -5266597 -2410257 1983106
13290 1983106 3157669 1762532 1206141 904192 -2503164 -8503654 -12555511 -12741848 -11900290
13281 -11900290 -12043029 -10984032 -6729495 -1709272 433132 -104493 -691634 -964822 -2263724
13272 -2263724 -3095936 380633 8107210 13995760 12586120 5688866 -189371 -1598349
13264 -1598349 -548864 3800 -169874 -20433 328300 172311 -182532 -12349 335285
13255 335285 -99579 -1151425 -1369236 151424 2407514 3377501 2144030 -125866 -1375259
13246 -1375259 -620788 1446607 3440254 4241743 3310543 1229067 119085 2030815 6049172
13237 6049172 8312123 6227629 1755328 -838608 315802 3513158 5979039 6017360
13229 6017360 3773691 1726267 3182942 7918724 10640714 7034518 321100 -2409095
13221 -2409095 -151577 852850 -2880754 -6477166 -4372885 1128149 3781044 2658046
13213 2658046 1957300 3257516 3698361 1758320 -412521 -1371372 -2545011 -4534001 -5326322
13204 -5326322 -4174971 -3650398 -5465472 -7464774 -7407032 -6609593 -6497333 -4461040 2220862
13195 2220862 9953562 11532146 5416162 -2254951 -5728962 -5393890 -4102590 -2409533
13187 -2409533 -419426 -464500 -3710652 -6530873 -4735173 -66599 1929234 -180336
13179 -180336 -2475183 -2376238 -1853391 -2891862 -4173400 -4115282 -3342021 -2051171 1242292
13170 1242292 5724600 6865125 2487248 -2933703 -3977507 -1574085 -344452 -1184817
13162 -1184817 -1643806 -2005807 -5116158 -10267709 -12831370 -11051081 -8563420 -8718571 -10340994
13153 -10340994 -10577827 -8422719 -4139455 1269211 4724360 2998889 -2163903 -4386835
13145 -4386835 -365759 5780091 8082463 5740042 2085439 -774905 -3220878 -5600532
13137 -5600532 -7214650 -7343152 -5935931 -3926422 -3121181 -4311129 -5655473 -5149977 -4159499
13128 -4159499 -5172530 -6523544 -4062988 1414479 3888427 993482 -2405104 -2171614
13120 -2171614 -701410 -1023284 -820845 2460611 5439666 3967644 800862 1465817 4970981
13111 4970981 5395678 1488167 -1613261 -33359 4555525 8125067 7744650 2868538
13103 2868538 -3001175 -3861610 1314756 5259794 1693240 -5127060 -6643962 -2927275
13095 -2927275 -1227106 -3283187 -3374316 692197 3954816 3582153 3155848 4746135 4638623
13086 4638623 678504 -3135072 -3311531 -1852422 -1021919 487426 2622367 2089883 -487054
13077 -487054 1059116 7661375 10276741 3029969 -5805556 -4822265 3736923 8077210
13069 8077210 4540825 879161 2604067 5788369 5061086 996767 -3027809 -5586862
13061 -5586862 -6377924 -4962124 -2333890 -690754 -667115 -1215274 -1833539 -2142979 -581035
13052 -581035 2901125 4554761 1714955 -1767975 -384286 4127771 5056367 1300255
13044 1300255 -1378286 -290503 358360 -2282327 -4550576 -2819982 498337 1358619
13036 1358619 -182060 -2248174 -4772119 -7101447 -6188298 -1329202 2953658 3056552
13028 3056552 1980350 4304758 8454074 9133694 5525124 1884638 912522 1204813 1014562
13019 1014562 463006 -138368 -896628 -1230391 -807167 -1075209 -3187903 -5299044 -5018627
13010 -5018627 -3685077 -4619831 -7593790 -8871879 -6909621 -4201475 -2750528 -1336849
13002 -1336849 1344654 3939485 4650956 3995448 3692690 4348173 5374472 5901842 5111411
12993 5111411 2967591 790824 -399752 -1707972 -4264705 -5845315 -2925932 3634424
12985 3634424 8733865 9871784 9932937 11436987 12234745 9868301 6357733 4607536 3070336
12976 3070336 -1259406 -6584232 -8196669 -5665122 -3053304 -2296434 -1593102 -733774 -2296686
12967 -2296686 -5766776 -6004439 -853204 4298140 3697318 -599747 -2387922 -337673
12959 -337673 1982596 3294763 5640419 8280650 6923148 1151144 -2720619 103972
12951 103972 5480275 5508195 -867177 -6847541 -6930056 -3160847 -1314291 -3506060 -6213638
12942 -6213638 -4655947 1772447 8328329 9553072 5487043 1967906 3375039 6728377
12934 6728377 5797279 50765 -4533183 -4100104 -1906895 -2345062 -3998326 -2808562 463805
12925 463805 1238590 -1166625 -2342878 -319608 998174 -1413786 -4116246 -2620283
12917 -2620283 965073 1134090 -1831027 -2038809 2211507 4908795 1273677 -4699088
12909 -4699088 -5778347 -1282313 3363990 4871096 4839537 4944341 4528624 3791428 4698290
12900 4698290 6890333 6733192 2918479 -613245 -506009 543496 -1642669 -5162981
12892 -5162981 -4377033 1001655 4756538 3067752 -490930 -1065832 690744 1246743 341417
12883 341417 425224 1742480 2093796 998142 437953 1111741 1042399 -1031638 -3133592
12874 -3133592 -2307794 1751971 6307562 8313015 7275097 5713059 6404866 8829285
12866 8829285 9511347 6792752 3494781 2942842 4128105 3734730 1619812 494155 719097
12857 719097 -204447 -2471690 -2833156 -216012 1717758 111423 -2551478 -2396360 259298
12848 259298 2329822 2567986 1825618 927085 1017080 3568770 7129981 6849386 775292
12839 775292 -6092884 -7971561 -5655859 -3223596 -718196 3697629 7003092 4650545
12831 4650545 -249175 408019 6967495 10510283 6616740 2163049 3997873 8592013
12823 8592013 9093672 6266613 4999729 4742222 1749524 -1961120 -530242 5496694
12815 5496694 8787644 6093340 2535465 2831534 4219372 1660500 -4112895 -7789458
12807 -7789458 -6513070 -2308578 1516286 3612355 4277146 3945170 2903014 1832180
12799 1832180 1629333 2277870 2560031 1823565 1414305 2734315 4374852 3674866 1154830
12790 1154830 207600 1612694 2049213 -244038 -2244403 -1278515 407088 -119976 -975754
12781 -975754 1362967 5835465 8366929 7859269 6264266 4512891 2881623 3453094 7093193
12772 7093193 9655615 6818119 1437508 114852 3427628 6169015 6781953 9020237
12764 9020237 13417478 14939542 11586754 8254890 8727813 10124371 8968641 6921973
12756 6921973 6442981 6228705 5316248 6403300 10172875 11383257 6423128 533496 1115649
12747 1115649 6963761 10607144 9131493 6240725 4912828 4256702 3272751 2219302
12739 2219302 328491 -2896709 -4372164 -478440 6595308 10730154 10497553 10518712 13093082
12730 13093082 14087835 9811652 3224176 -450137 -956928 -1732058 -3425749 -3130044 137377
12721 137377 3017865 2329250 -361129 -899134 1547929 3196379 993731 -2831887 -3705183
12712 -3705183 -1103094 885807 -461281 -2936063 -2907635 200526 4441235 7966613
12704 7966613 9350409 7557924 3648123 498313 -1028652 -3151966 -6228490 -6088821
12696 -6088821 -223787 6098027 5326107 -1606930 -5541222 -925074 7437102 11393836
12688 11393836 9250897 5706448 4628457 5365776 5638050 5283767 6002272 8184117 9217104
12679 9217104 5864839 -1651773 -9016138 -11888594 -9802232 -5504514 -1657640 877510
12671 877510 2655062 4715810 7248977 8615565 7081782 4022207 3226452 5869633
12663 5869633 8504968 7668624 4107820 527238 -2247453 -4319599 -4491412 -2193060
12655 -2193060 351943 1179706 2012358 5195338 8925266 9433080 6778932 4554431 4508811
12646 4508811 5184564 5391816 5428348 5101243 3827845 2442809 1967286 1265280 -1031205
12637 -1031205 -3291270 -3074354 -1608333 -2270403 -5194399 -7091695 -5895795 -2065012
12629 -2065012 3763444 10398413 14229737 12119014 5936639 611100 -1456590 -615207
12621 -615207 3057774 8116141 9623046 5022954 178427 2336010 8731046 10651601
12613 10651601 7795163 8367154 14016524 15818652 8782736 -72002 -3250612 -2812666
12605 -2812666 -2772492 -754188 4964198 8176278 3638593 -3027496 -3556514 70037 377984
12596 377984 -2517739 -2755926 -330591 -184276 -1518050 1198446 6784875 7569069 2498418
12587 2498418 27581 4826030 10447661 9726915 5370284 4925953 10104910 16001396
12579 16001396 17876862 15106233 10567988 8269732 9480901 10581728 7855853 4172140
12571 4172140 5774469 11777174 13446037 6748084 -890131 -1128567 3552337 5071934
12563 5071934 2650482 2584812 6550569 8354570 3976417 -2067020 -4022717 -3318281 -4585537
12554 -4585537 -6693860 -4304557 2145724 4770153 -859574 -8473739 -9369219 -4269915
12546 -4269915 -1026044 -2420193 -3360431 -650810 1794874 422183 -1662143 -428051
12538 -428051 2042798 1624986 -575856 -748635 717216 723199 -341523 217721 1834694
12529 1834694 2273185 3017191 6470967 9262689 5993882 -756872 -2470213 2401832
12521 2401832 6087719 4197637 2026338 4339809 7302108 6262587 4243790 5555887
12513 5555887 6815059 2489720 -4537399 -6381728 -2050892 2046691 2640828 2983264
12505 2983264 5254338 6786694 5796985 4860643 5810610 5859489 2185982 -2835181 -4340398
12496 -4340398 -1045215 4133061 8298931 10917418 12307682 11990721 9450143 5779417
12488 5779417 3413240 3631486 4957094 5186457 4567170 5064567 6564678 6602216 4698648
12479 4698648 3697033 4817037 4740570 885350 -3225771 -2212034 3160451 6801368
12471 6801368 5488259 1814439 -949129 -2411781 -2761127 -1214692 1600352 3140170
12463 3140170 2550382 2008839 3087419 4604363 5551645 7183743 10194225 12374574 11370508
12454 11370508 7925827 4532285 2621928 2612476 4553815 6887238 6782927 3888207 1659047
12445 1659047 2584020 4189658 2720571 -966001 -2617936 -711430 2091674 3312272
12437 3312272 3298839 3296843 3592228 3988972 3925679 1994649 -2375222 -6672797 -7253502 -3959670
12427 -3959670 -410462 827797 867753 1524140 2349998 2143908 1334984 1099346 1457708
12418 1457708 1677620 1473470 792462 -374359 -1177022 -434144 1217460 1582702 327740
12409 327740 -167378 1080076 1368063 -1260635 -3759695 -2046853 2238886 3451923 264503
12400 264503 -2389497 -907492 1857409 1642849 -766526 -2032158 -2812991 -6923169 -14267781
12391 -14267781 -19377247 -18510216 -14404509 -11379218 -8835667 -3560066 3290129 6554226
12383 6554226 4884583 3340192 5839505 9094221 7855166 3230146 801804 1836772
12375 1836772 1815402 -2005751 -6705660 -8702894 -7947953 -5225165 -35482 5890285 7419456
12366 7419456 2440552 -3879279 -5372544 -2430653 839874 3602096 7073852 9244556
12358 9244556 7346969 3998843 4083804 6297387 4974889 358393 -801929 3569937
12350 3569937 6879179 4065085 -1257147 -3696882 -3602223 -3174623 -1306935 2194335 2766566
12341 2766566 -2179931 -7216790 -6253610 -2086459 -1528184 -4311508 -4718999 -2097646 -1354885
12332 -1354885 -3611160 -4518626 -2507537 -1189055 -2230592 -2837109 -2068080 -2879304 -5558827
12323 -5558827 -5691877 -1676200 1850992 1537684 386803 1333834 1647921 -1087947 -2729952
12314 -2729952 1116421 6349269 5299662 -1419032 -5211121 -1567749 4648951 7181453
12306 7181453 6001396 4627206 4301130 4159804 4503395 6438770 9174641 10280303 8696252
12297 8696252 5855992 3519365 1762230 -31299 -993962 668693 4439809 6629824
12289 6629824 4606117 711062 -633782 893114 1580999 48646 -717044 609316
12281 609316 34501 -5604339 -11912942 -11307563 -3095666 5336991 7561764 4436302 683729
12272 683729 -1185866 -1701346 -1740492 -1404596 -678698 383988 1912602 3878403 5632841
12263 5632841 6142489 4821572 2446387 1154760 2577810 5692555 7758353 7737055 6976163
12254 6976163 5922312 2991083 -1533282 -3735326 -1568622 682618 -1820260 -6074230
12246 -6074230 -4549637 3252027 8877011 6269316 -685089 -4819926 -4681125 -2867630
12238 -2867630 72159 4655026 8123303 6840605 2174793 -758008 32193 1767193
12230 1767193 1795849 251728 -1930133 -3711346 -2799077 1999758 7110868 7396882 3616451
12221 3616451 1792008 4030079 5595549 3499294 1920137 4668408 7697248 5492102
12213 5492102 1135232 2408488 9472680 14246997 12451032 8812761 8193965 8351598
12205 8351598 5411685 1230486 320977 2699505 4541151 4076753 2785957 1999089 1835418
12196 1835418 2539371 3781556 3660857 1431900 112575 2974895 8170407 10500306
12188 10500306 8463142 5978974 6536952 8846552 9446285 7177513 3885781 2348399
12180 2348399 4006098 7120629 7351534 2450682 -3848621 -5655956 -2809426 -1219541
12172 -1219541 -4212315 -7599158 -5988764 -545422 3344660 3883788 3905779 4901728 4583129
12163 4583129 1492248 -1512034 -703655 3363896 6391127 5368830 1308288 -2913643
12155 -2913643 -5661051 -6739365 -5940358 -3265060 -403256 119042 -1725976 -2650193 -165464
12146 -165464 3818081 5585993 4682556 3577556 2857141 331705 -4391430 -8016796 -8049841
12137 -8049841 -6257401 -5373119 -4906308 -3072866 -851805 -684210 -2212546 -2697309 -1225183
12128 -1225183 732749 2814549 6293119 10398601 11544521 8009456 2802998 -305208
12120 -305208 -1621669 -3800715 -6539516 -6127362 -617752 6925945 11530289 11430143 9073814
12111 9073814 7844595 8869154 10710362 11156606 9221850 6142064 4530186 5761431
12103 5761431 7936272 7423604 3167982 -1470956 -2498089 -355774 596877 -2143322
12095 -2143322 -5956135 -6662703 -3630440 525312 4103399 7436580 9853915 8645326
12087 8645326 2978671 -3058840 -4107693 116332 4540086 5087815 2936900 1450644
12079 1450644 1285759 723444 -684948 -1506932 -932667 521879 2552771 4959420 6278618
12070 6278618 5265955 3700584 4520849 6819679 6436599 2516273 -824103 -1328851 -2355341
12061 -2355341 -6367406 -9344391 -6914019 -2502955 -2930234 -7890226 -10692551 -8774384
12053 -8774384 -6381322 -6145074 -5090533 -1234880 2180718 2327650 1420574 2110710 2759737
12044 2759737 1207170 -568889 322454 2769174 3804251 3144420 2111229 564626
12036 564626 -1551510 -2022753 607420 3926106 5077215 5157926 6556123 8033634 6523252
12027 6523252 2261370 -1730140 -3899833 -4339308 -2447782 1601926 4661995 4099793
12019 4099793 2127998 2407486 3872987 2790734 -337697 -1471242 -43236 575861
12011 575861 -223080 738178 3604107 3784048 -494820 -4368847 -3397436 -28490 719637
12002 719637 -1409314 -2828222 -1988967 -568340 -27324 -27552 262674 1208146 2440617
11993 2440617 2513636 73428 -3757770 -5875441 -5083359 -3684319 -4181184 -6341956 -8526329
11984 -8526329 -9666721 -8750157 -4937499 -20936 1664442 -1816845 -6836127 -8204229
11976 -8204229 -4984505 -395832 2521693 2866570 812602 -2658358 -5207127 -4591427
11968 -4591427 -1193425 2052148 2619588 847232 -567515 540932 3296117 4745889
11960 4745889 3868574 3206285 4862699 6604212 5111878 1994223 2186217 6159158 8425260
11951 8425260 5232402 -661677 -4989744 -7451205 -9343418 -9733375 -7713421 -5393715
11943 -5393715 -4894751 -4938759 -3963105 -3815401 -6219493 -8048323 -4858514 2370198 8391566
11934 8391566 10304965 8915593 5080199 -561138 -5193787 -5966310 -4094546 -2656009
11926 -2656009 -1380765 1573653 3994103 1856272 -3168776 -5085834 -3101047 -2920125
11918 -2920125 -6966040 -10457033 -10085400 -9469006 -11577528 -12241246 -7026473 568996 4159180
11909 4159180 3652733 2826392 1272573 -3671560 -9137422 -9048709 -4029643 -1344460 -3822140
11900 -3822140 -5855687 -2629034 3053641 6459828 8056986 10642339 13142470 11960179
11892 11960179 6737424 1141284 -1309935 7753 3202232 5322835 4574716 2153119
11884 2153119 469242 -679903 -3420027 -6741356 -6197573 -777807 3931157 2860606
11876 2860606 -1477721 -2954136 -218659 3136261 4724543 5066849 4498697 2944872
11868 2944872 1971348 2841088 3399143 1163592 -1640159 -1078493 1501689 1297204 -1625651
11859 -1625651 -2491312 -752636 -1481768 -5995504 -8767038 -7022721 -5739979 -8090373
11851 -8090373 -8279126 -985305 8037662 9406710 4313220 2265486 6574011 11011601
11843 11011601 10767825 8425088 7710122 8286908 8620397 8330652 6308752 1750209 -2213182
11834 -2213182 -1639007 1005971 -468123 -5048929 -4307924 4049501 10640329 7366009
11826 7366009 -1242369 -5820368 -5177300 -4222101 -3767112 -880826 3126113 3372753 -351284
11817 -351284 -2839891 -1251036 1907638 3646941 3245731 254102 -5006666 -8682930
11809 -8682930 -6263957 978367 6890677 8298626 7486264 6482106 4014664 -528096
11801 -528096 -4804188 -6877266 -6908895 -4499638 1036613 6510724 6334517 538066 -3804082
11792 -3804082 -2209253 1119082 642869 -1898056 -1360514 2016021 3598509 2057293
11784 2057293 437084 495339 1008589 1358538 2270569 2986553 1854727 25824 785528
11775 785528 4681496 8607340 10158295 9810380 8529473 6515399 4863873 5272626 7260948
11766 7260948 8446601 8112071 7618835 6955201 4320452 -37191 -3110824 -3507124 -3123697
11757 -3123697 -3153583 -2194905 -201785 -227970 -3285560 -5172122 -2274170 2392701 3312046
11748 3312046 508936 -1312738 -525069 -380327 -2694710 -4250709 -1294698 5191261
11740 5191261 10538269 11323649 8265258 4980846 4105948 4359300 2450309 -1655950 -3779145
11731 -3779145 -1503317 1873201 2504879 2125718 4318123 7065889 5339725 261173
11723 261173 -1458794 1794449 3651828 225932 -3464863 -1939750 1858390 1930328 -1061746
11714 -1061746 -2076203 -735004 -1089637 -3614041 -4215605 -1581104 407211 -976911
11706 -976911 -3256512 -2952346 -335081 1809689 1673758 -487600 -2739116 -2551509 340356
11697 340356 2370211 156513 -4286594 -5829690 -3668885 -2321640 -4419990 -7012930
11689 -7012930 -6975185 -5855655 -6320405 -7195248 -5772895 -2731773 -842171 -60478 2236284
11680 2236284 6306061 8651378 6335805 525406 -5059933 -7716833 -7101323 -4307936
11672 -4307936 -833649 1761820 2239877 697852 -812803 27907 2583794 2993252 -1130188
11663 -1130188 -6784697 -8932144 -7214449 -6024149 -7573470 -8755468 -6585887 -3103839
11655 -3103839 -1871218 -2385180 -1749110 -167455 -499594 -2719218 -3039481 381277 4277149
11646 4277149 4776395 2643490 1472178 1941652 889022 -3449383 -7740142 -7103401 -1559678
11637 -1559678 3364296 3143598 -442230 -2073566 249424 3373097 3777597 1739355
11629 1739355 -194005 -1028318 -2002628 -4115860 -6311277 -6411811 -3639546 30037 1708623
11620 1708623 1123141 1089585 3360748 5502151 4109538 44254 -2570933 -2311466 -2071529
11611 -2071529 -4159771 -7008536 -8012156 -6812602 -4277721 -810888 2628693 4131610
11603 4131610 3173992 1355469 -358340 -2519928 -4121613 -2274506 2549986 4612891
11595 4612891 87932 -6596364 -8085578 -3967407 -481462 -1228750 -3287949 -3121057
11587 -3121057 -1615368 -1326103 -2104306 -1869457 176625 2932364 4730701 4113136 558494
11578 558494 -4332654 -7261772 -6003487 -1623483 2364517 2851767 -508816 -4988926
11570 -4988926 -6961296 -5209863 -2076665 -822229 -2174128 -4012241 -3910006 -1326868
11562 -1326868 2083853 3618539 1638419 -2724785 -6565697 -8244074 -8346760 -7365014
11554 -7365014 -4363778 851601 5997711 8389824 7561872 4598541 459926 -3535722
11546 -3535722 -5298732 -4001272 -1290138 1046471 3049755 4814406 4996397 3171050
11538 3171050 1432860 1258067 1145824 46989 254011 3180081 5088687 1985877 -3144754
11529 -3144754 -3628763 1125382 4792940 3220357 -1110008 -4475026 -6442565 -7523023
11521 -7523023 -7227645 -6471542 -7508557 -9389470 -7844551 -2181539 1995631 239587
11513 239587 -4173926 -4817956 -468575 4826875 7834549 8429962 7177986 4385225 1339102
11504 1339102 -289973 -445303 -419655 -872075 -1349060 -1201400 -4591 2113087 3889786
11495 3889786 3898430 2599392 1714221 1118127 -1128562 -4669363 -5818807 -2625143 1829603
11486 1829603 3763300 3808007 4700556 6083390 5455264 2994578 1340825 923229 -534161
11477 -534161 -3416691 -4871790 -3373967 -1489382 -2057512 -3932394 -4007999 -2077887 -851740
11468 -851740 -1351549 -1146475 1537021 4077068 2477135 -2399579 -4712672 -1018017 4771937
11459 4771937 6209126 2388388 -1884973 -3081065 -2352872 -1695423 -646335 1387314
11451 1387314 2609754 1299152 -1028425 -1496546 25404 958539 -56091 -1046269 819476
11442 819476 5109972 7303650 3479152 -3708033 -6251923 -537640 6555289 5808203
11434 5808203 -1598317 -5834142 -3100388 -702555 -4274901 -7884724 -3561063 5152237
11426 5152237 7962491 3252136 -563958 1114747 2915195 -366689 -5110161 -4895761
11418 -4895761 -47635 3848734 4025895 2645301 2252475 2732331 2483314 412184 -3061057
11409 -3061057 -5934724 -6281171 -4492191 -2589823 -1132561 985104 3179822 2669254
11401 2669254 -1155382 -4788927 -5277802 -4174532 -4198799 -4618839 -3452745 -1979179 -2570227
11392 -2570227 -3372080 -343122 5393404 7665548 4273369 858317 2865948 7931505
11384 7931505 10266455 9233379 8452819 8402929 5879907 850520 -1992935 -462622 1198824
11375 1198824 -1150543 -4762749 -3946767 1232922 4648903 2175722 -3613481 -7324471
11367 -7324471 -6418428 -2168727 2636099 5620002 5912521 4382621 2071814 -1497011
11359 -1497011 -6865767 -11645472 -11694498 -6554945 -1250777 -295942 -1576375 607638 6852937
11350 6852937 10752175 7218735 -316837 -4178359 -2308015 286602 20181 -319179
11342 -319179 2178924 3900907 -61100 -6292762 -5865652 2465503 8912031 5675962
11334 5675962 -2782536 -7325825 -6776713 -6403151 -7405672 -5997618 -2071574 -856530
11326 -856530 -4460341 -8194562 -7670566 -4329538 -1409782 851329 2985058 3269250 380774
11317 380774 -3613609 -5660151 -4938007 -1975658 2490378 5893061 4561356 -1153093
11309 -1153093 -5502624 -4230354 -325415 343913 -2898968 -5164426 -2394958 4649168
11301 4649168 11770011 14537466 11376454 5392977 1803794 2080091 2555435 279243
11293 279243 -2497753 -1992731 1590232 5138879 7165825 8259817 8589108 7751883 5971164
11284 5971164 3416495 -114860 -3255099 -3259593 -165420 2027520 710087 -1790269 -2556101
11275 -2556101 -2379488 -2504218 -1155547 2255468 3407458 -831419 -5839320 -5208883 -763948
11266 -763948 576548 -1670159 -1272011 3347549 5811996 2265590 -1985111 -283122
11258 -283122 5880853 9255815 5684362 -2422870 -9203636 -10000747 -5054383 262695
11250 262695 1012764 -1347182 -1515904 1527451 3493574 2521061 2649327 7110800 12554984
11241 12554984 13301802 8398392 1515373 -3774358 -5947232 -4768991 -1159152 3154932
11233 3154932 7015227 9624757 9101675 4158336 -2364091 -5274443 -3526759 -1258977
11225 -1258977 -921399 333624 4869040 9384250 9368864 5746968 3014044 2819454 3364932
11216 3364932 3694472 4507043 5278168 4364177 2296117 1846874 3810943 4955545 1751655
11207 1751655 -4703069 -8955489 -6973024 -1062946 2428254 739838 -2094974 -1382535
11199 -1382535 1398151 1588940 -457027 552645 6199603 11036557 9905501 4270416
11191 4270416 -1169793 -4330671 -5360592 -3880520 -160803 3129301 3476315 1520045
11183 1520045 -403172 -1014310 -111320 1707611 2075354 -1303810 -6318318 -7512414 -3380565
11174 -3380565 1328278 2796687 2994856 4293564 4459166 1760150 341576 4420349
11166 4420349 10635667 12695472 10919627 10234653 10798995 8488773 4075194 3660891 8553213
11157 8553213 12039047 8995088 2776712 -576376 -38185 1772317 3447258 4740961
11149 4740961 4785665 3541690 2669109 2545395 934195 -3074230 -6487719 -6447098 -4439769
11140 -4439769 -3591243 -3844330 -3119146 -1804878 -2453987 -5290610 -7263244 -6226804 -3672516
11131 -3672516 -2262696 -2440917 -2954782 -3636778 -5622921 -8604314 -9805252 -7234002 -2874783
11122 -2874783 -572337 -1266189 -2888543 -4739294 -8186700 -11989323 -11461042 -5360040
11114 -5360040 371477 161866 -3070348 -2673005 1429770 3758189 3247083 4490713 8339782
11105 8339782 9144655 4251359 -753600 -578383 1937848 1815051 759681 3406282 7878815
11096 7878815 7289018 -27711 -7901970 -10554717 -8568140 -5624635 -3472802 -1901627
11088 -1901627 -777032 -150961 233842 611798 1330879 3180987 6131781 8135999 7075159
11079 7075159 3702191 789369 -349827 -443185 213755 2126398 4235714 3996194 1023551
11070 1023551 -1467617 -489448 2683909 3763231 263880 -5762928 -9667881 -8691538
11062 -8691538 -4649696 -1705188 -1271870 -590089 2488295 5329785 3972717 -441430
11054 -441430 -2521968 -90120 3085657 3167796 1118357 -313662 -899684 -1230930 172884
11045 172884 3977202 6381286 3253212 -2728465 -4129603 1198402 6816024 6531979
11037 6531979 2486334 1089500 3848665 6565019 6490151 5840814 7465545 10400356 11482820
11028 11482820 9425355 5578918 1772190 -1113062 -2972002 -4102929 -4939325 -5541716
11020 -5541716 -5440299 -4205267 -1917798 889347 3254729 4027419 3103649 2228353 3043494
11011 3043494 4287405 3051285 -529335 -2535821 -1089947 -265349 -4782368 -12308303
11003 -12308303 -15236264 -10180223 -1820348 3503914 4308769 2734901 752162 172064
10995 172064 3032671 8389287 11145395 8031013 3031121 2559218 6293600 7666690
10987 7666690 3478264 -2113168 -4550781 -4892733 -6014647 -6824587 -4419092 137466
10979 137466 2350744 151915 -3775394 -5443750 -3261803 1272379 4593048 3301733
10971 3301733 -2541814 -8591539 -10391905 -7984163 -4804552 -2943851 -1745311 -451990
10963 -451990 454327 674945 576672 26761 -1292365 -2424657 -2055008 -752861 -111305
10954 -111305 -42458 295175 -726693 -5686290 -12767019 -16070289 -13053309 -7956803 -5523546
10945 -5523546 -4983981 -3495174 -2111248 -3684522 -6772883 -6733008 -2642695 1364923 2379044
10936 2379044 2351200 3848229 5412645 3844953 -448523 -3117286 -1058139 3686762
10928 3686762 6209560 4451605 1399407 985512 3043391 4067609 2266782 -686827
10920 -686827 -2979186 -4720957 -5863823 -5216665 -3104359 -1953178 -2313546 -1536859 1269590
10911 1269590 2738595 1034861 188890 3849514 8086773 6431777 -190552 -5123656
10903 -5123656 -6077249 -6350834 -6566302 -3360676 2425409 4514741 1253717 -637145 3238541
10894 3238541 7388105 5355332 385839 -48567 3588222 4238668 163295 -2307519
10886 -2307519 1209094 6695053 7737275 3874659 175659 540523 3613088 4915592
10878 4915592 2125692 -2220291 -3974528 -2854142 -2446690 -4398186 -5811176 -4122686
10870 -4122686 -1308286 -497647 -1252785 -1487791 -1578500 -2856767 -4131701 -3635024 -2544190
10861 -2544190 -2477609 -1513381 2410121 5884824 3814690 -1784396 -3240302 1739255 6908665
10852 6908665 7346756 6120756 7419029 8563521 4406788 -3555460 -8439029 -7534916
10844 -7534916 -5622087 -7908451 -13159020 -15561223 -11836169 -5044026 -1403024 -3711697
10836 -3711697 -8464648 -10199980 -8029087 -5910894 -6457810 -7263468 -4751617 828566
10828 828566 6507724 10768088 13732843 14387237 11158923 5612998 2428261 4041006
10820 4041006 7151932 6448659 984779 -4841886 -6499901 -4002431 -903828 218927
10812 218927 72879 599643 1832629 1719862 -1066760 -4974723 -6864354 -5421873 -2664125
10803 -2664125 -1503346 -2197274 -2329821 -506580 1511789 1656255 1162851 2895430 6392732
10794 6392732 7612814 4750780 1628549 2891393 7406634 9436883 6241726 1717276
10786 1717276 1222479 4587047 6508241 3835553 128117 924288 5504853 6895585
10778 6895585 1425920 -5254585 -5314713 529654 4584108 3585702 2264449 4283305 6218987
10769 6218987 4244194 1167464 1367727 2806511 558874 -4085646 -5021370 -1353791
10761 -1353791 629331 -3175440 -8830122 -10169409 -6450180 -1774442 192174 -1266259
10753 -1266259 -4473095 -6466669 -4999312 -855083 2657512 2983109 286865 -3340417
10745 -3340417 -5227696 -3576964 413186 2780855 1319677 -1473165 -2531884 -3172476
10737 -3172476 -5896524 -8294164 -5878663 -293101 1818219 -1187086 -3815299 -3181774
10729 -3181774 -3862903 -9328158 -14905811 -14551835 -9785523 -6266710 -5391707 -5182141 -6163442
10720 -6163442 -9611581 -12007957 -8397287 -941347 2470725 -1028815 -5745369 -6116838
10712 -6116838 -3654891 -2840213 -4498882 -6356637 -7170393 -7278577 -6838852 -5835523 -4612901
10703 -4612901 -2942385 47028 3901575 6484586 6721908 5926460 5198232 3529483 174722
10694 174722 -2929083 -3242369 -959638 1591099 2820130 2404512 233749 -2921929 -4642514
10685 -4642514 -3347107 -1142405 -1518967 -4171196 -4962130 -1839483 1922511 2021709 -1380115
10676 -1380115 -4546542 -5294649 -5013370 -5880005 -7843145 -8726778 -6601364 -2086347 1483841
10667 1483841 1002048 -2803945 -5838434 -5451029 -3284438 -2118273 -1743084 -220596 2161944
10658 2161944 3140554 2151612 876343 170135 -763169 -1939871 -2190738 -1735906 -2375988
10649 -2375988 -4264279 -5174496 -4049328 -2631158 -2222612 -1418614 1140924 3902278 4270288
10640 4270288 1977125 -811993 -1596800 812680 5013625 7129667 4638007 350253
10632 350253 -481674 2579286 4672548 3289565 1664739 2539319 3670188 2936680 3016681
10623 3016681 6191580 8463509 4635723 -3115727 -7417443 -5317917 -852088 1367257
10615 1367257 910150 238875 1970400 6786075 11577921 11378403 5756762 769184 1370667
10606 1370667 4906095 5979025 4334802 2951061 1572131 -1751816 -4958656 -4185057
10598 -4185057 -375477 2114461 2177439 1586054 -238812 -4709701 -8684646 -7309703 -1576178
10589 -1576178 3139540 5006511 5874764 5228356 1606450 -1180961 2198586 8797298
10581 8797298 10005859 4551821 161376 1029465 2444042 -23487 -4411274 -7987953
10573 -7987953 -10947598 -11795488 -6970463 1789556 7053317 5636739 2017755 -216437
10565 -216437 -2419804 -4213406 -1696635 4369630 7375999 5505536 4640273 6858902
10557 6858902 5935792 -536017 -4631541 -528834 5696358 6302496 3565758 3180390 3813828
10548 3813828 2155419 1645210 6666849 13052205 13309622 7523527 1399313 -2726212
10540 -2726212 -5799899 -6821045 -4641158 -1792725 -692858 559818 3797715 6560322
10532 6560322 6793990 6679460 7378646 5905502 1848469 583779 4625396 8396762 6671500
10523 6671500 1459519 -3794566 -8891464 -11680371 -7759314 -54352 1913799 -2725088
10515 -2725088 -3786729 1845932 4208083 -667271 -2220756 4430068 7350281 -758325
10507 -758325 -7835389 -3904946 756891 -4456520 -10831519 -9115468 -8448305 -15706051
10499 -15706051 -17197745 -5231616 524503 -12521321 -20093522 -2636965 11058185
10492 11058185 -9815599 -35202931 -22978670 -12539807 -84306736 -217538018 -279156874
10485 -279156874 -193934537 -50114988 20133709 3631085 -17761994 -5018117 7366903
10478 7366903 -2303420 -8226819 5098986 14975419 6629999 -1518733 4275404 9599309
10470 9599309 3110414 -2124570 4719398 12307235 9882720 6064611 10040535 14655408
10462 14655408 12070333 8310931 9723880 10854854 6812893 3174235 4118116 4598577
10454 4598577 2391343 3766190 9660121 10882837 4857193 2232760 8427005 13493212
10446 13493212 9774871 5054634 7355973 10297562 5817185 -271181 1529654 7936840
10438 7936840 9260524 5073720 1970675 1429901 264785 -1491038 -1962165 -2384888 -3514688
10429 -3514688 -2169936 1986826 2179177 -5581970 -13845605 -12753958 -3455779 4454618
10421 4454618 5149709 301986 -5480854 -7585280 -3653449 2502834 3442192 -1854730
10413 -1854730 -5914906 -4255249 -1979792 -4161973 -7061619 -5261173 -984625 652639
10405 652639 149203 701438 1899355 2544616 4454884 7355206 5803286 -2127378 -9078674
10396 -9078674 -8624973 -5223221 -5792193 -7435979 -3473904 3089556 3367540 -2562878 -5700603
10387 -5700603 -2623987 258565 -1814444 -5180707 -5023617 -2395173 -890988 -1222477
10379 -1222477 -1771567 -1439728 -415128 -33935 -1812659 -4978617 -6452290 -5145307 -3564677
10370 -3564677 -2706457 724754 8073725 13753185 11867542 4816796 -148065 -326537
10362 -326537 1788918 4290366 6266766 5209370 652703 -1845362 2629218 9557768
10354 9557768 10357506 5220909 2463353 5324163 7920383 5592013 1189365 -1435493
10346 -1435493 -2985130 -4500613 -3901719 -659481 1191444 -1145424 -4281802 -3332353
10338 -3332353 1394861 5688197 7012730 6000629 4406788 3963468 5585402 7941953
10330 7941953 8539803 7500466 8023646 11492024 14372537 12237961 5566080 -495717
10322 -495717 -1688560 1265899 3967565 3208568 406559 -433424 1665793 2916546 119174
10313 119174 -4242366 -5008982 -1262739 2821191 3471319 779720 -2868357 -4883034 -3381330
10304 -3381330 852471 3443956 636419 -5445080 -8747822 -6598471 -1981515 1459147
10296 1459147 3081247 3391598 2339297 840304 777689 1818093 894173 -3522376 -8896668
10287 -8896668 -11741912 -11134913 -8101509 -3999936 -842219 -616801 -2414064 -2423575 1148286
10278 1148286 5050967 5152262 2112265 254630 1430604 2648114 294727 -5138871
10270 -5138871 -9700106 -10533132 -8484569 -5979291 -3667641 -762972 1855148 1590429
10262 1590429 -1624610 -3496298 -349434 5388588 7547606 3700296 -2224840 -4846595
10254 -4846595 -2652584 1777765 4869070 4827994 2633928 611011 -439506 -1814873
10246 -1814873 -3944489 -4855792 -3464296 -2189787 -3299651 -4513660 -2152376 2531691
10238 2531691 4663114 2998215 1077407 716569 -579398 -4161207 -7061229 -6895608
10230 -6895608 -5757582 -5938707 -5380986 -1529861 2848508 2509186 -2439636 -5961190 -3955975
10221 -3955975 672785 2213186 -866920 -4978169 -6441919 -5526940 -4970869 -5654427 -5374640
10212 -5374640 -2258408 2220544 5112002 5827481 6121213 6863669 7303431 7512275 8750600
10203 8750600 10546484 10072701 6097471 1545107 132084 1781290 3314453 2769607
10195 2769607 1037450 -402309 -1431015 -2573913 -3606693 -3703355 -2688451 -1608683
10187 -1608683 -1730376 -2952696 -3692184 -2739327 -749775 735266 1245616 1506156 2097466
10178 2097466 3083758 4589579 6424183 7248131 5525194 1632200 -2003822 -3257752
10170 -3257752 -2187482 -481607 383848 300536 48437 -292530 -1771469 -4306970 -4891757
10161 -4891757 -809046 5219566 6814948 2422899 -1992009 -1597902 166775 -2234470
10153 -2234470 -6753911 -6764195 -1844454 1749010 1255895 607589 2086827 2185616 -1206487
10144 -1206487 -4215040 -3793589 -3182157 -5432905 -6799391 -2927087 2587228 3276025 750100
10135 750100 2252014 7870444 8854457 808775 -8999319 -11687474 -8314108 -6038953
10127 -6038953 -6832283 -6504427 -3372494 -1233389 -2580228 -4181807 -2216533 1735352
10119 1735352 3204669 1230279 -1202038 -2020635 -1902914 -1440235 201865 3127841 5958926
10110 5958926 7985276 9462793 9211677 5341994 -266536 -2103276 1658007 5491343
10102 5491343 3785172 -1255013 -3380404 -1407314 890066 2359249 5442912 9358499
10094 9358499 8901588 2384489 -4493671 -5887679 -2938868 -407386 412938 1525140
10086 1525140 3224435 3468217 1814831 792922 2653732 6260566 7779028 4304184
10078 4304184 -2799278 -8325404 -8107702 -3467831 530642 1139228 467704 1842707 5528090
10069 5528090 8642558 8053764 3293291 -2218808 -3492393 808968 6339915 8226577
10061 8226577 6838629 5733427 5670867 4755845 3346311 3831154 5587241 5150194 2020832
10052 2020832 -454464 -774114 -1016947 -1937432 -1402198 910322 2305704 2045206 2294646
10043 2294646 2702252 104009 -4281310 -4183782 1742457 6004522 2995295 -2532424 -3175368
10034 -3175368 546945 3469304 4603095 5817002 5835421 2888042 305501 2151093
10026 2151093 5471611 4064022 -1581672 -5082862 -3899970 -1485381 -217807 1084866
10018 1084866 2315298 1045321 -2508563 -4571432 -2906609 1230099 6270918 11123085
10010 11123085 12993130 9279641 2061241 -3602518 -6040542 -7506402 -8724282 -7934468
10002 -7934468 -5750030 -5702096 -8369351 -9305038 -4843967 3160051 10003935 13007253 12442160
9993 12442160 9659633 5622910 735215 -3916549 -5600748 -2621407 1741431 2029891
9985 2029891 -1181403 -1203522 3721087 5880560 18306 -6822966 -5366428 1393115 3433839
9976 3433839 -459338 -2973097 -2070471 -2756398 -5375205 -4151835 833796 1615881 -4432812
9967 -4432812 -9663631 -8383644 -4379554 -1851597 1586422 7293622 9870433 5790700
9959 5790700 507258 148456 2235069 1143169 -2690617 -5346888 -6295538 -6686321 -5270581
9950 -5270581 -1681019 494302 -855022 -2306591 -1310950 -1591150 -6327889 -10840159 -8788854
9941 -8788854 -1950772 2729928 2819537 1075241 -707161 -2581385 -3476110 -2664362 -2140798
9932 -2140798 -3177210 -3334674 -1090633 250888 -1935202 -4126471 -2191355 1280826
9924 1280826 1182164 -1637530 -2104110 1272563 5713472 8929975 9810113 7199190 2499507
9915 2499507 99224 958121 172275 -4574691 -7832200 -5288690 -1433598 -1268573 -1129691
9906 -1129691 3454173 7275092 3374856 -3962478 -5640298 -2648303 -2383435 -4198193
9898 -4198193 -2055868 1583489 -843564 -6877132 -8043599 -7388642 -14323160 -20820611
9890 -20820611 -4725008 35138380 67376440 65071447 39025897 19027621 14716254
9883 14716254 12837661 5044304 -1447233 -40725 4653812 5779265 3207746 394999
9875 394999 -676932 425099 2527745 2744714 560483 166938 3957514 6693282 2480295
9866 2480295 -5038041 -6777574 -954193 5707734 8633669 9491503 9436382 6281870 552324
9857 552324 -2436324 131632 4107728 4431363 1961462 1276905 4333616 8980826 12125050
9848 12125050 12341439 10217530 7280981 4344402 1113618 -2038502 -3138015 -874259
9840 -874259 3410671 7560432 10887511 12843573 11635403 7065562 2929444 3092538 6279864
9831 6279864 8046313 6817664 4510025 2294567 -135130 -1597381 -181335 2520134
9823 2520134 1989097 -3119968 -8598638 -9726105 -6217739 -1101730 3012190 5342531
9815 5342531 6403391 7168210 7793285 7057644 4224948 940004 -528700 -512471 -1355853
9806 -1355853 -3870673 -6485614 -7776612 -7735061 -6612655 -4607110 -2658383 -1517540 -130209
9797 -130209 2902919 6294536 6827658 3569185 -597992 -2172297 -333651 3136886 5884147
9788 5884147 6746119 6384769 5990928 5156278 2535305 -769346 -1167241 2183558 5012160
9779 5012160 3832203 1428425 2371463 5418939 5593293 2565435 1257569 4057847 7773208
9770 7773208 8979155 7455593 3606826 -2338524 -7402825 -7473463 -3596208 -1523566 -3112194
9761 -3112194 -3707707 -478878 2842686 3196154 3777055 7065818 8182903 2435637 -4874562
9752 -4874562 -4731127 1700089 4323861 -753907 -5873372 -3682972 2971172 6648511
9744 6648511 5278962 2303357 629653 535546 1322462 1790474 488547 -2466950 -5426019
9735 -5426019 -8167907 -12074956 -15860650 -14782163 -7093197 1790970 5327672 3831716
9727 3831716 2544074 3601322 4509479 3823091 3525284 4965540 6155797 4501953 -10230
9718 -10230 -4910405 -6768635 -3369418 2975061 5455281 61445 -7846097 -9165584 -3247834
9709 -3247834 1453772 130813 -1903252 984855 5150443 3924147 -1372892 -3940264
9701 -3940264 -2296234 -1160371 -2605518 -3444924 -1807271 27904 544684 1255521 2631643
9692 2631643 2734640 1447587 1402676 3060556 3408619 1350090 -105576 931113 2206690
9683 2206690 1771212 1114280 1363043 628592 -2038504 -4135352 -4056020 -3837524 -4556254
9674 -4556254 -3476880 561446 3504835 2301870 505255 2617210 6777445 8690507
9666 8690507 9152618 11197906 12778290 9630929 3707325 1259894 3107229 4014435 1916183
9657 1916183 623880 2284482 3919974 3388395 2691216 3001074 2001824 -1019811 -2484428
9648 -2484428 -186992 2517040 1506625 -2478881 -6006291 -7795910 -8548382 -8380092 -7069732
9639 -7069732 -5138379 -2988096 -681626 712177 65695 -1107517 -252880 1406555 -163534
9630 -163534 -4971661 -7961643 -6723474 -5054359 -5824581 -5562950 -646281 5551983 7230262
9621 7230262 4788930 3175895 3707264 3408134 1480351 608568 1653946 2288201 1878806
9612 1878806 3048812 6581558 8633672 5589155 -720950 -5112615 -5146802 -3224574 -2996338
9603 -2996338 -4941790 -5884001 -2891724 2598807 5657938 3499137 -1057121 -3106747
9595 -3106747 -1498925 727622 929161 -470588 -1832386 -2523510 -2605090 -2072984 -1441389
9586 -1441389 -1881909 -3625459 -4873622 -3449458 524171 4467375 6151497 5996350 5954685
9577 5954685 6670142 6934126 5852321 3945275 1673524 -1203231 -3789305 -3862063 -1396612
9568 -1396612 111326 -1278705 -1835792 2786548 9975628 12745856 9422188 5139729
9560 5139729 3140810 779637 -3626984 -6099442 -3222646 1634117 3063351 1171093
9552 1171093 -290449 -522150 -1440914 -2735886 -2101813 389533 2258232 2414802 1619621
9543 1619621 34356 -2407520 -4217363 -4176836 -3680995 -3900590 -2354561 3339392 9623912
9534 9623912 10160829 4813579 361710 1231808 4119906 3706845 -23694 -2619826 -970301
9525 -970301 3727001 7468274 6928071 2594591 -1417740 -1950771 -506906 -472087 -1866310
9516 -1866310 -1924414 -83114 1400313 1710261 2316486 2972164 999809 -3911261 -7768690
9507 -7768690 -7160364 -3380884 40814 1467010 1221859 -32870 -1201551 -904746 890219
9498 890219 2977731 5117558 7705795 8879842 5494501 -1538730 -6426436 -5355426
9490 -5355426 -1212779 1038846 694715 -145214 -1624123 -5488273 -10693814 -13794445 -13622185
9481 -13622185 -12225525 -10910019 -8468569 -4296079 -708321 -369411 -2497573 -3252055
9473 -3252055 -180543 4293821 4742624 -1122306 -8805166 -11290620 -7059100 -1673440
9465 -1673440 -599893 -2964667 -4233325 -2712910 -431443 1070290 2327614 3384000
9457 3384000 2826012 417999 -1602365 -1317516 237229 731503 -17172 128315 2334019
9448 2334019 4698937 4406625 1471527 -1054884 -1148318 -689100 -2610885 -5932159 -6235530
9439 -6235530 -1786367 3256438 3637241 -388165 -3430478 -1547815 3401466 6179004
9431 6179004 3699897 -2166054 -6609159 -6511674 -3324031 -1052263 -1331173 -1580444 1236747
9422 1236747 6294423 9866416 9861294 7546792 4901772 2239284 -810109 -3405479 -3845107
9413 -3845107 -1436898 2593898 5808701 6081423 3307795 186963 423804 4931791 10024926
9404 10024926 10609393 5539000 -999852 -3735644 -1142938 4138297 8285035 8744486
9396 8744486 5188419 -31316 -3031703 -2018302 531805 1190865 359221 902568 2555393
9387 2555393 1889107 -1313956 -2484860 463545 3058616 1470811 -608773 1988499
9379 1988499 6390966 5531660 -65810 -2525422 831665 3498002 960147 -2037722
9371 -2037722 -159532 3235140 1866786 -3143838 -5872170 -5574046 -6629318 -9620357
9363 -9620357 -9839545 -5615165 -1696253 -1820914 -2795572 566314 7576181 12188411 10180288
9354 10180288 3298205 -3404772 -6599983 -6685745 -5635482 -4036397 -1404521 999858
9346 999858 353731 -3199678 -4812783 -940152 4433418 3618767 -4827813 -13931942 -16905854
9337 -16905854 -14171229 -10151908 -6734388 -3063139 477998 1930280 1035997 -122175
9329 -122175 -206275 -258291 -1645183 -4050760 -6321872 -7865295 -8008478 -5173641 1308758
9320 1308758 8672460 12099384 9669381 4509131 751141 -1144902 -2983566 -4149416
9312 -4149416 -1883444 3521552 7524746 7054031 4389512 3054089 2636467 851537 -1549594
9303 -1549594 -1997182 -1002799 -1445123 -3156812 -2719161 492548 2465427 802186 -1000764
9294 -1000764 1335693 6205973 8329106 6247185 3777004 4062873 5687181 5792577 4285143
9285 4285143 2874006 1616565 -934943 -4406766 -5973660 -4100018 -1080114 -99741
9277 -99741 -969588 -1068769 135390 565274 -79788 1096522 5302687 8784247 7530028
9268 7530028 3232625 1028997 2519656 4714065 5214897 4512611 3275471 1550679 1108970
9259 1108970 4077480 7968696 6812534 -332924 -6536605 -6153470 -2635359 -2407472 -4444730
9250 -4444730 -2468278 3883384 7314248 3606968 -2117035 -2960358 589473 2998327
9242 2998327 1903399 -515954 -2632226 -5177038 -7975406 -8766211 -6436987 -2868950
9234 -2868950 -380767 768117 1338584 1428783 1136342 1374817 2430812 2727077 680060
9225 680060 -2734628 -4710168 -3608860 -122437 3996707 6960717 7226921 4622628 1299523
9216 1299523 -78898 608115 1134258 241348 -1076416 -1884833 -2662869 -3464602 -3059111
9207 -3059111 -1449595 -1114852 -3584813 -6417616 -6025808 -2388547 1410013 3296381 3350565
9198 3350565 1896332 -479638 -1587062 268762 2783074 1717057 -2922585 -6216606
9190 -6216606 -4968884 -1632068 35361 -51141 60073 680256 1248771 2382793 4140620
9181 4140620 4282859 1537445 -1134717 -143596 3194044 4650604 3695563 3659139 5427221
9172 5427221 5816604 3317240 820682 548956 479547 -1283909 -2415000 -566043 1374346
9163 1374346 -844688 -5342229 -5829094 -726070 4597261 5861313 5304168 6537679 8082177
9154 8082177 6011579 732812 -3106456 -2820203 -302579 1515016 1790787 1020947 -48669
9145 -48669 20542 2495781 6169635 7953418 6683054 4273427 2211886 -456260 -3971276
9136 -3971276 -5478177 -2748046 1608640 3162957 1992803 2331614 5951196 9565621
9128 9565621 9769314 7403011 5535612 5718879 7816454 10968495 12688298 9502088 1394172
9119 1394172 -6112367 -7568105 -4263129 -1862805 -2046930 -887053 3528706 6556961
9111 6556961 3488781 -2495549 -3706097 1382308 5729525 3500407 -1927957 -3121311
9103 -3121311 879078 3874645 1943056 -1369604 -1154129 1575952 2207759 -319146 -2887297
9094 -2887297 -3755974 -4400671 -5467929 -5008887 -2245899 309833 538491 -363061 -913204
9085 -913204 -2484133 -6294697 -9452996 -7791318 -1653104 4569461 7898023 8271994 5444852
9076 5444852 -937393 -7516129 -8315870 -2126783 4721826 5804146 2049527 -1177702
9068 -1177702 -1719150 -1378530 -915446 738335 2279335 -67920 -6616018 -11856150 -10776857
9059 -10776857 -5207298 -1020243 -628929 -1454312 -1118164 -563759 -1236412 -2252082 -2320229
9050 -2320229 -2379262 -3786981 -5102405 -3696119 -479925 198910 -3302592 -6670596 -5095365
9041 -5095365 -260950 1503145 -2175362 -6355549 -5243381 626977 5741105 6501968
9033 6501968 4352207 2547754 2122386 1682008 -58982 -2430132 -3397079 -1909528 496186
9024 496186 1105371 -803607 -3182105 -4019335 -3571242 -2856565 -1508385 1080132 3617642
9015 3617642 4225140 3372443 3129300 3606071 2708439 -50727 -1970390 -586351 3153021
9006 3153021 6379605 7527434 6922428 5483449 4136132 3716749 4490949 6125271 8055336
8997 8055336 8935911 6556276 692006 -4362444 -3584503 1823662 5115392 3026470 -229492
8988 -229492 -444565 12124 -2507111 -5439721 -4021299 130950 1580957 711010 2905326
8979 2905326 7941546 8588452 2218912 -3945187 -3397979 457447 1067459 -789364 163344
8970 163344 4056917 6028231 4315099 1954177 957462 166494 -1117207 -1975089 -2448415
8961 -2448415 -3272869 -3240969 -805903 2069963 2000845 -111562 -177734 2098546 2542278
8952 2542278 -163116 -1835650 364016 3416363 3822315 3142371 4301725 5866915 4595207
8943 4595207 1526432 775666 2945625 4006239 1260980 -2895146 -4537528 -3467512
8935 -3467512 -3123871 -5665627 -8503719 -6880332 -52734 6688695 7825727 4187184
8927 4187184 1047129 493044 -380847 -3248843 -5151806 -3650118 -1480417 -2569696 -6051037
8918 -6051037 -7940252 -6991212 -5278420 -4134664 -2969337 -1518993 -294321 714032
8910 714032 1215013 -572754 -5352388 -9795048 -9532010 -5005775 -1224671 -1473588 -4141552
8901 -4141552 -6153400 -6652479 -6305385 -5247436 -3070103 171735 3439752 4775863 2806934
8892 2806934 -794598 -2060733 151300 1805348 -725207 -4828194 -5374982 -2633689
8884 -2633689 -1541300 -3780521 -5955366 -5868621 -5078258 -4236758 -1576184 2153705 2909369
8875 2909369 142681 -1109040 1805603 4546176 3296846 1502768 3623165 6831423
8867 6831423 5659516 1589202 639729 3237419 4037585 1461024 84034 2517782 5507138
8858 5507138 6076075 5789757 6317254 5751062 2521778 -932143 -1673349 -590654 -448040
8849 -448040 -1999801 -4357860 -6880525 -8466004 -7205759 -3042945 1089013 2813178
8841 2813178 3219675 4413654 6038453 6201230 4274315 1094389 -2049344 -3321425 -1289784
8832 -1289784 2607334 4894486 4897503 5835673 8916582 9754597 4381880 -3691622 -6939395
8823 -6939395 -3231275 2368107 4683958 3290720 290143 -2693916 -4239895 -3163632
8815 -3163632 -521754 531748 -1659444 -5090445 -6298626 -3633193 1883353 7578333
8807 7578333 10770164 10721406 9288620 8776695 9386785 9671203 8662265 6126110 1759616
8798 1759616 -3736237 -7454461 -6600260 -2006174 2618370 4809173 4973338 4478585 4240496
8789 4240496 4653762 4680056 1787392 -4489282 -9778761 -9157784 -3956832 -520743 -1891244
8780 -1891244 -4635874 -4757528 -2692920 -843594 120016 325289 -820464 -2963091 -4121011
8771 -4121011 -3475437 -2361855 -1150108 1692437 5775872 7641067 5732484 2932645
8763 2932645 1511845 -533791 -4642582 -7163493 -4428897 628345 2182085 -117946
8755 -117946 -1626168 -114402 2423040 4337073 5490716 4487941 36629 -5068535
8747 -5068535 -6540857 -5191462 -5503224 -7538937 -6631543 -2242619 -84181 -2543231 -3822702
8738 -3822702 733893 6387418 6222714 2221715 1886298 6163778 8322723 4764598 11411
8729 11411 -829244 1043754 1573655 28203 -1513742 -2022438 -1654213 52758 2991345
8720 2991345 4701445 2919828 -475819 -1048326 2357678 6135573 7266205 7441753 9680877
8711 9680877 12734907 12043642 6013682 -1572348 -6195442 -7292874 -7041938 -6519450 -5114970
8702 -5114970 -2671990 -177709 1404455 1709545 888311 38942 803598 3098138 4217967
8693 4217967 2047410 -1593850 -2862557 -629150 2823188 5367024 6825299 7289425
8685 7289425 6302317 4268984 2490665 1274337 -46944 -1146699 -1229920 -1619717 -4597464
8676 -4597464 -8825108 -9473340 -4791840 659419 1893684 -165493 -1292464 -497221 -106391
8667 -106391 -759795 -604523 598874 420160 -2332156 -5688874 -7631444 -8544722 -9229842
8658 -9229842 -8835738 -6669854 -4335449 -3835734 -4500796 -4009038 -2068776 -802582 -1191921
8649 -1191921 -1456052 -200515 790144 -841396 -3657456 -3532763 616864 4977520 5924202
8640 5924202 4514941 3933769 4541053 4284288 2777927 1779765 1933441 2021056 1557579
8631 1557579 1283606 789368 -1334727 -4247422 -4841990 -2315182 88433 -324961 -1867562
8622 -1867562 -1367155 1175974 3186737 3302861 2347880 1522276 1431517 2057068 2363514
8613 2363514 1050248 -1230749 -2023218 -648579 395236 -747896 -2335558 -2109985 -1117408
8604 -1117408 -1577666 -2760188 -2292129 -349805 830665 763760 545799 -614277 -4905317
8595 -4905317 -11537695 -16165925 -15615695 -10743453 -4179916 2018450 5811497 5314195 1270770
8586 1270770 -2446657 -2444760 924167 4455994 5159064 2290166 -2151779 -4681203 -3493863
8577 -3493863 -493520 1188754 1214017 1543742 2478553 2141499 135221 -1532053 -2211289
8568 -2211289 -4140087 -8402082 -12121235 -12124533 -9346336 -6908228 -5309636 -2567893 1383676
8559 1383676 3506796 1726406 -1796356 -2960075 -697450 1666175 537776 -3232058
8551 -3232058 -5193361 -3053887 364364 1383812 737799 1741360 4364715 4913400 1750027
8542 1750027 -2444327 -4974548 -5893433 -5137406 -1258899 4301104 5874529 718044 -5533245
8533 -5533245 -5444243 172015 4002336 2851775 679256 838783 1379807 124254 -887488
8524 -887488 556948 2320913 1433581 -611425 -192772 2562689 4316751 3918702 3192430
8515 3192430 2632093 494289 -3086108 -4996577 -3915749 -2900031 -4641413 -6600477
8507 -6600477 -4183637 2326069 7358906 6782947 2383574 -1149908 -1483538 452600 2992033
8498 2992033 4963010 5039562 2312843 -1656188 -3034756 323705 5554378 7032665 2326185
8489 2326185 -5251644 -10484030 -11310876 -9113830 -5522614 -1165980 2898524 5080977
8481 5080977 5223169 4688299 3801943 1405615 -1874624 -2482407 1461073 6175638 6073929
8472 6073929 1028387 -3358975 -3031972 -147686 542167 -2351753 -6026514 -7113542 -4679998
8463 -4679998 -496577 2493339 2388917 -246092 -3291887 -5323289 -6380751 -6866463 -6850340
8454 -6850340 -6483559 -6016416 -5331033 -4258374 -3048510 -1805932 -484292 -520861 -4487879
8445 -4487879 -11635281 -15861490 -12306711 -4958612 -2587647 -6886848 -10340625 -7574055
8437 -7574055 -2851995 -2570215 -5371559 -5157147 -855203 2597879 1950922 -601311 -1433842
8428 -1433842 301895 2781135 3475882 1297864 -1593126 -1393213 2252197 4920379 3455667
8419 3455667 637853 599172 2324938 1954915 -569869 -1868276 -672606 1595234 4453653
8410 4453653 7765719 8874385 5697431 1651075 1658553 3992007 2646071 -2292922 -4078805
8401 -4078805 -271430 3418115 2777833 995874 1069673 -234813 -5132695 -7884707 -2510293
8392 -2510293 6656112 9844744 5302900 747144 1906764 5964857 7154096 3816347
8384 3816347 -1462997 -5140832 -5043375 -2082851 -147502 -2041986 -5752849 -7161636 -5759637
8375 -5759637 -4504849 -4441884 -3348515 -382184 1732343 968711 -472946 687781 3991362
8366 3991362 6050253 5180774 2771578 284247 -2523485 -5422313 -6010074 -2579362 2263909
8357 2263909 3875573 1821782 620234 2773215 4631827 2352122 -1285234 -999939
8349 -999939 1992616 1340029 -4154028 -8124445 -6321927 -2681571 -2545801 -4883291 -5277036
8340 -5277036 -2775060 408537 3104990 5309265 6497539 6945517 8151933 9389569
8332 9389569 7385676 2376976 9906 3060581 5946090 2985339 -2215110 -2406222
8324 -2406222 1788039 3761955 1963360 661166 831053 -956051 -4259138 -4049625 132943
8315 132943 2368643 48909 -2183322 -960169 805830 818329 1776548 4507276 4116052
8306 4116052 -1381023 -5391347 -2496826 2113973 889172 -3344769 -2167163 3924606
8298 3924606 5908532 801686 -3823993 -1939815 2521177 2971844 -430714 -3040242
8290 -3040242 -2887964 -1244393 1006837 3591262 5191934 4781901 3638795 3809347 5387276
8281 5387276 6785357 6707210 4880991 2221070 947203 2548613 4848184 3811982 -291052
8272 -291052 -1836579 2277862 6791865 4489873 -3204657 -7128284 -2072469 7024842
8264 7024842 11914339 10084090 4923355 413350 -1282962 498575 4021809 5240451
8256 5240451 2150562 -1702586 -1326547 2591714 4316745 1143658 -2967272 -3278465 -479910
8247 -479910 1179756 -656360 -5323695 -11163413 -15749428 -15932617 -11205040 -6127016 -5787597
8238 -5787597 -9002186 -9609988 -4984709 485862 1838917 -96269 -1389354 -1324315 -2334598
8229 -2334598 -4771679 -5610319 -2957680 1120648 3660713 4484711 4877933 4097095 1160
8220 1160 -6735337 -11636242 -11200376 -7218977 -4428480 -4617453 -5307499 -4246805 -2588734
8211 -2588734 -2408794 -3273869 -3442216 -3193388 -4422909 -7183573 -9011000 -8298939 -6591874
8202 -6591874 -6466064 -8042772 -8581632 -5432005 844283 6271546 6812724 2431337 -2582135
8193 -2582135 -3837054 -841662 3563434 6405175 6082785 2303374 -3163759 -6488581
8185 -6488581 -5192936 -1477491 297229 -652100 -1225701 -102621 75947 -2107110 -3152582
8176 -3152582 491655 6273682 8402752 5967847 3907472 5396048 7399585 5891547
8168 5891547 2239908 955139 2686798 3498778 1403297 -240709 1952983 5429329
8160 5429329 4665081 -729224 -4799132 -3096333 1657335 4004602 3250171 3176494 5513139
8151 5513139 7514132 6523250 3803672 2300647 2606410 2881044 1760555 -68369 -847782
8142 -847782 376055 2561383 3300608 1312007 -1872571 -3719680 -3798077 -3429965 -2537699
8133 -2537699 585662 5546400 8482020 6382676 1153601 -2712001 -3442250 -2899713 -2921631
8124 -2921631 -3087557 -2355915 -1098108 -597744 -1173020 -1365766 778453 5114621 8228597
8115 8228597 6377750 424201 -3790024 -1738526 4190608 7487581 5338146 1341448
8107 1341448 432015 3442442 7358594 8912533 6835689 2215205 -2010388 -3057081
8099 -3057081 -1144286 414588 -965532 -4015959 -5349117 -3423816 483601 4381500
8091 4381500 6950887 7343079 5510168 2828492 764901 -1226696 -4785857 -9345873
8083 -9345873 -11772207 -10270636 -6886882 -4691503 -3908341 -2617308 -325022 1216824
8075 1216824 540317 -1885966 -4642338 -6672235 -7349229 -6149577 -2603749 3476630 11047310
8066 11047310 16913849 17454209 12663193 7111351 5028555 5557957 4905164 1906134 -1220324
8057 -1220324 -2647602 -2307248 -156797 3336231 5274916 2998118 -958093 -967505 3494775
8048 3494775 6338487 3516167 -1333429 -2821065 -1231334 -230481 -580883 -512230 11339
8039 11339 -321079 -1105727 -1239822 -1417867 -2202643 -1554379 1886984 4922314 3465522
8030 3465522 -1307550 -4719103 -5186633 -4649837 -3658684 -1002489 2247177 3124528 1223678
8021 1223678 -1314261 -3712781 -6210206 -6880644 -3902015 -90107 527891 -171444 2632281
8012 2632281 7117131 6310624 237901 -2282835 2845588 8220819 6597172 1666076
8004 1666076 921752 4257658 6901701 8439785 10902668 11683415 6867928 -314300 -2345930
7995 -2345930 1934640 6561132 7950753 8344633 9463063 9416592 7272585 4956360 3098256
7986 3098256 221452 -2470801 -917942 4971744 9357839 8212097 4600033 2941411
7978 2941411 2086220 -1604839 -7149871 -9702491 -7300545 -2831581 428442 1854092
7970 1854092 1980883 1152159 466577 1466403 3522129 3493204 -288584 -5095404 -6935953
7961 -6935953 -5798973 -5203157 -6451203 -6400968 -2565202 2337211 4045981 3333487 4897731
7952 4897731 9838035 13387491 11416530 5695136 787354 -1293433 -1108605 736455
7944 736455 3302260 4492392 3318279 1544703 881196 509101 -110339 1503784 6996265
7935 6996265 12389347 11781545 5480621 137856 197415 2892004 2804260 -1625983 -7373249
7926 -7373249 -10172636 -7543950 -684801 5533834 6296915 1669725 -3537173 -5090498
7918 -5090498 -3018260 34525 1868399 1475368 -1020484 -3812520 -4427992 -2731488 -1712327
7909 -1712327 -3812150 -7345453 -8305243 -5633156 -3004472 -4356702 -8540134 -10218436
7901 -10218436 -6456447 -426700 3054593 3790412 4928014 6608502 5450436 973321
7893 973321 -2361539 -1782121 -381452 -1369323 -2393489 -143523 2928023 2156443 -1379958
7884 -1379958 -2566396 -670418 281896 -733214 -204349 2682709 3735746 1063343 -1026917
7875 -1026917 1114638 4363179 3691674 -157145 -2173416 -277652 2906510 4508958
7867 4508958 4269980 3023786 923293 -2013025 -4687412 -5182742 -2865284 -328265 -1611073
7858 -1611073 -6914198 -10834424 -8689665 -3176031 -902615 -3249475 -5493721 -4888298
7850 -4888298 -3833314 -3747249 -1995295 2055130 3707000 130224 -3984327 -3357808 -617355
7841 -617355 -1399578 -4006363 -1791060 4911212 7484483 1672911 -5538972 -5692005 -266582
7832 -266582 2826599 875069 -1394777 -254538 2049870 2150675 983835 1496054 3638355
7823 3638355 4981721 4844312 4232107 2328023 -2666505 -8329438 -8247662 -461810 7760640
7814 7760640 7825085 480638 -5984937 -7130383 -6693552 -9028537 -12450328 -12673234 -9289747
7805 -9289747 -5642200 -4033988 -3601698 -2181687 1141965 4817576 5853916 3143746
7797 3143746 -564192 -1812360 -897155 -503395 -640031 1043178 3784651 3459400 -646348
7788 -646348 -3622814 -2180019 276541 -673113 -3584127 -4326310 -3199393 -3941032 -7240902
7779 -7240902 -9942471 -10127161 -8955449 -7525211 -5354461 -2334840 392802 1777722
7771 1777722 1329998 -1239967 -5081592 -7763232 -7659202 -5841076 -3944039 -1773181 823659
7762 823659 1709812 -726334 -3827427 -3232267 1246638 5280337 5313809 1708091 -2891504
7753 -2891504 -5822940 -5554753 -2956022 -884877 -517241 615712 4488414 8296756 7839814
7744 7839814 3869670 983953 814635 589719 -1480775 -3605571 -3902048 -2778100 -1020927
7735 -1020927 1004836 1412390 -2367630 -9443108 -15183245 -16334424 -13699651 -9033349
7727 -9033349 -2824930 3354127 5939514 3467490 -746379 -2366138 -783861 1573831
7719 1573831 2738373 2165915 35477 -2353955 -2776839 -566529 1911610 1706826 -1376245
7710 -1376245 -4706639 -5420269 -2791803 979176 2417135 589568 -1192429 400356
7702 400356 3460717 3115310 -992273 -3747868 -2382188 -773690 -3143487 -7247266 -7752603
7693 -7752603 -3870983 456904 2380983 2192406 637434 -1765531 -3039030 -1261032
7685 -1261032 1840485 2252262 -643317 -3003231 -2210369 -295414 256090 984340 4432661
7676 4432661 8498491 7981186 1983947 -3884213 -4285030 -340160 3275834 5053717 6779242
7667 6779242 8047204 5469660 -1289724 -6829698 -6227958 -1085996 3745788 6871130
7659 6871130 9787499 11641332 9693994 4773841 1385312 1532503 2607775 2462953 2398286
7650 2398286 3527794 4230011 3438082 2878786 3546532 3227235 271392 -3113788 -4167426
7641 -4167426 -3430908 -2521600 -1000625 1335556 2074639 51070 -1128430 1908347 5879166
7632 5879166 4782116 -827556 -4139407 -1823190 2000244 2900138 2407102 4550397 9435787
7623 9435787 13104772 12158443 6734541 49653 -4081931 -4439289 -3459533 -3871408 -4733274
7614 -4733274 -3022484 1165822 3963991 2754153 -918288 -4198130 -6013670 -6352626
7606 -6352626 -5059974 -2721962 -701117 795658 2795092 5090647 6030245 5399589 4782521
7597 4782521 4241531 1905595 -1735699 -2757673 536934 4152664 3826828 1322431 1583495
7588 1583495 5331822 8318558 7174700 2739251 -1942791 -4115442 -2445192 1471739
7580 1471739 3263072 284590 -4508020 -6056168 -3951607 -2310393 -3155872 -3833672 -1753645
7571 -1753645 1951735 4878995 6269633 5872450 2926433 -1622524 -4445013 -3686153 -1442304
7562 -1442304 -276773 411127 1855359 2089149 -1467834 -6659996 -8025839 -3898623 1522123
7553 1522123 4097650 4387126 4773623 5120707 4029521 2291549 1784055 1900917 486255
7544 486255 -1705129 -1017935 3363441 6780907 4732822 -816401 -3812690 -1955051 1022953
7535 1022953 1054771 -1387924 -3278052 -3272546 -2070064 -333706 1592446 2848114 2707612
7526 2707612 1418180 -754243 -4023144 -7213878 -7269553 -3120381 1405167 1693702 -1442025
7517 -1442025 -3112153 -1532381 102418 -639955 -2108891 -2591416 -3555966 -6115437 -7578237
7508 -7578237 -5110596 -737377 872668 -1588402 -5333525 -7673744 -7915373 -5982286
7500 -5982286 -2455099 243539 -240414 -2847221 -4127765 -2674344 -165904 1873501
7492 1873501 3612031 4952536 4867166 3550134 2927703 4109637 6224180 8343660 10493246
7483 10493246 12146236 11921368 9645765 6806095 4356941 2176257 1068016 2498934
7475 2498934 5425277 6471702 4850257 3995766 6089855 8065144 6271031 2598735
7467 2598735 1888103 4564430 6108752 3737058 -220262 -2288738 -2007430 -1005042 -509629
7458 -509629 -1146756 -3239713 -5888814 -7154722 -6351141 -5041119 -4818381 -5229851 -4882801
7449 -4882801 -3560661 -2087220 -843590 397384 1552656 2157738 2064648 1475703 434494
7440 434494 -1045997 -2438928 -2945918 -2367447 -1230937 31738 1483341 2997308 3749298
7431 3749298 3053301 1489066 446053 495868 966005 1255246 1568204 1889286 1400098
7422 1400098 -161669 -1708263 -2622103 -4039037 -6283527 -6257272 -696080 7873423 12067790
7413 12067790 8217137 1205477 -1646862 429360 1638534 -2287165 -8835085 -12001173
7405 -12001173 -9041048 -3007603 903678 807802 -722861 -1087723 -1535682 -4474266 -8073385
7396 -8073385 -7375315 -1446595 4431856 5585567 3563876 2602562 3843881 6109970 9152017
7387 9152017 12203500 12116762 7594148 3133520 3706929 7161626 7459054 4283841 3003506
7378 3003506 5113232 5736888 2348427 -640164 833065 4147312 4791387 2970281 1442899
7369 1442899 711370 542601 2695976 7478614 10525955 7967709 2548609 -391156 -1024764
7360 -1024764 -3445195 -7151247 -6658858 -481118 5431009 5665517 2166302 -74659 -588049
7351 -588049 -2641209 -6654199 -8683939 -6037894 -1424603 426440 -888631 -905593 3153749
7342 3153749 7432566 5800792 -1471155 -7197282 -6702311 -3886810 -4815121 -8572906 -9347199
7333 -9347199 -5839278 -2780223 -2804348 -2617966 480517 3130946 787275 -4924311 -7851757
7324 -7851757 -5080156 349510 4008092 4543478 3525125 3039834 3887749 4905396 4068016
7315 4068016 1207662 -914133 459356 4563936 7934399 8301213 6200070 3267242
7307 3267242 963912 886365 3900400 8044711 9270877 5791166 521698 -2175074 -1209209
7298 -1209209 1214867 3344538 5556192 8327955 10525182 10512331 7846831 3344223 -1459929
7289 -1459929 -4558502 -4714400 -3288560 -3214059 -4851267 -4614173 167484 6532384 9017570
7280 9017570 6680682 3426864 1465941 -1126345 -4995651 -6411460 -2920988 1637320
7272 1637320 2255601 248901 400332 2339967 1090782 -3729537 -6009112 -2650937 1197120
7263 1197120 409137 -1785738 662548 6252830 7815797 3596091 -264629 709356 3210900
7254 3210900 2303507 -858372 -1421388 1582498 4164951 3303148 652230 -285265 1351332
7245 1351332 3227181 2940082 749625 -954558 -420004 1999200 5145038 8350034 10392898
7236 10392898 8964243 3794898 -623657 990148 7569530 11996988 9772430 4011982
7228 4011982 -12955 -1680600 -3317858 -4926900 -4898154 -4034377 -4326285 -4772689 -2962407
7219 -2962407 -222524 -241990 -2415523 -1984997 1775555 3046068 -1776597 -7490017 -6758762
7210 -6758762 -356133 4180379 2766613 -955095 -1533866 1896596 6069455 7872890
7202 7872890 6991096 5446180 5085865 5253241 3672431 122529 -2494167 -2168779 -998279
7193 -998279 -2095381 -4761303 -5518889 -3049642 758220 4078129 6427582 6920994 4497823
7184 4497823 446966 -2100368 -2041545 -1356021 -1662272 -2175880 -2007273 -2050259 -3116714
7175 -3116714 -4047355 -3287784 -1233930 161357 -621865 -3560788 -7012185 -8589096 -7365887
7166 -7365887 -5281536 -4988075 -6509280 -7753856 -7902841 -7834722 -7372307 -5250512 -2413371
7157 -2413371 -2047935 -4957995 -7838212 -7771021 -5591613 -2948609 858692 6382849 11074287
7148 11074287 12263338 11299569 11234390 11665819 9624547 5094311 1871669 2328716 4375620
7139 4375620 4787963 3324250 2207979 2984455 5157240 7208557 8078267 7863786 7399369
7130 7399369 7084579 6305433 4241637 979485 -2318665 -4027529 -3124861 -516116 1127969
7121 1127969 377626 -481277 1694673 5508856 5657270 191802 -6010668 -7219548 -3596692
7112 -3596692 550605 2615808 2567971 287000 -3892562 -7114823 -6405845 -2777649 253652
7103 253652 1526412 2265775 2223564 -40584 -3266773 -4279940 -3153853 -3362527 -5908739
7094 -5908739 -7547098 -6177560 -3714330 -1735458 1263468 5455567 6775744 2512666
7086 2512666 -3303668 -4730618 -2162947 -936373 -2586111 -2560071 2474112 9130952 11157412
7077 11157412 6470537 -1309713 -6772329 -6829223 -2299361 2966600 4914265 2347092
7069 2347092 -2556507 -6697532 -8581204 -8508411 -7229207 -5069695 -2125585 1159370 3824362
7060 3824362 5020477 4906433 4519214 4417555 3938508 2407922 578223 -214292 -203690
7051 -203690 -1170517 -3738193 -5880547 -5255072 -2343251 104679 482444 -399326 -1534583
7042 -1534583 -3118467 -4647915 -3808031 273596 3933892 2429285 -3465787 -7602824
7034 -7602824 -6210802 -2385708 -994221 -1996557 -1780400 816051 3298098 3630977 2487176
7025 2487176 1413384 1163764 1807287 2410177 962540 -3119986 -6864045 -6728086 -3484735
7016 -3484735 -1213348 -1378581 -1235432 1064975 3114972 1772159 -2441664 -6428921 -8247106
7007 -8247106 -7989828 -6294723 -3633999 -462021 2709214 4784957 3979667 -11106 -3990541
6998 -3990541 -4032329 -684142 1370767 -365947 -3140531 -3340185 -926705 2084986 4583225
6989 4583225 5873452 5136593 3554118 4170648 7351529 9357990 8011706 6422838 7715344
6980 7715344 9419408 7518552 3291173 1018294 900407 -232361 -2452749 -2855550 -1726536
6971 -1726536 -2585447 -5507448 -6233308 -3366148 -994735 -1983958 -3545623 -2157613 1297487
6962 1297487 4044419 5305273 4994617 2167630 -2323759 -4938000 -4070189 -2409922 -2137729
6953 -2137729 -1640043 -120772 -918363 -5490600 -8161290 -3087952 6092922 10212840 6841326
6944 6841326 1908328 -539293 -3015661 -7625495 -11133159 -10285605 -7190794 -5691328
6936 -5691328 -5693494 -4496121 -1495301 1280039 1848574 -338755 -4202914 -7109888 -6931386
6927 -6931386 -4650811 -2723260 -933200 2563411 5913171 4362035 -1913439 -6184869
6919 -6184869 -4524010 -1544459 -2486606 -4666579 -2820078 1120369 1087483 -2400061 -2436385
6910 -2436385 3474204 9993899 12353726 11743730 10611991 8582679 5687831 4612108
6902 4612108 6576189 8761042 8490903 6707214 5191994 3778191 2379017 2292586 3383092
6893 3383092 3443302 2313276 2761240 5155061 5743071 3180350 2112600 6164561 11355960
6884 11355960 11271682 5799292 79722 -2740582 -3275657 -2765673 -2507527 -4195602 -6817110
6875 -6817110 -5952152 -435950 3726451 1413009 -3282488 -3475736 -1015322 -3223232 -9875799
6866 -9875799 -12799889 -8797596 -3822706 -2464850 -2062902 -376755 -702997 -4667182 -7111100
6857 -7111100 -3840240 1097313 1533009 -1930099 -4519154 -4729070 -3681958 -634746 4972309
6848 4972309 9462062 8608723 3924185 489258 -64180 20587 -313488 -72204 596795
6839 596795 681005 1068235 3076229 4937669 3680254 22729 -2389161 -2347183 -2049049
6830 -2049049 -2749840 -2924044 -1261955 1204307 2513721 1635452 -785308 -2218034 -161360
6821 -161360 3988308 5079655 802912 -4105064 -3667710 1287870 4908543 4610566 3056659
6812 3056659 2539530 2044946 347659 -1729177 -2929553 -2888922 -1807616 -789418 -1376255
6803 -1376255 -2554965 -586557 4897870 7713696 3057628 -4079559 -4894941 600003
6795 600003 4386215 3166487 1866122 3418258 3820094 418670 -2876333 -2928836 -2698057
6786 -2698057 -4070954 -2135420 6700341 16092443 16795147 9182966 1827713 -235956
6778 -235956 761505 1763886 2338637 1882489 -674411 -3601855 -3390809 300375 4372571
6769 4372571 6857189 8039447 7557148 4779731 1949185 2192882 3920296 2118261 -3500398
6760 -3500398 -6603090 -2963792 3138875 4626707 714167 -3363772 -3850684 -2036554
6752 -2036554 -970669 -1791963 -3771827 -5802617 -6811766 -5706671 -1977981 3366099
6744 3366099 7657411 8120267 4467101 -267490 -2521361 -1866204 -920096 -1729923 -3601155
6735 -3601155 -4746311 -4609179 -3833522 -3029960 -2346570 -1485962 287050 3136286 5228770
6726 5228770 3821040 -1076692 -5402880 -5135370 -970971 2994329 4886687 6847186
6718 6847186 10527065 13480215 12379375 8259732 5428386 5399332 5237893 2872783 718497
6709 718497 1665173 4131668 4540314 3116230 3190448 5151459 5353107 1949882 -1994572
6700 -1994572 -3041119 -1972623 -1698739 -2963621 -4347205 -4582774 -2811368 1564711 7128367
6691 7128367 10384383 9754239 7934711 7956509 8825264 7931892 5913434 5426942 6203205
6682 6203205 5378978 2617778 1023382 2308561 4420180 5003010 4305499 3384269 2019553
6673 2019553 40017 -1235382 -551959 1472090 3182495 3485152 1994462 -1029393 -4124388
6664 -4124388 -5359511 -4600857 -4083454 -5896132 -9562948 -12600579 -12872482 -10265577 -6795722
6655 -6795722 -5049270 -5708891 -6780178 -6082889 -4013264 -2731436 -3222558 -4530907 -5283507
6646 -5283507 -4487502 -1631136 2207709 4261920 3231487 1576974 2122231 3491372 2343706
6637 2343706 -577537 -939071 2231750 4498890 2469040 -1509050 -3197246 -1939953
6629 -1939953 -107357 449107 -495326 -1810704 -1158321 2585311 6220347 5050649 12202
6620 12202 -2429364 299024 2434079 -1545063 -8526052 -11853656 -10941981 -9940694 -9751521
6611 -9751521 -8169021 -6497152 -8778228 -13989956 -15575166 -10519889 -3595818 -506234
6603 -506234 -1422883 -3595220 -6062934 -8721904 -9940706 -8428349 -5709519 -4300125 -4615535
6594 -4615535 -5187428 -4662477 -2624476 128066 1645306 964131 285885 2579570 6882983
6585 6882983 9041342 7571807 5310904 4404901 3601677 1984241 1174405 1542393 431886
6576 431886 -2784607 -3976288 -527445 3339495 2334811 -1742788 -3078531 -938046
6568 -938046 429469 44207 1787272 6896657 10813500 9713130 5531744 2012735 -318107
6559 -318107 -2493160 -3776557 -3122877 -1624277 -759109 -181651 359426 -756551 -3862317
6550 -3862317 -5192508 -1200861 5275583 7400349 3270080 -1366379 -751630 3742319
6542 3742319 6523834 5547011 3910339 4420376 5922864 6006722 4798841 4019897 3678188
6533 3678188 2230899 -258214 -1763487 -1895929 -3453283 -8459698 -14177928 -15568601
6525 -15568601 -11423242 -5902698 -3625814 -4811049 -5826327 -3485169 1625707 5484419
6517 5484419 4471617 -425522 -4017435 -2811555 538829 879104 -2146717 -3570990
6509 -3570990 -41462 6090131 10603972 11917168 10068369 4855006 -1965549 -5612516
6501 -5612516 -3517919 119890 -741315 -5528457 -8024300 -5515967 -1981160 -1088696 -1012026
6492 -1012026 1086450 3509990 2887343 -67678 -2000216 -2795708 -5530831 -10446222 -13147137
6483 -13147137 -10400659 -4722293 -992850 -443817 -449032 701843 1488741 -8768 -2937728
6474 -2937728 -4594979 -3732529 -1689312 -268986 398894 1250367 2278818 2354851 1145918
6465 1145918 31258 336622 1418827 1523347 137770 -1619098 -2771027 -3334243 -3139469
6456 -3139469 -1172998 2939313 7512640 9885201 8759603 4974904 417104 -3157373
6448 -3157373 -4710316 -4410147 -3578988 -3377537 -3476597 -2710815 -1005822 285220 248610
6439 248610 -280354 110352 1492724 2531982 2106795 496685 -989001 -1333484 -812277
6430 -812277 -585632 -1047231 -1005137 638529 2740912 2980940 1288140 338935 1716614
6421 1716614 3566358 3755334 3388552 4451666 5408760 2925897 -2202327 -4927745 -2842738
6412 -2842738 604229 1734142 1802031 3482142 5392202 4435201 1683525 1096406 2960026
6403 2960026 3370366 664136 -2146209 -2458201 -1286584 200137 2833359 5571439 4069335
6394 4069335 -2698202 -8048594 -5234987 2693112 6603756 4097149 2288955 6683316
6386 6683316 13233255 14612513 10057312 4992119 3432601 4591787 5746238 5192228
6378 5192228 2770226 -167662 -1498386 -517187 1275971 2674436 4532657 7380673
6370 7380673 9080285 7417047 3798770 1604591 1697918 2429252 3372001 5674425 8673489
6361 8673489 9599099 7536910 4874657 3812476 3974687 4459258 5566982 7041497 7030461
6352 7030461 4630709 1581432 -266863 -1422978 -3033250 -4418213 -4206100 -2541437
6344 -2541437 -457868 1576677 2873421 1909973 -1493249 -4798213 -5661833 -4958195 -4811896
6335 -4811896 -5093471 -4440466 -3469229 -3896020 -5180272 -5203152 -3992185 -3544074 -3798914
6326 -3798914 -2102269 2464426 7112365 8940627 8160134 6556143 4968951 3694753
6318 3694753 3394876 3941312 3824133 2236898 551936 319669 908426 682360 -195636
6309 -195636 247415 2952638 5970402 5955992 1635164 -4294506 -7415335 -6228839 -3592992
6300 -3592992 -2653174 -2821482 -1697979 436977 1103655 98567 77002 2196236 4281843
6291 4281843 4218895 2424459 138799 -1950192 -2664038 -1065888 971948 589240 -700748
6282 -700748 1867246 7800008 9404834 2474548 -5876285 -5851388 1787205 7557186 6485083
6273 6485083 2716981 1243130 1703758 1824227 1467990 1041781 -6594 -1135897 -574052
6264 -574052 1358276 2190887 1639773 2112523 3582391 2398961 -2526061 -6621485 -5847944
6255 -5847944 -2337927 -400041 -165303 843451 2584103 3449729 4456593 7730818 11665896
6246 11665896 12136351 8576009 4828196 3408740 2526855 -127549 -3620522 -5231257
6238 -5231257 -3686075 68843 3787331 5170598 3793378 1949281 1925013 2777360 2196845
6229 2196845 1255437 3815575 10249416 15207064 13869044 8020043 3565004 3837637 7573418
6220 7573418 11644740 13103756 10036296 3666430 -1029487 -53960 4288630 5876517
6212 5876517 2798602 -585071 -681098 36465 -2450957 -6701245 -7387316 -3006036 1906025
6203 1906025 2867772 627859 -1097810 -607320 948186 2013993 1785509 -120575 -2995598
6194 -2995598 -4441409 -2596358 857054 1946405 -566654 -3218095 -2254960 1372608
6186 1372608 3439878 2346582 1270487 3691996 8524992 11273393 9329652 4588456
6178 4588456 852714 -50100 731501 865039 -909527 -3589410 -4646933 -2757898 83216
6169 83216 552022 -1429749 -2076745 834957 3932170 2346528 -3340204 -7671595 -7668773
6160 -7668773 -5899518 -5341660 -4993988 -2785370 348531 2415977 4140667 7230406 10187939
6151 10187939 9561980 5126078 584120 -1092792 -244934 1797842 4735400 8171390
6143 8171390 10859198 12051975 11791112 9456181 4364347 -1502955 -4037291 -1777922
6135 -1777922 1937117 3201124 2106162 1404362 2334992 3912586 5298155 6718704 8223513
6126 8223513 8894236 7374964 3070764 -2251890 -4324937 -294709 6444051 8396820
6118 8396820 3086741 -2821270 -1724401 4920995 9040294 7001146 3172137 2281973
6110 2281973 3437190 3622400 2705072 1906119 609732 -1705311 -2671314 -86399 3549160
6101 3549160 3585292 62122 -1826602 1167226 6084227 8053496 6286245 3881683 3317733
6092 3317733 4016485 3608671 465081 -4301653 -6901468 -4475482 619448 2264725 -2110640
6083 -2110640 -7799575 -8740917 -5305722 -3004130 -4619198 -7396032 -7909139 -5971302 -3059103
6074 -3059103 -332746 734479 -841564 -2708169 -597481 5438533 9684596 8305419
6066 8305419 4882866 4918298 7766379 8529956 6036181 3910250 4339942 5527979 5645482
6057 5645482 5170930 4631147 3669987 3048647 4092942 5501978 4333887 1030308 -343079
6048 -343079 1844360 4308938 4159018 2863545 2567196 2046504 -512023 -3460047 -3755970
6039 -3755970 -1215154 2149371 5296200 7990600 9154173 8087516 5976527 3931383
6031 3931383 1297299 -1745449 -2216348 1769450 7000716 8726803 6906715 5227968
6023 5227968 5035088 4356299 2454606 1012137 438797 -943252 -3061400 -3068862 336073
6014 336073 4450917 6002828 4806545 2753855 1289221 1159134 2755699 5300897 6970999
6005 6970999 6780945 5398796 3949853 3311183 4231529 6180081 6499688 3334726 -810770
5996 -810770 -1661156 516321 1079281 -1498982 -2690758 1057723 6272682 7113625 3361441
5987 3361441 -283503 -1140098 -690510 -677837 -1058049 -1866491 -3681459 -5708387 -6161638
5978 -6161638 -4998534 -3744693 -2280847 1377024 7219367 11779717 11964853 8544566
5970 8544566 4746755 3104821 4511331 8158020 11018691 9626225 4407426 426395
5962 426395 1443712 4825322 5324466 2840588 2612748 7323406 12729921 13095197 8471516
5953 8471516 4110775 3932455 6954965 9791577 10620823 10259919 10407382 11283835 10878729
5944 10878729 7041523 665992 -4248194 -4690750 -1901860 657248 1626032 2300331 3526259
5935 3526259 4313795 3834473 2867888 2459173 2443819 2077789 1262085 614297 891369 2342797
5925 2342797 3957478 3827434 1410910 -1182675 -1735846 -975948 -851545 -515406 2642806
5916 2642806 7793873 10390217 8523689 5869235 5875266 6351591 3311338 -2173673 -5059221
5907 -5059221 -3302197 27293 1606263 1715642 2636856 5367721 8590931 9749145 7273357
5898 7273357 2702616 -257644 15545 1090052 344587 -1006923 -299740 1738827 1888533
5889 1888533 -507639 -2785906 -3213983 -2832205 -2709780 -2267585 -992891 591706 2254802
5880 2254802 4281956 6106970 6727323 6465945 6244798 5517774 3473553 1807741 3119631
5871 3119631 6514358 7982421 5474774 752191 -3614898 -5775685 -3715783 2636653
5863 2636653 8303201 7402725 1424750 -1896916 605217 3761734 3413362 2775105 5110510
5854 5110510 6461837 2180112 -4009100 -4912041 -909293 1389713 -230340 -1928722
5846 -1928722 -2155837 -3821947 -7019326 -6828530 -1098035 5268350 6904653 4494721 1936070
5837 1936070 908283 1056466 2179758 3415443 2949885 820715 -560931 -321467 -344890
5828 -344890 -921904 738850 5040138 7358868 4676242 899316 772385 1875162 -1338905
5819 -1338905 -7681589 -10146751 -6314816 -1347294 347657 375725 1269105 1734828 262746
5810 262746 -959385 368243 2380361 2246969 1167355 2200987 4854805 5738063 3592118
5801 3592118 220025 -2652125 -4072067 -2551509 1875743 4861863 1694777 -5330554
5793 -5330554 -8038466 -2528353 5789663 9496998 7757891 4670437 2434629 360434
5785 360434 -1218403 -569089 2033781 4011654 4040108 3371660 3347452 3914221 4916440
5776 4916440 6576111 8064758 7624300 5063112 2677843 2747766 4953734 6785249 5938938
5767 5938938 2390217 -1259402 -2078451 -416181 -143292 -3578244 -7391218 -6352482 -629461
5758 -629461 4025064 3744691 712439 -1307066 -1971288 -2539872 -2207434 149691 2329551
5749 2329551 878263 -3408955 -5464908 -2172939 3898310 7945149 8037412 5536228 2219410
5740 2219410 -1022870 -3388787 -4164410 -3897859 -4114349 -5079322 -4959642 -2428117 663350
5731 663350 1012215 -1707100 -4084770 -3427402 -1162562 -396822 -1603725 -2683357 -2336522
5722 -2336522 -1322378 -924716 -2020929 -4972089 -8395361 -8937327 -4981353 -67069 526111
5713 526111 -3353330 -6525117 -5522326 -2348482 -324649 100419 -172854 -920949 -914671
5704 -914671 2171010 7249262 8622811 3108801 -4292098 -6135325 -2022384 2150396
$$ [...]
##END NTUPLES=NMR SPECTRUM
##END=
