##TITLE=31Pdec_SR146H3
 D2O 
  24 sc
 27.10.2023
##JCAMPDX= 6.0         $$ Bruker NMR JCAMP-DX V2.0
##DATA TYPE= NMR SPECTRUM
##DATA CLASS= NTUPLES
##ORIGIN= UXNMR, Bruker Analytische Messtechnik GmbH
##OWNER= root
$$ XWIN-NMR		Version 3.5
$$ Fri Oct 27 16:19:42 2023 Russian Standard Time (UT+4h)  she@DPX200
##.OBSERVE FREQUENCY= 81.013821
##.OBSERVE NUCLEUS= ^31P
##.ACQUISITION MODE= SIMULTANEOUS
##.ACQUISITION SCHEME= undefined
##.AVERAGES= 24
##.DIGITISER RES= 16
##SPECTROMETER/DATA SYSTEM= spect
##.PULSE SEQUENCE= zgpg30
##.SOLVENT NAME= D2O
##.SHIFT REFERENCE= (INTERNAL, D2O, 0, 248.564)
##AUDIT TRAIL= $$ (NUMBER, WHEN, WHO, WHERE, WHAT)
$$ ##TITLE= Audit trail, XWIN-NMR		Version 3.5
$$ ##JCAMPDX= 5.01
$$ ##ORIGIN= Bruker BioSpin GmbH
$$ ##OWNER= she
$$ F:/spectra/data/she/nmr/P31/1/pdata/1/auditp.txt
$$ ##AUDIT TRAIL=  $$ (NUMBER, WHEN, WHO, WHERE, WHAT)
(   1,<2023-10-27 16:18:38.07 +0400>,<she>,<DPX200>,
      <created by zg, POWCHK disabled, PULCHK disabled
       configuration hash MD5:
       00 E9 B6 7A A2 85 ED C7 34 08 36 98 17 FE 4E 26
       data hash MD5: 32K
       62 97 F5 33 54 A9 AE 9B 30 D8 C3 37 A1 E7 81 89>)
(   2,<2023-10-27 16:18:42.98 +0400>,<she>,<DPX200>,
      <Start of raw data processing
       efp BC_mod = 2 LB = 5 FT_mod = 6 PKNL = 1 PHC0 = -10716.88 PHC1 = 206.89 SI = 64K 
       data hash MD5: 64K
       19 0D A4 4B 3F 97 8F A4 59 AF 7A FA 32 61 23 C3>)
(   3,<2023-10-27 16:18:54.17 +0400>,<she>,<DPX200>,
      <abs ABSG = 5 
       data hash MD5: 64K
       F9 FB 83 83 7B D9 71 02 B3 1B 5E 50 7D 3F 48 1A>)
$$ ##END=
$$ 
$$ hash MD5
$$ B5 FF 03 2E 5E 97 6C 56 2B 68 53 7C 77 DC 7A 12
##$RELAX= 
##$RELAX= 
##$RELAX= 
##$RELAX= 
##$RELAX= 
##$RELAX= 
##$RELAX= 
##$RELAX= 
##$RELAX= 
$$ Bruker specific parameters
$$ --------------------------
##$DU= <F:/spectra>
##$EXPNO= 1
##$NAME= <P31>
##$PROCNO= 1
##$TYPE= <nmr>
##$USER= <she>
##$AMP= (0..31)
100 100 100 100 100 100 100 100 100 100 100 100 100 100 100 100 100 100 
100 100 100 100 100 100 100 100 100 100 100 100 100 100 
##$AQSEQ= 0
##$AQ_mod= 1
##$AUNM= <au_zg>
##$AUTOPOS= <>
##$BF1= 81.014009
##$BF2= 200.13
##$BF3= 200.13
##$BF4= 200.13
##$BF5= 200.13
##$BF6= 200.13
##$BF7= 200.13
##$BF8= 200.13
##$BYTORDA= 1
##$CFDGTYP= 0
##$CFRGTYP= 5
##$CHEMSTR= <none>
##$CNST= (0..31)
1 1 145 1 1 1 1 1 1 1 1 1 1 1 1 1 1 1 1 1 1 1 1 1 1 1 1 1 1 1 1 1 
##$CPDPRG= <waltz16>
##$CPDPRG1= <>
##$CPDPRG2= <waltz16>
##$CPDPRG3= <>
##$CPDPRG4= <mlev>
##$CPDPRG5= <mlev>
##$CPDPRG6= <mlev>
##$CPDPRG7= <mlev>
##$CPDPRG8= <mlev>
##$CPDPRGB= <>
##$CPDPRGT= <>
##$D= (0..31)
0 1 0 0 0 0 0 0 0 0 0 0.03 2e-05 3e-06 0 0 0 0 0 0 0 0 0 0 0 0 0 0 0 0 
0 0 
##$DATE= 1698409117
##$DBL= (0..7)
120 120 120 11 120 120 24 19 
##$DBP= (0..7)
150 150 150 150 150 150 150 150 
##$DBP07= 0
##$DBPNAM0= <>
##$DBPNAM1= <>
##$DBPNAM2= <>
##$DBPNAM3= <>
##$DBPNAM4= <>
##$DBPNAM5= <>
##$DBPNAM6= <>
##$DBPNAM7= <>
##$DBPOAL= (0..7)
0.5 0.5 0.5 0.5 0.5 0.5 0.5 0.5 
##$DBPOFFS= (0..7)
0 0 0 0 0 0 0 0 
##$DE= 6
$$ [...]
##$SUBNAM3= <"">
##$SUBNAM4= <"">
##$SUBNAM5= <"">
##$SUBNAM6= <"">
##$SUBNAM7= <"">
##$SUBNAM8= <"">
##$SUBNAM9= <"">
##$SW= 501.771253377433
##$SWIBOX= (0..15)
0 1 3 0 0 0 0 0 0 0 0 0 0 0 0 0 
##$SW_h= 40650.406504065
##$TD= 32768
##$TD0= 1
##$TE= 0
##$TE2= 300
##$TE3= 300
##$TEG= 300
##$TL= (0..7)
0 120 53 12 22 120 120 120 
##$TP= (0..7)
150 150 150 150 150 150 150 150 
##$TP07= 0
##$TPNAME0= <>
##$TPNAME1= <>
##$TPNAME2= <>
##$TPNAME3= <>
##$TPNAME4= <>
##$TPNAME5= <>
##$TPNAME6= <>
##$TPNAME7= <>
##$TPOAL= (0..7)
0.5 0.5 0.5 0.5 0.5 0.5 0.5 0.5 
##$TPOFFS= (0..7)
0 0 0 0 0 0 0 0 
##$TUNHIN= 0
##$TUNHOUT= 0
##$TUNXOUT= 0
##$USERA1= <user>
##$USERA2= <user>
##$USERA3= <user>
##$USERA4= <user>
##$USERA5= <user>
##$V9= 5
##$VALIST= <valist>
##$VCLIST= <CCCCCCCCCCCCCCC>
##$VD= 0
##$VDLIST= <DDDDDDDDDDDDDDD>
##$VPLIST= <PPPPPPPPPPPPPPP>
##$VTLIST= <TTTTTTTTTTTTTTT>
##$WBST= 1024
##$WBSW= 4
##$XGAIN= (0..3)
0 0 0 0 
##$XL= 0
##$YL= 0
##$YMAX_a= 879
##$YMIN_a= -4760
##$ZGOPTNS= <>
##$ZL1= 120
##$ZL2= 120
##$ZL3= 120
##$ZL4= 120
##$ABSF1= 248.5645
##$ABSF2= -253.2056
##$ABSG= 5
##$ABSL= 3
##$ALPHA= 0
##$AQORDER= 0
##$ASSFAC= 0
##$ASSFACI= 0
##$ASSFACX= 0
##$ASSWID= 0
##$AUNMP= <proc_1d>
##$AZFE= 0.1
##$AZFW= 0.5
##$BCFW= 0
##$BC_mod= 2
##$BYTORDP= 0
##$COROFFS= 0
##$CY= -3
##$DATMOD= 1
##$DC= 0
##$DFILT= <>
##$DTYPP= 0
##$F1P= 0
##$F2P= 0
##$FCOR= 1
##$FTSIZE= 65536
##$FT_mod= 6
##$GAMMA= 0
##$GB= 0
##$INTBC= 1
##$INTSCL= 6.047779e-11
##$ISEN= 30
##$LB= 5
##$LEV0= 0
##$LPBIN= 0
##$MAXI= 10000
##$MC2= 0
##$MEAN= 0
##$ME_mod= 0
##$MI= 50
##$NCOEF= 0
##$NC_proc= -12
##$NLEV= 6
##$NOISF1= 182.463
##$NOISF2= 159.3651
##$NSP= 0
##$NTH_PI= 0
##$NZP= 0
##$OFFSET= 248.5645
##$PC= 4
##$PHC0= -10716.88
##$PHC1= 206.89
##$PH_mod= 1
##$PKNL= yes
##$PPARMOD= 0
##$PSCAL= 0
##$PSIGN= 0
##$REVERSE= no
##$SF= 81.0140089999694
##$SI= 65536
##$SIGF1= 159.3651
##$SIGF2= -187.1042
##$SINO= 113.3802
##$SIOLD= 16384
##$SREGLST= <1H.CDCl3>
##$SSB= 0
##$STSI= 65536
##$STSR= 0
##$SW_p= 40650.406504065
##$SYMM= 0
##$S_DEV= 0
##$TDeff= 32768
##$TDoff= 0
##$TI= <>
##$TILT= no
##$TM1= 0
##$TM2= 0
##$TOPLEV= 0
##$USERP1= <user>
##$USERP2= <user>
##$USERP3= <user>
##$USERP4= <user>
##$USERP5= <user>
##$WDW= 1
##$XDIM= 65536
##$YMAX_p= 459057621
##$YMIN_p= -376111413
$$ End of Bruker specific parameters
$$ ---------------------------------
##NTUPLES= NMR SPECTRUM
##VAR_NAME=  FREQUENCY,     SPECTRUM/REAL,   SPECTRUM/IMAG
##SYMBOL=    X,             R,               I
##VAR_TYPE=  INDEPENDENT,   DEPENDENT,       DEPENDENT
##VAR_FORM=  AFFN,          ASDF,            ASDF
##VAR_DIM=   65536,         65536,           65536
##UNITS=     HZ,            ARBITRARY UNITS, ARBITRARY UNITS
##FACTOR=    0.620285442955139, 1,           1
##FIRST=     20137.2065510682, 0,            0
##LAST=      -20513.1999529968, 0,           0
##MIN=       -20513.1999529968, -376111413,  0
##MAX=       20137.2065510682, 459057621,    0
$$ Real data points
##PAGE= N=1
##DATA TABLE= (X++(R..R)), XYDATA
$$ [...]
39680c4859706J2504950J6533498J8859303J8366860J5488033J1899796Q467636
39673F7260370M185366k046254r101993j4130567j5312940j3315585r999277o495757
39665A043363k795777J339826N366049P672320O533567J889061l958677q067792
39657I021940r277926q447620o697574m469674k206060n65705N57050K144426
39649a9941143M514746O570279P292018P110005O924861O578645N361093L352726
39641B7763230R67256k392188p619261j3663055j7401447j6463641j1486833n205669
39633d5501608o3402K916956L906840L929131M342734N669870O790210N872634
39625a2136635K332461k395380o087792p459392o607404m168989n85839L613937
$$ plain form
39680 -34859706 -22354756 -5821258 13038045 31404905 46892938 58792734 67260370
39673 67260370 71445736 69399482 60297489 46166922 30853982 17538397 7539120 1043363
39665 1043363 -1752414 -412588 4953461 12625781 19159348 21048409 17089732 9021940
39657 9021940 -255986 -8703606 -15401180 -19870854 -22076914 -22642619 -22085569 -19941143
39649 -19941143 -15426397 -8856118 -1564100 5545905 12470766 19049411 24410504 27763230
39641 27763230 28730486 26338298 18719037 5055982 -12345465 -28809106 -40295939 -45501608
39633 -45501608 -45565010 -42648054 -38741214 -34812083 -30469349 -24799479 -18009269 -12136635
39625 -12136635 -9804174 -12199554 -18287346 -25746738 -32354142 -36523131 -37108970 -33495033
39617c3495033P175312Q450109O845487L805300J825521K181974L749999M244717
39609D783386K526069m93589l055092m177197l856838k165613R34943M580173
39601i23758O617953N265679J196852k742077m121875k804930l42776J558272
39593C703340J688038l55957l403289m874648l058976P22454L238200K784466
39585D43628N86724j407200k966562n036411p581267r142157q465418n699876
39577c9268539j796728K596797P205725J1433174J4142053J4301179J1768097
39570B0381758P433545K694932j230504l725317m832323n008330m693408m027824
39562F992529l015528j854936q18092K37802J844686M122187O251119P083524
$$ plain form
39617 -33495033 -26319721 -17869612 -11024125 -7218825 -5393304 -3211330 538669 4783386
39609 4783386 7309455 6815866 3760774 -416423 -4273261 -6438874 -5503931 -923758
39601 -923758 5694195 10959874 12156726 9414649 5292774 2487844 2145068 3703340
39593 3703340 5391378 5035421 1632132 -3242516 -6301492 -5579038 -2340838 443628
39585 443628 1030352 -376848 -3343410 -8379821 -15961088 -25103245 -33568663 -39268539
39577 -39268539 -41065267 -38468470 -31262745 -19829571 -5687518 8613661 20381758
39570 20381758 27815303 30510235 29279731 25554414 20722091 15713761 11020353 6992529
39562 6992529 3977001 2122065 1303973 1541775 3386461 7508648 13759767 20843291
39554B0843291O154955L880886J044785j525878l116126l675191m201918n832092
39546A3572712q218307r363679p579604l429504N94408K194565Q98442k036329
39538a3367296m712306n522951l681152L58851M789632P330771O968974M918713
39530b916764L344336K983099K601066J022703j163212k667350l508736m655002
39522d959860n848312n243857j673263L815250R247200J3563595J6423998J7132163
39514D2456914J4999698J0459495M787698j142037o940292j1734196j4285011
39507C8602269j4396381j3357048j2537469j2121264j1541562j0513163r129906
39500d4994524p459270n621059l906807k292316k40095K316763M131782L738297
$$ plain form
39554 20843291 26998246 30879132 31923917 30398039 27281913 23606722 19404804 13572712
39546 13572712 5354405 -4009274 -11588878 -15018382 -14423974 -12229409 -11330967 -13367296
39538 -13367296 -18079602 -23602553 -27283705 -26924854 -22135222 -14804451 -7835477 -2916764
39530 -2916764 427572 3410671 6011737 7034440 5871228 3203878 -304858 -4959860
39522 -4959860 -10808172 -16052029 -17725292 -13910042 -4662842 8900753 25324751 42456914
39514 42456914 57456612 67916107 72703805 71561768 64621476 52887280 38602269
39507 38602269 24205888 10848840 -1688629 -13809893 -25351455 -35864618 -44994524
39500 -44994524 -52453794 -58074853 -61981660 -64273976 -64514071 -62197308 -58065526 -54327229
39492e4327229J374371j162850k798195m210802n942701o570805m129724J017807
39484g6750128O127771R004417R775822R524573Q607936P199915O238711O336220
39476a3934763O294840M259383L63938l085308m360262m129005m072742m682343
39468b3346262n143418m730307l517811k020491p19175K50230J341364L282774
39460c4603096O148548Q984746J0666886J0827593R650812P210143L548453q68863
39452B1565222n319248r267377j2209659j3389344j2378774r933473p617074o361877
39444e4911604n785486n031810l816267k351801o20696J700654M441274O410918
39436e9964818O180532L591514J73876k335732l699473m854313n989038n798121
$$ plain form
39492 -54327229 -52952858 -54115708 -56913903 -61124705 -67067406 -73638211 -77767935 -76750128
39484 -76750128 -70622357 -61617940 -51842118 -42317545 -33709609 -26509694 -20270983 -13934763
39476 -13934763 -7639923 -3380540 -3016602 -6101910 -10462172 -14591177 -18663919 -23346262
39468 -23346262 -28489680 -33219987 -36737798 -38758289 -39477464 -39227234 -37885870 -34603096
39460 -34603096 -28454548 -19469802 -8802916 2024677 11675489 18885632 22434085 21565222
39452 21565222 16245974 6978597 -5231062 -18620406 -30999180 -40932653 -48549727 -54911604
39444 -54911604 -60697090 -65728900 -69545167 -71896968 -72517664 -70817010 -66375736 -59964818
39436 -59964818 -53784286 -50192772 -50018896 -52354628 -56054101 -60908414 -66897452 -72695573
39428g2695573l029504J873890P151374J1148484J2852597J1831573Q772614N743174
39420a6351371M577086M670112L319129j251040p807185j3410588j6126744j5896588
39412e8277189j3379835r021079l403845K245102O496459Q569329Q511139O768251
39404e1491668M113686K055409K487558N960848J0336845J2154856R919888N546947
39396A084369K079381N20731m10569j910332l591031m458214m480137m647199
39388a5813001n715131p122627p145635m384035N69499N210759P355232P056007
39380a9988932N826497M494804K861697J182978M79789R49304J395739J102560
39372a695564J240554L242845O358608Q063428O801002L357451m25798l270540
$$ plain form
39428 -72695573 -75725077 -73851187 -66699813 -55551329 -42698732 -30867159 -22094545 -16351371
39420 -16351371 -11774285 -7104173 -3785044 -5036084 -12843269 -26253857 -42380601 -58277189
39412 -58277189 -71657024 -80678103 -84081948 -81836846 -75340387 -66771058 -58259919 -51491668
39404 -51491668 -47377982 -45322573 -42835015 -36874167 -26537322 -14382466 -4462578 1084369
39396 1084369 3163750 3684481 3273912 1363580 -2227451 -6685665 -11165802 -15813001
39388 -15813001 -21528132 -28650759 -35796394 -40180429 -39610930 -34400171 -27044939 -19988932
39380 -19988932 -14162435 -9667631 -6805934 -5622956 -5143167 -4193863 -2798124 -1695564
39372 -1695564 -455010 2787835 9146443 17209871 24010873 27368324 26942526 23671986
39364B3671986m574089l976848j737734O96627J281274j034884n258045q897063
39356A71224r606534o556568p29429N557841R425560Q650354L231445m103548
39348F040345r704508j1739084j0886833q495518n105456j282882J275550R81576
39340c8916810j402922l029040j936919R21897L018045L004860J647632M19893
39332c6273364j51005o95356j971955l849788n257539n087372l166912l68465
39324e6821756K186917L994885N332677O723496Q290597R580998R971287R213781
39316a527118P548375N303861K487462j153267n575615r796399j1854727r974371
39308b4541799m386424K116309O157792O631997N276374M395191M642658N277495
$$ plain form
39364 23671986 19097897 15121049 13383315 14079942 15361216 14326332 9068287 171224
39356 171224 -9435310 -15991878 -16721307 -11163466 -1737906 6912448 10143893 6040345
39348 6040345 -3664163 -15403247 -26290080 -34785598 -39891054 -41173936 -39898386 -38916810
39340 -38916810 -40319732 -43348772 -45285691 -44363794 -41345749 -38340889 -36693257 -36273364
39332 -36273364 -36424369 -37119725 -39091680 -42941468 -48199007 -53286379 -56453291 -56821756
39324 -56821756 -54634839 -50639954 -45307277 -38583781 -30293184 -20712186 -10740899 -1527118
39316 -1527118 6021257 11325118 13812580 12659313 7083698 -2712701 -14567428 -24541799
39308 -24541799 -28928223 -26811914 -20654122 -14022125 -8745751 -4350560 292098 5569593
39300E569593N767219O318032P127076P859426P860440O480552L405384q09599
39292D9578123m674468o766897o787504n365999l241829j232520n34366j921619
39284A9052921m507356o223564n926770m464758l458052l652071m671212n654996
39276a9505858n734394m533965k730107j637677j750173k056803j193031J111122
39268c8030886M002370O340197P164937O053401L763678K073073K186308L517418
39260b929504M550032M397737K859733k78933m670437q449905r412092p446535
39252b1379904m602652k414310m28027K071668M262882M854361M055579L200565
39244a0379838K849042K391823J270762m54825k526267m331115m403223j369631
$$ plain form
39300 5569593 11336812 17654844 24781920 32641346 40501786 46982338 50387722 49578123
39292 49578123 44903655 38136758 31349254 25983255 22741426 21508906 20974540 19052921
39284 19052921 14545565 8322001 2395231 -2069527 -5527579 -9179650 -13850862 -19505858
39276 -19505858 -25240252 -29774217 -32504324 -34142001 -35892174 -37948977 -39142008 -38030886
39268 -38030886 -34028516 -27688319 -20523382 -14469981 -10706303 -8633230 -6446922 -2929504
39260 -2929504 1620528 6018265 8877998 8599065 3928628 -4521277 -13933369 -21379904
39252 -21379904 -25982556 -28396866 -28824893 -26753225 -22490343 -17635982 -13580403 -10379838
39244 -10379838 -7530796 -5138973 -3868211 -4323036 -6849303 -11180418 -15583641 -16953272
39236a6953272M178196R669458J2848495J3392575J2039633R182515N066429N67674
39228D9991703l269439o209624q567422j0183488j0424955r147014o946512m382187
39220i138938j576025J202111L128955L536825K970169L170811N635309R898444
39212A8827661J3345872J3290274R604039M980582K210309J485702Q08767j311634
39204F3241572m248331o180087n924585l845062j600680j130781l266198o994542
39196C0051306j0320708j1879966j1478706r425827o154560k486512O60647L162351
39188a7871975N580447P869170Q941692P964025N393267K245379r60749l901253
39180A5260003n748805n608186l347654M92470N016479Q558661Q845339M994245
$$ plain form
39236 -16953272 -12775076 -3105618 9742877 23135452 35175085 44357600 49424029 49991703
39228 49991703 46722264 40512640 31945218 21761730 11336775 2189761 -4756751 -9138938
39220 -9138938 -10714963 -9512852 -6383897 -2847072 123097 3293908 8929217 18827661
39212 18827661 32173533 45463807 55067846 60048428 62258737 63744439 64553206 63241572
39204 63241572 58993241 52813154 46888569 43043507 41442827 40312046 37045848 30051306
39196 30051306 19730598 7850632 -3628074 -13053901 -19208461 -21694973 -21034326 -17871975
39188 -17871975 -12291528 -4422358 4519334 12483359 17876626 20122005 19161256 15260003
39180 15260003 9511198 3903012 555358 1047828 6064307 14622968 23468307 28462552
39172B8462552p45767m447695l978594m07942L801680O912764Q186547P403774
39164D5187319M991955K125668N3557o46043k26773K92942n70010l671216q091719
39155C9445680j1671616j2971832j2183994j0048008o838070k892578P92936L360138
39147a3007344M916889N793823N488538L279122l68989l868917n865614n833530
39139i466022l656198L04260M662049P643971Q768357R154273R688459R590117
39131C6689266P480174L413367r08631l772345m716319m387947l879588m176317
39123B5741660n424026o401011n353035j896059K248377M873405N366409M765143
39115B3920863M177029L914792M011550M563725N176323M787004K641867q14855
$$ plain form
39172 28462552 27716785 23269090 19290496 18882554 22684234 29596998 37783545 45187319
39164 45187319 50179274 52304942 52358499 51712456 51485683 51778625 51208615 47537399 39445680
39155 39445680 27774064 14802232 2618238 -7429770 -14267840 -17160418 -16367482 -13007344
39147 -13007344 -8090455 -2296632 3191906 6471028 6102039 2233122 -3632492 -9466022
39139 -9466022 -13122220 -12817960 -8155911 -511940 8256417 17410690 27099149 36689266
39131 36689266 44169440 47582807 46674176 42901831 38185512 33797565 29917977 25741660
39123 25741660 20317634 13916623 8563588 6667529 8915906 13789311 19155720 23920863
39115 23920863 28097892 32012684 36024234 40587959 45764282 50551286 53193153 52378298
39107E2378298m269553o349775n976974k780496K050949N820012O252401L581206
39099E0706068L24104r77087L60186K980313M586450L655319Q38770j575919k210342
39090E8687862k103132k863313m101112m279396l798909n173740r526432j4606252
39082A2235576j7306083j6866484j4520308j1170532o883388k051720K274612
39075e4288327N017579N321343K887583r69987l455317k950042j158651j156310
39067e0752129l468866n525543n015862k332084N91408K463486L099993K914724
39059e8024873K788860L677501N533681P007508O761045M892471K914684K643441
39051b1805682M934638Q733256J1348408J0664291P452953M719069M467920N952425
$$ plain form
39107 52378298 48108745 41758970 35781996 33001500 35052449 40872461 47124862 50706068
39099 50706068 51030172 50053085 50413271 53393584 57980034 61635353 62474123 60898204 58687862
39090 58687862 56584730 53721417 49620305 45340909 41542000 36368260 26841828 12235576
39082 12235576 -5070507 -21936991 -36457299 -47627831 -54511219 -56562939 -54288327
39075 -54288327 -49270748 -43949405 -41061822 -42031809 -45487126 -48437168 -49595819 -50752129
39067 -50752129 -54220995 -59746538 -64762400 -67094484 -66503076 -64039590 -60939597 -58024873
39059 -58024873 -55236013 -51558512 -46024831 -39017323 -32256278 -27363807 -24449123 -21805682
39051 -21805682 -16871044 -8137788 3210620 13874911 21327864 26046933 30514853 36467278
39043C6467278P268275P366249N855942K307199k791588p221329q807605p784840
39035C2659581o083314m498311k097288J423860M461840N457163M999452M847383
39027D1170366N418626N387277L669033Q28486j751982l414936m439336n016091
39019D1851443m590287k453928J121551M539304N862716M381662J346982r73198
39011E1086245j299263n98280j159492m105590p828090r208991o595452j503885
39003A8787202K651986L437977J168013j712207k732046j195265J595865L666866
38995B5668391L943321K616277K81468k721688n888224q010102p858292n564110
38987B467041k789325j091978l00741J099925L998239P478838R808590J0281747
$$ plain form
39043 36467278 43735553 51101802 56957744 59264943 56473355 49252026 40444421 32659581
39035 32659581 26576267 22077956 19980668 21404528 25866368 31323531 36322983 41170366
39027 41170366 46588992 51976269 55645302 56473788 54721806 51306870 46867534 41851443
39019 41851443 37261156 34807228 35928779 40468083 46330799 50712461 52059443 51086245
39011 51086245 49786982 49188702 48029210 43923620 36095530 26886539 20291087 18787202
39003 18787202 21439188 24877165 26045178 24332971 21600925 20405660 22001525 25668391
38995 25668391 29611712 32227989 32509457 29787769 23899545 15889443 8031151 2467041
38987 2467041 -322284 -1414262 -1715003 -615078 3383161 10861999 20670589 30952336
38979C0952336R703855R180113Q922753Q354439O873146M186789L91967l601013
38971G4964385n937243n050064j494978J907971K384562k19138l288041l848766
38963E9418688j171062K764327N164979M813977K674907L01310j916413m530149
38955F7520564p401866r199395q892346p120611n418108m351194l123807j041437
38947B0971800J302411K664395K614255J884366J285138O69722p82187l423720
38939B7186180o622057r438571j1499565j2878432j3258066j1716700p710601
38932d5937812k202718K560081M792445M831455M799418O295848Q601576R660150
38924f599557Q724658P218204O711063O959219O663863N417379L823249K134764
$$ plain form
38979 30952336 40656191 49836304 58759057 67113496 73986642 78173431 78565398 74964385
38971 74964385 69027142 63977078 62482100 64390071 66774633 66555495 63267454 59418688
38963 59418688 58247626 61011953 66176932 70990909 73665816 73967126 72050713 67520564
38955 67520564 60118698 50919303 42026957 34906346 29488238 25137044 22013237 20971800
38947 20971800 22274211 24938606 27552861 29437227 30722365 31392087 30609900 27186180
38939 27186180 20564123 11125552 -374013 -13252445 -26510511 -38227211 -45937812
38932 -45937812 -48140530 -45580449 -40788004 -35956549 -31157131 -24861283 -16259707 -6599557
38924 -6599557 2125101 9343305 16054368 23013587 29677450 35094829 38918078 41052842
38916D1052842N8918k126488l507939l842586l852788l913315l586151k984941
38908A7297552l421605n709362q539643r505965p349094k586355L362665Q722777
38900g729030J1605996J0980489P544947L056960j024929l753304m235182k175223
38892A4270724J198370L795641M421137L206123N44839l200763o739721p878218
38884I618132n432358o99938L533968N286879M618135L181498K845475M204340
38876B7156131N995000O286833M539284K177064R43447J107140J513411Q48386
38868E0566696j592743n866927j1283081j6251750j8731307j7240453j1767448
38861c2167013m084936K828511O357994N948498L332186R22788P9445Q73027K845735
$$ plain form
38916 41052842 41111760 38985272 35477333 31634747 27781959 23868644 20282493 17297552
38908 17297552 13875947 8166585 -373058 -9879023 -17228117 -19814472 -16451807 -7729030
38900 -7729030 3876966 14857455 22402402 25459362 24434433 20681129 16445947 14270724
38892 14270724 15469094 19264735 23685872 26891995 27436834 24236071 17496350 9618132
38884 9618132 4185774 3485836 7019804 12306683 16924818 20106316 22951791 27156131
38876 27156131 33151131 39437964 43977248 46154312 47097759 48204899 49718310 50566696
38868 50566696 48973953 43107026 31823945 15572195 -3159112 -20399565 -32167013
38861 -32167013 -36251949 -33423438 -27065444 -21116946 -17784760 -16861972 -16782527 -15909500 -13063765
38852a3063765N306463P119403P050377M720104R99542k650595n052017n636911
38844a207399m476285k336498m07913N13425O54242Q70726J609220K419000K469466
38835A07984J354902n59055k290631k785362j823920o00012q23661k750627m612463
38826a4782845m795055m212340n315112q574876j1220344j0301490o239392k337675
38818f7779129j092652j851541j997013L31741M734511R058797J1124461J0293771
38810c7177054P645198M772021K666377J641927J531279J496830L63056k086461
38802a9146827m574429n766546n689185m884575k879783J083712O073475R829980
38794b5954178J1345893J1627343J1389361R443866M438386k650622q795050j1321427
$$ plain form
38852 -13063765 -7757302 -637899 6412478 11132582 12132124 9481529 4429512 -1207399
38844 -1207399 -5683684 -8020182 -8428095 -7914670 -7260428 -6389702 -4780482 -2361482 107984
38835 107984 1462886 903831 -1386800 -4172162 -5996082 -6596094 -7419755 -10170382 -14782845
38826 -14782845 -19577900 -23790240 -29105352 -37680228 -48900572 -59202062 -65441454 -67779129
38818 -67779129 -68871781 -70723322 -72720335 -72388594 -67654083 -58595286 -47470825 -37177054
38810 -37177054 -29531856 -24759835 -22093458 -20451531 -18920252 -17423422 -17060366 -19146827
38802 -19146827 -23721256 -29487802 -35176987 -40061562 -42941345 -41857633 -35784158 -25954178
38794 -25954178 -14608285 -2980942 8408419 17852285 22290671 19640049 10844999 -476428
38786d76428r520375m572742J233000N547411P101222O048067L235417l85185
38778H210387l604528n224773n187783m783674m954541m851795k861887J264829
38770b1993765O056299R825354J1788941J1884169J0349257P726434M824543K427820
38762D2889052J036139O50296O67994L75153k01922l64131O4168J98599p82510
38753D4532838k607079m631896o914250r573290j1498640j0898434p275265k092969
38745a0958985K568377N369881N877566M351585J705659q89242k649997l274483
38737B100361k737974j612992j237247k550397m731431n905905n295638l737690
38729b5708913k022355l53K162468L173111K180654L65338l05039L97686Q22201
$$ plain form
38786 -476428 -9996803 -14569545 -13336545 -7789134 -687912 5360155 8595572 8210387
38778 8210387 4605859 -618914 -5806697 -10590371 -15544912 -20396707 -23258594 -21993765
38770 -21993765 -15937466 -6112112 5676829 17560998 27910255 35636689 40461232 42889052
38762 42889052 43925191 44575487 45243481 45618634 45416712 45052581 45116749 45315348 44532838
38753 44532838 41925759 37293863 30379613 20806323 9307683 -1590751 -8866016 -10958985
38745 -10958985 -8390608 -3020727 2856839 7208424 8914083 8024841 5374844 2100361
38737 2100361 -637613 -2250605 -3487852 -6038249 -10769680 -16675585 -21971223 -25708913
38729 -25708913 -27731268 -27731621 -25569153 -22396042 -20215388 -19850050 -20155089 -19757403 -18935202
38720a8935202j85328j792666k375145j468779j12452L16253p74442k934891n137334
38711c3399986o530427o935674o620409n637871l700440r38389J475531K034937
38703f0252728N24892j327853j267486J337383M949008P463494Q093914P670406
38695c2808970P548300Q511802J0357885J2017439J2171565J0221954O755487
38688C4775462K841075j013850m860773q419967j0824532j1522771j1056886j0563859
38680b0646101j0569847j0488026r343314o936217m178526k074266l91886K157887
38672f2470296O049296R688272J0751209Q678856N164063K213825N57617P4528
38664a9292630O60441J889854K564472J685003k79510j912961k584132k894238
$$ plain form
38720 -18935202 -19120530 -20913196 -23288341 -24757120 -24869572 -24553319 -25327761 -28262652 -33399986
38711 -33399986 -39930413 -46866087 -53486496 -59124367 -62824807 -63763196 -62287665 -60252728
38703 -60252728 -59727836 -61055689 -62323175 -60985792 -56036784 -48573290 -40479376 -32808970
38695 -32808970 -25260670 -16748868 -6390983 5626456 17798021 28019975 34775462
38688 34775462 37616537 36602687 31741914 23321947 12497415 974644 -10082242 -20646101
38680 -20646101 -31215948 -41703974 -51047288 -57983505 -62162031 -64236297 -64628183 -62470296
38672 -62470296 -56421000 -46732728 -35981519 -27302663 -22138600 -19924775 -19367158 -19292630
38664 -19292630 -18632189 -16742335 -14177863 -12492860 -12772370 -14685331 -17269463 -20163701
38656b0163701l385381l675699l225003k273724j526552j389067j975584l283547
38648d0898258m558598l897062K63285O835602J2077838J2571545P979808P07525
38640h918315o404776j1459436j3489568j2588204j0243307q447854p895536p535452
38632h6982448o070957l182148R43677O260349J2245665J7288817J9646656J8854757
38624b0995632J5685719J1179793O457099L025224K120472L530488N688536P012610
38616C3704309O745420M796082J602722j867149m764520p075448r047853j0092680
38608A4000883r304108p147307n366981m653841l519666m63889L453725N336792
38600g664392L585593m90996m089534n229366l738603q45690J628604J955762
$$ plain form
38656 -20163701 -23549082 -27224781 -30449784 -32723508 -34250060 -35639127 -37614711 -40898258
38648 -40898258 -45456856 -49353918 -49090633 -42255031 -30177193 -17605648 -9625840 -8918315
38640 -8918315 -15323091 -26782527 -40272095 -52860299 -63103606 -71551460 -79446996 -86982448
38632 -86982448 -93053405 -96235553 -95291876 -89031527 -76785862 -59497045 -39850389 -20995632
38624 -20995632 -5309913 5869880 12326979 15352203 17472675 21003163 26691699 33704309
38616 33704309 40449729 45245811 46848533 44981384 40216864 33141416 24093563 14000883
38608 14000883 4696775 -2450532 -7817513 -12471354 -15991020 -16454909 -13001184 -7664392
38600 -7664392 -4078799 -4569795 -8659329 -13888695 -17627298 -18472988 -16844384 -14888622
38592a4888622q96847o623395j3161531j7306183j6724867j1961330o164207k402347
38584i0129329j279872j185210l62434J636896M100108O074925P140712P647515
38576f6356689Q263664R177700R860823R685081Q517329O611704M341341K328366
38568g570681J449280K244878M415340P041385Q987679R019408O321709J614873
38560C3523871k734807m637440m253848l409183l263951l468992l576544m049498
38552D129608n182562n860232m531858j453146Q37176k01675m390772q593780
38544b5247241r389159o153295j532112J179212J023487k94531o70394L96827
38536d0687206K021367L393202M495423N656575O893023P693704P261722N170462
$$ plain form
38592 -14888622 -15785469 -22408864 -35570395 -52876578 -69601445 -81562775 -87726982 -90129329
38584 -90129329 -91409201 -92594411 -92956845 -91319949 -87219841 -81144916 -74004204 -66356689
38576 -66356689 -58093025 -48915325 -39054502 -29369421 -20852092 -14240388 -9899047 -7570681
38568 -7570681 -6121401 -3876523 538817 7580202 16567881 25587289 31908998 33523871
38560 33523871 30789064 26151624 21897776 18488593 15224642 11755650 8179106 4129608
38552 4129608 -1052954 -6913186 -11445044 -12898190 -12061014 -12262689 -16653461 -25247241
38544 -25247241 -34636400 -40789695 -42321807 -41142595 -40119108 -40413639 -41084033 -40687206
38536 -40687206 -38665839 -35272637 -30777214 -25120639 -18227616 -10533912 -3272190 1898272
38528A898272K053640o50795k134341l191993n099497p567257q700223p364567
38520c0756761m775570k987660k346927j380417R89451M049696O140483O097002
38512b4970703L854669N93817j479823n28973L115057P182927R896996J1394087
38504I058054J2360723J2487635J1344309R825877R205803R025940P217588K364592
38496H2890521m910791j2413514j7328294j7473939j3216089p882108m699727
38489D966059l487406k050039n11437j674557o379764j1025125j1357960p093038
38481c8613267j262799L395014N580826M534452O72909l202792l653084l5731
38473c2584472N029162Q594817R630045Q700623P055704O140621O500974O732457
$$ plain form
38528 1898272 3951912 3301117 1166776 -2025217 -7124714 -14691971 -23392194 -30756761
38520 -30756761 -35532331 -38519991 -40866918 -42247335 -41257884 -37208188 -31067705 -24970703
38512 -24970703 -21116034 -20522217 -22002040 -22531013 -19415956 -12233029 -2336033 9058054
38504 9058054 21418777 33906412 45250721 55076598 64282401 73308341 80525929 82890521
38496 82890521 77979730 65566216 48237922 30763983 17547894 9665786 4966059
38489 4966059 1478653 -571386 -1082823 -2757380 -9137144 -20162269 -31520229 -38613267
38481 -38613267 -39876066 -36481052 -30900226 -26365774 -25692865 -28895657 -32548741 -32584472
38473 -32584472 -27555310 -18960493 -9330448 -629825 6425879 12566500 19067474 25799931
38465B5799931M682352J91538m177888n513873l141604J067459M261365M693369
38457B7862649L159539K275093L560641N594995N939609M210720J828469o11975
38449E3819740l624929o597292p636376o304914m431573l255668j742201R58721
38441B1185508L220733K945782O16599j524289k465605k688373k016305O52224
38433A9926274N174772R261576J0357353P774791K963810j586164l875723l803092
38425D6193597l196051l882756n896161q098686r903105j1169940j0790536p045193
38417a3788831J43862Q451038J5230331J9573097K1819786K1856099J8753701
38410I2039083J1951926K391977p462547j4755511j7858808j7193332j4408314
$$ plain form
38465 25799931 30482283 30673821 26495933 20982060 17840456 18907915 23169280 27862649
38457 27862649 31022188 33297281 36857922 42452917 48392526 52603246 54431715 53819740
38449 53819740 50194811 43597519 35961143 29656229 25224656 21968988 20226787 21185508
38441 21185508 24406241 27352023 27968622 26444333 23978728 21290355 19274050 19926274
38433 19926274 25101046 34362622 44719975 52494766 55458576 53872412 49996689 46193597
38425 46193597 42997546 39114790 33218629 25119943 15216838 4046898 -6743638 -13788831
38417 -13788831 -13644969 -5193931 10036400 29609497 51429283 73285382 92039083
38410 92039083 103991009 106382986 98920439 84164928 66306120 49112788 34704474
38403C4704474j0899259p351601m252340j983728m34031O67142R15630m30091
38395A0936196l003479n030066m982812l037373n58629J264340J914641J409424
38387a087758L56051k48492J14197J007273J722019J996640J736713P23093p43433
38378E576303j565897j174310o78239j564358l420456m169249k672581Q5375K672289
38369f911123M714289O033003N635761L011607k18912j560470o33771L33675o56362
38360I747697l029700m579287l889966j185566K577955O541159R931039J1888395
38352B8001726J1697955R389592O290277M605187N546227P669459Q016781N490227
38344H6707431K208474O14091L9709k462821q156779j4918987j9618200k0848261
$$ plain form
38403 34704474 23805215 16453614 12201274 10217546 9783515 10450657 11366287 10936196
38395 10936196 7932717 2902651 -2080161 -5117534 -5676163 -4411823 -2497182 -1087758
38387 -1087758 -731707 -980199 -866002 141271 1863290 3859930 5596643 6319736 5576303
38378 5576303 4010406 2836096 2157857 593499 -2826957 -6996206 -9668787 -9583412 -6911123
38369 -6911123 -2196834 3836169 9471930 12483537 12264625 10704155 10070384 10404059 9747697
38360 9747697 6717997 2138710 -1751256 -2936822 -358867 6182292 16113331 28001726
38352 28001726 39699681 49089273 55379550 59984737 65530964 73200423 81217204 86707431
38344 86707431 88915905 89529996 89569705 87106884 78950105 64031118 44412918 23564657
38336B3564657j8906343j4429989q091712j002914N469652J0153329J2203289
38329H959969J1530869R441352P852216P094242N326792J156466l822873o371189
38321D1167844n271296k583721j349354l012154o924435j1121763j3334506j2388644
38313a4818029r257484o174427m438074l671797l208007l055444l025128k046400
38305d9694790O08214L972397O203599O498271N493007M067525K545271R65452
38297a9341054n87714j975120k806220k363108l98901J954169K851000J738269
38289b0928679K58608O34523L185383N734314N593738K130024k659922o116764
38281a2168775p284819p067998o314188m686905j915487P37219J466873J91719
$$ plain form
38336 23564657 4658314 -9771675 -17863387 -18866301 -13396649 -3243320 8959969
38329 8959969 20490838 29932190 37784406 44878648 50205440 51361906 47539033 41167844
38321 41167844 35896548 33312827 31963473 28951319 22026884 10905121 -2429385 -14818029
38313 -14818029 -24075513 -30249940 -34688014 -38359811 -41567818 -44623262 -47648390 -49694790
38305 -49694790 -49086576 -45114179 -38910580 -32412309 -26919302 -22851777 -20306506 -19341054
38297 -19341054 -19928768 -21903888 -24710108 -27073216 -27472117 -25517948 -22666948 -20928679
38289 -20928679 -20670071 -20035548 -16850165 -11115851 -5522113 -3392089 -6052011 -12168775
38281 -12168775 -19453594 -26521592 -32835780 -37522685 -39438172 -38700953 -37234080 -37042361
38273c7042361j356557j959148k168135k782333l253140k628777j331089p21465
38265e3243005j119591j451739j035690o91875j556746l375383m507040l459328
38257g0440397k63074L443726N709197O020356N741107O385223P661618Q014978
38249b7727266O984428N805673N324713M724109L333196K473796L827428O529855
38241A1275932P754068O266712L671718J635642m03327l613489p113058q541721
38233A0932477o921753l669281p96105Q77013J666958K218224L177953M977113
38225A2462599P257710Q634207P493334L372301k247908o574208p392635m791636
38217A8213764r97125J646311K393715J888603R90794L76828O65025J829518K504217
$$ plain form
38273 -37042361 -38398918 -40358066 -42526201 -45308534 -48561674 -51190451 -52521540 -53243005
38265 -53243005 -54362596 -55814335 -56850025 -57541900 -59098646 -62474029 -66981069 -70440397
38257 -70440397 -70703471 -67259745 -61550548 -55530192 -49789085 -43403862 -35742244 -27727266
38249 -27727266 -20742838 -14937165 -9612452 -4888343 -1555147 918649 4746077 11275932
38241 11275932 19030000 25296712 28968430 30604072 30200745 26587256 19474198 10932477
38233 10932477 4010724 341443 -454662 422351 2089309 4307533 7485486 12462599
38225 12462599 19720309 28354516 35847850 39220151 36972243 30398035 23005400 18213764
38217 18213764 17216639 18862950 21256665 23145268 24136062 24512890 25177915 27007433 29511650
38208B9511650R08625l098506p533799j0258477j0873773j0212966q593727n523830
38200b5674803j110933L122352N402191N427843M445070L598020K716554J113730
38192i59976p74425j361768J96286K683285L936837K942933K97392k972436o075877
38183b087749p998435p583682m845986j629887q7515n11193j204624n47697J265744
38174b5231024K756368L101405L063763L779634M937189M817348K429285r24962
38166a270994k828226k190584J92762L204465O295680Q563270Q359014N047757
38158B5373144N60563k085494j830308k67553O37649N28226J70613O6137K38512
38149B3391489P32879J482867J975549J854688J809108L054695N610162P631461
$$ plain form
38208 29511650 30420275 27321769 19787970 9529493 -1344280 -11557246 -20150973 -25674803
38200 -25674803 -26785736 -23663384 -18261193 -12833350 -8388280 -4790260 -2073706 -959976
38192 -959976 -1734401 -3096169 -2899883 -216598 3720239 6663172 6960564 3988128 -2087749
38183 -2087749 -10086184 -17669866 -22515852 -24145739 -24233254 -24744447 -25949071 -26496768 -25231024
38174 -25231024 -22474656 -19373251 -16309488 -12529854 -7592665 -2775317 -346032 -1270994
38166 -1270994 -4099220 -6289804 -6097042 -2892577 3403103 11966373 20325387 25373144
38158 25373144 25933707 23848213 22017905 21750352 22388001 22916227 23086840 23152977 23391489
38149 23391489 24124368 25607235 27582784 29437472 31246580 34301275 39911437 47542898
38141D7542898O961605L142858k471739q344285j3821484j8451249k0959007j9737770
38133b6138173j4487362o961775J02761M651049O065917N001880L002304J862770
38125b6900629K436110L727177L692573J436657j608267l172142k731216k034909
38117b5154646k867717m832227n903203m947354l010594j948885k303181k873581
38109e3841388k088994N36051M053440O798485P623188O833555N850545N615911
38101a8619207N451873L904793O19034l128751n738850o559607n799920l920819
38093c3791454j529060P02709K616708M743410P289339R159361Q691873N484170
38085C367056J015869k660566m436294m270498k453636N76041L770970N566858
$$ plain form
38141 47542898 54504503 57647361 55175622 46831337 33009853 14558604 -6400403 -26138173
38133 -26138173 -40625535 -47587310 -47484549 -42833500 -36767583 -31765703 -28763399 -26900629
38125 -26900629 -24464519 -20737342 -17044769 -15608112 -17216379 -20388521 -23119737 -25154646
38117 -25154646 -28022363 -32854590 -38757793 -43705147 -46715741 -48664626 -50967807 -53841388
38109 -53841388 -55930382 -55394331 -51340891 -44542406 -36919218 -30085663 -24235118 -18619207
38101 -18619207 -13167334 -9262541 -8643507 -11772258 -17511108 -24070715 -29870635 -33791454
38093 -33791454 -35320514 -34617805 -32001097 -27257687 -19968348 -10808987 -2117114 3367056
38085 3367056 4382925 1722359 -2713935 -6984433 -9438069 -8862028 -5091058 475800
38077D75800N074623L202537K123500L227707N641895O991413N572877J624903
38069C3935255l246654p324106r477049r368004p518178m978990k629457q83659
38061a1490842n8641n26262k251146m653341p252610r925746j2098720j2350497
38053f0607805r681067m895470L7850L779717O054498O739348N757283L897778
38045d8917868K451936J593441K22224j989239l494222k805009p60391L45738
38037e3353390l70142j428270q39272K001891O339644J1063900J5250325J8168332
38029c166982J9195765J7781643J3736332P929272K417696r16110k091392k882899
38021E2003325m697746p006795q152262p354556n570096m522393n118799o725358
$$ plain form
38077 475800 5550423 8752960 10876460 14104167 19746062 26737475 32310352 33935255
38069 33935255 30688601 23364495 13887446 4519442 -2998736 -7977726 -10607183 -11490842
38061 -11490842 -11549483 -12075745 -14326891 -18980232 -26232842 -36158588 -48257308 -60607805
38053 -60607805 -70288872 -75184342 -75146492 -71366775 -65312277 -58572929 -52815646 -48917868
38045 -48917868 -46465932 -44872491 -44650267 -46639506 -50133728 -52938737 -53699128 -53353390
38037 -53353390 -53723532 -55151802 -55991074 -53989183 -47649539 -36585639 -21335314 -3166982
38029 -3166982 16028783 33810426 47546758 55476030 57893726 56977616 54886224 52003325
38021 52003325 47305579 40298784 32146522 24791966 19221870 14699477 9580678 2855320
38013B855320p856072p589998o236662m527419k533775L7455K656932L995733
38005a9198486L513483K368946K214256L511978N497286P243802Q014407O995378
37997B0161050L860885j19136k412808j394909J922423M599500M184610N62676
37989C1364291m078303o849278o145793k675634J210999L279680K755492L84605
37981A9246059k396280m422672n457068o173657p329727q871365j0054400j0358773
37973c5817883r758681p969507m192939J640802P652398J0903442R871172N814836
37965b1856360J622912m63013q5283J658195L438828M630863N385322N984065
37957C15529O251692N752248M550263L529412L706200N153945O683912O768761
$$ plain form
38013 2855320 -5000752 -12590750 -18827412 -23354831 -25888606 -25851151 -23194219 -19198486
38005 -19198486 -15685003 -13316057 -11101801 -7589823 -2092537 5151265 13165672 20161050
37997 20161050 24021935 23902799 21489991 20095082 22017505 26617005 30801615 31364291
37989 31364291 27285988 20436710 14290917 11615283 12826282 16105962 18861454 19246059
37981 19246059 16849779 12427107 6970039 796382 -6533345 -15404710 -25459110 -35817883
37973 -35817883 -45576564 -53546071 -57739010 -56098208 -48445810 -37542368 -27671196 -21856360
37965 -21856360 -20233448 -20696461 -20781744 -19123549 -15684721 -11053858 -5668536 315529
37957 315529 6567221 12319469 16869732 20399144 24105344 29259289 35943201 42711962
37949D2711962M967762K433927Q20679O62999J075857J032827M19596m52697j737711
37940E1935201l671408n584400o278353n561689m585602m293111m278512l741178
37932A3940948k933648k852379l790483m989713n651991n597189m920763l768184
37924b0563402k720992k735975m079057n489123m912611j323354M112686Q618704
37916b9093124R691248O796500J497249m008385q400286j1371148j2792652j2404398
37908f0084996j0314543p149062l383358J019605N878885J0033488J1935189J1120601
37900d0944191Q767651O634831N633334N600330O265697P870959J0338742J2073916
37892B2241269J0636268N375059j129793n318091o282764o124966o662611p275984
$$ plain form
37949 42711962 47679724 50113651 50934330 51597329 52673186 53706013 54125609 53672912 51935201
37940 51935201 48263793 42679393 36401040 30839351 26253749 21960638 17682126 13940948
37932 13940948 11007300 8154921 4364438 -625275 -6277266 -11874455 -16795218 -20563402
37924 -20563402 -23284394 -26020369 -30099426 -35588549 -40501160 -41824514 -37711828 -29093124
37916 -29093124 -19401876 -12605376 -11108127 -15116512 -23516798 -34887946 -47680598 -60084996
37908 -60084996 -70399539 -77548601 -80931959 -79912354 -74033469 -63999981 -52064792 -40944191
37900 -40944191 -32176540 -25541709 -19908375 -14308045 -8042348 -171389 10167353 22241269
37892 22241269 32877537 38252596 37122803 31804712 25521948 19396982 12734371 5458387
37884E458387o784163n987704o658480q627239r698901q530733o021984l509749
37876e0360566j129511J276527K974903L256211K717527K470811K603479K512102
37868c3678517K346088K944464M467297O110394P119402P166621N891818L240132
37860E607699L27642j271885j480415j870849l436975n331498o411588o783733
37852b0651602o786372n581504k346216J649468L794104L007792N69915j975149
37844b8319564m292446o174818o364470l550616J962925Q216714J2742665J3446123
37836a2333487R431115K096868n053058q899978r128123p573563n528648k753193
37828c9742067R18709M363232O262861O616443O390996O161406N841628N447901
$$ plain form
37884 5458387 -1325776 -7313480 -13971960 -22599199 -32298100 -40828833 -46850817 -50360566
37876 -50360566 -51490077 -50213550 -47238647 -43982436 -41264909 -38794098 -36190619 -33678517
37868 -33678517 -31332429 -28387965 -23920668 -17810274 -10690872 -3524251 2367567 5607699
37860 5607699 5935341 4663456 3183041 1312192 -2124783 -7456281 -13867869 -20651602
37852 -20651602 -27437974 -33019478 -35365694 -33716226 -29922122 -26914330 -26344415 -28319564
37844 -28319564 -32612010 -38786828 -45151298 -48701914 -46738989 -38522275 -25779610 -12333487
37836 -12333487 -2902372 -805504 -5858562 -14758540 -23886663 -31460226 -36988874 -39742067
37828 -39742067 -38823358 -34460126 -28197265 -21580822 -15189826 -9028420 -3186792 2261109
37820B261109N304303N447742N406843M697618L189720J024844j365608l143665
37812B2822906l510591k500936r62675M23213J686605K934225L751677L793707
37804B8438131L591198L981861M697819M201939J305243l298222p294809q418454
37796B7204706o003610j451876K626260M272476L746479L136517M093927O076447
37788D3701326P070947N782493K691578q28380l809728o033517p615094q499436
37780C2460189q086110n352122K0078O253633R837281Q272419K720299k610363
37772D3515304m135498j901474J072373J999576M60322k314879n280414q024912
37764B5390398r842827r510406o616361k659757m0750J62914r92598j758783j428385
$$ plain form
37820 2261109 7565412 13013154 18419997 23117615 26307335 27332179 25966571 22822906
37812 22822906 19312315 16811379 15848704 16271917 17958522 20892747 24644424 28438131
37804 28438131 32029329 36011190 40709009 44910948 46216191 42917969 35623160 27204706
37796 27204706 21201096 19749220 22375480 26647956 30394435 33530952 37624879 43701326
37788 43701326 50772273 56554766 59246344 58417964 54608236 48574719 40959625 32460189
37780 32460189 24374079 19021957 19042035 25295668 35132949 43405368 46125667 43515304
37772 43515304 39379806 37478332 38550705 40550281 41010603 38695724 33415310 25390398
37764 25390398 15547571 6037165 -579196 -3238953 -3279703 -3116789 -4109387 -5868170 -7296555
37755g296555l71221J149137L483020O789490J0125658J1706267J0199159N853880
37747D1638835M51406l910536o194462o789535o617058n992767m509781j992684
37739F083418P73552K598244L087174K870960K492092J555522m89301l029516
37731A5942145m626816m878197n121241o670048q892850r849517q596028o047749
37723c8740301l644881k030469j152033p23627j16753J475132M113363O767362
37715c4052207Q388999Q915695Q733700P728060N682670L250436J497665M76348
37707A0621366p74670k525652l551329k666757n27532Q61561L08186j489450l061875
37698b806152l817735m213975m512068l924883j414876K706985O407806P491879
$$ plain form
37755 -7296555 -7667776 -6518639 -3035619 3753871 13879529 25585796 35784955 41638835
37747 41638835 42090241 38179705 31985243 25195708 18578650 12585883 8076102 6083418
37739 6083418 6856970 9455214 12542388 15413348 17905440 19460962 18971661 15942145
37731 15942145 11315329 6437132 1315891 -5354157 -14247007 -24096524 -32692552 -38740301
37723 -38740301 -42385182 -44415651 -45567684 -46291311 -46408064 -44932932 -40819569 -34052207
37715 -34052207 -25663208 -16747513 -8013813 -285753 5396917 8647353 10145018 10621366
37707 10621366 9846696 7321044 3769715 1102958 575426 1436987 1745173 255723 -2806152
37698 -2806152 -6623887 -10837862 -15349930 -19274813 -20689689 -17982704 -11574898 -4083019
37690d083019N477800J817583j498942l301805l573712l120772l006098l745916
37682a5034881m760942m945505m014519k982112l042901m227074n404084n351836
37674d9763854l552159k67236L645671P057200R198022J0155245J0533051J0541118
37666b452942R591216O875267K292215l100626p423041r000440p581470m737528
37658a5537349k756203k796634m063965m789260l914396j841673J94877J291313
37650c4213290J553646J904655L300634O000658R377019J2213314J3176372J1442833
37642B4755841P487086L317635J262895J922693L471801L414340R34083k788530
37634D3777844o187032q413689q953221p393499m359529j833938j279843j567006
$$ plain form
37690 -4083019 1394781 3212364 1713422 -1588383 -5162095 -8282867 -11288965 -15034881
37682 -15034881 -19795823 -24741328 -28755847 -31737959 -34780860 -39007934 -44412018 -49763854
37674 -49763854 -53316013 -53583249 -49937578 -42880378 -33682356 -23527111 -12994060 -2452942
37666 -2452942 7138274 14013541 16305756 13205130 5782089 -3218351 -10799821 -15537349
37658 -15537349 -18293552 -21090186 -25154151 -29943411 -33857807 -35699480 -35504603 -34213290
37650 -34213290 -32659644 -30754989 -27454355 -21453697 -12076678 136636 13313008 24755841
37642 24755841 32242927 35560562 36823457 38746150 42217951 45632291 46566374 43777844
37634 43777844 37590812 29177123 20223902 12830403 8470874 6636936 5357093 3790087
37626C790087L8196M438772R167377J0897731Q887490N250448K318354O57778
37618D5446233m92596j927730l999091o573243q725924q919289o375555k358213
37610F074592N56337P78929j062439l316513n137738o593425p418820o712055
37602b2831132m172277r08099J575122K805551L212616K937060J595981p42489
37594a6527667l081568m284171l950001k447717o16181M63104J10288j144705
37586c1478618j950941j708311j139174q50069j59433J703236L830625M379987
37578b7372698L053018J649035J847217L408264M994085N850076N958563N150491
37570D538051K982500n12565m398912p199537p675514n661199k380210M47168
$$ plain form
37626 3790087 3828283 8267055 17434432 28332163 37219653 42470101 44788455 45446233
37618 45446233 44953637 43025907 39026816 32453573 23727649 14808360 8432805 6074592
37610 6074592 6630929 7409858 6347419 3030906 -2106832 -8700257 -16119077 -22831132
37602 -22831132 -27003409 -27911508 -26336386 -23530835 -20318219 -17381159 -15785178 -16527667
37594 -16527667 -19609235 -23893406 -27843407 -30291124 -30907305 -30444201 -30333913 -31478618
37586 -31478618 -33429559 -35137870 -36277044 -37127113 -37286546 -35583310 -31752685 -27372698
37578 -27372698 -24319680 -22670645 -20823428 -17415164 -12421079 -6571003 -612440 4538051
37570 4538051 7520551 7007986 2609074 -4590463 -12265977 -17927176 -20307386 -19860218
37562a9860218K139063L437935N213749P263445Q689142Q902788P762815N253006
37554B8801725J761520j617949l835522m880210n442903n711957n175409l609250
37546B90045j575572K17788J505352K254094K373749J860256Q71304m50636j873662
37537E472718k814736k745045j981570j483442j616531j696354j093478k08261
37529h166699J57394q7390m75747r32015j839239l173470m120957l658041j229950
37520b3526114K989185Q004035J2161801J3943067J2870397R521797M786386m72316
37512D0278238n105368p794013q014948o679148n429228n330750o368458p942588
37504a2386263r429817j0229783r647327p154613l009265J434636M432316N316490
$$ plain form
37562 -19860218 -17721155 -14283220 -9069471 -1806026 6883116 15785904 23548719 28801725
37554 28801725 30563245 28945296 25109774 20229564 14786661 9074704 3899295 290045
37546 290045 -1285527 -1067739 437613 2691707 5065456 6925712 7797016 7346380 5472718
37537 5472718 2657982 -87063 -2068633 -3552075 -5168606 -6864960 -7958438 -8166699
37529 -8166699 -8009305 -8096695 -8572442 -9504457 -11343696 -14517166 -18638123 -22296164 -23526114
37520 -23526114 -20536929 -12532894 -371093 13571974 26442371 35964168 40750554 40278238
37512 40278238 35172870 27378857 19363909 12684761 7255533 1924783 -4443675 -12386263
37504 -12386263 -21816080 -32045863 -41693190 -48847803 -51857068 -50422432 -45990116 -40673626
37496d0673626N184604N551128O133854M672324l37729p045716j1330875j0769295
37488d8615331o913060l293188j797824j674980j593551j467495j869370k541916
37480f9766715k426002j039673Q89576K370191L281456M259552N672448P031182
37472d9727985P431057O429009M482166K632861J773564K058282K797948K830592
37464a9292506J242508j775911m576782m979583k145501K423287O132765P617972
37456a5353751P562448P358543P578058P910368P903440P247022N791432L913704
37448C9911264K604975K566068L293814L546456K614785P26763j520962l490723
37440E0252440m471532m130109l011987j878686o08278J335475L335165L772330
$$ plain form
37496 -40673626 -35489022 -29937894 -23804040 -19131716 -19469445 -26515161 -37846036 -48615331
37488 -48615331 -55528391 -58821579 -60619403 -62294383 -63887934 -65355429 -67224799 -69766715
37480 -69766715 -72192717 -73232390 -72342814 -69972623 -66691167 -62431615 -56759167 -49727985
37472 -49727985 -42296928 -35867919 -31385753 -28752892 -26979328 -24921046 -22123098 -19292506
37464 -19292506 -18049998 -19825909 -24402691 -29382274 -31527775 -29104488 -22971723 -15353751
37456 -15353751 -7791303 -432760 7145298 15055666 22959106 30206128 35997560 39911264
37448 39911264 42516239 45082307 48376121 51922577 54537362 55264125 53743163 50252440
37440 50252440 45780908 41650799 38638812 36760126 36151848 37487323 40822488 44594818
37432D4594818K238555M20895o1678K76322n3458j118849j721471j543184j678467
37423D1353483k946127m827966o226813o229706m028463O04296O174966R844330
37415C3718000R783044O643367K269345k216241o301247q884974q543111n164435
37407B1303748n90577K719148L557453K686650K011835K912573N042956O702266
37399D6346052O387401L858845p7928m156776o880037p013064m537412p67880
37391C3159201K930690O141954Q738142R939568Q920887N992382K248765j770145
37383G6301444o065227r809232j1148824r027561m656136n88680J440010J470563
37375C7916357N22177n55179j405134j848781j751483j325490j215217j838777
$$ plain form
37432 44594818 46833373 47254268 47192590 47468912 47415454 46296605 44575134 43031950 41353483
37423 41353483 38407356 33579390 27352577 21122871 17094408 17698704 23873670 33718000
37415 33718000 43501044 50144411 52413756 50197515 43896268 35011294 26468183 21303748
37407 21303748 20713171 23432319 26989772 29676422 31688257 34600830 39643786 46346052
37399 46346052 52733453 56592298 56514370 52357594 45477557 38464493 33927081 33159201
37391 33159201 36089891 42231845 50969987 60909555 69830442 75822824 78071589 76301444
37383 76301444 70236217 60426985 49278161 40250600 35594464 35005784 36445794 37916357
37375 37916357 38438534 37883355 36478221 34629440 32877957 31552467 30337250 28498473
37367B8498473k745861l190190l373220m320050o090952o892105m815143j04058
37359c033106N046569Q619228R948568R242670P177935N100970M565969O110646
37351E2779449Q840469J1243532J1978807J0232880O365781K277875Q7393J09193
37343A03915379R13891J431642J860068K294978K041459J253437J959836N911444
37335A21582134J1906065J6628521J8082660J7185709J6058066J5820448J6355765
37328B33619368J7395195J9155006K1901367K5039557K6866132K5734358K1695930
37321C91406913J6525290J1817087P596023L182549j305973n091879p878350j0034850
37313D06216810j1999478j4263867j7529495k1909220k6180147k8705550k8867811
$$ plain form
37367 28498473 25752612 22562422 19189202 14869152 8778200 1886095 -2929048 -3033106
37359 -3033106 2013463 10632691 20581259 29823929 37001864 42102834 46668803 52779449
37351 52779449 61619918 72863450 84842257 95075137 101440918 103718793 103806186 103915379
37343 103915379 104829270 106260912 108120980 110415958 112457417 113710854 115670690 121582134
37335 121582134 133488199 150116720 168199380 185385089 201443155 217263603 233619368
37328 233619368 251014563 270169569 292070936 317110493 343976625 369710983 391406913
37321 391406913 407932203 419749290 427345313 430527862 429221889 424130010 416251660 406216810
37313 406216810 394217332 379953465 362423970 340514750 314334603 285629053 256761242
37306B56761242k6772720k2170621j5264059q476065n428258p191993j0749316
37299A60708210j2150622j0359957p187841m469133k645719j611970j449286k049761
37291A18783921k902269l590025m033527m135867l638800k451346q15854Q56384
37283I8072617K055213K254346J386649J72150n17004o35632q46915j433428j953329
37274I8554667k191329k791646m398224o558966q125350q570618q250194p372005
37266E0296335n503811k501948O48702K530971K549160R57527j981592n913101
37258D1082243r405056j0163152p082157j748407K735582M324851L155211O05024
37250B3504139j967635l639924l931373k898225j103652N90500J160771k98177
$$ plain form
37306 256761242 229988522 207817901 192553842 184077777 178649519 171457526 160708210
37299 160708210 148557588 138197631 131009790 126540657 123894938 122282968 120833682 118783921
37291 118783921 115881652 112291627 108258100 104122233 100483433 98032087 97216233 98072617
37283 98072617 100127830 102382176 103768825 103940975 103423971 102788339 101941424 100507996 98554667
37274 98554667 96363338 93571692 89173468 82614502 74489152 65918534 57668340 50296335
37266 50296335 44792524 42290576 42939278 45470249 48019409 48976936 46995344 41082243
37258 41082243 31677187 21514035 14431878 12683471 15419053 19743904 22899115 23504139
37250 23504139 21536504 17896580 13965207 11066982 9963330 10553830 11714601 11416424
37242A1416424l849451q198129j1302389j1676033r056893m181755J508608O099059
37234b9240559P999473P008927M398448J802565J13807q31686j993929m345653
37226a5088607p601020r751575q721626m695352n3562L177258M951298O106436
37218c1676750O902903P404142Q142527R112844Q799167N709447P64980l140466
37210A2018794m149251l012104j537317n79069m690K99681J87059l51156j042804
37201A829143j428669j028648J20941J033574O28931n87691m10173K804612Q073028
37192A1035048J2484718J3637455J0973592N368795j514510p477789j0452946
37185C4054363r632164n866537r15116L440012N760569N351139K893876L04876
$$ plain form
37242 11416424 7566973 -631156 -11933545 -23609578 -32666471 -36848226 -35339618 -29240559
37234 -29240559 -21241086 -14232159 -9833711 -8031146 -7917339 -8749025 -10742954 -15088607
37226 -15088607 -22689627 -32441202 -41162828 -45858180 -45911742 -42734484 -37783186 -31676750
37218 -31676750 -24773847 -17369705 -9227178 -114334 8684833 14394280 15159260 12018794
37210 12018794 7869543 4857439 3320122 2741053 2736363 3036044 3223103 2871947 1829143
37201 1829143 400474 -628174 -507233 526341 1155272 567581 157408 2962020 11035048
37192 11035048 23519766 37157221 48130813 53499608 51985098 44507309 34054363
37185 34054363 24422199 18555662 17640546 21080558 26841127 32192266 35086142 35391018
37177C5391018p47288l23474P3287o75248k034949k532726j557221j90145j97900
37168B7205354k326275n622448q220000q585410o245925j958044K473708M986264
37160A707224M638365K438563M45746j71635L5715R695j88823N36468K635520
37151A2086838M801255M940852K273317j762912m852854n965731n965819o135716
37143e80770o584130o491346n558976m475852l887917l624802l300508l075176
37135c7579477l223545l306788k456503m22872K125022M214254N036111M119704
37127c1494094J906082K00619J097659M871516R381225J1998454J1783414R506298
37119A9251173O201629K505253q19870k623315k062261O38132M222699P090695
$$ plain form
37177 35391018 34643730 34320256 34393543 33718295 31683346 29150620 27593399 27403254 27205354
37168 27205354 24879079 19256631 11036631 2451221 -3794704 -5752748 -3279040 1707224
37160 1707224 6345589 8784152 9229898 9058263 9093978 9103673 8914850 9451318 12086838
37151 12086838 16888093 21828945 24102262 22339350 17486496 11520765 5554946 -580770
37143 -580770 -7164900 -13656246 -19215222 -23691074 -27578991 -31203793 -34504301 -37579477
37135 -37579477 -40803022 -44109810 -46566313 -46989185 -44864163 -40649909 -35613798 -31494094
37127 -31494094 -29588012 -29387393 -28289734 -23418218 -14036993 -2038539 9744875 19251173
37119 19251173 25452802 27958055 27138185 24514870 22452609 23090741 27313440 34404135
37111C4404135Q083992O998333M531500J683593q44518k765209m024039m738711
37103D3329076n181003n554149n761243n510069m679448l599408k967169l242394
37095F834193l871409l466592j473291M35510l12501l951112p338638p059041
37087b0202881l120684J268091L268136K875503K111308K850230N522594Q908272
37079C480569J0785555R555166N811213J979890J19363L48267J390442J947224
37071C5417689J269665q22407l726226o122626o896456o087525m740784l912861
37063D378469l948160m470672m755284m140861k343387M06527L376708N556355
37055e940305O269067N771154M814206L302006Q6978n007546r455884r744155
$$ plain form
37111 34404135 42488127 49486460 54017960 55701553 54857035 52091826 48067787 43329076
37103 43329076 38148073 32593924 26832681 21322612 16643164 13043756 10076587 6834193
37095 6834193 2962784 -503808 -1977099 -1541589 -1854090 -5805202 -13143840 -20202881
37087 -20202881 -23323565 -22055474 -18787338 -15911835 -13800527 -10950297 -5427703 3480569
37079 3480569 14266124 23821290 29632503 31612393 31731756 32080023 33470465 35417689
37071 35417689 36687354 35864947 32138721 26016095 19119639 13032114 8291330 4378469
37063 4378469 430309 -4040363 -8795647 -12936508 -15279895 -14873368 -11496660 -5940305
37055 -5940305 328762 6099916 10914122 14216128 14303106 9295560 -160324 -9904479
37047i904479n162189J103040N091028N508137L784760J805574L83146p77466
37039A831551k588579n764244r758929j2718563j3093839j1201724q808233p373429
37031f9475989p007069o797590n741544l572657r74995J215219L024242N035445
37023h4294938P089325Q224718Q233546Q213636Q912089R499729Q825882O912359
37015a8383654M176659K60183m786763q852483r202063n576869l50998M400737
37007c8315251Q407338J1627874J3019432J1825596Q967936O256148M868135N016821
36999C1674029O145564O833618N434907J666772k930730o586807q667040r050233
36991B4520080p213812k986754K321373O535686Q237366P326981M525965J058052
$$ plain form
37047 -9904479 -15066668 -13963628 -8872600 -3364463 420297 2225871 2609017 1831551
37039 1831551 -757028 -6521272 -16280201 -28998764 -42092603 -53294327 -62102560 -69475989
37031 -69475989 -76483058 -83280648 -89022192 -92594849 -93569844 -92354625 -89330383 -84294938
37023 -84294938 -77205613 -68980895 -60747349 -52533713 -43621624 -34121895 -25296013 -18383654
37015 -18383654 -14206995 -13946812 -18733575 -27586058 -36788121 -42364990 -42715988 -38315251
37007 -38315251 -29907913 -18280039 -5260607 6564989 15532925 21789073 26657208 31674029
36999 31674029 37819593 44653211 50088118 51754890 48824160 42237353 33570313 24520080
36991 24520080 17306268 14319514 16640887 23176573 31413939 38740920 43266885 44324937
36983D4324937j593532k501428j903491o82811M01146O47854o45569l292900n683704
36974B9070502o086690m389551j915018J38572J247968R38250j181493m575208
36966A3247332p861306r984976j0683771r812013p126518l006599J418555N213268
36958b8596028Q067875R634035R371487P526038N348077L612446J680233j118916
36950A5525247l903571n215686n117582m877192m594208k774685J033020M563297
36942e361360N161579L152528J402394J536151K015766O10077k286495l902986
36934B327654k244644K094304P207666J1687630J4472629J3917915Q655477k17549
36926E7901082q844465j3488311j3636557j1792786j0424983r778735q655941
$$ plain form
36983 44324937 42731405 40229977 38326486 37643675 38044821 38692675 38047106 34754206 29070502
36974 29070502 22983812 18594261 16679243 16817815 18065783 19004033 17822540 13247332
36966 13247332 5386026 -4598950 -15282721 -25094734 -32221252 -35227851 -33809296 -28596028
36958 -28596028 -20528153 -10894118 -1522631 6003407 11351484 14963930 16644163 15525247
36950 15525247 11621676 6405990 1288408 -3588784 -8182992 -10957677 -9924657 -5361360
36942 -5361360 -199781 2952747 4355141 5891292 7907058 8517135 6230640 2327654
36934 2327654 83010 2177314 9384980 21072610 35545239 49463154 58118631 57901082
36926 57901082 49056617 35568306 21931749 10138963 -286020 -10064755 -18720696
36919a8720696o472118l995087k459448k463800l523195m315199l645655j675245
36911d7270443R479Q2551r35147j378930n41961P61021J704619K435131L113552
36902d2020128L020655J552285m32597j201479P6164K767833N692544P874257
36894b2670466Q654531P990413O763437O119097O324767O705739O632374N983677
36886C2503569M687046K517831m73629l849458p132984r720546j0559607q832840
36878h60618n239132j789354J55408J111551K393099M352424O056457O196313
36870A2376148M014326k7324m047933n854109m869504k546393m42979J400158
36862B390L478229N047135M659866K300058l26639j938809l058479m656042o234147
$$ plain form
36919 -18720696 -25192814 -29187901 -31647349 -34111149 -37634344 -41949543 -45595198 -47270443
36911 -47270443 -47260964 -47178413 -48113560 -49492490 -50034451 -49273430 -47568811 -45133680 -42020128
36902 -42020128 -38999473 -37447188 -37879785 -39081264 -39005100 -36237267 -30544723 -22670466
36894 -22670466 -14015935 -6025522 737915 6857012 13181779 19887518 26519892 32503569
36886 32503569 37190615 39708446 39234817 35385359 28252375 18531829 7972222 -860618
36878 -860618 -6099750 -7889104 -7733696 -6622145 -4229046 123378 6179835 12376148
36870 12376148 16390474 16363150 12315217 6461108 1591604 -954789 -1397768 2390
36862 2390 3480619 8527754 13187620 15487678 15161039 13222230 10163751 5507709 -726438
36853g26438o223661m122682j425721j19015o65359j924059k939029m181629o592027
36844b8919620r738146j1676452j0805676p326678k677489J834060N385336P280621
36836e6644044P202440N869998M794065N046554O383194P564565P440823N944550
36828f397855M289713M017303N547807P792261R344579R707019R051880P330301
36820E0683008M404472Q97063j947873l509885m387019n495825o931039p951299
36812B5761603p879612o854421n781564n511026n873054n578357l320518R42330
36804a4094619N771379R083613R231950N940098P91731l508040n038127l863218
36796D314767j134180K416450O319335R294424R790094P836374N144115K836210
$$ plain form
36853 -726438 -6950099 -11072781 -12498502 -12617517 -13282876 -15206935 -18145964 -22327593 -28919620
36844 -28919620 -38657766 -50334218 -61139894 -68466572 -71144061 -69310001 -63924665 -56644044
36836 -56644044 -49441604 -43571606 -38777541 -33730987 -27347793 -19783228 -12342405 -6397855
36828 -6397855 -2108142 1909161 7456968 15249229 24593808 34300827 43352707 50683008
36820 50683008 55087480 55984543 54036670 50526785 46139766 40643941 33712902 25761603
36812 25761603 17881991 11027570 5246006 -265020 -6138074 -11716431 -15036949 -14094619
36804 -14094619 -8323240 760373 9992323 15932421 16724152 13216112 8177985 4314767
36796 4314767 3180587 5597037 11916372 21210796 31000890 38837264 43981379 46817589
36788D6817589J80719l620279p388748r021548q197948o738266o146713n894098
36780i292m629070k303391k98189L45443J50530M76342J877665L443758L722568
36771B776364K117038o89806l484713n403038o084576n389322l355692l76128
36763a9889873K908735N954638Q327797R367307Q288043N066394J074797j749790
36755A9348048k641015k622797l203284m809377o812467q608255r966938j0554703
36747b9870788r997782q517623o701263m489738j332551K289446M561843M340895
36739d9717561K614180J048040j10410j507208k792102k884150j927887j341961
36731e6619059j712398k114113j854868j351477o79932J124301M211663O693409
$$ plain form
36788 46817589 46998308 43378029 35989281 26967733 18769785 12031519 5884806 -9292
36780 -9292 -4638362 -6941753 -7239942 -6894499 -6743969 -6267627 -4389962 -946204 2776364
36771 2776364 4893402 4203596 718883 -4684155 -10768731 -16158053 -19513745 -19889873
36763 -19889873 -16981138 -11026500 -2698703 6668604 14956647 20023041 21097838 19348048
36755 19348048 16707033 14084236 10880952 6071575 -740892 -9349147 -19316085 -29870788
36747 -29870788 -39868570 -48386193 -55087456 -59577194 -60909745 -58620299 -54058456 -49717561
36739 -49717561 -47103381 -46055341 -46165751 -47672959 -50465061 -53349211 -55277098 -56619059
36731 -56619059 -58331457 -60445570 -62300438 -63651915 -64331847 -63207546 -58995883 -52302474
36723e2302474O715190M912765L422643L165371L617315M653861O641479Q642181
36715a0531669Q527880N745419K571945J523010K418724L145308K717037K290103
36707A8407757L168010M886091N711043M483005J540564j889126m787813o818866
36699B4700665p986799q129894o983807m785546k536615j266864q98714o6104
36691g953678K643196P178999J1819936J4461309J4063388J1014393O540091K055540
36683F1823174j222016k679223k625121k010680j666245j881203k605812l609888
36675D3522986m281570l801451k113058n85282j043397l779269o758773p196823
36667A3963363m073166R39535N029622O620137O190824N068938L976489L010250
$$ plain form
36723 -52302474 -45587284 -40674519 -37251876 -34086505 -30469190 -25815329 -19173850 -10531669
36715 -10531669 -2003789 3741630 6313575 7836585 10255309 13400617 16117654 18407757
36707 18407757 21575767 26461858 32172901 36655906 38196470 36307344 31519531 24700665
36699 24700665 16713866 8583972 1600165 -3185381 -5721996 -6988860 -7887574 -7953678
36691 -7953678 -5310482 1868517 13688453 28149762 42213150 53227543 59767634 61823174
36683 61823174 60601158 57921935 55296814 53286134 51619889 49738686 47132874 43522986
36675 43522986 39241416 35439965 33326907 32741625 31698228 27918959 21160186 13963363
36667 13963363 9890197 10829732 15859354 22479491 28670315 33739253 37715742 40725992
36659D0725992K519986L174702M957614O609533O510585M110935M75778k414825
36651F6670300k995143j194720J577911L697342M570339M401293L015735j95748
36643G9547309m850481q886915j0081931q074199m474155j241089O87572J562530
36635D4188641K192644K960277L084703J214019k782479p006463r085038q181954
36627B6584350m991571n24830L991517O650729O096410L470981J576128J453563
36619D4307277J169447j117364m227451n536691m594228l411870l390076l733436
36611A9465608l317247k563245k418757k388729q93065K441959N674619O057526
36603B2058669K538241l119187p494835q043702m985350q97356J598670J748224
$$ plain form
36659 40725992 43245978 46420680 51378294 57987827 64498412 68609347 69085125 66670300
36651 66670300 63675157 62480437 64058348 67755690 72326029 76727322 79743057 79547309
36643 79547309 74696828 65809913 55727982 47653783 43179628 41938539 42626111 44188641
36635 44188641 46381285 49341562 52426265 53640284 50857805 43851342 34766304 26584350
36627 26584350 21592779 21067949 25059466 31710195 37806605 41277586 42853714 44307277
36619 44307277 45476724 44359360 40131909 34595218 30000990 26589120 23199044 19465608
36611 19465608 16148361 13585116 11166359 8777630 7884565 10326524 16001143 22058669
36603 22058669 24596910 21477723 13982888 5939186 953836 56480 1655150 3403374
36595C403374M99962q79117j537559q74684J364036M542398P286481Q600286Q515623
36586C0920800P391662N103740J564058k193483m252785l457265n49015K403383
36578C6931095L475593J956739j347783m527859n760581m722375k895770k249505
36570B0859554l537130n794682p181165o193092k526712K656861P240775R270286
36562A4794695P933803L852435j159346m727203n191237k981442m51106L28447
36554A2399046m26313q73408j9443J195691J321392O5079j874536l965318o100674
36545A721516p947154q756447q016604n995829l556460j583745m66902K42403
36537c4359222J685461M727624Q762320J1711032J1704711Q891720N337610L063404
$$ plain form
36595 3403374 3903336 3024219 1486660 611976 1976012 6518410 13804891 22405177 30920800
36586 30920800 38312462 43416202 44980260 42786777 38533992 35076727 34527712 36931095
36578 36931095 40406688 42363427 41015644 36487785 30727204 26004829 23109059 20859554
36570 20859554 17322424 11527742 4346577 -1846515 -4373227 -1716366 5524409 14794695
36562 14794695 22728498 26580933 25421587 20694384 15503147 12521705 12070599 12399046
36554 12399046 11972733 11099325 11079882 12275573 13596965 13662044 11787508 7822190 1721516
36545 1721516 -6225638 -14982085 -22998689 -28994518 -32550978 -34134723 -34601625 -34359222
36537 -34359222 -32673761 -27946137 -19183817 -7472785 4231926 13123646 18461256 21524660
36529B1524660K425605K445424K204669J471950L08830j219271k890641m468071
36521B1803155o116480q096774r826273r901279p544168l575828M99070L829774
36513a8928803O013765O195238L608161r12384n039750p061637p215709o518667
36505b9859786n011777k040248J955462M899657M872232K190802p86367k056103
36497b5836128j787473j392039j209380j62647J982068L180978J178726l355977
36489b7401872p054719p391108m973485k012451L91288K631843M976868O630406
36481c4203230O506352M484051J803635K58546P24182K310834L199138K376868
36473a2539624K45363k366114n018962p238640q073499o775938l605190M84458
$$ plain form
36529 21524660 23950265 26395689 28600358 30072308 30381138 29161867 26271226 21803155
36521 21803155 15686675 7589901 -2236372 -12137651 -19681819 -23257647 -22758577 -18928803
36513 -18928803 -12915038 -6719800 -3111639 -4024023 -9063773 -16125410 -23341119 -29859786
36505 -29859786 -34871563 -36911811 -34956349 -30056692 -25184460 -22993658 -23780025 -25836128
36497 -25836128 -27623601 -29015640 -30225020 -30387667 -28405599 -25224621 -24045895 -27401872
36489 -27401872 -34456591 -41847699 -46821184 -48833635 -48442347 -45810504 -40833636 -34203230
36481 -34203230 -27696878 -23212827 -21409192 -21150646 -20426464 -18115630 -14916492 -12539624
36473 -12539624 -12294261 -14660375 -19679337 -26917977 -34991476 -41767414 -45372604 -44888146
36465d4888146M590509P943279R824241J0089750R466485Q679870P444481M819530
36457A7969999M33023m941575r656495j1748562j0005707n347390o68927J704549
36449b2261085K226404K943531M470112N399717M718622L362063K774340L012264
36441F645968L117391K663206K067703J771362J894364K552555L866628N593547
36433C0172724P072581P568077O636443M466548K040947N77738M19336O12672
36425E9567066j81061k477730n663132q469702r625692q596690o116560l626762
36417A4809737j787199J45606L109914O812821R963437J1526013J1194294R050203
36409F4824826N545509J626494j915003n118853q109063r854729q854622n328817
$$ plain form
36465 -44888146 -40297637 -32354358 -22530117 -12440367 -2973882 5705988 13150469 17969999
36457 17969999 18403022 13461447 3804952 -7943610 -17949317 -23296707 -23965634 -22261085
36449 -22261085 -20034681 -17091150 -12621038 -7221321 -2502699 859364 3633704 6645968
36441 6645968 9763359 12426565 14494268 16265630 18159994 20712549 24579177 30172724
36433 30172724 37245305 44813382 51449825 55916373 57957320 58535058 58954394 59567066
36425 59567066 59386005 56908275 51245143 42775441 33149749 24553059 18436499 14809737
36417 14809737 13022538 13168144 16278058 23090879 33054316 44580329 55774623 64824826
36409 64824826 70370335 71996829 70081826 64962973 56853910 46999181 38144559 32815742
36401C2815742j539689P60925K179674L975106N393462M303586L81678l893902
36393D4376582n967398n794687n012842m553276m213547l993401m409517n352332
36385E079582n809989n245585m421910m233728m376999l991082l235446l279475
36377b9514632m693466o607036p637331p016005m631441q25466L144893N019292
36369e2761192L060400k018115p238383r848232r385074p235582m860981l069382
36361i3356541k488432l463614n005393m742978j013420N004897R953213J1289875
36353h3822393R271893O071617L715587L156046M412121O558431P791948O623071
36345c6221679L512552Q47730P98805L291638O283309P822481P565217O440308
$$ plain form
36401 32815742 31276053 32036978 34216652 38191758 43585220 47888806 48270484 44376582
36393 44376582 38409184 32614497 27601655 23048379 18834832 14841431 10431914 5079582
36385 5079582 -730407 -5975992 -10397902 -14631630 -19008629 -22999711 -26235157 -29514632
36377 -29514632 -34208098 -40815134 -48452465 -55468470 -60099911 -60925377 -57780484 -52761192
36369 -52761192 -49700792 -51718907 -58957290 -68805522 -78190596 -85426178 -90287159 -93356541
36361 -93356541 -95844973 -99308587 -104313980 -109056958 -110070378 -105065481 -95112268 -83822393
36353 -83822393 -74550500 -68478883 -64763296 -61607250 -57195129 -50636698 -42844750 -36221679
36345 -36221679 -32709127 -31861397 -31062592 -27770954 -21487645 -13665164 -6099947 340361
36337C40361N324116M335518L221172J913458M34918j360483l292493m146806
36329F769761k399501J681645N217814N011937P44847m777365q606821j0136024
36321f493707j0422698j0003064q273958m801923m48589L084049M634762M474185
36313b8250943L949512M222193N289417O267293O460429N802439M368235K168981
36305A0277556k62242j769432j738570r88383p71420j112276r67126k6377N36357
36296C178087n41086l101117n803769p272755o598266l444640J396832N783301
36288a6403413P536254O364363M134401L147966M422714P399273J0525412J2011860
36280C9138830J0930335Q139797N536263L850591J820948j793266o147408r353990
$$ plain form
36337 340361 5664477 9999995 13221167 15134625 15569543 14209060 10916567 6769761
36329 6769761 4370260 6051905 11269719 16281656 17026503 12249138 3642317 -6493707
36321 -6493707 -16916405 -26919469 -35193427 -39995350 -40443939 -37359890 -32725128 -28250943
36313 -28250943 -24301431 -20079238 -14789821 -8522528 -2062099 3740340 8108575 10277556
36305 10277556 10015314 8245882 6507312 5518929 4747509 3635233 2668107 2641730 3178087
36296 3178087 2637001 -464116 -6267885 -13540640 -20138906 -23583546 -22186714 -16403413
36288 -16403413 -8867159 -2502796 1631605 4779571 9202285 16601558 27126970 39138830
36280 39138830 50069165 58208962 63745225 67595816 69416764 67623498 61476090 52122100
36272E2122100j0965157j1852001j1829033r437985m811483r16553m65492k700187
36264h55791m745677n254974m961855m260149k469788K38008K155410K117765
36256a8037051R40508N4054p7788N53988K257840M721852O341267N799031L727254
36247F280955J616562l62765l118574o559952r208948r943634q865832o262371
36239c6424559k075330K896906O327075O095948K670889q47694j241526K236651
36231b0361640P464698J1327179J2019033R739174N592529N32831m367955p488656
36223A4457193p661559n631069l598908k933179k823558j477386J763494N732026
36215b172946Q489660Q821764O950787M016209Q41651k659541o685392j0471357
$$ plain form
36272 52122100 41156943 29304942 17475909 8037924 3226441 2309888 1844396 -855791
36264 -855791 -5601468 -10856442 -15818297 -20078446 -22548234 -22310226 -20154816 -18037051
36256 -18037051 -17096543 -17042489 -17120277 -16566289 -14308449 -9586597 -3245330 2553701 6280955
36247 6280955 7897517 7534752 4416178 -2143774 -11352722 -21296356 -30162188 -36424559
36239 -36424559 -38499889 -35602983 -29275908 -23179960 -20509071 -21356765 -22598291 -20361640
36231 -20361640 -12896942 -1569763 10449270 20188444 25780973 26313804 21945849 14457193
36223 14457193 6795634 1164565 -2434343 -5367522 -8191080 -9668466 -7904972 -2172946
36215 -2172946 6316714 15138478 22089265 26105474 26947125 24287584 17602192 7130835
36207G130835j2533750j1906905q741158l944648J119596M851961O371741O454196
36199a1198132O658581P271006O982106M926933K023349l60900k117428l814231
36191A0371284n134218n132112l788013k138399q10940N53513K187098L434475
36183d57312L621160L063965K623314K580216K518374K209369K075216K540279
36175B0774581L153644K714093M62587k942389n899537p381272p727969p787661
36167d633923p567777o110531k635941K455988P633095J1032364J1441029R082887
36159B0697191N638448L067103J996767J355690j45565k229709l077224j320238
36151B5982463K144549M645231M184485J316284j489396k201230p96575J297441
$$ plain form
36207 7130835 -5402915 -17309820 -26050978 -29995626 -28876030 -24024069 -17652328 -11198132
36199 -11198132 -4539551 2731455 9713561 14640494 16663843 16302943 14185515 10371284
36191 10371284 5237066 104954 -3683059 -5821458 -6632398 -6078885 -3891787 -457312
36183 -457312 3163848 6227813 8851127 11431343 13949717 16159086 18234302 20774581
36175 20774581 23928225 26642318 27104905 24162516 18262979 10881707 3153738 -4633923
36167 -4633923 -12201700 -18312231 -20948172 -18492184 -10859089 173275 11614304 20697191
36159 20697191 26335639 29402742 31399509 32755199 32609634 30379925 27302701 25982463
36151 25982463 28127012 32772243 36956728 38273012 36783616 34582386 33785811 35083252
36143C5083252K840872L622895L923377L596905K020570r95692m525214p179475
36135C8387490q528208r425280j0615715j1447802j0557290p660711m099334j677441
36127b5624291j436093l261447n790750o749925m561294j40569L761446N588242
36119c8214681O563489Q587928J1403977J2902057J1709314Q302107L828578q52400
36111B4230369m795375o874693o767865n418766l956522k519182n55969K030410
36103d627593M483565N824068N626935M272491K615462J347017N44225j87004
36095A9899166j144645k113070k464322j778657o09844m90450k541961n856284
36087B899933p930638p218071m667097k120236Q4527K789729N715317P001251
$$ plain form
36143 35083252 37924124 41547019 45470396 49067301 51087871 50092179 45566965 38387490
36135 38387490 29859282 20434002 9818287 -1629515 -12186805 -19847516 -23946850 -25624291
36127 -25624291 -27060384 -30321831 -36112581 -42862506 -47423800 -47564369 -43802923 -38214681
36119 -38214681 -31651192 -23063264 -11659287 1242770 12952084 21254191 25082769 24230369
36111 24230369 19434994 12560301 5792436 373670 -3582852 -6102034 -6658003 -4627593
36103 -4627593 -144028 5680040 11306975 15579466 18194928 19541945 20086170 19899166
36095 19899166 18754521 16641451 14177129 12398472 11788628 11298178 8756217 2899933
36087 2899933 -5030705 -12248776 -16915873 -19036109 -18951582 -16161853 -10446536 -3445285
36079c445285N451618K170209o37144j835282j921975k077547l132308m936754
36071a0364468o244975n590098k715420J020212L727966M156170K041705j681339
36063a5650247m783527n018450k371858O23608J621695R71965P30255J790222
36055b2086337L124247L622179L479515L516511L961032M281684L767440K094358
36047E760629k82262k198451k613052j461548N22561K646432M536590N860626
36039A2771525O431293O533259O504881N952373L976960K65801m555805r561952
36031B8318335j3723459j5448143j3074033o573280J797611R181381J4084761
36024D563173J6328904J5926041J3123091R244544O151723M351987K377487j374778
$$ plain form
36079 -3445285 2006333 4176542 3539398 1704116 -217859 -2295406 -5427714 -10364468
36071 -10364468 -16609443 -22199541 -24914961 -23894749 -20166783 -16010613 -13968908 -15650247
36063 -15650247 -20433774 -25452224 -27824082 -27200474 -25578779 -24606814 -23876559 -22086337
36055 -22086337 -18962090 -15339911 -11860396 -8343885 -4382853 -101169 3666271 5760629
36047 5760629 5478367 3279916 666864 -794684 -272123 2374309 6910899 12771525
36039 12771525 19202818 25736077 32240958 38193331 42170291 42436092 37880287 28318335
36031 28318335 14594876 -853267 -13927300 -20500580 -18702969 -9521588 4563173
36024 4563173 20892077 36818118 49941209 59185753 65337476 69689463 72066950 70692172
36016G0692172o570183j1180794j3470640j3114659j0499167n882861P4445N453617
36008A5501930P934235P054169N013256M465910N664240O423168M839771J348313
36000E8244992j957561l227429j867548J316482M220300M441538J325676l146172
35992E9350278o399492q053595r696444j1914677j2839415j0333635m836592P57851
35984c965721L662135L085296Q8838l587389o624913q681335r988389j0306713
35976c6318191q731073m969351k45245L949263P691983J2124753J7078820K0417781
35968A0998740K0311472J7274124J3212058R120670M610999o70884o106074j0555964
35960E8195141j3038418j2941619j0267209n897076j200788K767574N425589O253373
$$ plain form
36016 70692172 64121989 52941195 39470555 26355896 15856729 9973868 10048313 15501930
36008 15501930 23436165 30490334 35503590 39969500 45633740 52056908 56896679 58244992
36000 58244992 56287431 53060002 51192454 52508936 56729236 61170774 62496450 59350278
35992 59350278 52950786 44897191 35200747 23286070 10446655 113020 -4723572 -3965721
35984 -3965721 -303586 2781710 2870548 -716841 -7341754 -16023089 -26011478 -36318191
35976 -36318191 -45049264 -50018615 -50263860 -46314597 -38622614 -26497861 -9419041 10998740
35968 10998740 31310212 48584336 61796394 70917064 75528063 74857179 68751105 58195141
35960 58195141 45156723 32215104 21947895 16050819 14850031 17617605 23043194 29296567
35952B9296567N025857K676433J131069J525973K773263K476253o28741n360634
35944C8916040r177767j0419494r631408q889443r622287j0805443r576371m258410
35936c3464583L186758Q397966Q691884N446524K036058P4452j330784l024390
35928i986115m154421l745296k638875k528316l571929m263732l524480j711959
35920c6125123M13904K363918L288760K161459o05653k920006l397731l016686
35912c7837158l273632l669412k575525k8206K091155K597868K088539J264634
35904c9341737k03224k422974m112523l589917k92239N110129J1185587J5758512
35896a7908386J6527967J2836547O557719N80716l331351m985303m988583m314083
$$ plain form
35952 29296567 34322424 36998857 38129926 39655899 42429162 44905415 44276674 38916040
35944 38916040 29738273 19318779 9687371 797928 -8824359 -19629802 -29206173 -33464583
35936 -33464583 -30277825 -21879859 -13187975 -7741451 -5705393 -5630941 -6961725 -9986115
35928 -9986115 -14140536 -17885832 -20524707 -23053023 -26624952 -30888684 -34413164 -36125123
35920 -36125123 -35711219 -33347301 -30058541 -27897082 -28502735 -31422741 -34820472 -37837158
35912 -37837158 -41110790 -44780202 -47355727 -47383933 -45292778 -42694910 -40606371 -39341737
35904 -39341737 -39544961 -41967935 -46080458 -49670375 -49962614 -44852485 -33666898 -17908386
35896 -17908386 -1380419 11456128 18013847 18594563 15263212 10277909 5289326 975243
35888I75243l925510l844543k959840o18321J963642K846331J763645M46192N08984
35879b844177J756512K641488J769361j043541m485887o362034n097324r59724
35871a4625326M362108R181451J2394562J3107902J0852625O525211K287883j31148
35863D3955268q14616j139791k324231m708117p839744j0598678j1489158r562603
35855d521670n304635l58498L694291O078099O518196M931705K006787k83663
35847A2760612J69463L338324O449850O471657L166287r64625l710772n236280
35839B2444516o833994q524248q811140o616932k771835N26003J518421L02830
35831h766379j350737j770864j020143l71962k22733N05117K358888L749261K498024
$$ plain form
35888 975243 -2950267 -6794810 -9754650 -10372971 -8409329 -5562998 -3799353 -3353161 -2844177
35879 -2844177 -1087665 1553823 3323184 2279643 -2206244 -8568278 -13665602 -14625326
35871 -14625326 -10263218 -1081767 11312795 24420697 35273322 41798533 44086416 43955268
35863 43955268 43140652 42000861 39676630 34968513 27128769 16530091 5040933 -4521670
35855 -4521670 -9826305 -10184803 -6490512 -412413 6105783 11037488 13044275 12760612
35847 12760612 12930075 16268399 22718249 29189906 32356193 31391568 27680796 22444516
35839 22444516 15610522 7086274 -1724866 -8341798 -11113633 -10587630 -9069209 -8766379
35831 -8766379 -10117116 -11887980 -12908123 -13280085 -13502818 -12997701 -10638813 -6889552 -4391528
35822d391528j426281n841532q843277j0220118j0327823q812193n152758J65322
35814e4850188N708563J0131708J2803638J3598861J2498110R645565N840088
35807A5376345K644333J376426J841175K698179L350555M568046O593694P714541
35799D6163294O139140K812937P71092J585242L735146M688553L393432M89233
35791F9778069k675562m798844n568970o331926q625807j1498813j1677396p451058
35783A1149693j294490K618056K704206N22430k173215n123146q256547j0296344
35775a0149357r528923n447893P70269P083300J1692314J3730586J3256598J0797464
35767C2204358P161265L628823J616920J563350K429746K791276K188325J020640
$$ plain form
35822 -4391528 -5817809 -11659341 -20502618 -30722736 -41050559 -49862752 -55015510 -54850188
35814 -54850188 -49141625 -39009917 -26206279 -12607418 -109308 9536257 15376345
35807 15376345 18020678 19397104 21238279 23936458 27287013 31855059 38448753 46163294
35799 46163294 52302434 55115371 55886463 57471705 61206851 65895404 69288836 69778069
35791 69778069 67102507 62303663 56734693 50402767 41776960 30278147 18600751 11149693
35783 11149693 9855203 12473259 15177465 15699895 13526680 8403534 146987 -10149357
35775 -10149357 -19678280 -25126173 -24355904 -17272604 -5580290 8150296 21406894 32204358
35767 32204358 39365623 42994446 44611366 46174716 48604462 51395738 53584063 54604703
35759E4604703m75978k500352n166932q333502j1715261j4443698j4711600j0969540
35751a3712160l992430K908856O488463O325332M605499L246161J773633j614412
35743F028942p211346j2718861j5221030j3681840r048910k571603M859212J1857918
35735c7707518J6499975J7953577J7414240J6566293J5455097J2564618O852074
35728F5598356p53479p754419j1789289j2350576j1171488j0584481j1212684
35721a8060j1594979j0113230o571542j721935L654313Q479745J1193203J0974730
35713D282245Q711705N872137K900764m40570l798069o401913q016552q553780
35705e444033p244600l652926O71381L065472K501607L72097j428363j991993
$$ plain form
35759 54604703 54128725 51628373 46461441 38127939 26412678 11968980 -2742620 -13712160
35751 -13712160 -17704590 -14795734 -8307271 -1981939 2623560 5869721 7643354 6028942
35743 6028942 -1182404 -13901265 -29122295 -42804135 -51853045 -54424648 -49565436 -37707518
35735 -37707518 -21207543 -3253966 14160274 30726567 46181664 58746282 65598356
35728 65598356 64844877 57090458 45301169 32950593 21779105 11194624 -18060
35721 -18060 -11613039 -21726269 -28297811 -30019746 -26365433 -17885688 -6692485 4282245
35713 4282245 12993950 18866087 21766851 21326281 17528212 11126299 3109747 -5444033
35705 -5444033 -12688633 -16341559 -15670178 -12604706 -10103099 -9731002 -11159365 -13151358
35697a3151358j157260N32468J381797j75658l146976m381382k285566J263485
35689b1120450L649082M588399N082441M801163K693172m31123k193024j757985
35681d688325r08087j465464k982703l680395k706867p76345P65768R76824M1362
35672a5424232n17495J051845M772413Q485382R920644Q895464O949619N276415
35664B9410055L906698K793666K584153L722161N341732N727215L794066j90557
35656E7089189n055643r317128j1439646j0351675o313813j131733K911244M519667
35648B0910462L948734K468517J428534J469872K190400K612162K256811J709452
35640C8994944J883379K859458L820903M082669L699024K865891J172005j988800
$$ plain form
35697 -13151358 -14308618 -13776150 -12394353 -12570011 -15716987 -20098369 -22383935 -21120450
35689 -21120450 -17471368 -12882969 -7800528 -2999365 -306193 -737316 -2930340 -4688325
35681 -4688325 -5596412 -7061876 -10044579 -13724974 -16431841 -17208186 -16442418 -15465594 -15424232
35672 -15424232 -15941727 -14889882 -10117469 -1632087 8288557 17184021 24133640 29410055
35664 29410055 33316753 36110419 38694572 42416733 47758465 53485680 57279746 57089189
35656 57089189 52033546 42716418 31276772 20925097 14611284 13479551 16390795 20910462
35648 20910462 24859196 27327713 28756247 30226119 32416519 35028681 37285492 38994944
35640 38994944 40878323 43737781 47558684 51641353 55340377 58206268 59378273 57389473
35632E7389473o161349r380930r554011o651838l349667k872525n827084r417263
35624D174806j0174725p388488l609806j971148l345622n941146p124871n530698
35616d0911698j834176K121539M882438O181906O504281O369576O232810O551998
35608c901326P339234P777915O810559M146550M18052l470078o731422q678834
35600C710650q985519q060628o712781n380013m058221k905144k368102k620756
35592c7380514l286818l757851l429729j796296J034808L868079N117238M251469
35584c5379614K235492N83210M19901K199321N379253Q241524R045065P886177
35576F10329O727958P101168Q385124Q807899P468156M787362J620386j280422
$$ plain form
35632 57389473 51228124 41847194 32293183 25641345 22291678 19419153 13592069 4174806
35624 4174806 -5999919 -13388407 -16998213 -18969361 -22314983 -28256129 -35381000 -40911698
35616 -40911698 -42745874 -40624335 -35741897 -29559991 -23055710 -16686134 -10453324 -3901326
35608 -3901326 3437908 11215823 18026382 22172932 22590984 19120906 12389484 3710650
35600 3710650 -5274869 -13335497 -20048278 -25428291 -29486512 -32391656 -34759758 -37380514
35592 -37380514 -40667332 -44425183 -47854912 -49651208 -48616400 -44748321 -39631083 -35379614
35584 -35379614 -33144122 -32560912 -32141011 -29941690 -24562437 -16320913 -7275848 610329
35576 610329 7338287 14439455 22824579 31632478 39100634 43887996 45508382 44227960
35568D4227960l322501m405058n041622n578556n533537m325423k445490j198296
35560A2377477j298614k312795l492368m529938n254544n038116k983557J151161
35552a1381294O208568R974509J0709694Q656273N860276M280658M210381M609435
35544D3128500M516024L722744K421032Q35189p16339j802233k140434j845633
35536D8118850j418922j429751j994344k568426k525981j896677j116909j56846
35528C5010994J309074K640839K111081j158245n679022q838584r346632p777617
35520H271888n192004k310538J15464J408162J873818K681431M222808N256561
35512A6327590M403960K096502K62338J90544J440157K972851M572809O520018
$$ plain form
35568 44227960 40905459 36500401 31458779 25880223 20346686 16021263 13575773 12377477
35560 12377477 11078863 8766068 5273700 743762 -4510782 -9548898 -12532455 -11381294
35552 -11381294 -5172726 4801783 15511477 24167750 30028026 34308684 38519065 43128500
35544 43128500 47644524 51367268 53788300 54623489 53907150 52104917 49964483 48118850
35536 48118850 46699928 45270177 43275833 40707407 38181426 36284749 35167840 35010994
35528 35010994 36320068 38960907 41071988 39913743 34234721 25396137 16049505 8271888
35520 8271888 3079884 769346 884810 2292972 4166790 6848221 11071029 16327590
35512 16327590 20731550 22828052 23090390 23280934 24721091 27693942 32266751 38786769
35504C8786769Q262161Q309883N685197R49617m369362q684261j0347627p838504
35496C0753873j304752O352629J1344621J2261254J0524280P619624L520922j436333
35488G9636118m897052m595420j543526N93013o41167m423411q354586j0862401
35480D4911568j1620242j0889060r324549p821510o764482n593550l531455o15809
35472a1249089K272496M335862N605174O668750P657809P739343O072646L270277
35464C2373268J187969Q61204J333412J175227M87596L85511R14622P55898q88922
35455C8585785l144801m457599l946309j604905J902326N170627O502390N128592
35447D4136106J873190j584993l957923n015708n497252o288459p221921o960110
$$ plain form
35504 38786769 47048930 55358813 61044010 61993627 57624265 48940004 38592377 30753873
35496 30753873 29449121 35801750 47146371 59407625 69931905 77551529 81072451 79636118
35488 79636118 74739066 70143646 68600120 69193133 68551966 64128555 55773969 44911568
35480 44911568 33291326 22402266 13077717 5256207 -1508275 -7101825 -10633280 -11249089
35472 -11249089 -8976593 -4640731 964443 7633193 15291002 23030345 29102991 32373268
35464 32373268 33561237 34422441 35755853 36931080 37418676 37804187 38718809 39474707 38585785
35455 38585785 35440984 30983385 27037076 25432171 27334497 32505124 39007514 44136106
35447 44136106 46009296 44424303 40466380 35450672 29953420 23664961 16443040 9482930
35439I482930m816702k400774k269411m794905p484391p727681n153200r57530
35431b6121664L664452P510354R062232P697144M784093K440080J461940J337437
35423A1836068J730386K683191L614279L588794K878080L029598M765270O629854
35415D0755520O412921L469443q38565m558816o492543o497873n162705l343420
35407B3743962j825201j319805k519642n537239r031914j0546550q575035m330911
35399a9942335q65653k22743j797218l504582l931227l009840j260372P70763
35391c3763207K456348L297170L405770L259956K848908J697779L1109p67371
35383a7533538N17556L475481O452402Q110643Q183465P134739N795960N088768
$$ plain form
35439 9482930 4666228 2265454 -3957 -4798862 -12283253 -20010934 -25164134 -26121664
35431 -26121664 -22457212 -14946858 -5884626 1812518 6596611 9036691 10498631 11836068
35423 11836068 13566454 16249645 19863924 23452718 26330798 29360396 34125666 40755520
35415 40755520 47168441 50637884 49799319 45240503 38747960 32250087 27087382 23743962
35407 23743962 21918761 20598956 18079314 12542075 3510161 -7036389 -15611424 -19942335
35399 -19942335 -20807988 -21030731 -22827949 -26332531 -30263758 -33273598 -34533970 -33763207
35391 -33763207 -31306859 -28009689 -24603919 -21343963 -18495055 -16797276 -16766167 -17533538
35383 -17533538 -17015982 -13540501 -7088099 1022544 9206009 16340748 22136708 27225476
35375B7225476N290011N569701M910007L422423K027268Q84955q87300l655916
35367D4786625o317093p423354o598917m333057j146098K102937L529693J186507
35359B5787243m700254j1011331j3986400j2401677q350010m759681k303806Q98114
35351c0827802O446734J2997443J6951336J5802387J0495685M509264Q73685n3864
35343C7194868l72345k395106o446301j0806431j3669717j4536515j3433746r842135
35335c4307428l706847K882211O632817O133046K984536m02009k926015m214977
35327b6924666l400364P4646M914236Q477104Q940157O516046K904363J60448
35319A661970l23440J350802L692280N257313N951437O582879P416285P715943
$$ plain form
35375 27225476 32515487 38085188 42995195 46417618 48444886 49329841 48442541 44786625
35367 44786625 38469532 31046178 24447261 20114204 18968106 21071043 24600736 25787243
35359 25787243 21086989 10075658 -3910742 -16312419 -24662429 -29422110 -31725916 -30827802
35351 -30827802 -24381068 -11383625 5567711 21370098 31865783 36375047 37248732 37194868
35343 37194868 36822523 34427417 27981116 17174685 3504968 -11031547 -24465293 -34307428
35335 -34307428 -38014275 -35132064 -28499247 -22366201 -19381665 -19783674 -22709689 -26924666
35327 -26924666 -30325030 -30250384 -25336148 -16859044 -7918887 -1402841 1501522 1661970
35319 1661970 1338530 2689332 6381612 11638925 17590362 24173241 31589526 39305469
35311C9305469O619386M042924P94442j978116l686391m840190o280857p700926
35303B6275741p665374n630060l150261k148473k501960k476601j384304o64108
35295F54600k041609n315444q225204q189089m403067J121935M765296M364008
35287a7268574J230977j342249j357721P91783L980307P597928J0856452J2315017
35279A6803920J1149603Q238928N175797K685529O97734o08403q20613j32804
35271D3189691P78845J769853L293530N212545O278183N352589K821887K76202
35263F8973325j120197j510644j594178j486466p13639Q20703K331101K842833
35255F8542838K216037J245506P82620R90510J564696K481327M137681O507359
$$ plain form
35311 39305469 45924855 49967779 50762221 48784105 45097714 40257524 33976667 26275741
35303 26275741 18610367 12980307 9830046 7681573 5179613 2703012 1318708 654600
35295 654600 -1387009 -6702453 -14927657 -23116746 -27519813 -26397878 -21632582 -17268574
35287 -17268574 -16037597 -17379846 -18737567 -17945784 -13965477 -6367549 4488903 16803920
35279 16803920 27953523 36192451 41368248 44053777 44751511 44143108 43322495 43189691
35271 43189691 43968536 45738389 49031919 54244464 60522647 65875236 68697123 68973325
35263 68973325 67853128 66342484 64748306 63261840 62548201 63368904 65700005 68542838
35255 68542838 70758875 72004381 72787001 73777511 75342207 77823534 81961215 88468574
35247H8468574Q371651P991333M932327R30789j631040k163594k337784l968104
35239A00594152o837682q912821q429877n427599j408007K004151L833610L533129
35231G8949056P88368l732276p618434p927990m109041P84278K842412J156052
35223F1132425j909739l920157m466246m093624l024668j925171k488192n669140
35215C3635488r878958j2192883j1133158p449910k741930J512462L925610L685421
35207f37858J510755n91324q32489J267255M855373Q156726R316762P795271M941478
35198C5781949K602880J324383L70175j033002l229114o209235q986770r456241
35190A1165025o427882j726720J213256J015064o81971j973454k720495l276310
$$ plain form
35247 88468574 96840225 104831558 109763885 110694674 109063634 106900040 104562256 100594152
35239 100594152 93756470 84843649 76413772 70986173 69578166 71582317 75415927 78949056
35231 78949056 79737424 76005148 68386714 60458724 56349683 57133961 59976373 61132425
35223 61132425 59222686 55302529 50836283 46742659 43717991 41792820 39304628 33635488
35215 33635488 23756530 11563647 430489 -7019421 -9761351 -8248889 -4323279 -637858
35207 -637858 872897 281573 -550916 716339 5571712 13728438 23045200 30840471 35781949
35198 35781949 38384829 39709212 40079387 39046385 35817271 29608036 20621266 11165025
35190 11165025 4737143 3010423 4223679 5238743 4556772 2583318 -137177 -3413487
35182c413487k865782n61995K895944N355971N049924J699593l501543q365626
35174c707001j0711519r669270o035754j379282K765064N090110N121387M042684
35166a4483581L918149N512476P674723R269723J0583401J2036518J2627540J0947021
35158E8085970P225286L250062N17627o64822o28290Q801J49136j394650m925103
35149F1624017r447155j3117346j4063587j1494922o698844k530931j156681k409612
35141G04939m720300p030565q976686r773759q337744m805325r63904J390785
35133d2512559K089121K245913K650912K882980J921275o22458l957194o717247
35125d2019257p939112p362444n140795j839565J360166L257859L805736M127394
$$ plain form
35182 -3413487 -6279269 -6841264 -3945320 1410651 6460575 8160168 4658625 -3707001
35174 -3707001 -14418520 -24087790 -30123544 -31502826 -28737762 -23647652 -18526265 -14483581
35166 -14483581 -10565432 -5052956 2621767 11891490 22474891 34511409 47138949 58085970
35158 58085970 65311256 68561318 69078945 68414123 67785833 67794634 67943770 66549120 61624017
35149 61624017 52176862 39059516 24995929 13501007 6802163 4271232 3114551 704939
35141 704939 -4015361 -11045926 -20022612 -29796371 -38134115 -42939440 -43903344 -42512559
35133 -42512559 -40423438 -38177525 -35526613 -32643633 -30722358 -31344816 -35302010 -42019257
35125 -42019257 -49958369 -57320813 -62461608 -64301173 -62941007 -59683148 -55877412 -51750018
35117e1750018M932663N364124L922193K95467m055431o899132o706369l678203
35109e8574706L23343L262803M612843N173080N281896M221863J827735m36450
35101c4307593j014127k16659L62322k0778o36004m60121R20109L338036O067635
35092b5967180P870614P774587N874996L024843P4278k142228k707284j415767
35084g613141O56508K232742L275148M636086O579542Q383563R077967P896983
35076C5125398M572792J21651l226876m052073l305688k755970k461970j243608
35068B2773656Q88671K687758L891620N351591O644594N849123K702432k9405
35060E0760040J16306J990526K480974N22985k092981l262119k424157l39950
$$ plain form
35117 -51750018 -46817355 -41453231 -37531038 -37235571 -41291002 -48190134 -54896503 -58574706
35109 -58574706 -58251363 -54988560 -50375717 -45202637 -39920741 -35698878 -33871143 -34307593
35101 -34307593 -35321720 -35538379 -35176057 -35196835 -35832839 -36292960 -35372851 -32034815 -25967180
35092 -25967180 -18096566 -10321979 -4446983 -1422140 -1347862 -3490090 -6197374 -7613141
35084 -7613141 -6956633 -4723891 -1448743 3187343 9766885 18150448 27228415 35125398
35076 35125398 39698190 39819841 36592965 32540892 29235204 26479234 24017264 22773656
35068 22773656 23662327 26350085 30241705 35593296 42237890 48087013 50789445 50760040
35060 50760040 50876346 52866872 55347846 55870831 53777850 50515731 48091574 47751624
35052D7751624J482958J279290j643221n802972q742240r520795r222374q910278
35044F671992q061402n502497j234445L312419O631960Q284065Q636791P768408
35036B6507291N028085J6187o069167j0561166j1183934p802011k438299K070154
35028d432860L518056J311025l217166p518403r290770p530181k679552L452562
35020b6387289P944040Q214378M307069o81010l368940l220444k338741k507680
35012a8038617l424339l865734l450139k554863j170645J133599M004984N800382
35004b1565372M908323J547626k201281m408205n052656n402681n910179n501590
34996d3586015l193397L19928L359603N170277O334447P323474P505400O069320
$$ plain form
35052 47751624 49234582 50513872 48870651 43067679 34325439 24804644 15582270 6671992
35044 6671992 -1389410 -6891907 -8126352 -4813933 1818027 10102092 18738883 26507291
35036 26507291 31535376 31551563 25482396 14921230 3737296 -4064715 -6503014 -4432860
35028 -4432860 -914804 396221 -2820945 -10339348 -19630118 -27160299 -29839851 -26387289
35020 -26387289 -18443249 -10228871 -5921802 -6602812 -9971752 -13192196 -15530937 -18038617
35012 -18038617 -21462956 -25328690 -28778829 -31333692 -32504337 -31370738 -27365754 -21565372
35004 -21565372 -16657049 -15109423 -17310704 -21718909 -26771565 -32174246 -38084425 -43586015
34996 -43586015 -46779412 -46459484 -43099881 -37929604 -31595157 -24271683 -16766283 -10696963
34988a0696963L415276R22514n85698j525029k563735l588892m125691m268914
34980b3017132m365990l978642k265057K72877J467002k76566m033276p441249
34972d3638033r143462r234895p897091n012913j117272K586783N491878P889296
34964f0075709R822274J0763531J0806834J0993360J1751838J2003682J0694475
34957A6760285Q461845O819921O157616N454179L767696J308925q61799j794582
34949D6074086j527499j256955k202069m061104n241796m962267m248801m187943
34941A8385652m098435k552094L18737K770897L614053L388372L243596L419001
34933B8489779L096722J370444j706149m818302o342855n853620m330595k689433
$$ plain form
34988 -10696963 -7281687 -6359173 -6944871 -8469900 -11033635 -14622527 -18748218 -23017132
34980 -23017132 -27383122 -31361764 -33626821 -33353944 -31886942 -32163508 -36196784 -43638033
34972 -43638033 -52781495 -62016390 -69913481 -74926394 -76043666 -73456883 -67965005 -60075709
34964 -60075709 -50253435 -39489904 -28683070 -17689710 -5937872 6065810 16760285
34957 16760285 25222130 32042051 38199667 43653846 47421542 48730467 47868668 46074086
34949 46074086 44546587 43289632 41087563 37026459 31784663 26822396 22573595 18385652
34941 18385652 14287217 11735123 12053860 14824757 18438810 21827182 25070778 28489779
34933 28489779 31586501 32956945 31250796 26432494 20089639 14236019 9905424 7215991
$$ [...]
##END NTUPLES=NMR SPECTRUM
##END=
