##TITLE=31Pdec_SR146H12W
 D2O, 128 sc
 14.4.2023
##JCAMPDX= 6.0         $$ Bruker NMR JCAMP-DX V2.0
##DATA TYPE= NMR SPECTRUM
##DATA CLASS= NTUPLES
##ORIGIN= UXNMR, Bruker Analytische Messtechnik GmbH
##OWNER= root
$$ XWIN-NMR		Version 3.5
$$ Fri Apr 14 14:07:10 2023 Russian Standard Time (UT+4h)  she@DPX200
##.OBSERVE FREQUENCY= 81.013821
##.OBSERVE NUCLEUS= ^31P
##.ACQUISITION MODE= SIMULTANEOUS
##.ACQUISITION SCHEME= undefined
##.AVERAGES= 128
##.DIGITISER RES= 16
##SPECTROMETER/DATA SYSTEM= spect
##.PULSE SEQUENCE= zgpg30
##.SOLVENT NAME= D2O
##.SHIFT REFERENCE= (INTERNAL, D2O, 0, 248.564)
##AUDIT TRAIL= $$ (NUMBER, WHEN, WHO, WHERE, WHAT)
$$ ##TITLE= Audit trail, XWIN-NMR		Version 3.5
$$ ##JCAMPDX= 5.01
$$ ##ORIGIN= Bruker BioSpin GmbH
$$ ##OWNER= she
$$ F:/spectra/data/she/nmr/P31/1/pdata/1/auditp.txt
$$ ##AUDIT TRAIL=  $$ (NUMBER, WHEN, WHO, WHERE, WHAT)
(   1,<2023-04-14 14:06:09.78 +0400>,<she>,<DPX200>,
      <continue with go, POWCHK disabled, PULCHK disabled
       configuration hash MD5:
       00 E9 B6 7A A2 85 ED C7 34 08 36 98 17 FE 4E 26
       data hash MD5: 32K
       A2 96 0F 27 7D CF 01 49 DB 04 39 13 51 38 22 A9>)
(   2,<2023-04-14 14:06:12.18 +0400>,<she>,<DPX200>,
      <Start of raw data processing
       efp BC_mod = 2 LB = 1 FT_mod = 6 PKNL = 1 PHC0 = -10991.21 PHC1 = 150.6854 SI = 64K 
       data hash MD5: 64K
       75 C0 84 69 C0 54 C1 F0 1A B8 40 B6 5B D0 F8 8F>)
(   3,<2023-04-14 14:06:35.50 +0400>,<she>,<DPX200>,
      <pk PHC0 = -210.7773 PHC1 = 403.5997 
       data hash MD5: 64K
       B7 BC C1 7E 97 46 0D D0 AA 5D A4 F7 B5 3F CF AC>)
(   4,<2023-04-14 14:06:44.89 +0400>,<she>,<DPX200>,
      <abs ABSG = 5 
       data hash MD5: 64K
       28 77 8D 89 8D 80 58 E4 8D 07 10 16 F9 2A C1 46>)
$$ ##END=
$$ 
$$ hash MD5
$$ 0A AC 5E FB 9A 3A 37 4F FF 84 1A 0C E4 BB 9C FB
##$RELAX= 
##$RELAX= 
##$RELAX= 
##$RELAX= 
##$RELAX= 
##$RELAX= 
##$RELAX= 
##$RELAX= 
##$RELAX= 
$$ Bruker specific parameters
$$ --------------------------
##$DU= <F:/spectra>
##$EXPNO= 1
##$NAME= <P31>
##$PROCNO= 1
##$TYPE= <nmr>
##$USER= <she>
##$AMP= (0..31)
100 100 100 100 100 100 100 100 100 100 100 100 100 100 100 100 100 100 
100 100 100 100 100 100 100 100 100 100 100 100 100 100 
##$AQSEQ= 0
##$AQ_mod= 1
##$AUNM= <au_zg>
##$AUTOPOS= <>
##$BF1= 81.014009
##$BF2= 200.13
##$BF3= 200.13
##$BF4= 200.13
##$BF5= 200.13
##$BF6= 200.13
##$BF7= 200.13
##$BF8= 200.13
##$BYTORDA= 1
##$CFDGTYP= 0
##$CFRGTYP= 5
##$CHEMSTR= <none>
##$CNST= (0..31)
1 1 145 1 1 1 1 1 1 1 1 1 1 1 1 1 1 1 1 1 1 1 1 1 1 1 1 1 1 1 1 1 
##$CPDPRG= <waltz16>
##$CPDPRG1= <>
##$CPDPRG2= <waltz16>
##$CPDPRG3= <>
##$CPDPRG4= <mlev>
##$CPDPRG5= <mlev>
##$CPDPRG6= <mlev>
##$CPDPRG7= <mlev>
##$CPDPRG8= <mlev>
##$CPDPRGB= <>
##$CPDPRGT= <>
##$D= (0..31)
0 1 0 0 0 0 0 0 0 0 0 0.03 2e-05 3e-06 0 0 0 0 0 0 0 0 0 0 0 0 0 0 0 0 
0 0 
##$DATE= 1681466552
##$DBL= (0..7)
120 120 120 11 120 120 24 19 
##$DBP= (0..7)
150 150 150 150 150 150 150 150 
##$DBP07= 0
##$DBPNAM0= <>
##$DBPNAM1= <>
$$ [...]
##$SUBNAM3= <"">
##$SUBNAM4= <"">
##$SUBNAM5= <"">
##$SUBNAM6= <"">
##$SUBNAM7= <"">
##$SUBNAM8= <"">
##$SUBNAM9= <"">
##$SW= 501.771253377433
##$SWIBOX= (0..15)
0 1 3 0 0 0 0 0 0 0 0 0 0 0 0 0 
##$SW_h= 40650.406504065
##$TD= 32768
##$TD0= 1
##$TE= 0
##$TE2= 300
##$TE3= 300
##$TEG= 300
##$TL= (0..7)
0 120 53 12 22 120 120 120 
##$TP= (0..7)
150 150 150 150 150 150 150 150 
##$TP07= 0
##$TPNAME0= <>
##$TPNAME1= <>
##$TPNAME2= <>
##$TPNAME3= <>
##$TPNAME4= <>
##$TPNAME5= <>
##$TPNAME6= <>
##$TPNAME7= <>
##$TPOAL= (0..7)
0.5 0.5 0.5 0.5 0.5 0.5 0.5 0.5 
##$TPOFFS= (0..7)
0 0 0 0 0 0 0 0 
##$TUNHIN= 0
##$TUNHOUT= 0
##$TUNXOUT= 0
##$USERA1= <user>
##$USERA2= <user>
##$USERA3= <user>
##$USERA4= <user>
##$USERA5= <user>
##$V9= 5
##$VALIST= <valist>
##$VCLIST= <CCCCCCCCCCCCCCC>
##$VD= 0
##$VDLIST= <DDDDDDDDDDDDDDD>
##$VPLIST= <PPPPPPPPPPPPPPP>
##$VTLIST= <TTTTTTTTTTTTTTT>
##$WBST= 1024
##$WBSW= 4
##$XGAIN= (0..3)
0 0 0 0 
##$XL= 0
##$YL= 0
##$YMAX_a= 2114
##$YMIN_a= -3826
##$ZGOPTNS= <>
##$ZL1= 120
##$ZL2= 120
##$ZL3= 120
##$ZL4= 120
##$ABSF1= 248.5645
##$ABSF2= -253.2056
##$ABSG= 5
##$ABSL= 3
##$ALPHA= 0
##$AQORDER= 0
##$ASSFAC= 0
##$ASSFACI= 0
##$ASSFACX= 0
##$ASSWID= 0
##$AUNMP= <proc_1d>
##$AZFE= 0.1
##$AZFW= 0.5
##$BCFW= 0
##$BC_mod= 2
##$BYTORDP= 0
##$COROFFS= 0
##$CY= -3
##$DATMOD= 1
##$DC= 0
##$DFILT= <>
##$DTYPP= 0
##$F1P= 0
##$F2P= 0
##$FCOR= 1
##$FTSIZE= 65536
##$FT_mod= 6
##$GAMMA= 0
##$GB= 0
##$INTBC= 1
##$INTSCL= 6.047779e-11
##$ISEN= 30
##$LB= 1
##$LEV0= 0
##$LPBIN= 0
##$MAXI= 10000
##$MC2= 0
##$MEAN= 0
##$ME_mod= 0
##$MI= 50
##$NCOEF= 0
##$NC_proc= -8
##$NLEV= 6
##$NOISF1= 182.463
##$NOISF2= 159.3651
##$NSP= 0
##$NTH_PI= 0
##$NZP= 0
##$OFFSET= 248.5645
##$PC= 4
##$PHC0= -11201.99
##$PHC1= 554.2851
##$PH_mod= 1
##$PKNL= yes
##$PPARMOD= 0
##$PSCAL= 0
##$PSIGN= 0
##$REVERSE= no
##$SF= 81.0140089999694
##$SI= 65536
##$SIGF1= 159.3651
##$SIGF2= -187.1042
##$SINO= 113.3802
##$SIOLD= 16384
##$SREGLST= <1H.CDCl3>
##$SSB= 0
##$STSI= 65536
##$STSR= 0
##$SW_p= 40650.406504065
##$SYMM= 0
##$S_DEV= 0
##$TDeff= 32768
##$TDoff= 0
##$TI= <>
##$TILT= no
##$TM1= 0
##$TM2= 0
##$TOPLEV= 0
##$USERP1= <user>
##$USERP2= <user>
##$USERP3= <user>
##$USERP4= <user>
##$USERP5= <user>
##$WDW= 1
##$XDIM= 65536
##$YMAX_p= 566912729
##$YMIN_p= -127038825
$$ End of Bruker specific parameters
$$ ---------------------------------
##NTUPLES= NMR SPECTRUM
##VAR_NAME=  FREQUENCY,     SPECTRUM/REAL,   SPECTRUM/IMAG
##SYMBOL=    X,             R,               I
##VAR_TYPE=  INDEPENDENT,   DEPENDENT,       DEPENDENT
##VAR_FORM=  AFFN,          ASDF,            ASDF
##VAR_DIM=   65536,         65536,           65536
##UNITS=     HZ,            ARBITRARY UNITS, ARBITRARY UNITS
##FACTOR=    0.620285442955139, 1,           1
##FIRST=     20137.2065510682, 0,            0
##LAST=      -20513.1999529968, 0,           0
##MIN=       -20513.1999529968, -127038825,  0
##MAX=       20137.2065510682, 566912729,    0
$$ Real data points
##PAGE= N=1
##DATA TABLE= (X++(R..R)), XYDATA
$$ [...]
12926a5278978P758615J0784321M160426p38723k950851p753779r808189k85496
12918a4112654J2958626J2524889j324145r940430n059744Q39674j943347n225594
12910a1282725k93191O035850M353562j306279k652013j724489l750380m406970
12902a5026635K340600J0254304Q255688j937936p769285l268670N672315J1335181
12894I855562J0465414L201870n633347p433664o47039L603114l436581j2585579
12886b610250q805580M913308J0755141K596591o297703m961606O17216N32059
12878c260824l688882m778628j873345J046285K859013M751564O040508N302934
12870F398625K598430j665553o361255p834951l926076O03931k38707l275149
$$ y = [-15278978, -7520363, 3263958, 7424384, 6685661, 3734810, -4018969, -13827158, -14112654, -1154028, 11370861, 10046716, 106286, -4953458, -4113784, -6057131, -11282725, -11575916, -5540066, -1186504, -2492783, -5144796, -6869285, -10619665, -15026635, -12686035, -2431731, 5823957, 3886021, -3883264, -7151934, -1479619, 9855562, 20320976, 23522846, 17889499, 10455835, 9808796, 13411910, 9975329, -2610250, -11415830, -6502522, 4252619, 6849210, 551507, -4410099, -3792883, -3260824, -6949706, -11728334, -13601679, -12555394, -9696381, -4944817, 1095691, 6398625, 8997055, 7331502, 970247, -6864704, -10790780, -10186849, -10425556, -13700705]
12862a3700705o03906N805380N611646j935845m577901L552704J1764017R170524
12854A5085914j99717o826028r390497r804858n091680M654127R426496K864660
12846G18417n000920j773478O975986N994196n276122j2209375p929242j560232
12838b0060770j119814j488101M814274J3989496J4975567L498511j1806757j6847426
12830a4045020o306054Q959017J2748790L341564m608482j492823M236213K251892
12822E085097j937982J398722O628370K110614p170992o157149L727033N823185
12814I506898k784966n771944L273107Q267955j877284j3004275q466675L538235
12806g318949L982308o259589r622985o85962P600977O561175L434493N851250
$$ y = [-13700705, -14304611, -8499231, -2887585, -4823430, -9401331, -5848627, 5915390, 15085914, 14886197, 8060169, -1330328, -11135186, -16226866, -11572739, -2146243, 718417, -4282503, -6055981, 920005, 6914201, 1638079, -10571296, -18500538, -20060770, -21180584, -22668685, -17854411, -3864915, 11110652, 14609163, 2802406, -14045020, -20351074, -11392057, 1356733, 4698297, 89815, -1403008, 2833205, 5085097, 3147115, 4545837, 11174207, 13284821, 6113829, -43320, 3683713, 9506898, 6721932, 949988, 4223095, 12491050, 10613766, -2390509, -10857184, -7318949, -3336641, -9596230, -19219215, -19905177, -12304200, -5743025, -2308532, 3542718]
12798C542718Q228301J683058j0407637j5325379p087268O530241J3646900J1246989
12790A2057923N921519L202619J056798l548331o804734l532384K411330K147169
12782A2911909m113995o808370k655436m9860m516360r024086n625012J982066
12774a7899144N598657M958650M365508L180390r05301l972127r78498M607923
12766a043942N520785K320526J212160K500134Q18750m031149o004715l262886
12758a970337j126900k723267l928557m28030N387062P209412J587608q715319
12750d708328j5685897j1728546J968219J4230108J5178008P281151J100668J956583
12742I591966N626373N836815J092938n363609q636451o078047o82000J451530
$$ y = [3542718, 11771019, 13454077, 3046440, -12278939, -19366207, -12835966, 810934, 12057923, 17979442, 21182061, 22238859, 18690528, 11885794, 8353410, 10764740, 12911909, 8797914, 1989544, -665892, -715752, -5232112, -14256198, -19881210, -17899144, -12300487, -7341837, -2976329, 204061, -701240, -4673367, -5651865, -1043942, 4476843, 6797369, 8009529, 10509663, 11328413, 7297264, 1292549, -1970337, -3097237, -5820504, -9749061, -10177091, -4790029, 2419383, 4006991, -4708328, -20394225, -32122771, -30154552, -15924444, -746436, 6534715, 7635383, 9591966, 15218339, 21055154, 22148092, 16784483, 8148032, 2069985, 1387985, 2839515]
12734B839515j155202l914787l994161l432634k076714L970362J2294809J2770350
12726A7301538L338450l796606j149152J219013n252285r221128J285494J3008931
12718A6734255N283595j3447381j5122759L231032J4149537L941905p566211k623814
12710D580159O782149L514690n716186n660658J414439M777061N198560O882069
12702B1772283L592217p884939j4062527m814035O075223K242856o469808j663658
12694a212388Q861740L532762j2939547j4225709L693423J5314929P188030l334566
12686F878674l61552O456336L231364n078131p293847m125767p42770L644043
12678B608350P984151N775811j617126l235152K099322K022957n895964p374442
$$ y = [2839515, 1684313, -2230474, -6224635, -9657269, -11733983, -7763621, 4531188, 17301538, 20639988, 16843382, 15694230, 16913243, 11660958, 2439830, 3725324, 16734255, 22017850, 8570469, -6552290, -3321258, 10828279, 14770184, 7203973, 4580159, 11362308, 14876998, 9160812, 3500154, 4914593, 9691654, 14890214, 21772283, 25364500, 17479561, 3417034, -1397001, 4678222, 6921078, 451270, -1212388, 7649352, 11182114, -1757433, -15983142, -12289719, 3025210, 10213240, 6878674, 6517122, 12973458, 16204822, 11126691, 3832844, -292923, -1035693, 2608350, 10592501, 16368312, 14751186, 11516034, 13615356, 15638313, 9742349, 2367907]
12670B367907J640688M037918q137478j5926358m884678Q403476M376923n879834
12662a4001436k242346P690521M606652m616832L50869J2879136Q796733q637838
12654D825459j1469669M613872J2932369K560266n174320K223630O960505l574066
12646A3898046j3197003q361736k819643q549497j0360903M593439J7536012P995352
12638G34067q477715n076709J0758980J1451123k981202p714404K207324O246791
12630G148255k623012p806075k644074j793048j0271873j0890123M587381J7710536
12622f582033J2380966j88139k551130J272554k173669j0007392q749068K293431
12614a4304480J0489974Q780663K192036j909282q12080L548414N466832M83212
$$ y = [2367907, 4008595, 8046513, -90965, -16017323, -20902001, -12498525, -8121602, -14001436, -16243782, -8553261, -3946609, -8563441, -8212572, 4666564, 13463297, 4825459, -6644210, -2030338, 10902031, 13462297, 8287977, 10511607, 17472112, 13898046, 701043, -7660693, -10480336, -19029833, -29390736, -24797297, -7261285, 734067, -7743648, -12820357, -2061377, 9389746, 6408544, -1305860, 901464, 7148255, 4525243, -3280832, -5924906, -7717954, -17989827, -28879950, -24292569, -6582033, 5798933, 5610794, 3059664, 4332218, 2158549, -7848843, -16597911, -14304480, -3814506, 4966157, 7158193, 5248911, 4436831, 7985245, 13452077, 13935289]
12606A3935289o698373o206276J834526N911013J248044k679488O80217L621289
12598A1646241l23079k857344M006913J0734461L698793j2162948j9779509j3538974
12590a8575446k073096P419489J3209150J2058968L239348l912160j045232M165252
12582A4486273o56303j0226628q691620K943340O998116j407968o257908J642997
12574a169701Q847765J862371j1027408j3709539n672335J864533M046666L858034
12566a1099614K275879j231035l016638q635L730311L278548J191555K094653
12558b784976M176699L829032L262687N217831N609143M35679n251988m961870
12550I532237k342977m583526q740469o546125L57481K811886J88077P42451N783998
$$ y = [13935289, 7236916, 1030640, 2865166, 8776179, 10024223, 7344735, 8024952, 11646241, 11323162, 8465818, 12472731, 23207192, 26905985, 14743037, -5036472, -18575446, -20648542, -13229053, -19903, 12039065, 15278413, 11366253, 10321021, 14486273, 13829970, 3603342, -5088278, -2144938, 4853178, 3445210, -2812698, -1169701, 7678064, 9540435, -1486973, -15196512, -20868847, -19004314, -14957648, -11099614, -8823735, -10054770, -13071408, -13080043, -9349732, -6071184, -4879629, -2784976, 1391723, 5220755, 8483442, 13701273, 19310416, 19746095, 14494107, 9532237, 7189260, 2605734, -6134735, -12680860, -12323379, -9511493, -9323416, -8580965, -2796967]
12541b796967O995301J626304k831725k714807l794362p479376m693783P964573
12533g724842J7603554J1830589k271975q028511k211697M138874M340245K669790
12525B0346027K781997J414872l810507r331345j1301778r405396l506663N953079
12517f859714J2653412Q491689l359485q535034m84792Q994286O310175m160819
12509A3049718p611424j176151M202547K949417J826069M684991L868394n470899
12501A6322662j3431191q783703K747980O076043p61689m512957K597415J2075368
12493A2329928J2689275N153175k091531m735721m579654m525405o356642r744295
12485a860870j0382396l908465N614910P713471P0771o486693l623084K031387
$$ y = [-2796967, 4198334, 5824638, 2992913, 278106, -3516256, -10995632, -15689415, -7724842, 9878712, 21709301, 19437326, 11408815, 9197118, 13335992, 17676237, 20346027, 23128024, 24542896, 20732389, 11401044, 99266, -9306130, -12812793, -6859714, 5793698, 14285387, 10925902, 2390868, 1906076, 10900362, 17210537, 13049718, 5438294, 4262143, 8464690, 11414107, 13240176, 17925167, 21793561, 16322662, 2891471, -5892232, -3144252, 2931791, 2170102, -2342855, 254560, 12329928, 25019203, 30172378, 28080847, 23345126, 18765472, 14240067, 7883425, -1860870, -12243266, -16151731, -10536821, -2823350, -2752579, -9239272, -12862356, -10830969]
12477a0830969R27687k667203J350421R352919P984572k936317p783665P03431
12469c899124R632057N895655m808344q944494m996266o75058K076342O135926
12461D16694P899859J008718r446023r825678K348344J2922413J0018997q20176
12453A4523148o504799m147840j251835k306675l422030k71994M633183N076791
12445F327949p75398p495848p877103r72734O409513P397412L090080M53411K741835
12436I299117N532147L331951l015635p697014o791785j659660L419427N114215
12428G532763L006387p56262l309702l003668k09684K828964L076943m59377m222204
12419D484160k945850L160551O913686K992823m294175o385523j720396L415663
$$ y = [-10830969, -9903282, -12570485, -11220064, -1867145, 6117427, 3181110, -4602555, -3899124, 5732933, 11628588, 6820244, -2124250, -7120516, -7795574, -5719232, 416694, 8316553, 9325271, -120752, -9946430, -7598086, 5324327, 15343324, 14523148, 8018349, 3870509, 2618674, 311999, -3110031, -3382025, 1251158, 6327949, 5552551, -1943297, -9820400, -10793134, -4383621, 3013791, 6103871, 6557282, 9299117, 14831264, 18163215, 15147580, 7450566, 658781, -1000879, 2418548, 7532763, 10539150, 9782888, 6473186, 3469518, 3259834, 6088798, 9165741, 8706364, 4484160, 1538310, 4698861, 11612547, 14605370, 10311195, 3925672, 2205276, 5620939]
12411E620939M072380J027026l395175p515716p932529j845729O547680Q717649
12403E296525L323738j752076j987794k991360r217554j3473735o397896P975738
12395a9224414J5606343J0351803M09811l814108j643938J26070k962136p936827
12387i087396p766827L84486R955196J0648272R69713q612411q157004j20O108163
12378e557928N643657J809208j172680j363811J563840M629651K239409n507263
12370B284083r247709k598103O265205M980290m235031p873284j983619L322136
12362i086032J744993k55972K859783N410577J385073m147463l276746K158247
12354c207540M766626L220189J700463J530554O54828j071162k216583l446192
$$ y = [5620939, 9693319, 10720345, 7325170, -190546, -8123075, -9968804, -3421124, 5296525, 8620263, 6868187, 4880393, 1889033, -7328521, -20802256, -27200152, -19224414, -3618071, 6733732, 7143543, 3329435, 1685497, 1811567, -1150569, -9087396, -16854223, -16469737, -6514541, 4133731, 5103444, -3508967, -11665971, -11666091, -5557928, 85729, 1894937, 722257, -641554, 922286, 5551937, 7791346, 2284083, -6963626, -9561729, -3296524, 1683766, -2551265, -10424549, -12408168, -9086032, -7341039, -7597011, -4737228, 673349, 2058422, -2089041, -5365787, -3207540, 1559086, 4779275, 6479738, 8010292, 8665120, 7593958, 5377375, 1931183]
12346A931183n774401o847451l292774M204383J0805118J1492828M801448m757072
12338A2563262q840639m400906R73273m76444l470575K299476J2253345J0124211
12330B1025003n718876j5875072q027183M483354M318683l893309m858042J538621
12322g006821L695580M5648j013396J463307J041124j256208J309577O409750
12314D688561N580872L96747m26020J408960l404019j1765859r988444K233719
12306a1275483Q852368K952197l483418j578790J053623k532119n404846j253196
12298a2669664L250562J750141k29435J665170J40873q402763j1856650q20643
12290b7172409J2944808J3167990M297197K177546P072837N393430n230370j1621512
$$ y = [1931183, -3843218, -10690669, -13983443, -9779060, 1026058, 12518886, 17320334, 12563262, 3722623, -678283, 294990, -181454, -3652029, -1352553, 10900792, 21025003, 15306127, -568945, -8596128, -4112774, 205909, -3687400, -8545442, -7006821, -3311241, -3265593, -4278989, -2815682, -1774558, -3030766, -1721189, 4688561, 10269433, 10666180, 10240160, 11649120, 8245101, -3520758, -13509202, -11275483, -2423115, 529082, -2954336, -4533126, -3479503, -6011622, -11416468, -12669664, -9419102, -7668961, -7898396, -6233226, -6092353, -14495116, -26351766, -27172409, -14227601, -1059611, 3237586, 5415132, 12487969, 17881399, 12651029, 1029517]
12282A029517o402786K389085N551675L535995J22132l788322o759038n616053
12274i937795m93768M563988O576102M830211l68815n092716k784137N326173
12266B619243P244609k853450j1714889m124001J2411723J6109613K225903j0951065
12258A0967686r299350l1162L386752l02629l881246l419326O93875O730023J0229377
12249A5074000O340430k551011q021434o869679m011510k808781j436973n20555
12241d805513l857334q573449n928669L549221P583669J123083m260240J228314
12233a3940918R171110O681477k488657m662679J396213L814262j907352n930722
12225g867266o91906O872862N924643k428978p113760k516731M482315M659501
$$ y = [1029517, -5373269, -2984184, 2567491, 6103486, 6225618, 2437296, -4321742, -9937795, -10431563, -5867575, 708527, 5538738, 5169923, 77207, -2706930, 2619243, 9863852, 7010402, -4704487, -8828488, 3583235, 19692848, 21918751, 10967686, 1668336, 1637174, 5023926, 4721297, 840051, -2579275, -1885400, 4844623, 15074000, 21414430, 18863419, 10841985, 3972306, -39204, -2847985, -4284958, -4805513, -8662847, -17236296, -23164965, -19615744, -12032075, -10908992, -15169232, -13940918, -4769808, 1911669, -576988, -5239667, -3843454, -29192, -1936544, -7867266, -8559172, -1686310, 4238333, 1809355, -5304405, -7821136, -3338821, 1320680]
12217A320680m45740q54049O268501J0289329J963219j0843285j2160415p71992
12209e233752P799143M045418l160338k580217K477119K283695l096563o300160
12201c765655n296101l029601R15784P569436J0898034M228999p021346j0056369
12193e556819k458012M976058M483102M80715m42846M90866r06575l939934n273627
12184h147072m124699q69890N014594J1258436J1415995K732943p343691q426064
12176A510552k00505P096664N841268j17805k115329J475281M309544J858798
12168A9658468k722417m219716k908673k674821l834370k853663Q66824K957797
12160D269429N87768k961422k802257J189480M904205M924436J203275l211027
$$ y = [1320680, 874940, 20891, 6289392, 16578721, 18541940, 7698655, -4461760, -5233752, 2565391, 6610809, 3450471, 870254, 3347373, 5631068, 2534505, -3765655, -9061756, -12091357, -11175573, -3606137, 7291897, 11520896, 4499550, -5556819, -8014831, -3038773, 1444329, 1925044, 1482198, 1973064, 1066489, -2873445, -8147072, -12271771, -13141661, -8127067, 3131369, 14547364, 17280307, 9936616, 1510552, 1310047, 8406711, 14247979, 14130174, 12014845, 13490126, 17799670, 19658468, 16936051, 12716335, 9807662, 7132841, 3298471, 444808, 1311632, 4269429, 4857197, 1895775, -906482, 282998, 5187203, 10111639, 11314914, 8103887]
12152H103887l992763L77729N318449M226936k632271p116548l505326L841804
12144D621897O343413J696955n028139q485066p546795l947188M19892M760127
12136g164904Q836886J0746543O735299l438598j2306587j1484923k767024L973779
12128f869529M592314M502071O875392O548164K33907o486397q573578q866502
12120h044158q878422k566007J0517054J6173830M040864j2682333j3108585M61978
12112a4085779O795020m41348m731256L026211Q420279p06263j1148841m488205
12104a7360182J2210863J6152439L447177o543025j829923O455984N017701j181110
12096A6369924n29244M633382L231269m527099p474599l167221k268653r043075
$$ y = [8103887, 4111124, 4488853, 9807302, 14034238, 11401967, 4285419, 780093, 4621897, 10965310, 12662265, 7634126, -850940, -8397735, -12344923, -11925031, -7164904, 1671982, 12418525, 19153824, 15715226, 3408639, -8076284, -10843308, -6869529, -2277215, 2224856, 9100248, 15648412, 15882319, 9395922, 822344, -8044158, -16922580, -19488587, -8971533, 7202297, 11243161, -1439172, -14547757, -14085779, -7290759, -7732107, -12463363, -9437152, -1016873, -1723136, -12871977, -17360182, -5149319, 11003120, 14450297, 7907272, 6077349, 12533333, 17551034, 16369924, 15840680, 20474062, 23705331, 19178232, 11703633, 8536412, 6267759, -2775316]
12088b775316j1431994l1001J3957423J3155009j17793p639065k436252M052605
12080F733616L158728N61041J373178j51509o764159q601433J70436P501213J330206
12071E311317q615527m552255J0190654J5057330L573888q263721p523194j137385
12063D041107r67933n828594o927546k235477K717785L673586J767678Q85154
12055b874240K682205L320851j930215q677198n517994P629810J3564192J863964
12047A0061375j1630262o844445P842764Q073403o070262j0035381K909188R488706
12039C795086l556123j6038169q025005P557095Q059278k151060k757173P789790
12031e326281J3585932R483358M671633K385355k684078q669100p380143m04745
$$ y = [-2775316, -14207310, -14238311, -280888, 12874121, 12756328, 5117263, 2681011, 6733616, 9892344, 10453385, 11826563, 11675054, 4910895, -3690538, -3520102, 3981111, 5311317, -3304210, -7856465, 2334189, 17391519, 20965407, 12701686, 5178492, 4041107, 3073174, -2755420, -9682966, -11918443, -9200658, -5527072, -3759394, -2874240, -192035, 3128816, 1198601, -7478597, -12996591, -5366781, 8197411, 10061375, -1568887, -8413332, -570568, 7502835, 1432573, -8602808, -5693620, 3795086, 238963, -15799206, -23824211, -16267116, -8207838, -10358898, -13116071, -5326281, 8259651, 17743009, 22414642, 24799997, 22115919, 13446819, 6066676, 5661931]
12023E661931K422935J11214M21995L534474J591459n289246p758441l089663
12015b393342J468236J902709R42092j278932o184255p214959K909648J5150273
12007E301470J1994755m828164j2941409j843848J1201350P881168m553877p313564
11999D897881Q84348M905180k076276r953998q078500O38982N519872K333681
11991i28830k395974n84231O464036R338584L242810n305218p724203m019163
11983a912189R65852N802294R481381O686010l704580j1190269o886889J090821
11975C32431m81454p740618o359767L353889P714035M499992M484918P179741
11967A2983167j55086j4401381j4302571L665050J4231160L269677p854247J367061
$$ y = [5661931, 8084866, 8196080, 8618075, 12152549, 13744008, 8454762, 696321, -2393342, -925106, 977603, 1919695, 640763, -5543492, -12758451, -9848803, 5301470, 17296225, 12468061, -473348, -2317196, 8884154, 16765322, 12211445, 4897881, 5782229, 10687409, 8611133, -1342865, -9421365, -8782383, -3262511, -928830, -3324804, -3909035, 2555001, 11893585, 15136395, 9831177, 2106974, -1912189, -946337, 4855957, 14337338, 21023348, 17318768, 6128499, -758390, 332431, -149023, -7889641, -14249408, -10895519, -3181484, 1318508, 5803426, 12983167, 12828081, -1573300, -15875871, -12210821, 2020339, 5290016, -2564231, -1197170]
11959a197170J4959439Q515853p791265p122787O902812O950606j0018410j7614803
11951f415725m727477Q219228N401022j837016k92580L113703n37100l642680
11943g18625J780266O805545J489064n875336k557296O503230P602714J284158
11935A6313720o25315L775114M468540k483263q850543p492028j272589L223264
11927G056900L426572P95257j634143j316466O00187l36190n039325p787665m246581
11918h481454J428709K910177J117905R17110J991113N09237k480692k274397
11910d362292P99201J522742j196505k524893k3102K542746J579975j393547l282590
11901f338265l454683k146946J099550M771364M497007j715808r001006r784497
$$ y = [-1197170, 13762269, 22278122, 14486857, 7364070, 14266882, 21217488, 11199078, -6415725, -11143202, -2923974, 2477048, 640032, 347452, 3461155, 2924055, -718625, 1061641, 7867186, 9356250, 3480914, 923618, 7426848, 15029562, 16313720, 15688405, 19463519, 23932059, 21448796, 12598253, 5106225, 3833636, 7056900, 10483472, 11278729, 9644586, 8328120, 8928307, 8592117, 3552792, -4234873, -8481454, -7052745, -4142568, -3024663, -2107553, -116440, 392797, -2087895, -4362292, -3563091, -2040349, -3236854, -5761747, -5784849, -3242103, -1662128, -3055675, -6338265, -9792948, -11939894, -10840344, -6068980, -1571973, -3287781, -12288787, -22073284]
11893b2073284k669015N109857N565464o56763n037400j809147N076675P946371
11885h547242N291620J121528l004332q161436j0891339m967403O853140J1773053
11877a0532411L351074q362097j0019550k082775N156959P085549O716251M958090
11869c728910k59383o064526n898244K32135M979475M411279K222589K003194
11861b102391K348637J325949m20089k495234n185633o454612m059240m40334
11853a7482947N68241P70573L917369O613979K655969m168969l300655N162062
11845e264378Q918635K895168l021293j561341J47633m629431q279675j893104
11837a2687786P654371P665536p5663l236641R64136L593651K64474l398089k950649
$$ y = [-22073284, -24742299, -19632442, -14066978, -14723741, -19761141, -21570288, -16493613, -8547242, -3255622, -2134094, -5138426, -13299862, -24191201, -29158604, -22305464, -10532411, -7181337, -15543434, -25562984, -27645759, -22488800, -15403251, -8687000, -3728910, -3988293, -10052819, -15951063, -15718928, -10739453, -6328174, -4105585, -2102391, 246246, 1572195, 1152106, -1343128, -6528761, -12983373, -17042613, -17482947, -16914706, -16144133, -12226764, -5612785, -2956816, -7125785, -10426440, -5264378, 3654257, 6549425, 3528132, 1966791, 2114424, -2515007, -10794682, -12687786, -5033415, 2632121, 2556458, -680183, 283953, 3877604, 4142078, 743989, -2206660]
11828b206660r34452m03597j330637l675242o397946m723608L421027J0328155
11820e922960P262675j541307l953720K123076O753748L599775l316280q524677
11812c519670r841884m428068P738581J6178415R308862o732322j3011125m562913
11804h870124L187216l27043n802454k704846L182633K733310K30954L249753
11796e120601O878825K738987n001805p135429n376734o251112o107392J888617
11788b3486644J1339786J0138807J068372k129285K470423L531191k148885m772578
11780c988813q37342L44537n003527o645967J754079J0649218J0160089N149716
11772A1581990L996890L295078l592041j1092664q732271N64284L302696m229952
$$ y = [-2206660, -3141112, -3544709, -4875346, -8550588, -14948534, -19672142, -16251115, -5922960, 1339715, -201592, -4155312, -2032236, 4721512, 8321287, 5005007, -3519670, -13361554, -17789622, -10051041, 6127374, 15436236, 8703914, -4307211, -8870124, -5682908, -6009951, -11812405, -14517251, -11334618, -8601308, -8370354, -5120601, 1758224, 4497211, -504594, -7640023, -13016757, -19267869, -25375261, -23486644, -12146858, -2008051, -939679, -3068964, -598541, 2932650, 783765, -3988813, -4826155, -4481618, -9485145, -16131112, -14377033, -3727815, 6432274, 11581990, 15578880, 18873958, 15281917, 4189253, -4543018, -3978734, -676038, -4905990]
11764d905990j0577510o112564M265883R447450O540349K165570K477482N967479
11756I268149O139350j29409p811083q562609o02598Q436233J0018942M056170
11748B0813145k335901l709780j208220P41967Q798j878942k869659l381775m862573
11739A317060n787228k292593N067502Q565603K098093q966801j2818085o376348
11731a9192797Q78966M00601m217692m016933J723996N019777J500714k706399
11723b0609767O52488R572959J2787672M765385n017150m023598M400986M382764
11715F911739p550380j3579248m22476J7062832J4616605n000577j4813419l669660
11707f444584Q271459K241578j0852231r782668M003355J1398003N386673l141487
$$ y = [-4905990, -15483500, -21596064, -17330181, -7882731, -1342382, 823188, 3300670, 9268149, 15407499, 15278090, 7467007, -1095602, -1698200, 6738033, 16756975, 20813145, 18477244, 14767464, 13559244, 14301211, 14310009, 12431067, 9561408, 6179633, 1317060, -4470168, -6762761, -1695259, 6870344, 8968437, 1636, -12816449, -19192797, -18313831, -17913230, -22130922, -26147855, -24423859, -19404082, -17903368, -20609767, -19957279, -10384320, 2403352, 7168737, 2151587, -1872011, 2528975, 6911739, -638641, -14217889, -14640365, 2422467, 17039072, 12038495, -2774924, -6444584, 1826875, 4068453, -6783778, -16566446, -12563091, -1165088, 4221585, 1080098]
11699A080098o117058o995648p976708m400049M056734R163764O215749O24875
11691d348243j910085k854508m046940k324889L330115O889293M049438j54890
11683a370709Q68521M887765N087985Q26383k788363l486095l460922m002754
11675c438189m257325m003545k629224K442107J0485587J3457862N247184o764409
11667A0540048r256473k267975P20819n014170o819678L447697J2199303L567629
11659G117200j3012117j3991174K416918J2703899M026597p218595k895440R212507
11651a640205J0924789K934537o88375J409977j788215j0486156j1865659k489578
11643a3688885N730341N970964N681050R294698Q255423k570373j2642315j1018439
$$ y = [1080098, -5036960, -12032608, -20009316, -24409365, -20352631, -11188867, -4973118, -4348243, -6258328, -9112836, -13159776, -15484665, -12154550, -5265257, -1215819, -1370709, -502188, 4385577, 9473562, 10299945, 7511582, 4025487, 564565, -3438189, -7695514, -11699059, -14328283, -11886176, -1400589, 12057273, 17304457, 10540048, 1283575, -984400, -263581, -5277751, -12097429, -8649732, 3549571, 7117200, -5894917, -19886091, -17469173, -4765274, -738677, -7957272, -10852712, -1640205, 9284584, 12219121, 11530746, 12940723, 11152508, 666352, -11199307, -13688885, -7958544, -1987580, 3693470, 12988168, 21243591, 18673218, 6030903, -4987536]
11635d987536k839303O28564r05950r73829M11204l27606m79340L965526Q222102
11626B713832N037915k578938n742235l438742j248213L42227M770293Q821256
11618H677395N533985k643347n499514r70452J904316j731942n166093k193935
11610b089587K752633K241102l092168o773843n543710j648518J308946J818769
11602a1026376J190207J730346L144852K422229n85899j217364K114410K917041
11594F89446l441708r396893m808847N762277P397251l202347j2181685q095004
11586b7277510L764667J1139204R658289K993040l559984m594167K686437J2247315
11578G057291J2950141L181541n876952o344329m072811o437000r001758l970905
$$ y = [-4987536, -7826839, -7198275, -8104225, -9078054, -8666850, -8994456, -9473796, -5508270, 2713832, 7751747, 5172809, -569426, -4008168, -5256381, -4914154, -143861, 8677395, 14211380, 11568033, 6068519, 5098067, 7002383, 5270441, 104348, -2089587, 663046, 2904148, -188020, -6961863, -12505573, -14154091, -12845145, -11026376, -9836169, -8105823, -4960971, -2538742, -3124641, -4342005, -2227595, 689446, -2752262, -12149155, -16958002, -11195725, -3798474, -7000821, -19182506, -27277510, -23512843, -12373639, -2715350, 277690, -3282294, -7876461, -5190024, 7057291, 20007432, 23188973, 17312021, 10967692, 6894881, 457881, -8543877, -12514782]
11570a2514782N167228Q428264M486262O02697J39452N1235p52438k7593J268692
11561F849017l13719l358663k851256R17679K413617L64072n61216J322782J949371
11552F731684l96404j915662j057790j910370n961723p715279l719004N86015
11544a5358533m16586k570997J088032P295459O278004k282677p069491j509858
11536a4546647O425759O035885j201490n550686l495033p9844J507319L930418
11528f974319P919003Q521179L143246k823320l610697j600368k277320m444079
11520b146675k801007J742032K627787j123964k455594K379264P354146N940414
11512A1516403Q57051j004189J093580K700198K316056J805004M59473m008867
$$ y = [-12514782, -7347554, 1080710, 5566972, 6169669, 6309121, 6360356, 5607918, 5580325, 6849017, 6535298, 3176635, 325379, 1243058, 3656675, 4020747, 3459531, 4782313, 6731684, 6335280, 4419618, 3361828, 1451458, -4510265, -12225544, -15944548, -15358533, -15775119, -18346116, -17258084, -9962625, -3684621, -5967298, -13036789, -14546647, -8120888, -2085003, -3286493, -8837179, -12332212, -12412056, -10904737, -6974319, 944684, 9465863, 12609109, 9785789, 6175092, 4574724, 2297404, -2146675, -4947682, -3205650, -577863, -1701827, -4157421, -1778157, 5575989, 11516403, 12373454, 11369265, 12462845, 15163043, 17479099, 19284103, 19743576, 15734709]
11504A5734709q447314n726009M174253J0889739O183731m438235q303190j950845
11496H116839M999104L227745m084902o038207J171028Q706013N927865n774055
11488A6251430j3643479q786841K670565P345266J934391l212046J39248N371103
11480H069637R62377j0580815j4049633l228096R187224R519388K222362R17345
11472C019789N952578M470909p247874j5538071r108420M009632Q278303K118347
11464d044807k816980r5834M412502L929997J75246j360192N58849K886834K789129
11455F434744j12599l699642m594633j658693J660445J277379j365214q14927
11447b873140L953018O687733J867407p265732j1848348p585327Q36095N624415
$$ y = [15734709, 7287395, 1561386, 5735639, 16625378, 22809109, 18370874, 10067684, 8116839, 13115943, 16343688, 12258786, 6220579, 7391607, 16097620, 22025485, 16251430, 2607951, -6178890, -3508325, 3836941, 5771332, 2559286, 2698534, 8069637, 9032014, -1548801, -15598434, -18826530, -9639306, -119918, 2102444, 3019789, 8972367, 13443276, 6195402, -9342669, -18451089, -14441457, -6163154, -4044807, -6861787, -6957621, -2545119, 1384878, 1560124, 199932, 758781, 3645615, 6434744, 6322145, 2622503, -1972130, -3630823, -1970378, -692999, -2058213, -2873140, 1079878, 7767611, 9635018, 2369286, -9479062, -17064389, -16228294, -10603879]
11439a0603879M161405L30147j272979m13223K4454j414996l083699k262794K347554
11430a2188010Q796750J1410502N276251n826454j0006824j600695Q459759N193576
11422I514855q942913j5691949n617879R948326J5658727J0037109M74570r022802
11414F358044j6171843j5415798n318047N116117P315200M781192M741159N181989
11406c411987J408939j362868M106122J1432281Q198968l155298p776382j552238
11398G887537L876228J131418l261079l221142k593896m349991l284616L040437
11390g75104O863076J748044o871317r906197o352360p78418M144679O894134
11382e033463N146983M8974k784372p08047K538723L533910L354398L037540J732568
$$ y = [-10603879, -6442474, -6112327, -7385306, -7798529, -7774075, -9189071, -12272770, -14535564, -12188010, -3391260, 8019242, 13295493, 7469039, -2537785, -4138480, 4321279, 9514855, 571942, -15120007, -20737886, -10789560, 4869167, 14906276, 15380846, 6358044, -9813799, -25229597, -30547644, -25431527, -18116327, -13335135, -8593976, -3411987, -2003048, -3365916, 740206, 12172487, 20371455, 17216157, 9439775, 7887537, 11763765, 12895183, 9634104, 6412962, 3819066, -530925, -3815541, -775104, 6087972, 7836016, 964699, -8941498, -15293858, -16072276, -11927597, -5033463, 113520, 162494, -2621878, -3329925, -791202, 2742708, 6097106, 9134646, 10867214]
11373A0867214J055833L382010M380403l014768j4686739j6411232l551379J0765251
11365g213407J3079764N725794p33799k185631j199621l04699j375464n040940
11357G51997o408522N06383J0505562R814015l983628j5788185j3163760j529829
11349a9295967P631369J1651583J1570373M981832n426282q077800Q06243P626958
11341A1468309J159780q747226o445202N029381J0322982N194527k014013o303051
11333I665487q141867m972654M104942R640506L069158p178744o050969M874488
11325E010347R997891L344213n674002q843498o843833j260370O906030J1361643
11317A3998421O606074j194917k396115o3129l204455p459181r01799J2076203
$$ y = [10867214, 11923047, 15305057, 19685460, 16670692, 1983953, -14427279, -17978658, -7213407, 5866357, 11592151, 10858352, 8672721, 7473100, 7168401, 5792937, 751997, -5656525, -5150142, 5355420, 15169435, 11185807, -4602378, -17766138, -19295967, -11664598, -13015, 11557358, 16539190, 11112908, 3035108, 3841351, 11468309, 12628089, 3880863, -2564339, 2465042, 12788024, 17982551, 15968538, 9665487, 1523620, -3449034, 655908, 10296414, 13365572, 6186828, 135859, 5010347, 15008238, 18352451, 12678449, 3834951, -3008882, -4269252, 2636778, 13998421, 20604495, 19409578, 17013463, 16950334, 13745879, 6286698, 5384899, 17461102]
11309A7461102J3093630j397847j3543005j1646610n250076n034429n814379j99039
11301a2330653O364661O585525M854402P082461P411269j408894j2031332j1054864
11293d527425K27332O758463J298976n915404k443797Q857099J3631276N182846
11285B3069366o599657q787783l050130j519915o586958p211098P51000M749218
11277e185957l964297j3145215p772550M914123O857354j354646k860260O672272
11269a5839176J3304903Q611269L29687l195708k562139P69349O463216Q280003
11261A6161404P17124p960573o259155n08836m934496j3538325p451732R576741
11253a4197848J2495465l396164j3140263l932813N436099J004031k344129P308954
$$ y = [17461102, 30554732, 29156885, 15613880, 3967270, -1282806, -6317235, -12131614, -12330653, -5965992, 619533, 5473935, 12556396, 19967665, 18558771, 6527439, -4527425, -4300093, 2458370, 3757346, -2158058, -4601855, 4255244, 17886520, 23069366, 16469709, 7681926, 4631796, 3111881, -3475077, -10686175, -9935175, -5185957, -9150254, -22295469, -30068019, -25153896, -18296542, -19651188, -22511448, -15839176, -2534273, 6076996, 6406683, 3210975, 648836, 1418185, 7881401, 16161404, 16878528, 8917955, 2658800, 2149964, -2784532, -16322857, -23774589, -14197848, -1702383, -5098547, -18238810, -22171623, -16735524, -15731493, -18075622, -10766668]
11245a0766668J3424397J869711r877346k542517R703585M791133p089770k945518
11237c432993R947108P274275p089521p282305Q049280J3112608r9933r571550
11229A0906969k270709N986200l6394j1570816j3588912n944283L268052R231397
11221d018496Q190162j375698j0636081p989727K753487O934631K211815l24737
11213d254644J792324m33081o557926m853836M637236P319331q3082l300410K684180
11204c049908L850028n973964j1532516k540932P733414N615847n79454J792128
11196d685357O847026L165042m861852o867680n160766n915806l701169O901396
11188a4279166J5188932R241327k141867k241768O067141N776960o240956j6383910
$$ y = [-10766668, 2657729, 4527440, -5349906, -7892423, 1811162, 6602295, -487475, -3432993, 6514115, 13788390, 6698869, -583436, 7465844, 20578452, 20478519, 10906969, 8636260, 14622460, 14586066, 3015250, -10573662, -16517945, -13249893, -4018496, 4171666, 2795968, -7840113, -15829840, -13076353, -6141722, -3929907, -4254644, -2462320, -2895401, -9453327, -14307163, -9669927, -2350596, -2433678, -5734088, -3049908, 800120, -5173844, -16706360, -19247292, -11513878, -5898031, -6477485, -4685357, 2161669, 5326711, 464859, -6402821, -11563587, -17479393, -21180562, -14279166, 909766, 10151093, 8009226, 5767458, 11834599, 17611559, 11370603, -5013307]
11180e013307j6469200j0291036o17589J1790277J7868179Q412071o795699p233450
11172h349754Q005194J6539268M723623j3686029j8523830q337288M198091R933967
11164e496758P424489n37181o112078r09555J0949901J3117997j200673j6562261
11156F73881j4762938L51374R802347O290695J80021k08671L08674l426010n520513
11147f311140O31820Q405340N439314p443011j5554492j0056439J188543O904339
11139a6795726P846906J0748255J3210340O749435o323191j1951155m046516N889310
11131E327658N547684j108684k766344N25838m68979o671189q281092j130668
11123i025776N841126L993803k614957m506611q96692P06584l039524o053144
$$ y = [-5013307, -21482507, -31773543, -32391132, -20600855, -2732676, 5679395, -1116304, -8349754, -344560, 16194708, 20918331, 7232302, -11291528, -19628816, -15430725, -5496758, 1927731, 1390550, -4721528, -5631083, 5318818, 18436815, 17236142, 673881, -14089057, -13737683, -3935336, 2355359, 2535380, 2326709, 2635383, -790627, -6311140, -5679320, 2726020, 8165334, 722323, -14832169, -24888608, -23700065, -16795726, -8948820, 1799435, 15009775, 21759210, 15436019, 3484864, -561652, 5327658, 10875342, 9766658, 7000314, 7526152, 7057173, 385984, -7895108, -9025776, -3184650, 809153, -1805804, -6312415, -7209107, -6502523, -9542047, -15595191]
11115a5595191j682405P258317J0956562M738955m525415o627613q86360L550932
11107b812218P94245l662297j500654N717981Q239004J619334o901814p246415
11099e752834J403407R718216Q837198L69510n588241k803656L300858L410410
11091A2894868k361342n028772o21879M053321K478215j979243k712425j86212
11083F536531Q66736J90138J013276L040237K835051l32756l993881o108709n460911
11074a414288j418960L170150L170161r45002k154100J631125K939954j734801
11066C244239l145161N548817J3737411P747259o137441r637526k20356O502073
11058A7639315J643209o934800j0934652j0984766p044671L080245J1476407M749635
$$ y = [-15595191, -17277596, -10019279, 937283, 5676238, 1150823, -5476790, -6363150, -2812218, -2017973, -5680270, -7180924, -1462943, 6776061, 8395395, 1493581, -5752834, -4349427, 5368789, 14205987, 14575497, 8987256, 6183600, 9484458, 12894868, 10533526, 5504754, 4882875, 8936196, 11414411, 9435168, 6722743, 6536531, 7403267, 7593405, 8606681, 11646918, 14481969, 14149213, 10155332, 4046623, -1414288, -2833248, 336902, 3507063, 2562061, 407961, 2039086, 4979040, 3244239, 99078, 5647895, 19385306, 27132565, 20995124, 11357598, 11137242, 17639315, 19282524, 12347724, 1413072, -9571694, -16616365, -13536120, -2059713, 2689922]
11050B689922j2424672j7016714m98035J6107704J2561958k079018o808108J36571
11042g330392N470501M931923L946046K013838m671444r955390m723313O049520
11034d268711R292022L911445m21797j116955l215623n132180r88617M581624
11026B641208J648006n779584m295685M654562N213170n021146q618253K945264
11018f612458J4086611R594600k758941p188131l594508k109492m405193m491687
11010g479199j101636K584295N804381P346567K599854p469731j2157870n724627
11002a5597966J802650k98215n596659j225755R837955J2667567L801191m443875
10994I46893l382244J968711M395667L924576K079145k787464r363912j0869188
$$ y = [2689922, -9734750, -26751464, -27249499, -11141795, 1420163, -658855, -7466963, -7330392, -1859891, 3072032, 7018078, 9031916, 4360472, -5594918, -10318231, -4268711, 5023311, 8934756, 8512959, 7396004, 4180381, -951799, -1940416, 2641208, 4289214, -1490370, -5786055, -1131493, 4081677, -939469, -9557722, -6612458, 7474153, 17068753, 14309812, 7121681, 3527173, 1417681, -2987512, -7479199, -8580835, -5996540, -192159, 7154408, 9754262, 2284531, -9873339, -15597966, -13795316, -14093531, -19690190, -20915945, -11077990, 1589577, 5390768, 946893, -2435351, -466640, 3929027, 7853603, 9932748, 7145284, -2218628, -13087816]
10986a3087816m397649L050948L288239k267384n365938k088568L177190M433639
10978a3257339J442785j006199m2806J459827n21424m731716o266772l701540
10970b6625184j27455K644276N395224O629425L244585k004232j131578P274179
10962d700760J3727746J0043747k8001o993084o953476k606338J456167R27067
10954D873068m495118p243984k06582R244840N967780q194543j2478409J258356
10946a1274592J2846017M303971j0930631r744626L631305P729939J708203L940932
10938B210518J5517408J5761570j018595j2891612n059158P303635N058117o585224
10930B0296659j1950372j0303483r770200q779262j841320M999345K160084n358169
$$ y = [-13087816, -17485465, -14434517, -11146278, -13413662, -18779600, -20868168, -17690978, -13257339, -11814554, -12820753, -12863559, -11403732, -11925156, -16656872, -22923644, -26625184, -26752639, -24108363, -18713139, -12083714, -8839129, -10843361, -11974939, -4700760, 9026986, 19070733, 19042732, 12049648, 5096172, 2489834, 3946001, 4873068, 377950, -6866034, -7072616, 2172224, 8140004, -54539, -12532948, -11274592, 1571425, 5875396, -5055235, -14799861, -11168556, -3438617, -1730414, 2210518, 17727926, 33489496, 32470901, 19579289, 14520131, 21823766, 26881883, 20296659, 8346287, -1957196, -11727396, -20506658, -22347978, -17348633, -15188549, -20546718]
10922b0546718m033505O585830J2820453P176708k566581o344886m279215k801360
10914a3989274m155520l537362M117854J5292939J8250070O699105q607003j0342578
10906C728231K301624J1239258M327477q148600r574114m89500M718068n94345
10898G508099q066749p708488j10347O150025M830289j681930n531402l017637
10890g628140J024053J498285J620890N998014R243436L073777p169430p566609
10882I4276J947686O427422P21975k490564L486506O484719k030431r736099m562401
10873C43089K917023k465381j2807719r596838M636699J0316186K619908l216347
10865g253380J547670P882155P159398K791148l51684k783309k818023L458698
$$ y = [-20546718, -24580223, -17994393, -5173940, 2002768, -563813, -6908699, -11187914, -13989274, -18144794, -21682156, -17564302, -2271363, 15978707, 22677812, 14070809, 3728231, 6029855, 17269113, 21596590, 13447990, 3873876, 3384376, 8102444, 7508099, -558650, -8267138, -8377485, -2227460, 2602829, 920899, -4610503, -7628140, -6604087, -5105802, -3484912, 2513102, 11756538, 14830315, 7660885, 94276, 2041962, 8469384, 9191359, 6700795, 10187301, 16672020, 14641589, 4905490, 343089, 3260112, 794731, -12012988, -21609826, -16973127, -6656941, -4037033, -7253380, -5705710, 2176445, 9335843, 12126991, 11775307, 8991998, 6173975, 9632673]
10857I632673J0711030P101122o451665j3487579n194389N952063M163385p846926
10849D579714j4441324q171825L389063R023276N709591k95184j231495L406074
10841A967890O569377L188777l317108p161955p984965p304641k961596N156642
10833a1847579R441229M423785k482262j137191M896865M653763j542630m252978
10825B153002k878838m792368p526008n33945J3011150J5706975L149082p240404
10817A1048646l726814J388039o187070j7791411j5290532R14691J4050803J5101158
10809d92490R675573M288838l87071l521304k959957p62648j444980m489216n314396
10800e407651k963074o15648M69875J612904K355027J002801j162207r37176K019807
$$ y = [9632673, 20343703, 27444825, 20993160, 7505581, 2311192, 8263255, 12426640, 4579714, -9861610, -18033435, -14644372, -5621096, 88495, -206689, -1438184, 1967890, 8537267, 11726044, 8408936, 1246981, -6737984, -14042625, -17004221, -11847579, -2406350, 2017435, -464827, -1602018, 3294847, 7948610, 6405980, 2153002, -725836, -5518204, -13044212, -13578157, -567007, 15139968, 18289050, 11048646, 7321832, 8709871, 2522801, -15268610, -30559142, -29644451, -15593648, -492490, 9183083, 13471921, 13084850, 9563546, 6603589, 5840941, 4395961, -93255, -5407651, -8370725, -8986373, -8516498, -6903594, -4548567, -3545766, -4707973, -5645149, -3625342]
10791c625342M805375M561826J60140o534711r380100l082938P282308Q434263
10783B620821l889112j6209761j3521650Q90680J0975597R565260M007225J644012
10775c916928J071319k19903J72757L251948M094136o72099o333715o582551k347768
10766a1482804J294860L409018O131117P765589M215298k831609o111961k846223
10758d56715J483853J759379n46353l105057p590413j2747537r637994O259639
10750b4581198K2532801K1728786N150215p766398n679509K061883L480063R68354
10742A7894997J650339K792688j042508m857338o86571O969391O376477l316940
10734B5780535j1150366j0399775m922543j09457K671936K726429j59434k701550
$$ y = [-3625342, 1180033, 5741859, 5901999, -632712, -10012812, -13095750, -5813442, 2620821, -1268291, -17478052, -30999702, -30109022, -19133425, -9568165, -5560940, -3916928, -2845609, -3065512, -2892755, 359193, 4453329, 3781230, -2552485, -9135036, -11482804, -10187944, -6778926, -647809, 7117780, 11333078, 8501469, 2389508, -456715, 1027138, 2786517, 2240164, -864893, -8455306, -21202843, -30840837, -24581198, -2048397, 19680389, 24830604, 17064206, 11384697, 13446580, 16926643, 17894997, 19545336, 22338024, 21295516, 16438178, 15751607, 22720998, 29097475, 25780535, 14630169, 4230394, -692149, -801606, 1870330, 4596759, 4437325, 1735775]
10726A735775k124260j451330l756243m898566o09122L986298K716005J180697
10718c220746P656009J5167274R185138p570118j5648497o958481M539483N522916
10710H672978Q25687M64053L073011K222834j233997k982433l732804n509198
10702A800131n690056j681776L763880O939268P426594M758269k008813q310228
10694F997269o380673K172247N246311k542974j0243319n592048P186497J2865522
10686I708832M777908p904407j1205268j049992J2402796J4898803M091352p406254
10678A8313770q498525l594834k888613n152843j985033N205144O489268J6852
10670G905186o217177p913380o514565l77431J0976319J7018300Q314381m518817
$$ y = [1735775, -388485, -1839815, -5596058, -10494624, -11103746, -7117448, -4401443, -3220746, 4435263, 19602537, 28787675, 21217557, 5569060, -1389421, 3150062, 8672978, 9498665, 9962718, 13035729, 15258563, 14024566, 11042133, 7309329, 1800131, -3889925, -5571701, -1807821, 5131447, 12558041, 17316310, 15307497, 6997269, 616596, 2788843, 8035154, 5492180, -4751139, -10343187, -3156690, 9708832, 14486740, 6582333, -4622935, -5672927, 6729869, 21628672, 25720024, 18313770, 9815245, 6220411, 3331798, -1821045, -3806078, 1399066, 7888334, 7905186, 1688009, -6225371, -12739936, -13117367, -2141048, 14877252, 23191633, 18672816]
10662A8672816m138931M342222J865788q676701n146483J1785739J3138386j0466657
10654B1376179k8655712j7211539N843064J2231790M577626L54459j202432p747670
10646a0434235r396663M321983J8619580J3855320j317534n524046m53749j464872
10638H205784m672086L892746J5219013Q077726j1539001j6161454j459120Q199724
10630I763332J027118p782383p808486p924482j1197827n611323R181378J4001123
10622f351550K351046n457638M313226J5294699Q767145o131450j0392520o272694
10614c879736q130360j4036558r528981N694380J5450495J1349933L297056K893448
10606C109677P943069Q220399K69623q348654q531056j116130L585917o90207
$$ y = [18672816, 14533885, 18876107, 20741895, 12065194, 6918711, 18704450, 31842836, 21376179, -7279533, -24491072, -18648008, -6416218, -1838592, -1484133, -2686565, -10434235, -19830898, -15508915, 3110665, 16965985, 15648451, 10124405, 9670656, 8205784, 3533698, 7426444, 22645457, 30723183, 19184182, 3022728, 1563608, 9763332, 10790450, 3008067, -4800419, -12724901, -23922728, -29534051, -20352673, -6351550, -4000504, -9458142, -5144916, 10149783, 18916928, 12785478, 2392958, -3879736, -12010096, -26046654, -35575635, -29881255, -14430760, -3080827, 216229, 3109677, 11052746, 19273145, 19542768, 11194114, 2663058, 1546928, 5132845, 4442638]
10598D442638o918405m477878M858686Q908588K659634m974063m131399L624731
10590C992532R162029O751252j700567r841006j2307523q814658l141480K035092
10582a3864329O180594O586753r5287r234248r723936M21414Q785530N986486
10574d957023p95215n61448M593417O102176L771050K018474o80854n792494n961935
10565b263852L702252J2534651P507738n989274j1500980n174196K232663L067805
10557D116807q52203n661419p278414r81616R978774J2942128M031926k751169
10549A3544814K597709Q210102M75317j1759358j2535243n243727k413660j880122
10541i004168L652946O076727l537937j2053228l549691J0121419P640690m134818
$$ y = [4442638, -2475767, -6953645, -2094959, 6813629, 9473263, 4499200, 367801, 3992532, 13154561, 19905813, 18205246, 8364240, -3943283, -12757941, -15899421, -13864329, -7683735, -1096982, -1192269, -10426517, -20150453, -19729039, -10943509, -4957023, -5752238, -6313686, -1720269, 4381907, 8152957, 10171431, 9490577, 3698083, -2263852, 1438400, 13973051, 21480789, 15491515, 3990535, -1183661, 1049002, 4116807, 3264604, -2396815, -9675229, -10656845, -678071, 12264057, 16295983, 13544814, 16142523, 24352625, 24827942, 13068584, 533341, -4710386, -7124046, -9004168, -5351222, 725505, -2812432, -14865660, -18415351, -8293932, -653242, -4788060]
10533d788060l081839P538800O196324o511506j0340898k832476J243826K186282
10525a0389547J0524865J6418253L309207j4174638q658550R368256O097357j4584201
10517b088998j6192569M521116J2097030k405429p679368O548420J1782634j858600
10509D724236p102569N364750R154751l553113o504492N630439N985596n902620
10501G796978N25878J8500506N970616k7034914k0629526K1738327K4512010k0247709
10493A1132166k3958982L2109397M0537964l0119465k7957947J37575290K76292885
10486D15611308J51301421j44655764k82121882j48508281K7070095L8729985
10480E7426882l6189597l7142867J8776097K2349409k0056808k3993155J0048422
$$ y = [-4788060, -7869899, -331099, 5865225, -646281, -10987179, -13819655, -12575829, -10389547, 135318, 16553571, 19862778, 5688140, -2970410, 6397846, 12495203, -2088998, -18281567, -13760451, -1663421, -4068850, -11748218, -5199798, 6582836, 4724236, -2378333, 2986417, 12141168, 8588055, 2083563, 7714002, 13699598, 7796978, 8322856, 26823362, 32793978, 5759064, -14870462, 6867865, 31379875, 11132166, -12826816, 19282581, 59820545, 29701080, 1743133, 139318423, 415611308, 566912729, 422256965, 140135083, -8373198, 18696897, 57426882, 21237285, -15905582, 2870515, 25219924, 5163116, -18830039, -8781617]
10473h781617J5383139q313066o263813J9008758J6373022j2749371j9067255
10466d410203J383835N983480j0260638r546519J2107882J6902885l187285j3344389
10458d370952r86590N590997o850360j4565093k777154J0914080J0877768M562174
10450B394870N51533l246169m774908J020620O032405M0381p016663q99220Q095704
10441B198553K825642n537739M365379K1248654J6465371n136176j2358759k136352
10433B1934573k022953j6755420j8224718K794994J8066582Q786028o862892q709637
10425i93443l486843k381053j0984P268172Q630570K59923m227268J377908L826829
10416A0263811m076696r297822k860647M513624M005783L429881P462088N991456
$$ y = [-8781617, 6601522, -1711544, -7975357, 11033401, 27406423, 14657052, -4410203, -3026368, 2957112, -7303526, -16850045, -4742163, 12160722, 8973437, -4370952, -5357542, 233455, -6616905, -21181998, -23959152, -13045072, -2167304, 2394870, 2946403, -299766, -5074674, -4054054, 1978351, 2018732, -4997931, -5897151, 2198553, 5024195, -513544, 3851835, 25100489, 41565860, 36429684, 24070925, 21934573, 19911620, 3156200, -15068518, -12273524, 5793058, 14579086, 7716194, -993443, -4480286, -6861339, -6872323, 395849, 9026419, 9286342, 5059074, 6436982, 10263811, 6187115, -3110707, -5971354, -1457730, 2548053, 5977934, 13440022, 19431478]
10408A9431478m025354q031267j47719L047616q116355j5992905m431900J2475805
10400e790601J2500513r26597r257410q560030o494884k319440P435155J3597590
10392A84296O909181k506433P8533P417897J473396j4061735j6800367q42135
10384a8147367J4043702J2387474K532660n95961L489646N602867J805859m544832
10376A6574048r219463r912395o544924j614711K402223N624808P640197M982673
10368I932456k695767p588861k683356O712977Q973383K234729m465770n438342
10360D981449m027210l190140l94507M824059O879605K473798l704171o282013
10352A560870o417782o878320n479902M06066O998978Q669921O676919O120031
$$ y = [19431478, 15406124, 7374857, 7227138, 10274754, 2158399, -13834506, -18266406, -5790601, 6709912, 5783315, -3474095, -12034125, -18529009, -20848449, -13413294, 184296, 7093477, 4587044, 4665577, 12083474, 13556870, -504865, -17305232, -18147367, -4103665, 8283809, 10816469, 10220508, 13710154, 19313021, 21118880, 16574048, 7354585, -2557810, -9102734, -10717445, -8315222, -2690414, 4949783, 9932456, 7236689, -352172, -3035528, 3677449, 12650832, 14885561, 10419791, 4981449, 954239, -2235901, -2630408, 2193651, 9073256, 11547054, 7842883, 1560870, -4856912, -11735232, -17215134, -16809068, -9810090, -1140169, 5536750, 11656781]
10344A1656781N919695N06920p894155q516202J809199J0500885N310796p712259
10336A1581660j2576347n749868J951962M526920P363925J1826871Q870959l565846
10328B4230236j0808693j976297J0608090Q302544n256053j0575809l273957J545775
10320A2795836l252580n697045K278429R205571L150504p556203o852123M457410
10312H529799J0637910L446127r041977j4420864q214867M397218J2598625Q031905
10304A5963876n326484j2672648n601005O443572Q940367J905000k532345Q03607
10296G923940M354411J504176m054097n806859l694866j897799k613193n492413
10288i776700r062722r731932l372953Q579360J7599528J6382675P116941j550304
$$ y = [11656781, 17576476, 18083396, 10189241, 1673039, 3482238, 13983123, 19293919, 11581660, -994687, -6744555, -4792593, -265673, 7098252, 18925123, 27796082, 24230236, 13421543, 11445246, 22053336, 30355880, 25099827, 14524018, 11250061, 12795836, 9543256, 3846211, 6124640, 15330211, 18480715, 10924512, 4072389, 8529799, 19167709, 22613836, 13571859, -849005, -9063872, -4666654, 7931971, 15963876, 10637392, -2035256, -7636261, -1192689, 7747678, 9652678, 7120333, 7923940, 12278351, 13782527, 9728430, 3921571, 226705, -1671094, -4284287, -9776700, -18839422, -28571354, -31944307, -23364947, -5765419, 10617256, 17734197, 16183893]
10280A6183893m601629m630343o072525q659483q250962k779513M711477R287992
10272d811093R014275N667857J695101j613549l137385j680850J804570L331471
10264A0270397n01841p861653j2236713q828394j23483O261611O120099L484482
10256c415495M453718P497114N091535l719410r095119l963721L987790K685986
10248C522398n304673n739359M639573J1267079L444138q608622q743559J107267
10240d415758N166113j570249p414203l973383J684400O05650l617923k927513
10232a6462866Q38482N50978k068715J043052Q921687J0950834L894173j830871
10224E836754J685279P211841M005474n285558r174494m372739J804878L820388
$$ y = [16183893, 11582264, 6951921, 879396, -7780087, -16031049, -18810562, -14099085, -4811093, 4203182, 9871039, 11566140, 9952591, 6815206, 5134356, 6938926, 10270397, 9768556, 1906903, -10329810, -19158204, -19281687, -13020076, -6899977, -3415495, 1038223, 8535337, 13626872, 9907462, 812343, -3151378, 836412, 3522398, -1782275, -7521634, -2882061, 8385018, 11829156, 3220534, -5523025, -4415758, 750355, -819894, -8234097, -12207480, -10523080, -9917430, -13535353, -16462866, -15624384, -15073406, -17142121, -16099069, -7177382, 3773452, 7667625, 5836754, 7522033, 14733874, 18739348, 13453790, 4279296, -93443, 1711435, 5531823]
10216E531823K840395L9503n242969r807149q134721j434696K915230K413480
10208a0879104J607722K073308l0436m065831l121092L960489Q998976P327114
10200E871146L645441O55764n526361j2510934q864818O112708J4646398N501663
10192I531007p334945o621964J342861J222339k870483K549974J1154065N556161
10184A4529015r024751r548551N532483J2064069J196494n863040M020607J1845159
10176B4751485j157069k0861892k2073613n660661Q204350J0933393Q464725L501043
10168F101761m445268q296739j782256O421031L632507o632807j0913328o815058
10160b2730157k185418J108336O079465Q140836R94898q256736o828120L305641
$$ y = [5531823, 8372218, 8411721, 3168752, -6638397, -14773118, -16207814, -13292584, -10879104, -9271382, -7198074, -7228510, -11294341, -14415433, -10454944, -1455968, 5871146, 9516587, 10172351, 4645990, -7864944, -16729762, -10617054, 4029344, 9531007, 2196062, -4425902, -3083041, -1860702, -4731185, -2181211, 8972854, 14529015, 5504264, -4044287, 1488196, 13552265, 14748759, 8885719, 12906326, 24751485, 23594416, 2732524, -19341089, -25001750, -16797400, -5864007, 2600718, 6101761, 1656493, -6640246, -8422502, -2001471, 1631036, -5001771, -15915099, -22730157, -24915575, -23807239, -17727774, -9586938, -8592040, -16848776, -23676896, -20371255]
10152b0371255R088418P900599Q026942R655973M470869n398047p302852J88573
10144F259220L807211j859770n959486j295036M188729L185102P48997J776822
10136A0851789R70427n212881r098545m269525L092293M795240K991902L041873
10128G162573L309121J143195L67574L614034N136394L25550n110832m476956
10120A1470653j335204k130722m352962j868325L503914N235331K357418j751888
10112A1128215n922301q878950o390725R07676L400937m192921j1868099p696323
10104b9512491L723412Q613644M987106K276933L077183Q07937m391656l440843
10096a3858775M367306O765361j700238q062479N09720J5424979J6400756q38197
$$ y = [-20371255, -11282837, -3382238, 4644704, 14300677, 18771546, 13373499, 6070647, 6259220, 10066431, 8206661, 2247175, 952139, 5140868, 8325970, 9074967, 10851789, 11822216, 6609335, -2489210, -6758735, -3666442, 1128798, 4120700, 7162573, 10471694, 11614889, 11982463, 15596497, 20732891, 21058441, 15947609, 11470653, 10135449, 8004727, 3651765, 1783440, 5287354, 10522685, 12880103, 11128215, 5205914, -3673036, -10063761, -9156085, -5755148, -9948069, -21816168, -29512491, -25789079, -17175435, -12188329, -9911396, -6834213, -6026276, -10417932, -13858775, -9491469, -2726108, -4426346, -12488825, -11979105, 3445874, 19846630, 19008433]
10088A9008433j8193953j8078281l919569P090710O527789K396519M253995Q884654
10080G970297P104046k47244l494547p94018j445518q446622j0434444k97032
10072a0085082R426882L819924r489136j0172501K980499R488881o33983j1094451
10064a5758967m870409R922611J3352101K914684n777695l292240L057716L533461
10056C081262q41087l380762k360138j435341l038439n358253n082371j415997
10048a9831126K640699L281408N50937j358262L97714L441159L911393K226706
10040d739372J891199L380265K977912j368161n986748n542873p3597M413822
10032e047553L215875o34269L88808P988658J3702520Q127813o334721j6124471
$$ y = [19008433, 814480, -17263801, -21183370, -14092660, -7564871, -5168352, -914357, 7970297, 15074343, 14827099, 11332552, 10538534, 9093016, 646394, -9788050, -10085082, -658200, 3161724, -6327412, -16499913, -13519414, -4030533, -4664516, -15758967, -20629376, -10706765, 2645336, 5560020, -217675, -3509915, -452199, 3081262, 2240175, -1140587, -3500725, -4936066, -7974505, -13332758, -18415129, -19831126, -17190427, -13909019, -13358082, -14716344, -14318630, -10877471, -6966078, -4739372, -2848173, 532092, 3510004, 2141843, -3844905, -9387778, -9461375, -5047553, -1831678, -2465947, -2077139, 5911519, 19614039, 27741852, 21407131, 5282660]
10024E282660j1441366K590731J2108659R630900n232p445247q692533o393242
10016d364670m270933k936404r39224J978369M101424M161394L280791L333687
10008D344434L808581K070159k513966o283285n047618K52882L856047J928006
10000B415240k914568n394873m043066j147583K195007O410860Q932526N523423
9992A1976966j405442k613990M294589P637878k602127j6562899j5154722J593355
9984a2836392J1991357L448387r004081n492211R263989J4351251L887234p000644
9976H608890o559149p81195O78922l18393K844853Q349978Q621847K319587l933430
9967A9831910m883425k298152o62221q26526p1049K560709L753469P20800l352136
$$ y = [5282660, -6158706, -3567975, 8540684, 18171584, 18166352, 10721105, 2028572, -4364670, -8635603, -11572007, -12511231, -10532862, -6431438, -2270044, 1010747, 4344434, 8153015, 10223174, 7709208, 1425923, -3621695, -3368813, 487234, 2415240, -499328, -5894201, -9937267, -11084850, -8889843, -2478983, 6453543, 11976966, 10571524, 7957534, 12252123, 19890001, 17287874, 724975, -14429747, -12836392, -845035, 2603352, -6400729, -11892940, -2628951, 11722300, 15609534, 8608890, 2049741, 1268546, 1947468, 1629075, 4473928, 12823906, 21445753, 23765340, 19831910, 14948485, 12650333, 11988112, 11161586, 11090537, 13651246, 17404715, 18125515, 14773379]
9958A4773379k898395J407865L343369J307211L92359J706529j026455q492677
9950A0513185r757408R63342J0925742N850110o834638q239452K525157P826283
9942A3772321N00979o152117k171472L494642J09073p098111p176837k57608O372506
9933A393376R968480J0539535N522405m395023j1101344r223177m024946j969717
9925c290411j087475J518234J266553m909139q861222k079330R081879J0836189
9917B475278J853649n174953j476740P122959R060614J332232p236326o437571
9909A519142J961293N209471k225501q399023j603001R469933R331008K360243
9901A7623565L330292O790077l515290j6090488k519241K6141948K2702962j5517120
$$ y = [14773379, 11874984, 13282849, 16626218, 17933429, 18325788, 20032317, 19005862, 10513185, 755777, 1719119, 12644861, 18494971, 11660333, 3420881, 5946038, 13772321, 14273300, 8121183, 5949711, 9444353, 9553426, 2455315, -4721522, -4979130, 1393376, 11361856, 21901391, 27423796, 23028773, 11927429, 2704252, -1320694, -3290411, -4377886, -2859652, -1593099, -6502238, -15363460, -17442790, -8360911, 2475278, 4328927, -846026, -2322766, 4800193, 13860807, 15193039, 7956713, 1519142, 3480435, 8689906, 6464405, -1934618, -3537619, 5932314, 15263322, 17623565, 20953857, 27743934, 24228644, 8138156, 5618915, 31760863, 54463825, 38946705]
9893C8946705k4700194K4997041O0528906M630489r3555517j11544009k6342246
9886a27038825N4779641M9513684P80472j3531728N299862R542858m115477l397089
9878b8166602J1714089J3073336K39943k302519N555992J996602j0532033p840586
9870a6261778Q655565J1176527m947279j2782446j792771N136155n613335j4741804
9862c1171166n376922Q765881R556799L458121M361424P879404L205103m769128
9854d090484m702727P62631J208689k696881j920353M134166O466084N16519p292771
9845g615127p088617L521313J4835550J3026572k497049j4050287p131723Q245981
9837A246613J1143124n0867q675883q253647p897577q472145J214550J7726946
$$ y = [38946705, 14246511, 39243552, 99772458, 104402947, 10847430, -100696579, -127038825, -72259184, -22745500, -21965028, -35496756, -30196894, -20654036, -24769513, -28166602, -16452513, -3379177, -3139234, -5441753, 114239, 2110841, -8421192, -16261778, -7606213, 3570314, -1376965, -14159411, -15952182, -10816027, -16429362, -31171166, -36548088, -27782207, -18225408, -14767287, -10405863, -2526459, 678644, -4090484, -8793211, -8030580, -6821891, -9518772, -11439125, -7304959, -838875, -322356, -7615127, -14703744, -11182431, 3653119, 16679691, 14182642, 132355, -6999368, 1246613, 12389737, 12338870, 3662987, -4590660, -12488237, -20960382, -19745832, -2018886]
9829b018886J8715873j889350j8609872j1440663L847340L529363n394101o00346
9821a3860642J4922352J6807842j025887j7281482j4950712p04493J0264293J1532665
9813E703936M678122m476200o694451J615504J0087340O653111l937878p024551
9805F604933r57330K251095j863585m927375k769078j297969k534667o37961M275352
9796a856585L984190j387138p46023P602973R105783m031917j7561504j4988557
9788a9878778j172361O709880L165612l253638n281690k725072K817002Q605271
9780a1013774R234685L072156k932929k259931J369857N93097l645435m857760
9772a0440034j859838J345980L309651M968931M787596J439276j764584j917259
$$ y = [-2018886, 16696987, 14807637, -3802235, -15242898, -11395558, -7866195, -13260296, -13860642, 1061710, 17869552, 16843665, -437817, -15388529, -16093022, -5828729, 5703936, 10382058, 5905858, -788593, 826911, 10914251, 17567362, 13629484, 6604933, 5647603, 7898698, 6035113, 1107738, -1661340, -2959309, -5493976, -6131937, -1856585, 2127605, 740467, -5556, 7597417, 16703200, 12671283, -4890221, -19878778, -21051139, -14341259, -11175647, -14429285, -19710975, -22436047, -19619045, -11013774, -1779089, 1293067, -1639862, -3899793, -2529936, -1936839, -5582274, -10440034, -12299872, -10953892, -7644241, -2675310, 2112286, 3551562, 1786978, -130281]
9764a30281j867913l598006k052962N465715J0062478L116083p761317q394681
9756e160884j00824L592715O78221K957570J2056758J2270456m287664k1645834
9748C60514k0933752n302863Q384923J2818544J2018296P886921k76127p113975
9740G842481o021485q94759r42030n160167m143704L189101P544929N293133L607693
9731A0315192N958626N056508l335647j0560330p624833R46022N219504M939439
9723A0914481O061553P366518K523406o423971r550178l941494K531067M418948
9715A3900330N095242O268407K390226p278723j1339923j900154R981932P898053
9707B5015390n227787j1454809o017142l684637j2178192j7004730m636112J3193294
$$ y = [-130281, -1998194, -5596200, -7649162, -2183447, 7879031, 10995114, 3233797, -5160884, -5261708, -1668993, -990772, 1966798, 14023556, 26294012, 22006348, 360514, -20573238, -25876101, -17491178, -4672634, 7345662, 15232583, 14956456, 7842481, 1820996, 926237, -15793, -5175960, -9319664, -6130563, 1414366, 6707499, 10315192, 16273818, 21330326, 17994679, 7434349, -190484, 755538, 5975042, 10914481, 16976034, 24342552, 26865958, 20441987, 10891809, 6950315, 9481382, 13900330, 18995572, 25263979, 27654205, 20375482, 9035559, 7135405, 17117337, 25015390, 19787603, 8332794, 2315652, -1368985, -13547177, -30551907, -35188019, -21994725]
9699b1994725J5050838J461445p284343j893406N802486N032362Q84896R65542
9691a974905K070826j010631m659764l775145j261355j301542p91214L681564
9683i022166P297659M595881o50634k359337k799542o349705q483472k514976
9675b0286292O964591R472659M667753J063325Q46563j402498n551799m489876
9667h715574K753649Q256339P645668M538896J063468m452246q205300k163928
9659G20972J0959306J6345330P222851m451781n085258K225550N067477j21155
9651C2883292o384494p922666n474671k740208k769372n587019o845200k619339
9643g459677L556510M416881J26271k405159j760471k843096m100630K320416
$$ y = [-21994725, -6943887, -5482442, -12766785, -14660191, -8857705, -3825343, -2940447, -1974905, 95921, -914710, -5574474, -9349619, -10610974, -11912516, -12703730, -9022166, -1724507, 2871374, 2220740, -138597, -2938139, -9287844, -17771316, -20286292, -13321701, -3849042, 818711, 1882036, 2728599, 1326101, -4225698, -8715574, -5961925, 2294414, 9940082, 14478978, 15542446, 11090200, 2884900, 720972, 11680278, 28025608, 35248459, 30796678, 25711420, 27936970, 33004447, 32883292, 26498798, 18576132, 13101461, 10361253, 7591881, 2004862, -4840338, -7459677, -3903167, 513714, 639985, -1765174, -3525645, -6368741, -10469371, -8148955]
9635h148955J3261713J2895603k937993j5581306r006961O465751J0596297K650688
9627A0194837k512989k44057L16828m579012p544559m170716N93030J884092Q91525
9618e171021Q61510M390994J2264821J8224772J0910059r680730k5037076j9772218
9610a3008889l510049L316200r44789j243612O736868J1038234N347838k388985
9602E342816n839377p700309q061223j851774P892001R838679K223755l630625
9594a786057j825290R88623R78500L297288P504885M017071p204995j1248779
9586e278754j270790Q757631N464207m213855o943128l349811j134232M74599
9578g494133N149541P825334K710047m449212m850424p45262M84962n37607N92932
$$ y = [-8148955, 5112758, 18008361, 15070368, -510938, -9517899, -3052148, 7544149, 10194837, 7681848, 7437791, 7754619, 3175607, -4368952, -8539668, -7946638, -6062546, -5171021, -4309511, 81483, 12346304, 30571076, 41481135, 31800405, 6763329, -13008889, -16518938, -13202738, -14147527, -15391139, -8654271, 2383963, 7731801, 5342816, -496561, -8196870, -16258093, -18109867, -10217866, -379187, 1844568, -1786057, -3611347, -2622724, -1644224, 1653064, 9157949, 13175020, 5970025, -5278754, -6549544, 2208087, 7672294, 3458439, -3484689, -6834500, -7968732, -7494133, -2344592, 5480742, 8190789, 3741577, -1108847, -1854109, -1369147, -1906754, -1313822]
9569a313822J487772j861260n453408l819195k63119l18127j492943L00219J427877
9560a1306006j580243k655917L488892R358454N688240k739760n388009k916128
9552h050477k098401j063473N246100J1307487Q703107K074564J248119L061521
9544B0428547j495693p464937l125580O439900M474878r178563j6398810r481709
9536a5801967q69149l80207k564348j940233j806332j779500M815186J4190438
9528f136112J1509420m405930j4173809n971094O967559Q711497L585974K925036
9520C012541M368777N13753m251774k232364K026378N64601k238786J444756O095452
9511I303334J750787o262359m157849O704069J0292882L93165j0466214r376233
$$ y = [-1313822, 173950, -1687310, -7140718, -10959913, -11223032, -11541159, -13034102, -12733883, -11306006, -12886249, -15542166, -12053274, -2694820, 2993420, 253660, -5134349, -8050477, -10148878, -11212351, -5966251, 5341236, 14044343, 16118907, 17367026, 20428547, 18932854, 11467917, 8342337, 14782237, 19257115, 10078552, -6320258, -15801967, -16671116, -17051323, -19615671, -21555904, -23362236, -25141736, -20326550, -6136112, 5373308, 967378, -13206431, -19177525, -12209966, -3498469, 87505, 3012541, 7381318, 7895071, 3643297, 1410933, 3437311, 4001912, 1763126, 3207882, 9303334, 11054121, 4791762, 633913, 7337982, 17630864, 18024029, 7557815, -1818418]
9503a818418J339677J0221818R988113K364512m583537l620397K924049M369208
9495B1185025l653728j1304650q447964l6043K253845j992264m224975k941415
9487i162169l931095o519332l538351M349672P346721J954902l660420k769711
9479a5929783J501157L973262M567937M515975L331060J996430K028778O15210
9471F600026n173371r485033l316366J0033282J6571758J1067223L070224J00993
9463B9468736k211301p413584q949295k799101J995975l001366j0050649o056205
9455i016790O529373J2476471N318467n206821p546637j364798N097618M608358
9447A0895241k919918r961993p984184K189079R307655N022237n180583r436140
$$ y = [-1818418, -478741, 9743077, 19731190, 22095702, 17512165, 13891768, 16815817, 21185025, 17531297, 6226647, -2221317, -2257360, -3515, -1995779, -6220754, -9162169, -13093264, -19612596, -23150947, -18801275, -11454554, -9499652, -13160072, -15929783, -14428626, -10455364, -5887427, -1371452, 1959608, 3956038, 5984816, 6600026, 1426655, -8058378, -11374744, -1341462, 15230296, 26297519, 29367743, 29468736, 27257435, 19843851, 10894556, 8095455, 10091430, 7090064, -2960585, -9016790, -2487417, 9989054, 15307521, 10100700, 2554063, 1189265, 6286883, 10895241, 7975323, -1986670, -9970854, -7781775, 1525880, 6548117, 1367534, -8068606]
9439h068606m536250K413333M819828K932820N64511L97031J829148R85437m427564
9430c090312q955276m290656O938045J1239953L760865k774892K136595R028425
9422A3992747M218178o297847o695944J298513J876263o292375p691368J691331
9414c900502O969039J747939m60317O812611P586381q315588k1807284j1382661
9406b2750382J1419199J8103790N368366m579438j409217J867618l809713r302410
9398e092187o733431k541908k319472k513P800306J1622093M423899n142096o096098
9389d081407j562299m40918j465185K127298Q264614Q580530J902092m987700
9381H337025p678530o831561l281839J657617L727747J092092p76231K887950
$$ y = [-8068606, -12604856, -10191523, -5371695, -2438875, -1874364, -1477333, 351815, 1337252, -3090312, -12045588, -16336244, -9398199, 1841754, 5602619, 2827727, 4964322, 13992747, 18210925, 11913078, 5217134, 6515647, 8391910, 2099535, -5591833, -3900502, 3068537, 4816476, 4356159, 11168770, 18755151, 10439563, -11367721, -22750382, -11331183, 6772607, 12140973, 7561535, 6152318, 8019936, 4210223, -5092187, -11825618, -14367526, -16686998, -16689511, -8889205, 2732888, 7156787, 2014691, -4081407, -5643706, -6084624, -7549809, -5422511, 2842103, 11422633, 13324725, 8337025, 658495, -6173066, -9454905, -7797288, -4069541, -2977449, -3753680, -865730]
9373h65730O738549K728388n959673q568883l380246o2397m011092q300873n099051
9364b6781008K845232P354299O109896L378544K333071J479598j516742n171166
9356i968276m720800J956279R478133R292388P47299o163202l270692M247938
9348A599067N034073k289985q061398o352223k103480j033522o04763L524256
9340a0287975P972893N959319j233846m510428K62916N594993K274432p304718
9332a272414j1270333l990710O088133Q082891L488420K456838P579878J0543684
9324B1706387O083850l07870k635409l275375n539830n969330k007340O52612
9316H707695k026594l089237K909258N855018n364034j9414661j3694325J0582836
$$ y = [-865730, 5872819, 8601207, 2641534, -5927349, -9307595, -9369992, -13381084, -21681957, -26781008, -23935776, -16581477, -10471581, -7093037, -4759966, -3280368, -4797110, -9968276, -14689076, -12732797, -3254664, 6037724, 6785023, 621821, -2648871, 1599067, 6633140, 4343155, -3718243, -10070466, -12173946, -13207468, -13812231, -10287975, -2315082, 3644237, 2410391, -2100037, -1837121, 3757872, 6032304, -1272414, -12542747, -16533457, -10445324, -2362433, 1125987, 3582825, 11162703, 21706387, 27790237, 27482367, 24846958, 21571583, 16031753, 10062423, 8055083, 8707695, 6681101, 3591864, 6501122, 12356140, 6992106, -12422555, -26116880, -15534044]
9308a5534044K5347843J3948122o560280j1760899k101614N011268K694263j659722
9300I384937k306337j5258M232306P937252M160354q134942j5954295p739372
9292h435355P378699J0536518O23570n470064m4840N372474J305577m826828l348747
9283C091004J549821P58912m417611o676244n487391m889457l465660K903952
9275a6632674J0752271J1222730K538493p037740r240773l591039M475814Q580308
9267A067390N347194k134876n978648k846039O92074k395954p611447m544298
9259a8404604O190579J1270697K916585r601127j2230000l722230N690422Q932107
9251h957571P764845N654916K884399K9917j46496K510044L292069q73263n523519
$$ y = [-15534044, 9813799, 23761921, 17201641, 5440742, 3339128, 8350396, 11044659, 9384937, 7078600, 7063342, 11295648, 19232900, 23393254, 15258312, -695983, -8435355, -1056656, 9479862, 10103432, 4633368, 4588528, 9961002, 11266579, 6439751, 3091004, 4640825, 5399737, 982126, -5694118, -11181509, -16070966, -19536626, -16632674, -5880403, 5342327, 7880820, 843080, -8397693, -11988732, -7512918, 1067390, 6414584, 4279708, -1698940, -4544979, -3852905, -6248859, -13860306, -18404604, -12214025, -943328, 1973257, -7627870, -19857870, -23580100, -17889678, -8957571, -1192726, 4462190, 7346589, 7376506, 7230010, 9740054, 13032123, 12158860, 6635341]
9242F635341l875714L136405P007897K893566l902125n799758l596395l721971
9234a222754o381996l990687N973760J3629701Q772556l828677r554183l320131
9226G7589M919782N637223J780488O44868J491495r32954n373877n592506j188891
9217A463217J637132L79890o65465P08856K52817m519406q113643m465167L583692
9208i738077P951603O066591K229568p46440n034599j1194482j3242521n099448
9200b8807805R409668J7894297J2715867m4454q103624p318183l697948k071418
9192a0023600l4119M242395N856211J229578l486532o48247N870799N703654j555778
9183G154361n554478j623607K561752j92889o507035r216182o137113J579896
$$ y = [6635341, 2759627, 5896032, 12903929, 15797495, 11895370, 6095612, 2499217, -1222754, -7604750, -11595437, -5621677, 8008024, 16780580, 12951903, 3397720, 77589, 4997371, 10634594, 12415082, 13059950, 14551445, 13618491, 8244614, 2652108, 1463217, 3100349, 3480239, 2814774, 3523630, 3776447, -742959, -8856602, -13321769, -9738077, -1786474, 4280117, 6509685, 5763245, 728646, -10465836, -23708357, -28807805, -19398137, -1503840, 11212027, 11167573, 3063949, -4254234, -7952182, -10023600, -10057719, -5815324, 40887, 1270465, -2216067, -2864314, 3006485, 8710139, 7154361, 1599883, -23724, 2538028, 2345139, -4161896, -13378078, -19515191, -17935295]
9175a7935295J1404896J6104699Q254781o802252j2855922m420145M359950J078160
9167h11128o017592k658487P834287J0887225L928347k984102n640159q088743
9159c550352q770588j718728Q008108P638133j802406m591682M145278R378148
9151H735911P18246j0376955r327689l60792L964124L736110O382910Q479521
9143A1951386N79785j2771851j5118480k246614J0046099P494069m259350r809399
9135a4134355m893338J324429J637441Q4560M000139J1924905J4281156N825922
9127B0050859o709608j2122911p624845n55131J829234J44376p2536M125781R499468
9118H564687R108237m28160j2466531j4700070l941163P851192Q564591K118988
$$ y = [-17935295, -6530399, 9574300, 17829081, 11026829, -1829093, -6249238, -1889288, -811128, -6828720, -9487207, -1652920, 9234305, 13162652, 10178550, 4538391, -3550352, -12320940, -14039668, -6031560, 1606573, -195833, -4787515, -642237, 8735911, 9454157, -922798, -10250487, -10611279, -6647155, -2911045, 3471865, 11951386, 12531171, -240680, -15359160, -17605774, -7559675, -65606, -4324956, -14134355, -19027693, -17703264, -16065823, -15981263, -11981124, -56219, 14224937, 20050859, 13341251, 1218340, -6406505, -6961636, -5132402, -4988026, -5060562, -934781, 8564687, 17672924, 17244764, 4778233, -9921837, -13863000, -6011808, 2552783, 4671771]
9110D671771N79027M615838M619006p14497k162667K187632K824240l150354o020869
9101G449127k210647k267361j0291977j2384173M76187J3670555J0624070j61031
9093D904750m46571O169982K234356j0430233j2229886M4912P135076K41361n099910
9084g476163K309985R561106K754926q673845p942306K168906O222106J033387
9076d1898l494812l064860k503917k955067L07173P208737J1256842R183012L619465
9067A9514675l021501r151715j0416041m723488P66044k200469q808086o550873
9059b4591454M642831J0352817L417198m892955k740578M247236L564892l247876
9051i247889l492469N576823J1693413N810364n211292r202647m526457R02025
$$ y = [4671771, 5250798, 9866636, 14485642, 13771145, 11608478, 13796110, 16620350, 13469996, 7449127, 5238480, 2971119, -7320858, -19705031, -19228844, -5558289, 5065781, 4904750, 4458179, 10628161, 12862517, 2432284, -9797602, -9752690, -2617614, -2376253, -7476163, -5166178, 4394928, 7149854, -1523991, -9466297, -7297391, -1075285, -41898, -3536710, -6601570, -9105487, -12060554, -11753381, -4544644, 6712198, 15895210, 19514675, 16493174, 7341459, -3074582, -7798070, -7032026, -9232495, -18040581, -24591454, -19948623, -9595806, -6178608, -11071563, -13812141, -9564905, -6000013, -9247889, -12740358, -7163535, 4529878, 10340242, 5128950, -4073697, -8600154, -7698129]
9043g698129J703973m53815k227324k320934m1637M754274R139261Q407127J787076
9034A3049872n504757p618435m021546R97330L428086L038782K582477M182352
9026A0134161O205141M348434k915886j0925793j3244673r162298l935148j404274
9018b0900336J12928L258315O512683O592664L986615K771330M983494P466357
9010A4784050N479962r58463n700907l310058K885804L281109n280851j3609200
9002b428554j1821006l042925J759834j2936r99456K125212M099725K660213L093174
8993d566719O504262N212601k847396o616002R19980Q527531L119597q022374
8985B231480p725244L307405P385017j894475j0337872o149021L859818Q083551
$$ y = [-7698129, -5994156, -6447971, -8675295, -10996229, -11037866, -6283592, 2855669, 11262796, 13049872, 7545115, -73320, -4094866, -3097536, 330550, 3369332, 5951809, 10134161, 16339302, 20687736, 17771850, 6846057, -6398616, -15560914, -19496062, -20900336, -20787408, -17529093, -11016410, -4423746, -437131, 2334199, 7317693, 14784050, 20264012, 19305549, 13604642, 10294584, 13180388, 16461497, 11180646, -2428554, -14249560, -17292485, -15532651, -15545587, -16545043, -14419831, -10320106, -7659893, -4566719, 1937543, 7150144, 4302748, -2313254, -1393274, 7134257, 10253854, 2231480, -5493764, -2186359, 5198658, 3304183, -7033689, -13182710, -9322892, -1239341]
8977a239341O627944N043230K424262l885629r241778p609721k054156o01330
8969a0536519m385751o949916l518778M248380J1001972J1729441N735602r63071
8961F361360j252488L131336L291843k547831m688731K674104J0224222O196751
8953B3390566o421545j5282224j6001211j2913680o451890O629890K0368987K0803513
8945A4122406N106499j0876813j1239350O49020Q473451M215900m245746n484718
8937G20649J699731Q594171P637895M64098n447812o225063m713655m074218k834653
8928d178857P56158L715435K703792M24476J775933N605945O488967L288085l87350
8919B0192584k755771m006961j938169L950221O062089k319965j2453648q776234
$$ y = [-1239341, 5388603, 10431833, 12856095, 8970466, -271312, -7881033, -9935189, -10536519, -14922270, -21872186, -25390964, -21142584, -10140612, 1588829, 7324431, 6361360, 5108872, 8240208, 11532051, 8984220, 4295489, 6969593, 17193815, 23390566, 16969021, 1686797, -14314414, -27228094, -33679984, -27050094, -6681107, 14122406, 19228905, 8352092, -2887258, -2238238, 6235213, 10451113, 6205367, 720649, 2420380, 11014551, 18652446, 19116544, 13668732, 7443669, 2730014, -1344204, -4178857, -3422699, 292736, 2996528, 3421004, 5196937, 10802882, 17291849, 20579934, 20192584, 17436813, 13429852, 11491683, 15441904, 21503993, 19184028, 6730380, -2045854]
8911b045854N820954J0278706k413539j1777850j686274J1998867O004108j1353866
8903D825252j2255052N173321J3080331r55087j3850475m334600J4146960J6450598
8895B2281248L505261m932823l498513l616282q035362o339043K962143O447174
8887H773803k178114j0410787n705164O349068J1901368Q007344K208655j227171
8879A7719002m538332p814457o217548J738861Q757203O353766l490721r375043
8871C132731n378319O9443l544472j1405406r049532M409310J2450602N877145
8863c438498k912256o05055N635832K514292m928104k439150P071093P794809
8855H692963j277634m973532J179538M558126o23140m286390j067673Q22532j335356
$$ y = [-2045854, 3775100, 14053806, 11640267, -137583, -1823857, 10175010, 16179118, 4825252, -7429800, -2256479, 10823852, 9868765, -3981710, -8316310, 5830650, 22281248, 25786509, 20853686, 17355173, 13738891, 5703529, -635514, 2326629, 8773803, 6595689, -3815098, -9520262, -3171194, 8730174, 16737518, 18946173, 17719002, 13180670, 5366213, -851335, 887526, 9644729, 15998495, 12507774, 3132731, -2245588, -2176145, -5720617, -17126023, -26175555, -21766245, -9315643, -3438498, -6350754, -6955809, -1319977, 1194315, -3733789, -6172939, 898154, 8692963, 7415329, 2441797, 3621335, 8179461, 7556321, 3269931, 2202258, 3024790, 1689434]
8846A689434K373075J3064387J5142554J942571j0315886q138184j372819k515202
8838A1869930m321361K925357R229085K197046p879796m312402O053687M470026
8830B0231572o590927q222040J749622O423389m45105o734348n369209l293285
8822b250331m330114l067662J065010J669844m58992J643287N016959K7247r433036
8813a0117788q711516K522928Q275989K766026j689846J626539L043830l296744
8805e580582q035171m200833J401197L132717O062614J1862471J1615402K063356
8797A8321171o135254n215592j021530L60892J380778J944967l307306r837593
8789c509467m449338J0192283J3341670j088864j2053205n206817M067514q01339
$$ y = [1689434, 4062509, 17126896, 32269450, 34212021, 23896135, 15757951, 14385132, 11869930, 7548569, 10473926, 19703011, 21900057, 14020261, 9707859, 15761546, 20231572, 13640645, 5418605, 7168227, 13591616, 13146511, 6412163, 1042954, -2250331, -6580445, -9648107, -8583097, -6913253, -7372245, -5728958, -711999, -684752, -10117788, -18829304, -16306376, -8030387, -5264361, -6954207, -5327668, -2283838, -5580582, -13615753, -17816586, -16415389, -13282672, -7220058, 4642413, 16257815, 18321171, 12185917, 6970325, 5948795, 6309687, 7690465, 9635432, 6328126, -3509467, -7958805, 2233478, 15575148, 14486284, 2433079, -2773738, 1293776, 492437]
8781D92437q713240l118676O570753J903771j1284010j3567920m853529L34102
8773c2236312J892983J0768634K1644513J7083731j159693j0592984j146078J1868885
8765A8123679J2497991L169186n953531j0548449r921751m327320J226227P34419
8757E000451l484601m220652r00974J894717M081205P061622N538170m364184
8749A0605754j2839247p159457P868712J5107183Q952873n13177n365957o878599
8741I778085n977891j538270K191958j8653l822034j843332K572578J914540l30761
8732B926220K825347N091437l089988j2771500p154682Q448024J1420741k779564
8724D916035j4297995j0821461j931809K932477P012900J0564696O032062l571922
$$ y = [492437, -8220803, -11339479, -4768726, -2864955, -14148965, -27716885, -32570414, -32236312, -30343329, -19574695, 2069818, 19153549, 17993856, 7400872, 6254794, 18123679, 30621670, 33790856, 27837325, 17288876, 7367125, 3039805, 4266032, 5000451, 1515850, -2704802, -3605776, -1711059, 2370146, 9431768, 14969938, 10605754, -2233493, -9392950, -1524238, 13582945, 22535818, 22022641, 16656684, 9778085, 3800194, 2261924, 4453882, 4435229, 613195, -1230137, 1342441, 3256981, 2926220, 5751567, 10843004, 7753016, -5018484, -12173166, -3725142, 7695599, 4916035, -9381960, -20203421, -22135230, -19202753, -12189853, -1625157, 4406905, 834983]
8716H34983l955377N081291O362653m604486j0566349l112227L184199p48500
8708g523813k110530O616074J0490696M47249o796999J362687Q204125k776937
8700G912552j6006408r932537N046059N897658k721784r62460P049166K495544
8692a222210r078652n760250Q210554O663256j0959339j5245354L149504J6753815
8684g488676P549835m651784J256795J2713797Q280778o038139j0576275n253434
8676d207103l826209o213527j050122R822688J1624008Q02628q772617n925086
8668g745340M401989J0471899P519195p5621m778826k978204J483137K307782
8660A0606011k95959p54669J376598O15777k744117j209772N177088N518263k877967
$$ y = [834983, -3120394, 1960897, 8323550, 3719064, -6847285, -9959512, -6775313, -7523813, -9634343, -3018269, 7472427, 7919676, 1122677, 2485364, 10689489, 7912552, -8093856, -18026393, -12980334, -7082676, -9804460, -10766920, -3717754, -1222210, -10300862, -16061112, -7850558, -1187302, -12146641, -27391995, -24242491, -7488676, 61159, -4590625, -3333830, 9379967, 17660745, 11622606, 1046331, -4207103, -8033312, -14246839, -15296961, -5474273, 6149735, 6952363, -1820254, -7745340, -3343351, 7128548, 14647743, 14572122, 9793296, 6815092, 8298229, 10606011, 10310052, 9555383, 10931981, 11547758, 8803641, 7593869, 12770957, 18289220, 15411253]
8651A5411253n951243M741801J4371387O068318j0572358j2371547J923137J0773926
8643B4394674L294598q247026j2121492j1888139j0793276k216472J2845569J7004354
8635A2272790Q47835j7719447j5995359J514286J1895661P774312K588856M401811
8627G580745M971462j588277p128164m158597J055458q85026p830553j0211725
8619a8194677l815923P431250J6189795J5517366M308035q107833j0279109l964686
8611i15782j621335o024654n627905L827567Q633610n14738j0159848m451882
8603a6854967Q097877Q352265j438281k609660O791239R154074o41288n816303
8595E034956K104993P555868j828505j2884007q769016L080127M331110m276722
$$ y = [15411253, 9460010, 14201811, 28573198, 34641516, 24069158, 11697611, 13620748, 24394674, 27689272, 19442246, 7320754, -4567385, -15360661, -17577133, -4731564, 12272790, 13120625, -4598822, -20594181, -19079895, -7184234, 590078, 3178934, 7580745, 12552207, 10963930, 3835766, -322831, 732627, -152399, -7982952, -18194677, -22010600, -14579350, 1610445, 17127811, 21435846, 13328013, 3048904, -915782, -2537117, -8561771, -14189676, -10362109, -1728499, -2243237, -12403085, -16854967, -8757090, -404825, -1843106, -4452766, 2338473, 11492547, 10851259, 5034956, 7139949, 14695817, 12867312, -16695, -8785711, -5705584, -1374474, -5651196]
8587e651196o949459l54953L346819n51676k103360M627681J0985594P714325
8579A1063775r97260l926259K647226J1510624J2722571L365205r123129j3969472
8571A3293281q961879k485025j868988n020273o909375p081520n108859K835276
8563b1307362J4075610J4899088j371403j8600835j5875728K334954J1492272
8556a4353404K246447q199428m223951O771368J0014038N261523R60823k059395
8548c581979p433882j1305882p167536J411954N189548M028132N663625J0656477
8540b539543J0368518J772237o276125n765641l42829J778183n04467k314301
8532c823968j217011J312568L974041N684040L712423k421298o716049l108406
$$ y = [-5651196, -12600655, -12955608, -9608789, -10160465, -12263825, -7636144, 3349450, 11063775, 10066515, 6140256, 8787482, 20298106, 33020677, 36385882, 27262753, 13293281, 4331402, 1846377, -22611, -5042884, -11952259, -19033779, -24142638, -21307362, -7231752, 7667336, 6295933, -12304902, -28180630, -25845676, -14353404, -12106957, -20306385, -24530336, -17758968, -7744930, -2483407, -1522584, -3581979, -11015861, -22321743, -29489279, -28077325, -22887777, -18859645, -13196020, -2539543, 7828975, 9601212, 3325087, -2440554, -2783383, -1005200, -1509667, -3823968, -5040979, -3728411, 245630, 5929670, 9642093, 7220795, 504746, -2603660]
8524b603660M121021M256717l661983p469657M9390Q477083M666077o106563p064548
8515e336123M119375J1248233M461733n320516m576447K331957K304093n049174
8507D183131q170976k024564O252486R197215O514690J002113m167694m374330
8499H412071J658666O356915J714922o720715m794675R049644J8262660R425041
8491D3364529r536987j9671598j3994301k612508K385730P6592j889696J336627
8483e41612N732564M040829l616663q153298k950270O578056R713737M290851
8475A5094194k376122m973924n230728n226649l291152J120599M573815M462640
8467D152673K279072M68614J2986J442582L811038L512554m64087k243801K418550
$$ y = [-2603660, 1517361, 5774078, 2112095, -5357562, -5308172, 3168911, 7834988, 1728425, -5336123, -1216748, 10031485, 14493218, 9172702, 4596255, 6928212, 9232305, 4183131, -3987845, -6012409, 240077, 9437292, 15951982, 16954095, 12786401, 8412071, 10070737, 16427652, 18142574, 11421859, 6627184, 15676828, 33939488, 43364529, 33827542, 14155944, 161643, -2450865, -65135, 11457, -1878239, -541612, 5190952, 9231781, 5615118, -2538180, -5488450, 1089606, 10803343, 15094194, 12718072, 7744148, 2513420, -2713229, -6004381, -4883782, -309967, 4152673, 6431745, 6900359, 6913345, 8355927, 12166965, 15679519, 15215432, 12971631, 15390181]
8458A5390181O123462p09480j1931978j1676526q573M271593o860680j5519926
8450b0921927m649286J4694465J9598136Q702915K14604J772863K404676m974884
8442A6841562j1395389p531434K138735P469852N271508j494341q922471j2086508
8434i708486p263314J711488O166560M642064M470626Q383747Q999918J850581
8426A9253184n544205n151505r14225r31751m053673m447737l823813p035363
8418a2649088r130362q44524J3028910J5628497K798575p988786k066893J0762201
8410I538530J1498999O77522m269370K158687N095743n452952j6614405j1302350
8402h669596N229021J2179566K917711p038701m032044M775869L975362o953649
$$ y = [15390181, 21513643, 20804163, 8872185, -2804341, -2812914, 1458679, -5402001, -20921927, -25571213, -10876748, 8721388, 17424303, 17638907, 19411770, 21816446, 16841562, 5446173, -2085261, 53474, 7523326, 12794834, 11300493, 2378022, -9708486, -16971800, -15260312, -9093752, -4451688, 18938, 8402685, 17402603, 19253184, 13708979, 8557474, 7643249, 6711498, 2657825, -1789912, -5613725, -12649088, -21779450, -22623974, -9595064, 6033433, 8832008, 843222, -1223671, 9538530, 21037529, 21715051, 17445681, 19604368, 24700111, 19247159, 2632754, -8669596, -3440575, 8738991, 11656702, 4618001, 585957, 5361826, 9337188, 2383539]
8394B383539j3242303n223592R663716J7003903J1869723J740283m272509m923130
8386A4999630m863929o274681o219999k642039J119385J033062j047275o2600
8378c958446M176406O555195M182153n80338m828666p457059o274085N70022Q293252
8369F78434P849086j548117r095426o711435m1104J387607j409435r80605L036236
8360f834759M843388M029230N105931O510229J737065p289825r690481k148288
8352c737510M867109K864680k543212k352703J803308L118495J949012K636346
8344H605525L172068j223472p335508p530840k501180J97697l53123K246856Q040991
8335C319014Q588449J978077k173621J149302K803795m874635j2983978q747688
$$ y = [2383539, -10858764, -16082356, -6418640, 10585263, 22454986, 24195269, 19922760, 14999630, 10135701, 3861020, -2358979, -5001018, -3881633, -2848571, -3895846, -3958446, 217960, 6773155, 10955308, 10374970, 5546304, -1910755, -8184840, -7614818, 678434, 8527520, 6979403, -2116023, -8827458, -8868562, -7480955, -8890390, -9870995, -6834759, -1991371, 2037859, 7143790, 13654019, 15391084, 8101259, -1589222, -3737510, 1129599, 3994279, 1451067, -901636, 901672, 4020167, 5969179, 8605525, 11777593, 10554121, 3218613, -4312227, -6813407, -6615710, -6968833, -4721977, 3319014, 11907463, 13885540, 11711919, 12861221, 15665016, 10790381, -2193597, -10941285]
8327a0941285L800541R689251N666172K241454L917125K921805m009021p328920
8319E957122n14217P721755O576221n46329l327174j199655j414876n060157o631024
8310A561666n137659m324556k884020L916050J2166281J0950957n35290q733937
8302F979492m443681L862715L258546m842471q843147n157136j429655k261961
8294a2877298j731882O197662J6110563J5714635J002731j6918448k2198650j1055288
8286b5755975M049814Q740555K933619j310479L170901J0092276R905816K354812
8278A4181339n287692q072880o619305l462094q89350o20106j819989j182337
8270a3772414J889836K837754j528347o862411o384029j25907N759107P315352
$$ y = [-10941285, -7140744, 2548507, 8214679, 10456133, 14373258, 17295063, 13286042, 5957122, 5442905, 13164660, 19740881, 19194552, 15867378, 14667723, 13252847, 8192690, 1561666, -3575993, -7900549, -10784569, -6868519, 5297762, 16248719, 15713429, 6979492, 2535811, 6398526, 9657072, 4814601, -4028546, -9185682, -10615337, -12877298, -14609180, -8411518, 7699045, 23413680, 24416411, 7497963, -14700687, -25755975, -21706161, -12965606, -10031987, -11342466, -8171565, 1920711, 11826527, 14181339, 8893647, 820767, -5798538, -9260632, -10149982, -10770088, -12590077, -13772414, -11882578, -9044824, -10573171, -17435582, -23819611, -23945518, -18186411, -10871059]
8262a0871059N494767K058553j680435k682776J448381P315476P994654J686380
8254A0763941n831043q184423m303787K640830P823464O087785l878407j4821969
8246i703609j5398826k847016J1976070J5667397O562676m842560q358441m009274
8238a0953583N35164P5365k446898p36483N852508J0703279Q058233J80190n625591
8229E642184n351460j523562N15437k108791o743841o762562Q68088R209883Q025573
8220A770949j394214n795352J019226P768727K966090o058165m617543M841091
8212E00809O513146k106949n953348J645268P077723p21299j1355070r379537
8204a3779257K210159Q870290O569372K773261R11318k028377n030195l108129
$$ y = [-10871059, -5376292, -3317739, -4998174, -7680950, -6232569, 1082907, 9077561, 10763941, 4932898, -3251525, -7555312, -4914482, 2908982, 8996767, 5118360, -9703609, -25102435, -27949451, -15973381, -305984, 6256692, 1414132, -6944309, -10953583, -10418419, -10343054, -12789952, -13526435, -7673927, 3029352, 11087585, 11267775, 5642184, 290724, -1232838, -717401, -2826192, -9570033, -16332595, -15464507, -6254624, 1770949, 376735, -5418617, -4399391, 3369336, 6335426, 277261, -4340282, 500809, 7013955, 4907006, -1046342, 598926, 7676649, 6955350, -4399720, -13779257, -11569098, -2698808, 3870564, 6643825, 7555143, 5526766, 496571, -2611558]
8196b611558K553712N033336K132741k185967n414200p061011m197157L796256
8188g953848Q684840K850834o673693o299636K957266O744140O49780l901368
8180b941685j034272n56277q221964j2069346j572680J2502142J3350402M048905
8172C505225O99702N337046M736736m729109j0186921m276567K895656J486048
8164e32184k660942n03882L930440K255527j852156Q61641P386243O247919k346191
8155A2786415n678691J33755L510851k058432o104515k37994M669157l854712
8147C165834j5069962q426069J1962951J9159373L366621j2347358o867612Q103541
8139C047319Q578746n140000j3016127p701761n73660J448115L746354P365832
$$ y = [-2611558, -57846, 4975490, 7108231, 4922264, -491936, -7552947, -11750104, -7953848, 730992, 3581826, -3091867, -9391503, -6434237, 309903, 959683, -2941685, -3975957, -4532234, -12754198, -24823544, -26396224, -13894082, -543680, 3505225, 4204927, 9541973, 14278709, 9549600, -637321, -4913888, -2018232, -532184, -3193126, -3697008, 233432, 2488959, 636803, 1498444, 8884687, 15132606, 12786415, 7107724, 7241479, 10752330, 8693898, 2589383, 2351389, 7020546, 3165834, -11904128, -20330197, -8367246, 10792127, 14158748, 1811390, -5056222, 3047319, 11626065, 6486065, -6530062, -14231823, -14805483, -13357368, -9611014, -2245182]
8131b245182M469471m633222p522877K60867O699296K814595l711001l469962
8123g338015q7504M37349J873582O722048N423793q089739j9990815j3117502
8115c4166803O282428J5890507Q131930l208818n991878k892072l20741P63868
8107a5511579j06520m277020p272976k235871P459342J0528574N044452J132316
8099e239282L369472L743719k586290p502141l666759K936638L240785o70879
8091f374737o30097M578094R198625Q825741K910692o110619j1873216q382266
8083g857783Q54861N118708J389238j847508M53847K220867n86428j546709K822509
8074A021602L828609l694316q534987o06437R226055M515825r114174j1431918
$$ y = [-2245182, 2224289, -2408933, -9931810, -9670943, -2971647, -157052, -3868053, -7338015, -7425519, -6988170, -5114588, 1607460, 7031253, -1058486, -21049301, -34166803, -27884375, -11993868, -3861938, -7070756, -13062634, -15954706, -16275447, -15511579, -15618099, -19895119, -27168095, -29403966, -21944624, -11416050, -6371598, -5239282, -1869810, 1873909, -712381, -8214522, -11881281, -8944643, -5703858, -6374737, -7004834, -2426740, 6771885, 15597626, 18508318, 12397699, 524483, -7857783, -7002922, -1884214, -494976, -2342484, -1888637, 332230, -254198, -1800907, 1021602, 4850211, 1155895, -7379092, -7985529, 1240526, 5756351, -3357823, -14789741]
8066a4789741R71091J0917362Q311655J911310J40101j344367o214194p514041
8058g610824k39462Q109027Q551303L138034j203876l364466n497536o538450
8050d656250m690903j153496K942466P855053J0916872P837511N74174m024087
8042A5601340n132932p760343r956744l129733J0399090J4583187K746979r966223
8034G384621q112944K324399O570275M155348L918960M968306K33585o647791
$$ y = [-14789741, -13818650, -2901288, 5410367, 7321677, 7461778, 6117411, -96783, -7610824, -7850286, 258741, 8810044, 11948078, 10744202, 7379736, 1882200, -4656250, -9347153, -10500649, -7558183, 296870, 11213742, 19051253, 19625427, 15601340, 10468408, 2708065, -7248679, -10378412, 20678, 14603865, 17350844, 7384621, -728323, 1596076, 8166351, 12321699, 16240659, 21208965, 21442550, 14794759]
$$ [...]
##END NTUPLES=NMR SPECTRUM
##END=
