##TITLE=31Pdec_SR146H12VV
 D2O, 64 sc
 12.4.2023
##JCAMPDX= 6.0         $$ Bruker NMR JCAMP-DX V2.0
##DATA TYPE= NMR SPECTRUM
##DATA CLASS= NTUPLES
##ORIGIN= UXNMR, Bruker Analytische Messtechnik GmbH
##OWNER= root
$$ XWIN-NMR		Version 3.5
$$ Wed Apr 12 16:39:14 2023 Russian Standard Time (UT+4h)  she@DPX200
##.OBSERVE FREQUENCY= 81.013821
##.OBSERVE NUCLEUS= ^31P
##.ACQUISITION MODE= SIMULTANEOUS
##.ACQUISITION SCHEME= undefined
##.AVERAGES= 64
##.DIGITISER RES= 16
##SPECTROMETER/DATA SYSTEM= spect
##.PULSE SEQUENCE= zgpg30
##.SOLVENT NAME= D2O
##.SHIFT REFERENCE= (INTERNAL, D2O, 0, 248.564)
##AUDIT TRAIL= $$ (NUMBER, WHEN, WHO, WHERE, WHAT)
$$ ##TITLE= Audit trail, XWIN-NMR		Version 3.5
$$ ##JCAMPDX= 5.01
$$ ##ORIGIN= Bruker BioSpin GmbH
$$ ##OWNER= she
$$ F:/spectra/data/she/nmr/P31/1/pdata/1/auditp.txt
$$ ##AUDIT TRAIL=  $$ (NUMBER, WHEN, WHO, WHERE, WHAT)
(   1,<2023-04-12 16:38:17.96 +0400>,<she>,<DPX200>,
      <continue with go, POWCHK disabled, PULCHK disabled
       configuration hash MD5:
       00 E9 B6 7A A2 85 ED C7 34 08 36 98 17 FE 4E 26
       data hash MD5: 32K
       81 3C 01 F6 35 9D 15 5F 58 AE 80 2C FA ED 68 74>)
(   2,<2023-04-12 16:38:20.73 +0400>,<she>,<DPX200>,
      <Start of raw data processing
       efp BC_mod = 2 LB = 1 FT_mod = 6 PKNL = 1 PHC0 = -11193.75 PHC1 = 557.0854 SI = 64K 
       data hash MD5: 64K
       15 EA AA ED 78 03 97 2B 62 BF 89 C3 EF 72 A5 C3>)
(   3,<2023-04-12 16:38:45.75 +0400>,<she>,<DPX200>,
      <pk PHC0 = -113.3288 PHC1 = 257.2 
       data hash MD5: 64K
       8D F1 2F 6C 23 70 FD 01 E7 08 2A CA EF BF D8 4E>)
(   4,<2023-04-12 16:38:49.68 +0400>,<she>,<DPX200>,
      <abs ABSG = 5 
       data hash MD5: 64K
       53 76 D3 8B 52 C1 DF 49 C5 4B 39 53 C6 B3 39 3F>)
$$ ##END=
$$ 
$$ hash MD5
$$ 57 77 66 9A 1D A1 2C F7 6B 29 03 D8 BB 1A 6F 07
##$RELAX= 
##$RELAX= 
##$RELAX= 
##$RELAX= 
##$RELAX= 
##$RELAX= 
##$RELAX= 
##$RELAX= 
##$RELAX= 
$$ Bruker specific parameters
$$ --------------------------
##$DU= <F:/spectra>
##$EXPNO= 1
##$NAME= <P31>
##$PROCNO= 1
##$TYPE= <nmr>
##$USER= <she>
##$AMP= (0..31)
100 100 100 100 100 100 100 100 100 100 100 100 100 100 100 100 100 100 
100 100 100 100 100 100 100 100 100 100 100 100 100 100 
##$AQSEQ= 0
##$AQ_mod= 1
##$AUNM= <au_zg>
##$AUTOPOS= <>
##$BF1= 81.014009
##$BF2= 200.13
##$BF3= 200.13
##$BF4= 200.13
##$BF5= 200.13
##$BF6= 200.13
##$BF7= 200.13
##$BF8= 200.13
##$BYTORDA= 1
##$CFDGTYP= 0
##$CFRGTYP= 5
##$CHEMSTR= <none>
##$CNST= (0..31)
1 1 145 1 1 1 1 1 1 1 1 1 1 1 1 1 1 1 1 1 1 1 1 1 1 1 1 1 1 1 1 1 
##$CPDPRG= <waltz16>
##$CPDPRG1= <>
##$CPDPRG2= <waltz16>
##$CPDPRG3= <>
##$CPDPRG4= <mlev>
##$CPDPRG5= <mlev>
##$CPDPRG6= <mlev>
##$CPDPRG7= <mlev>
##$CPDPRG8= <mlev>
##$CPDPRGB= <>
##$CPDPRGT= <>
##$D= (0..31)
0 1 0 0 0 0 0 0 0 0 0 0.03 2e-05 3e-06 0 0 0 0 0 0 0 0 0 0 0 0 0 0 0 0 
0 0 
##$DATE= 1681303025
##$DBL= (0..7)
120 120 120 11 120 120 24 19 
##$DBP= (0..7)
150 150 150 150 150 150 150 150 
##$DBP07= 0
##$DBPNAM0= <>
##$DBPNAM1= <>
$$ [...]
##$SUBNAM3= <"">
##$SUBNAM4= <"">
##$SUBNAM5= <"">
##$SUBNAM6= <"">
##$SUBNAM7= <"">
##$SUBNAM8= <"">
##$SUBNAM9= <"">
##$SW= 501.771253377433
##$SWIBOX= (0..15)
0 1 3 0 0 0 0 0 0 0 0 0 0 0 0 0 
##$SW_h= 40650.406504065
##$TD= 32768
##$TD0= 1
##$TE= 0
##$TE2= 300
##$TE3= 300
##$TEG= 300
##$TL= (0..7)
0 120 53 12 22 120 120 120 
##$TP= (0..7)
150 150 150 150 150 150 150 150 
##$TP07= 0
##$TPNAME0= <>
##$TPNAME1= <>
##$TPNAME2= <>
##$TPNAME3= <>
##$TPNAME4= <>
##$TPNAME5= <>
##$TPNAME6= <>
##$TPNAME7= <>
##$TPOAL= (0..7)
0.5 0.5 0.5 0.5 0.5 0.5 0.5 0.5 
##$TPOFFS= (0..7)
0 0 0 0 0 0 0 0 
##$TUNHIN= 0
##$TUNHOUT= 0
##$TUNXOUT= 0
##$USERA1= <user>
##$USERA2= <user>
##$USERA3= <user>
##$USERA4= <user>
##$USERA5= <user>
##$V9= 5
##$VALIST= <valist>
##$VCLIST= <CCCCCCCCCCCCCCC>
##$VD= 0
##$VDLIST= <DDDDDDDDDDDDDDD>
##$VPLIST= <PPPPPPPPPPPPPPP>
##$VTLIST= <TTTTTTTTTTTTTTT>
##$WBST= 1024
##$WBSW= 4
##$XGAIN= (0..3)
0 0 0 0 
##$XL= 0
##$YL= 0
##$YMAX_a= 2829
##$YMIN_a= -2181
##$ZGOPTNS= <>
##$ZL1= 120
##$ZL2= 120
##$ZL3= 120
##$ZL4= 120
##$ABSF1= 248.5645
##$ABSF2= -253.2056
##$ABSG= 5
##$ABSL= 3
##$ALPHA= 0
##$AQORDER= 0
##$ASSFAC= 0
##$ASSFACI= 0
##$ASSFACX= 0
##$ASSWID= 0
##$AUNMP= <proc_1d>
##$AZFE= 0.1
##$AZFW= 0.5
##$BCFW= 0
##$BC_mod= 2
##$BYTORDP= 0
##$COROFFS= 0
##$CY= -3
##$DATMOD= 1
##$DC= 0
##$DFILT= <>
##$DTYPP= 0
##$F1P= 0
##$F2P= 0
##$FCOR= 1
##$FTSIZE= 65536
##$FT_mod= 6
##$GAMMA= 0
##$GB= 0
##$INTBC= 1
##$INTSCL= 6.047779e-11
##$ISEN= 30
##$LB= 1
##$LEV0= 0
##$LPBIN= 0
##$MAXI= 10000
##$MC2= 0
##$MEAN= 0
##$ME_mod= 0
##$MI= 50
##$NCOEF= 0
##$NC_proc= -8
##$NLEV= 6
##$NOISF1= 182.463
##$NOISF2= 159.3651
##$NSP= 0
##$NTH_PI= 0
##$NZP= 0
##$OFFSET= 248.5645
##$PC= 4
##$PHC0= -11307.08
##$PHC1= 814.2854
##$PH_mod= 1
##$PKNL= yes
##$PPARMOD= 0
##$PSCAL= 0
##$PSIGN= 0
##$REVERSE= no
##$SF= 81.0140089999694
##$SI= 65536
##$SIGF1= 159.3651
##$SIGF2= -187.1042
##$SINO= 113.3802
##$SIOLD= 16384
##$SREGLST= <1H.CDCl3>
##$SSB= 0
##$STSI= 65536
##$STSR= 0
##$SW_p= 40650.406504065
##$SYMM= 0
##$S_DEV= 0
##$TDeff= 32768
##$TDoff= 0
##$TI= <>
##$TILT= no
##$TM1= 0
##$TM2= 0
##$TOPLEV= 0
##$USERP1= <user>
##$USERP2= <user>
##$USERP3= <user>
##$USERP4= <user>
##$USERP5= <user>
##$WDW= 1
##$XDIM= 65536
##$YMAX_p= 481063164
##$YMIN_p= -95306751
$$ End of Bruker specific parameters
$$ ---------------------------------
##NTUPLES= NMR SPECTRUM
##VAR_NAME=  FREQUENCY,     SPECTRUM/REAL,   SPECTRUM/IMAG
##SYMBOL=    X,             R,               I
##VAR_TYPE=  INDEPENDENT,   DEPENDENT,       DEPENDENT
##VAR_FORM=  AFFN,          ASDF,            ASDF
##VAR_DIM=   65536,         65536,           65536
##UNITS=     HZ,            ARBITRARY UNITS, ARBITRARY UNITS
##FACTOR=    0.620285442955139, 1,           1
##FIRST=     20137.2065510682, 0,            0
##LAST=      -20513.1999529968, 0,           0
##MIN=       -20513.1999529968, -95306751,   0
##MAX=       20137.2065510682, 481063164,    0
$$ Real data points
##PAGE= N=1
##DATA TABLE= (X++(R..R)), XYDATA
$$ [...]
##PAGE= N=2
##DATA TABLE= (X++(I..I)), XYDATA
$$ plain form
12950 12391140 13911061 10491659 5634082 2842490 1073268 -1955312 -4543849 -3769098
12942 -3769098 -2218232 -5734452 -13579076 -17658575 -14366183 -10172780 -10701471 -11305047
12934 -11305047 -5623832 2674559 5856632 5026157 6387335 8024312 2929193 -5884872
12926 -5884872 -7130781 -7819 2779458 -4468625 -10493423 -5340587 3727139 4984787
12918 4984787 777225 834637 4385370 2758514 -3814375 -5536441 877779 6683527
12910 6683527 3536254 -6673760 -15952845 -18090920 -12200020 -3740819 -1005155 -5329934
12902 -5329934 -7297717 1082998 13839018 18667064 13858348 7977702 5120302 1739404
12894 1739404 -2531327 -2881117 491007 1516569 -349429 896093 5084944 4394038
$$ packed form
12950A2391140J519921l419402m857577k791592j769222l028580k588537P74751
12942c769098J550866l516220p844624m079499L292392M193403n28691o03576
12934a1305047N681215Q298391L182073q30475J361178J636977n095119q814065
12926e884872j245909P122962K787277p248083o024798N152836R067726J257648
12918D984787m207562N7412L550733j626856o572889j722066O414220N805748
12910F683527l147273j0210014r279085k138075N890900Q459201K735664m324779
12902e329934j967783Q380715J2756020M828046m808716n880646k857400l380898
12894A739404m270731l49790L372124J025562j865998J245522M188851o90906
$$ plain form
12886 4394038 -1698850 -3152018 2961776 4931996 -4572366 -14445707 -11748697 -1972855
12878 -1972855 934055 -2969688 -2113146 6097636 12227685 10941031 6752687 3329604
12870 3329604 -757193 -4068970 -1301682 6806876 11854396 9190457 3391157 255084
12862 255084 733761 4230419 9723669 11772221 4350884 -8139352 -12450517 -3559139
12854 -3559139 7697710 9105809 1863874 -4803592 -6824240 -6065154 -3701932 -758814
12846 -758814 -1402309 -7750418 -13654597 -11102408 -1735123 4853784 4044187 898556 1062561
12837 1062561 2953192 1776100 -2508141 -4684572 -862505 6419579 10511806 8445039
12829 8445039 5311526 8147885 15475153 17509668 9263193 -1168316 -2202308 6459068
$$ packed form
12886D394038o092888j453168O113794J970220r504362r873341K697010R775842
12878a972855K906910l903743Q56542Q210782O130049j286654m188344l423083
12870C329604m086797l311777K767288Q108558N047520k663939n799300l136073
12862B55084M78677L496658N493250K048552p421337j2490236m311165Q891378
12854c559139J1256849J408099p241935o667466k020648P59086K363222K943118
12846g58814o43495o348109n904179K552189R367285O588907q09597l145631J64005
12837A062561J890631j177092m284241k176431L822067P282084M092227k066767
12829H445039l133513K836359P327268K034515q246475j0431509j033992Q661376
$$ plain form
12821 6459068 14507173 14847362 10183187 5584855 1409675 -3255228 -5360264 -1394074
12813 -1394074 5727124 8255885 3129101 -3254101 -2290174 5836912 11611623 7922322
12805 7922322 -583252 -3427732 2116137 8750984 10779082 11474373 15588880 20467599
12797 20467599 20365854 15587977 10876917 7512549 3899736 1898511 4657729 8908579
12789 8908579 7898273 2614048 1182192 5130584 5959433 -293823 -4910231 -305447
12781 -305447 6386170 3592000 -6506233 -11481896 -7566493 -3135865 -3333697 -3184768
12773 -3184768 739062 2543058 -2983087 -10616718 -12231747 -8615054 -6502640 -7557177
12765 -7557177 -7517094 -4268115 -90260 3336039 6407002 8386394 7830299 6092446 5664616
$$ packed form
12821F459068Q048105L40189m664175m598332m175180m664903k105036L966190
12813a394074P121198K528761n126784o383202R63927Q127086N774711l689301
12805G922322q505574k844480N543869O634847K028098O95291M114507M878719
12797B0467599j01745m777877m711060l364368l612813k001225K759218M250850
12789H908579j010306n284225j431856L948392Q28849o253256m616408M604784
12781c05447O691617k794170j0098233m975663L915403M430628j97832J48929
12773c184768L923830J803996n526145p633631j615029L616693K112414j054537
12765g557177M0083L248979M177855L426299L070963J979392n56095j737853m27830
$$ plain form
12756 5664616 5260471 1628164 -3590038 -4356510 1134754 7448107 9378233 7681309
12748 7681309 5149658 1830567 -2472254 -4837457 -2255369 4368850 11836520 17412046
12740 17412046 17885180 10313824 -2554261 -11768705 -11855703 -7472885 -5500238 -4891499
12732 -4891499 -1392255 1696102 -2534554 -11045797 -12389157 -4010544 2668611 -616368
12724 -616368 -6664368 -5433498 -761664 -3620602 -13247213 -17267731 -10507315 -2219125
12716 -2219125 -1032436 -2167395 3815772 15583711 22147358 17345650 6740694 -9530
12708 -9530 1126686 7079047 11741373 9982035 956464 -10174276 -15757600 -13012575
12700 -13012575 -6630521 -2589901 -1472584 -340959 1093717 625890 -776896 1288493
$$ packed form
12756E664616m04145l632307n218202p66472N491264O313353J930126j696924
12748G681309k531651l319091m302821k365203K582088O624219P467670N575526
12740A7412046M73134p571356j2868085r214444q6998M382818J972647O08739
12732d891499L499244L088357m230656q511243j343360Q378613O679155l284979
12724f16368o048000J230870M671834k858938r626611m020518O760416Q288190
12716b219125J186689j134959N983167J1767939O563647m801708j0604956o750224
12708i530J136216N952361M662326j759338r025571j1130740n583324K745025
12700a3012575O382054M040620J117317J131625J434676m67827j402786K065389
$$ plain form
12692 1288493 7669211 12865258 11927807 6566198 1391969 -2414611 -5940553 -8340245
12684 -8340245 -8525559 -8552732 -10285248 -10919357 -7434225 -3306196 -3986985 -7301846 -6518044
12675 -6518044 -2522305 -3341396 -9829576 -12105572 -4768804 3747393 3589926 -2639437
12667 -2639437 -5990312 -4430060 -1661065 1624433 6169208 8276887 4942592 1318563
12659 1318563 3457985 6856742 2870710 -5874413 -8502677 -3629956 -1199412 -4985631
12651 -4985631 -6394217 -31552 6741211 6299503 2247157 755665 -320902 -4748300
12643 -4748300 -7931754 -3553295 5056075 9653591 9255098 8578550 7752596 3147749 -3320119
12634 -3320119 -5055664 -945522 3096264 2971861 77934 -3600291 -7272229 -8323245
$$ packed form
12692A288493O380718N196047r37451n361609n174229l806580l525942k399692
12684h340245j85314k7173j732516o34109L485132M128029o80789l314861P83802
12675f518044L995739q19091o488180k275996P336768Q516197j57467o229363
12667b639437l350875J560252K768995L285498M544775K107679l334295l624029
12659A318563K139422L398757l986032q745123k628264M872721K430544l786219
12651d985631j408586O362665O772763m41708m052346j491492j076567m427398
12643d748300l183454M378459Q609370M597516l98493o76548q25954m604847o467868
12634c320119j735545M110142M041786j24403k893927l678225l671938j051016
$$ plain form
12626 -8323245 -4379995 1303687 3074359 1576674 2336185 5751363 6693712 5017756
12618 5017756 7087004 13644650 15582440 7640846 -1569062 -880401 7681989 12647306
12610 12647306 8992093 2073428 -2431913 -4345892 -4588478 -2240617 1997053 4690926
12602 4690926 4387974 3858855 5941261 10194403 14867218 18889016 20399554 16710724
12594 16710724 8222602 -105537 -3892755 -4217938 -4796345 -5908099 -4540833 -103758
12586 -103758 3660676 3494809 447980 -2703251 -5107024 -6374745 -4107071 2673073
12578 2673073 8613138 6196836 -3623616 -10185104 -5905931 4006984 9155120 7363511
12570 7363511 4368491 3041347 1031697 -1429524 -331965 3408751 2549865 -5060752
$$ packed form
12626h323245L943250N683682J770672j497685P59511L415178R42349j675956
12618E017756K069248O557646J937790p941594r209908O88661Q562390M965317
12610A2647306l655213o918665m505341j913979k42586K347861M237670K693873
12602D690926l02952n29119K082406M253142M672815M021798J510538l688830
12594A6710724q488122q328139l787218l25183n78407j111754J367266M437075
12586a03758L764434j65867l046829l151231k403773j267721K267674O780144
12578B673073N940065k416302r820452o561488M279173R912915N148136j791609
12570G363511k995020j327144k009650k461221J097559L740716q58886p610617
$$ plain form
12562 -5060752 -11407297 -10336422 -7531891 -10815390 -16391537 -14581341 -5990479 -1228397
12554 -1228397 -4761836 -9170050 -7489318 -2383452 445730 418888 -736897 -3736003
12546 -3736003 -8698921 -12044795 -11158396 -8582191 -7553043 -6831088 -3813702 605676
12538 605676 4192761 7153011 9883160 10178342 6734877 2349027 -320695 -2632015
12530 -2632015 -5222718 -3632432 5293488 16053961 20534588 18973981 17463267 16414371
12522 16414371 10366709 -513807 -7771755 -6179768 -626720 1850031 769913 -689757
12514 -689757 -1897953 -3813367 -5639938 -6074566 -5076517 -2254587 2962833 7812946 7418335
12505 7418335 1915595 -2390096 -1765778 134556 -555470 -1655577 -455663 185122 -2577911
$$ packed form
12562e060752o346545J070875K804531l283499n576147J810196Q590862M762082
12554a228397l533439m408214J680732N105866K829182k6842j155785k999106
12546c736003m962918l345874Q86399K576205J029148P21955L017386M419378
12538F05676L587085K960250K730149K95182l443465m385850k669722k311320
12530b632015k590703J590286Q925920J0760473M480627j560607j510714j048896
12522A6414371o047662j0880516p257948J591987N553048K476751j080118j459670
12514f89757j208196j915414j826571m34628R98049K821930N217420M850113l94611
12505G418335n502740m305691O24318J900334o90026j100107J199914O40785k763033
$$ plain form
12496 -2577911 -4706817 -1349330 3816013 3530091 -801107 -527685 6747480 13549933
12488 13549933 13930362 10774913 8836019 7203306 3006003 -2342790 -5354835 -5805743
12480 -5805743 -5654839 -4756446 -1569865 2877255 5027308 2825428 -2123216 -6315482
12472 -6315482 -7333821 -5736850 -4669477 -6582137 -9780878 -9763295 -4954533 564947
12464 564947 1744049 -1159577 -3101077 -874209 2888692 3435696 342395 -1939483
12456 -1939483 -512962 1165295 -2510737 -10990316 -16986116 -15490940 -10277401 -8716237
12448 -8716237 -12181840 -15069444 -12773623 -7465953 -5239592 -9185181 -15663713 -16801463
12440 -16801463 -7830909 6526855 14485497 8705488 -5106534 -13786235 -10991725 -3380005
$$ packed form
12496b577911k128906L357487N165343k85922m331198K73422P275165O802453
12488A3549933L80429l155449j938894j632713m197303n348793l012045m50908
12480e805743J50904Q98393L186581M447120K150053k201880m948644m192266
12472f315482j018339J596971J067373j912660l198741J7583M808762N519480
12464E64947J179102k903626j941500K226868L762901N47004l093301k281878
12456a939483J426521J678257l676032q479579n995800J495176N213539J561164
12448h716237l465603k887604K295821N307670K226361l945589o478532j137750
12440a6801463Q970554J4357764P958642n780009j3812022q679701K794510P611720
$$ plain form
12432 -3380005 -1841464 -8859165 -16486135 -16299860 -9299105 -4032759 -5114023 -7007780
12424 -7007780 -2299322 6631360 10208411 5590025 613075 1343579 3239485 40354
12416 40354 -4975087 -4112847 2629070 8628874 11149309 12725989 13781128 12166065 9471999
12407 9471999 9561383 10568930 6563149 -1780405 -6329864 -3266536 2065342 4486879
12399 4486879 5307562 6006761 3440841 -3703123 -10115463 -10940646 -8589194 -7579750 -7362096
12390 -7362096 -5302320 -2469521 -1208815 -535532 1142915 2047968 531407 -746558
12382 -746558 758902 1681210 -3145275 -12284789 -18181635 -15482631 -5798653 4619707
12374 4619707 9563099 7203429 2071477 578322 3248612 5081451 4861403 7916685
$$ packed form
12432c380005J538541p017701p626970J86275P000755N266346j081264j893757
12424g007780M708458Q930682L577051m618386m976950P30504J895906l199131
12416D0354n015441Q62240O741917N999804K520435J576680J055139j615063k694066
12407I471999Q9384J007547m005781q343554m549459L063328N331878K421537
12399D486879Q20683O99199k565920p143964o412340q25183K351452J009444K17654
12390g362096K059776K832799J260706O73283J678447R05053j516561j277965
12382g46558J505460R22308m826485r139514n896846K699004R683978J0418360
12374D619707M943392k359670n131952j493155K670290J832839k20048L055282
$$ plain form
12366 7916685 15868510 20341119 13696319 1314461 -4746696 -1628310 2679364 2114767
12358 2114767 -1086388 -3135757 -4320632 -5722128 -6042470 -4555028 -3214355 -3062174
12350 -3062174 -1376877 4585563 12011255 13262837 3624312 -11828718 -21237548 -18162564
12342 -18162564 -9160961 -5278479 -7518984 -7301314 -1382195 2724279 -163634 -3576781
12334 -3576781 -154692 5869832 5983157 1525723 329686 2999689 3346647 544845
12326 544845 -200268 1140017 -1316211 -7250758 -8120143 -1115172 4311734 -394254 -10215477
12317 -10215477 -13276808 -5818878 4722699 8676045 2535592 -8900779 -16165798 -13608597
12309 -13608597 -5909212 -2791776 -6292325 -8287007 -2703120 5715017 8959674 6971459
$$ packed form
12366G916685P951825M472609o644800j2381858o061157L118386M307674n64597
12358B114767l201155k049369j184875j401496l20342J487442J340673J52181
12350c062174J685297N962440P425692J251582r638525j5453030r408830L074984
12342a8162564R001603L882482k240505K17670N919119M106474k887913l413147
12334c576781L422089O024524J13325m457434j196037K670003L46958k801802
12326E44845p45113J340285k456228n934547q69385P004971N426906m705988r821223
12317a0215477l061331P457930J0541577L953346o140453j1436371p265019K557201
12309a3608597P699385L117436l500549j994682N583887Q418137L244657j988215
$$ plain form
12301 6971459 5497759 6017236 4546592 -68556 -2888544 799 5050991 5179037
12293 5179037 -1212631 -8040518 -8769669 -3603427 2217202 5641013 8125296 10844311
12285 10844311 11500575 7893575 1935222 -2151221 -1839400 2575462 8100513 9585121
12277 9585121 4558540 -1045028 2017328 12536084 17469931 9697538 -607004 -752934
12269 -752934 5316612 4262775 -4833108 -9864167 -6265705 -3943628 -10205889 -17932378
12261 -17932378 -16728775 -7046166 2615180 5866775 1325958 -8128384 -14900200 -11887961
12253 -11887961 -2142667 2924610 -1389011 -6664813 -4172687 3154998 7007817 5501478
12245 5501478 2602995 1073203 1903741 6194957 12110142 14221942 10707522 6548593
$$ packed form
12301F971459j473700N19477j470644m615148k819988K889343N050192J28046
12293E179037o391668o827887p29151N166242N820629L423811K484283K719015
12285A0844311O56264l607000n958353m086443L11821M414862N525051J484608
12277I585121n026581n603568L062356J0518756M933847p772393j0304542j45930
12269g52934O069546j053837r095883n031059L598462K322077o262261p726489
12261a7932378J203603R682609R661346L251595m540817r454342o771816L012239
12253a1887961R745294N067277m313621n275802K492126P327685L852819j506339
12245E501478k898483j529792Q30538M291216N915185K111800l514420m158929
$$ plain form
12237 6548593 5210770 3174455 -1774490 -3704696 2134199 8897396 6570175 -2809686
12229 -2809686 -8123573 -5428508 -1408652 -707345 504925 5801992 11104365 10253620
12221 10253620 3480572 -3325192 -5480497 -3425821 -1096517 -1485154 -3510616 -3916056
12213 -3916056 -2329077 -1735361 -2731867 -1200796 5340551 12790445 15865714 15171374 14306698
12204 14306698 13079463 9186760 4295045 2279778 2762684 2586752 2870105 7832005
12196 7832005 16211328 20739495 18223103 14120943 13849005 14541153 9988165 779196
12188 779196 -5377047 -2998013 4946868 10805121 10294043 5909665 3198525 4583308
12180 4583308 7138598 6338149 1582976 -2646136 -1699474 3390762 6395918 3421100
$$ packed form
12237F548593j337823k036315m948945j930206N838895O763197k327221r379861
12229b809686n313887K695065M019856P01307J212270N297067N302373q50745
12221A0253620o773048o805764k155305K054676K329304l88637k025462m05440
12213c916056J586979N93716r96506J531071O541347P449894L075269o94340q64676
12204A4306698j227235l892703m891715k015267M82906j75932K83353M961900
12196G832005Q379323M528167k516392m102160k71938O92148m552988r208969
12188G79196o156243K379034P944881N858253n11078m384378k711140J384783
12180D583308K555290q00449m755173m229112R46662N090236L005156k974818
$$ plain form
12172 3421100 -1666947 -2484347 106485 -1020272 -6996794 -8629817 360692 11765745
12164 11765745 12858887 4247894 -1965729 -269505 2647922 1041623 -1891701 -2069850
12156 -2069850 -812552 806020 4750458 8809938 5827875 -4415521 -11456798 -8573812
12148 -8573812 -2321577 -572874 195401 6710803 15482683 17738863 12611370 6106558
12140 6106558 1374896 -1484973 -634179 3871647 6246417 3129184 454575 3684040
12132 3684040 7510923 5386398 2496707 6740896 12662857 9063308 -1183120 -4712507
12124 -4712507 556368 3380152 -787379 -4160715 -3456080 -5970743 -13798279 -17289194
12116 -17289194 -11526424 -5835291 -8279519 -12389901 -8866134 -595659 4158267 5580272
$$ packed form
12172C421100n088047q17400K590832j126757n976522j633023Q990509J1405053
12164A1765745J093142q610993o213623J696224K917427j606299k933324j78149
12156b069850J257298J618572L944438M059480k982063j0243396p041277K882986
12148h573812O252235J748703P68275O515402Q771880K256180n127493o504812
12140F106558m731662k859869Q50794M505826K374770l117233k674609L229465
12132C684040L826883k124525k889691M244189N921961l599549j0246428l529387
12124d712507N268875K823784m167531l373336P04635k514663p827536l490915
12116a7289194N762770N691133k444228m110382L523767Q270475M753926J422005
$$ plain form
12108 5580272 8927191 13216345 13221386 8804742 3674192 -1784083 -8398691 -11867693 -6825061
12099 -6825061 3882131 11260071 11530925 9318706 8766529 7156586 333367 -8796966
12091 -8796966 -11691085 -4972126 3592265 4027361 -2195468 -3956021 2634259 7648253
12083 7648253 2950641 -4533160 -4467486 -34907 -291694 -1788217 5635045 17269863
12075 17269863 16402337 715504 -12434080 -12187128 -7918693 -9151060 -9147404 11884
12067 11884 10792395 12188327 6941408 3752677 2336850 -1055527 -2968281 -760549
12059 -760549 -1690122 -9948913 -14412671 -5472357 5101440 267904 -13088689 -12718855
12051 -12718855 4001705 16127530 11755155 2754502 1391296 2539846 -1247336 -4036354
$$ packed form
12108E580272L346919M289154N041m416644n130550n458275o614608l469002N042632
12099f825061J0707192P377940K70854k212219n52177j609943o823219r130333
12091h796966k894119O718959Q564391M35096o222829j760553O590280N013994
12083G648253m697612p483801O5674M432579k56787j496523P423262J1634818
12075A7269863q67526j5686833j3149584K46952M268435j232367L656R159288
12067A1884J0780511J395932n246919l188731j415827l392377j912754K207732
12059g60549r29573q258791m463758Q940314J0573797m833536j3356593L69834
12051a2718855J6720560J2125825m372375r000653j363206J148550l787182k789018
$$ plain form
12043 -4036354 1663642 9709524 9594492 2604225 -2216215 -1764124 1115797 5701160
12035 5701160 11998028 15319817 11066126 2657552 -2250049 -1536542 893802 1818793
12027 1818793 518088 -3549743 -9392837 -12670571 -10163265 -4541959 -553893 1526380
12019 1526380 4309097 7233646 7121336 3875692 1096843 1144140 3112223 5403657 7079459
12010 7079459 6952162 4416926 1135262 -717942 -1598986 -3300222 -4807175 -2698685
12002 -2698685 3536895 9434162 10463484 7084081 2925754 -645360 -5238656 -10716126
11994 -10716126 -13204158 -10160216 -5002414 -2831805 -2700236 669783 6853360 7776758
11986 7776758 -500149 -9542655 -8142835 3233372 14244138 18665067 19071078 18338806
$$ packed form
12043d036354N699996Q045882j15032o990267m820440M52091K879921M585363
12035E701160O296868L321789m253691q408574m907601P13507K430344R24991
12027A818793j300705m067831n843094l277734K507306N621306L988066K080273
12019A526380K782717K924549j12310l245644k778849M7297J968083K291434J675802
12010G079459j27297k535236l281664j853204q81044j701236j506953K108490
12002b698685O235580N897267J029322l379403m158327l571114m593296n477470
11994a0716126k488032L043942N157802K170609J31569L370019O183577R23398
11986G776758q276907r042506J399820J1376207J1010766M420929M06011p32272
$$ plain form
11978 18338806 14962990 8852926 4421914 4157406 4493508 1755229 -2290816 -4360995
11970 -4360995 -4944013 -5763297 -5409883 -1597159 4522315 9454198 10642928 6613264 -2660301
11961 -2660301 -12722312 -15949488 -9958866 -1566166 1660333 445471 -193278 -183463 -2878046
11952 -2878046 -6412642 -4521176 3246078 9004918 6665864 -611131 -5723409 -5880022
11944 -5880022 -2409369 3713792 11730590 18380107 19491206 14326485 6020765 -1987249
11936 -1987249 -7948526 -10712271 -9273873 -4458591 343889 1596145 -1043592 -4185897
11928 -4185897 -3906357 176515 4096145 3473973 -1327765 -4624161 -1100170 7669093
11920 7669093 13554960 10169983 646251 -4915562 -1041773 6004258 5749766 -2488287
$$ packed form
11978A8338806l375816o110064m431012k64508L36102k738279m046045k070179
11970d360995n83018q19284L53414L812724O119474M931883J188730m029664r273565
11961b660301j0062011l227176N990622Q392700L226499j214862o38749R815k694583
11952b878046l534596J891466P767254N758840k339054p276995n112278j56613
11944e880022L470653O123161Q016798O649517J111099n164721q305720q008014
11936a987249n961277k763745J438398M815282M802480J252256k639737l142305
11928d185897K79540M082872L919630o22172m801738l296396L523991Q769263
11920G669093N885867l384977r523732n561813L873789P046031k54492q238053
$$ plain form
11912 -2488287 -7574459 -660446 12501941 17981782 11013133 1554809 1271753 9664267
11904 9664267 16673164 16184452 11990289 10490941 12300735 13631855 12884155 11763956
11896 11763956 10711906 7811925 3792637 3941556 11024346 18706051 17609166 7935885
11888 7935885 -15813 -278686 76138 -7762141 -19023498 -20047489 -7612820 5492635
11880 5492635 7165370 516711 -3543395 -1947222 -122320 -694342 -335990 2389055
11872 2389055 3920960 2233595 90111 -698970 -2572171 -6539142 -8387073 -4900654
11864 -4900654 128600 936496 -2037936 -3863794 -2858908 -1557287 -1164843 -59506
11856 -59506 2437041 5251387 8608221 13662595 18554504 18762477 12519832 2966518 -5602428
$$ packed form
11912b488287n086172O914013J3162387N479841o968649r458324k83056Q392514
11904I664267P008897m88712m194163j499348J809794J331120p47700j120199
11896A1763956j052050k899981m019288J48919P082790P681705j096885r673281
11888G935885p951698k62873L54824p838279j1261357j023991J2434669J3105455
11880E492635J672735o648659m060106J596173J824902n72022L58352K725045
11872B389055J531905j687365k143484p89081j873201l966971j847931L486419
11864d900654N029254Q07896k974432j825858J004886J301621L92444J105337
11856e9506K496547K814346L356834N054374M891909K07973o242645r553314q568946
$$ plain form
11847 -5602428 -10761557 -11376662 -7950597 -4314953 -5077592 -9877292 -13387710 -12319859
11839 -12319859 -9121203 -7325011 -6784785 -5594387 -3611553 -1742130 -248445 332160
11831 332160 -726118 -1600930 1408147 8028774 12187647 9290098 2455091 -2239431
11823 -2239431 -4200028 -7410711 -12516983 -15042260 -12290352 -7961895 -7621946 -11413819
11815 -11413819 -13559509 -9351165 -1406495 2856199 532433 -2690704 -728080 3236065
11807 3236065 1081422 -6989982 -11299323 -7097931 -2098326 -4363927 -9757795 -9199566
11799 -9199566 -3294892 -430614 -3021396 -5489573 -5482860 -7245978 -11805881 -12652461 -5415582
11790 -5415582 4572316 8889238 5785186 -136252 -3986863 -3352841 1017163 4300353
$$ packed form
11847e602428n159129o15105L426065L635644p62639m799700l510418J067851
11839a2319859L198656J796192N40226J190398J982834J869423J493685N80605
11831C32160j058278q74812L009077O620627M158873k897549o835007m694522
11823b239431j960597l210683n106272k525277K751908M328457L39949l791873
11815a1413819k145690M208344P944670M262694k323766l223137J962624L964145
11807C236065k154643q071404m309341M201392M999605k265601n393868N58229
11799i199566N904674K864278k590782k468177O713j763118m559903q46580P236879
11790e415582R987898M316922l104052n921438l850611O34022M370004L283190
$$ plain form
11782 4300353 1158952 -7090414 -12909771 -12663295 -11222197 -13001529 -14446038 -11219376
11774 -11219376 -7296709 -8623856 -11392899 -6754297 3544473 7182371 -188770 -6613038
11766 -6613038 -527692 11963869 15509054 6821729 -2526810 -3844032 -1740070 -3814159
11758 -3814159 -8388003 -8708806 -4295673 -1050065 -2136227 -5055855 -7193702 -8449349
11750 -8449349 -7979764 -4122730 702972 451698 -6010960 -11253410 -8331870 -238898
11742 -238898 4433304 2987438 234054 -651951 -2626156 -7902860 -11423584 -5874847
11734 -5874847 7914110 19606674 19871783 10508665 2117045 1998565 6689835 7792806
11726 7792806 2915514 -2678410 -4682084 -5315272 -8299059 -12218100 -12880327 -10402195
$$ packed form
11782D300353l141401q249366n819357K46476J441098j779332j444509L226662
11774a1219376L922667j327147k769043M638602J0298770L637898p371141o424268
11766f613038O085346J2491561L545185q687325r348539j317222K103962k074089
11758c814159m573844l20803M413133L245608j086162k919628k137847j255647
11750h449349M69585L857034M825702k51274o462658n242450K921540Q092972
11742b38898M672202j445866k753384q86005j974205n276704l520724N548737
11734e874847J3788957J1692564K65109r363118q391620j18480M691270J102971
11726G792806m877292n593924k003674o33188k983787l919041o62227K478132
$$ plain form
11718 -10402195 -9526892 -12583391 -15419966 -11961204 -1698628 8386681 9770795 1042786
11710 1042786 -9511342 -11844016 -5237898 912744 -1412337 -9631856 -15353921 -15419023
11702 -15419023 -13772002 -13560370 -12582179 -8232610 -3361489 -3735982 -10016095 -14979847
11694 -14979847 -11006096 -18570 7182230 3707224 -4251492 -5482290 1128639 6288106
11686 6288106 4973974 2977264 5707808 8831277 6252581 937252 58884 3698725
11678 3698725 6128305 5196198 2848505 -1061031 -7617792 -13422332 -14105429 -11700654
11670 -11700654 -10818606 -9507624 -2944759 5261215 6105941 22305 -2282104 3805362
11662 3805362 10199521 9738852 6262669 5666759 6086983 3712722 586276 -731897 -3585285
$$ packed form
11718a0402195Q75303l056499k836575L458762J0262576J0085309J384114q728009
11710A042786j0554128k332674O606118O150642k325081q219519n722065o5102
11702a5419023J647021K11632R78191M349569M871121l74493o280113m963752
11694a4979847L973751J0987526P200800l475006p958716j230798O610929N159467
11686F288106j314132j996710K730544L123469k578696n315329q78368L639841
11678C698725K429580r32107k347693l909536o556761n804540o83097K404775
11670a1700654Q82048J310982O562865Q205974Q44726o083636k304409O087466
11662C805362O394159m60669l476183n95910M20224k374261l126446j318173k853388
$$ plain form
11653 -3585285 -10330982 -14470139 -8411262 4089215 11349153 8154682 139598 -5137056
11645 -5137056 -5552683 -3117694 -190830 2199791 4486657 6783370 6875870 3096937 -494506
11636 -494506 2654736 11172987 15134195 9622031 2073478 638193 2073546 -1187560
11628 -1187560 -7617535 -9431216 -5239870 -562387 2228141 5424366 8474095 7788896
11620 7788896 4281214 3169304 5553664 7249159 6490865 5834277 5935571 4636191 2953555
11611 2953555 4456411 7331068 4793038 -4249230 -12226072 -13515715 -11204580 -10067858
11603 -10067858 -9644099 -8358915 -8153373 -10070281 -10615827 -7666230 -5346178 -7757877
11595 -7757877 -11899867 -12258904 -9133893 -7046165 -7585459 -8937202 -10131389 -10828924 -9147642
$$ packed form
11653c585285o745697m139157O058877J2500477P259938l194471q015084n276654
11645e137056m15627K434989K926864K390621K286866K296713R2500l778933l591443
11636d94506L149242Q518251L961208n512164p548553j435285J435353l261106
11628a187560o429975j813681M191346M677483K790528L196225L049729o85199
11620G788896l507682j111910K384360J695495p58294o56588J01294j299380j682636
11611B953555J502856K874657k538030r042268p976842j289643K311135J136722
11603a0067858M23759J285184K05542j916908n45546K949597K320052k411699
11595g757877m141990l59037L125011K087728n39294j351743j194187o97535J681282
$$ plain form
11586 -9147642 -4710961 -1794605 -4278595 -9292628 -11217183 -10251550 -10964764 -13460165
11578 -13460165 -12787224 -7457988 -1959748 535421 1751874 2696466 863395 -3645847
11570 -3645847 -5151715 -389906 5178059 4843353 1246237 2989820 11876466 19900183
11562 19900183 19774110 13301381 7427992 5887817 7221930 8590791 8993154 9378902
11554 9378902 10612876 11124115 7567252 -334538 -6864241 -5718201 1882424 8489593
11546 8489593 10197004 10188844 10936098 8743300 557806 -8245066 -9173575 -1986893 4949217
11537 4949217 5292846 888412 -2734212 -2604014 466418 3218402 2121791 -2698137
11529 -2698137 -6238977 -4866772 -2413780 -4878957 -10100186 -9850260 -3160505 448344
$$ packed form
11586i147642M436681K916356k483990n014033j924555R65633p13214k495401
11578a3460165O72941N329236N498240K495169J216453R44592j833071m509242
11570c645847j505868M761809N567965l34706l597116J743583Q886646Q023717
11562A9900183j26073o472729n873389j540175J334113J368861M02363L85748
11554I378902J233974N11239l556863p901790o529703J146040P600625O607169
11546H489593J707411q160P47254k192798q185494q802872r28509P186682O936110
11537D949217L43629m404434l622624J30198L070432K751984j096611m819928
11529b698137l540840J372205K452992k465177n221229K49926O689755L608849
$$ plain form
11521 448344 -5270476 -13427724 -13757384 -7036513 -2728194 -4992307 -8042298 -5125058
11513 -5125058 3353510 11611182 14951298 13518184 11149955 10308569 8055784 -66239
11505 -66239 -11146962 -14873871 -6399659 4970744 5889237 -4573830 -14760852 -15573809
11497 -15573809 -9410424 -3725651 -1785579 -1725866 -338017 4258643 10581080 13261428
11489 13261428 7754856 -3336882 -11662953 -11892980 -6444865 -1051102 1067514 -169603
11481 -169603 -3190984 -5052080 -2988376 2441706 7581760 9911969 9979985 8867699 6830510
11472 6830510 5207431 6062679 8232899 7154860 975047 -6227892 -10083143 -11834812
11464 -11834812 -14868982 -17609127 -14944485 -6681805 312633 490385 -3328666 -4511978
$$ packed form
11521D48344n718820q157248l29660O720871M308319k264113l049991K917240
11513e125058Q478568Q257672L340116j433114k368229q41386k252785q122023
11505f6239j1080723l726909Q474212J1370403R18493j0463067j0187022q12957
11497a5573809O163385N684773J940072N9713J387849M596660O322437K680348
11489A3261428n506572j1091738q326071k30027N448115N393763K118616j237117
11481a69603l021381j861096K063704N430082N140054K330209O8016j112286k037189
11472F830510j623079Q55248K170220j078039o179813p202939l855251j751669
11464a1834812l034170k740145K664642Q262680O994438J77752l819051j183312
$$ plain form
11456 -4511978 -2129164 -1464912 -4827900 -6752355 -1733117 6614471 9713367 6547408
11448 6547408 5458302 11247716 16744312 12498222 857215 -6348969 -2913134 5246489
11440 5246489 9088023 6451501 1607288 -580716 2107677 8285988 12951881 11129204
11432 11129204 3632122 -2794577 -2710585 2328503 6325148 5080758 -1152062 -9036157
11424 -9036157 -14467668 -14816432 -10336545 -3310570 3799472 8659078 9194006 5762532
11416 5762532 1890910 -18422 -2243383 -7407838 -12469146 -12428179 -9073232 -9254479 -13757454
11407 -13757454 -15248040 -9808193 -3313229 -2208344 -4535364 -5462231 -5689302 -7603303
11399 -7603303 -8035318 -2848654 4470632 7039400 5402743 5753016 8483493 7794577 3383296
$$ packed form
11456d511978K382814O64252l362988j924455N019238Q347588L098896l165959
11448F547408j089106N789414N496596m246090j1641007p206184L435835Q159623
11440E246489L841534k636522m844213k188004K688393O178311M665893j822677
11432A1129204p497082o426699Q3992N039088L996645j244390o232820p884095
11424i036157n431511l48764M479887P025975P110042M859606N34928l431474
11416E762532l871622j909332k224961n164455n061308M0967L354947j81247m502975
11407a3757454j490586N439847O494964J104885k327020r26867k27071j914001
11399g603303m32015N186664P319286K568768j636657L50273K730477o88916m411281
$$ plain form
11390 3383296 2774859 8710566 13085135 8985693 1678256 695757 6116825 10379815
11382 10379815 10507012 10297557 11300115 9697666 3827080 -1691184 -2373584 127838
11374 127838 1556996 1067882 508451 457968 357853 664180 1664081 1747030 168965 86750
11364 86750 4777333 11408380 13201525 8736157 4728273 7167946 13091472 14517553
11356 14517553 8637655 695262 -2577172 407664 5821246 8438079 5763274 -15323
11348 -15323 -3845320 -2749925 1008732 2453046 -1105420 -8521312 -16802011 -22505878
11340 -22505878 -22333975 -15708267 -7344098 -4404411 -9389962 -17246328 -20684179 -17147571
11332 -17147571 -9521146 -1570135 5047372 9500824 10157000 6291653 824426 -1112793
$$ packed form
11390C383296o08437N935707M374569m099442p307437r82499N421068M262990
11382A0379815J27197k09455J002558j602449n870586n518264o82400K501422
11374A27838J429158m89114n59431n0483j00115L06327R99901Q2949j578065q2215
11364H6750M690583O631047J793145m465368m007884K439673N923526J426081
11356A4517553n879898p942393l272434K984836N413582K616833k674805n778597
11348a5323l829997J095395L758657J444314l558466p415892q280699n703867
11340b2505878J71903O625708Q364169K939687m985551p856366l437851L536608
11332a7147571P626425P951011O617507M453452O56176l865347n467227j937219
$$ plain form
11324 -1112793 2371890 7464036 9426529 8370774 7454642 6640217 2901265 -2892459
11316 -2892459 -4797843 -387257 4137551 1719972 -6088747 -12102942 -12942093 -10157717
11308 -10157717 -4665818 3018897 8062749 4630540 -4499851 -8298478 -548838 12255852
11300 12255852 19106632 16707964 10672218 7795055 10053077 14057805 14355202 8870454
11292 8870454 1613578 -2385405 -4137363 -8263603 -13766097 -13565520 -4990018 5811407
11284 5811407 12994453 17842545 21934126 20412333 9388984 -4630422 -10950102 -7958115
11276 -7958115 -2787724 322894 3272066 6383302 6111559 2255215 120283 2444839
11268 2444839 5003456 3588391 332085 -764098 -458275 -2062877 -5492699 -7927694
$$ packed form
11324a112793L484683N092146J962493j055755r16132q14425l738952n793724
11316b892459j905384M410586M524808k417579p808719o014195q39151K784376
11308a0157717N491899P684715N043852l432209r130391l798627P749640J2804690
11300A2255852O850780k398668o035746k877163K258022M004728K97397n484748
11292H870454p256876l998983j751958m126240n502494K00577Q575502J0801425
11284E811407P183046M848092M091581j521793j1023349j4019406o319680K991987
11276g958115N170391L110618K949172L111236k71743l856344k134932K324556
11268B444839K558617j415065l256306j096183L05823j604602l429822k434995
$$ plain form
11260 -7927694 -8757067 -9747949 -10923234 -9929824 -5869232 -1003008 2167718 3548448 4115569
11251 4115569 3298705 -676367 -7733106 -14301737 -15873626 -11544932 -5315242 -2075399
11243 -2075399 -2597709 -3364797 -1285615 2454403 3850112 1033212 -2967413 -3146848 1615159
11234 1615159 6662902 6812417 2765765 98240 1823522 4812057 4904103 2891583 2926868
11225 2926868 6605634 11230709 13150663 10813152 5445901 563341 -552978 914747
11217 914747 -705279 -8303705 -16214712 -15889408 -6900541 2309524 5302257 4379269 4339503
11208 4339503 4271342 -11469 -7965899 -13916758 -14538851 -12495957 -11394709 -10531149 -7206221
11199 -7206221 -2275962 32009 -2005824 -4776138 -3954014 -192196 1980357 48764
$$ packed form
11260g927694q29373r90882j175285R93410M060592M866224L170726J380730N67121
11251D115569q16864l975072p056739o568631j571889M328694O229690L239843
11243b075399n22310p67088K079182L740018J395709k816900m000625j79435M762007
11234A615159N047743J49515m046652k667525J725282K988535R2046k012520L5285
11225B926868L678766M625075J919954k337511n367251m882560j116319J467725
11217I14747j620026p598426p911007L25304Q988867R210065K992733r22988l9766
11208D339503o8161m282811p954430n950859o22093K042894J101248Q63560L324928
11199g206221M930259K307971k037833k770314Q22124L761818K172553j931593
$$ plain form
11191 48764 -4166490 -7899282 -10445392 -12111063 -12667263 -12037411 -10357026 -6368288 1344416
11182 1344416 9886214 12542336 7223852 1259668 2757880 9138452 10347326 3161440
11174 3161440 -4490564 -5409245 -2857550 -4107365 -9084619 -11381303 -8282017 -3676882
11166 -3676882 -1045360 1064489 4848709 8619847 9265620 7170080 5733821 6582593
11158 6582593 7638105 6506533 4351152 5021195 10045547 15334792 14468431 6079648
11150 6079648 -3507187 -7075937 -5074323 -4134283 -6819229 -7479945 -1402025 6095692
11142 6095692 5751701 -2043257 -6958074 -3164894 3202713 4563549 2874683 3813457
11134 3813457 5549947 2217923 -3985275 -3992531 4172155 11481971 10467624 4060648 -1258259
$$ packed form
11191D8764m215254l732792k546110j665671n56200O29852J680385L988738P712704
11182A344416Q541798K656122n318484n964184J498212O380572J208874p185886
11174C161440p652004r18681K551695j249815m977254k296684L099286M605135
11166c676882K631522K109849L784220L771138O45773k095540j436259Q48772
11158F582593J055512j131572k155381O70043N024352N289245q66361q388783
11150F079648r586835l568750K001614R40040k684946o60716O077920P497717
11142F095692l43991p794958m914817L793180O367607J360836j688866R38774
11134C813457J736490l332024o203198p256Q164686P309816j014347o406976n318907
$$ plain form
11125 -1258259 -3714703 -3352620 1911033 11224492 17408358 15411860 10038873 8628475
11117 8628475 9660258 5816374 -4099556 -13452091 -16615571 -13357017 -6022919 1470417
11109 1470417 3680060 -631864 -4371466 -524503 7239745 10096932 7989133 8212001
11101 8212001 11064865 8706179 271582 -3972902 1426637 7834361 6154244 535611
11093 535611 133714 4614872 7209538 7021398 8853572 13603035 16950175 16017188 11205854
11084 11205854 3753571 -3000870 -3251494 4206733 11835965 12484089 8841090 7117134
11076 7117134 6195838 1953143 -2111278 155355 4423821 271286 -11270581 -17325831
11068 -17325831 -12540880 -6163051 -5370813 -4024270 4513350 14097863 15338600 10808951
$$ packed form
11125a258259k456444L62083N263653R313459O183866j996498n372987j410398
11117H628475J031783l843884r915930r352535l163480L258554P334098P493336
11109A470417K209643m311924l739602L846963P764248K857187k107799K22868
11101H212001K852864k358686q434597m244484N399539O407724j680117n618633
11093E35611m01897M481158K594666j88140J832174M749463L347140r32987m811334
11084A1205854p452283o754441k50624P458227P629232O48124l642999j723956
11076G117134r21296m242695m064421K266633M268466m152535j1541867o055250
11068a7325831M784951O377829P92238J346543Q537620R584513J240737m529649
$$ plain form
11060 10808951 9982038 13699624 14394667 9747329 6114910 7771235 10837657 10186084
11052 10186084 6730522 5038807 6796291 8866748 6980596 965665 -3799916 -1950221
11044 -1950221 4517121 7671170 3642034 -2813729 -5684820 -4795006 -2458393 1408083
11036 1408083 5974149 6632122 1974689 -814434 4696556 12841551 12704829 4413559
11028 4413559 -986864 2115102 7337334 7936756 5861944 5472058 5887649 4413039 1943797
11019 1943797 549551 139171 986483 5021366 11303876 14737352 12512180 7399783
11011 7399783 1987075 -4789572 -11966593 -13850045 -8253406 -1865013 -1378295 -4178766
11003 -4178766 -4298324 -2813016 -4642825 -8887258 -10863161 -11087906 -13349819 -15564284
$$ packed form
11060A0808951q26913L717586O95043m647338l632419J656325L066422o51573
11052A0186084l455562j691715J757484K070457j886152o014931m765581J849695
11044a950221O467342L154049m029136o455763k871091Q89814K336613L866476
11036A408083M566066O57973m657433k789123N510990Q144995j36722q291270
11028D413559n400423L101966N222232N99422k074812l89886M15591j474610k469242
11019A943797j394246m10380Q47312M034883O282510L433476k225172n112397
11011G399783n412708o776647p177021j883452N596639O388393M86718k800471
11003d178766j19558J485308j829809m244433j975903k24745k261913k214465
$$ plain form
10995 -15564284 -11983787 -4069748 483622 265125 1685610 5950190 5203184 -3390237
10987 -3390237 -9448630 -2931095 10983245 18847532 16180394 9691275 5465784 3203375
10979 3203375 1181648 -400335 -1613349 -2939637 -2870821 252291 4464133 6814287
10971 6814287 8860486 13958635 19555001 18973118 12118574 7399714 9798871 13328269
10963 13328269 10160736 2088245 -3377362 -4780490 -7059905 -11059776 -10517291 -1954592
10955 -1954592 8224498 10837654 5233130 -585470 -22315 5544061 10550649 12484462
10947 12484462 13084758 13415109 10958401 3775536 -4082559 -5472230 373157 5486127
10939 5486127 3670007 -442123 1393606 7292482 7044711 -1813573 -9040892 -6854666
$$ packed form
10995a5564284L580497P914039M553370k18497J420485M264580p47006q593421
10987c390237o058393O517535J3914340P864287k667138o489119m225491k262409
10979C203375k021727j581983j213014j326288O8816L123112M211842K350154
10971F814287K046199N098149N596366n81883o854544m718860K399157L529398
10963A3328269l167533q072491n465607j403128k279415l999871N42485Q562699
10955a954592J0179090K613156n604524n818600N63155N566376N006588J933813
10947A2484462O00296L30351k456708p182865p858095j389671N845387N112970
10939E486127j816120m112130J835729N898876k47771q858284p227319K186226
$$ plain form
10931 -6854666 -1325467 -1490716 -4412566 -1140031 7052106 10284706 6754200 5666191
10923 5666191 11646984 17706708 18038304 17292142 20562749 23118620 18388496 9383784
10915 9383784 3391838 545594 -3294921 -6515155 -4384166 844552 2285553 -200110
10907 -200110 -378955 2847099 3777732 683502 -1108157 858579 1940910 -587961 -2365260
10898 -2365260 37408 3080992 2882098 1410837 1177504 -131706 -4199811 -6931994
10890 -6931994 -5008004 -2637132 -4845479 -8103890 -5381240 2101980 6190036 3804113
10882 3804113 -54419 -1547885 -2950989 -6623812 -10244367 -10890391 -9367420 -7709365
10874 -7709365 -5884018 -3556763 -2221987 -3010555 -4544770 -5168975 -5396013 -6077444 -6024758
$$ packed form
10931f854666N529199j65249k921850L272535Q192137L232600l530506j088009
10923E666191N980793O059724L31596p46162L270607K555871m730124r004712
10915I383784n991946k846244l840515l220234K130989N228718J441001k485663
10907b00110j78845L226054R30633l094230j791659J966736J082331k528871j777299
10898b365260K402668L043584j98894j471261k33333j309210m068105k732183
10890f931994J923990K370872k208347l258411K722650P483220M088056k385923
10882C804113l858532j493466j403104l672823l620555o46024J522971J658055
10874g709365J825347K327255J334776p88568j534215o24205k27038o81431N2686
$$ plain form
10865 -6024758 -3881515 -906506 959738 3086720 8830276 17274481 21228705 14376457
10857 14376457 -193919 -11375556 -10986149 -1633461 7527875 11004584 10493679 9449071
10849 9449071 8143989 5624893 3567017 4909366 9095975 11369262 8056473 1451938
10841 1451938 -2341694 -923165 806947 -3012243 -9859015 -10061221 387998 12289816
10833 12289816 13475506 4471937 -2294704 982081 8366669 9928880 4560789 -1515512
10825 -1515512 -4679111 -6300668 -7029699 -4927742 -306465 2201230 -980917 -7237129
10817 -7237129 -10636036 -9178593 -6707072 -6958070 -7987479 -5123330 1351248 5367195
10809 5367195 3264573 -1192426 -3244977 -4886908 -10758751 -18429185 -19663003 -11919200
$$ packed form
10865f024758K143243K975009J866244K126982N743556Q444205L954224o852248
10857A4376457j4570376j1181637L89407R352688R161336L476709n10905j044608
10849I449071j305082k519096k057876J342349M186609K273287l312789o604535
10841A451938l793632J418529J730112l819190o846772k02206J0449219J1901818
10833A2289816J185690r003569o766641L276785P384588J562211n368091o076301
10825a515512l163599j621557p29031K101957M621277K507695l182147o256212
10817g237129l398907J457443K471521k50998j029409K864149O474578M015947
10809E367195k102622m456999k052551j641931n871843p670434j233818P743803
$$ plain form
10801 -11919200 -2317371 1902690 1666354 2178646 5147530 8018739 7912230 3786929
10793 3786929 -2987999 -8816086 -11099313 -11528006 -12666011 -11866490 -4372295 6985607
10785 6985607 12395316 8042588 1622190 1084981 4464389 5697345 4225756 2670964
10777 2670964 256135 -4463634 -8030150 -6026882 -241258 3606900 2980393 -957973
10769 -957973 -6407596 -9979611 -7173271 741552 5087224 1289388 -3069549 797855
10761 797855 9006555 11336129 7266403 4839953 5803382 3524507 -4063170 -10391757
10753 -10391757 -11112624 -9524592 -8538625 -5665869 787462 7515035 11059406 11101679 7498539
10744 7498539 308351 -6229434 -6639765 -2382734 -233929 -1726901 -1881728 722864
$$ packed form
10801a1919200R601829M220061k36336N12292K968884K871209j06509m125301
10793C786929o774928n828087k283227m28693j138005P99521P494195J1357902
10785F985607N409709m352728o420398n37209L379408J232956j471589j554792
10777B670964k414829m719769l566516K003268N785624L848158o26507l938366
10769i57973n449623l572015K806340P914823M345672l797836m358937L867404
10761G97855Q208700K329574m069726k426450R63429k278875p587677o328587
10753a0391757p20867J588032R85967K872756O453331O727573L544371M2273l603140
10744G498539p190188o537785m10331M257031K148805j492972j54827K604592
$$ plain form
10736 722864 1619956 343559 3329120 13205156 23443657 27501858 25549732 19113010
10728 19113010 8249827 -1930717 -2166118 7441472 14300188 10565687 3887000 2908291
10720 2908291 2354987 -6153258 -17005502 -18131337 -10523302 -6285017 -9646491 -13224533
10712 -13224533 -12392000 -10313834 -7631758 245992 12231404 18839690 15005139 6885076
10704 6885076 1603850 -1534469 -4837099 -5249639 -128570 5744058 5615180 -162956
10696 -162956 -5672827 -7152465 -4967091 -895246 2434297 2074601 -1481044 -3525169
10688 -3525169 -1306750 2013288 2872100 3176382 6413954 11255042 14056704 14898559 15496348
10679 15496348 13537123 5861565 -3710908 -7012247 -2916096 481042 -2729403 -8321639
$$ packed form
10736G22864Q97092j276397K985561R876036J0238501M058201j952126o436722
10728A9113010j0863183j0180544k35401R607590O858716l734501o678687r78709
10720B908291n53304q508245j0852244j125835P608035M238285l361474l578042
10712a3224533Q32533K078166K682076P877750J1985412O608286l834551q120063
10704F885076n281226l138319l302630m12540N121069N872628j28878n778136
10696a62956n509871j479638K185374M071845L329543l59696l555645k044125
10688c525169K218419L320038Q58812L04282L237572M841088K801662Q41855N97789
10679A5496348j959225p675558r572473l301339M096151L397138l210445n592236
$$ plain form
10671 -8321639 -8485642 -1841013 6548822 11798187 12385809 9086518 3936475 -713545
10663 -713545 -3623431 -4086300 -425929 7509493 14443869 13442596 5167878 -1925451
10655 -1925451 -2993598 -2720331 -6632636 -12707566 -16179654 -16507014 -13965420 -5823727
10647 -5823727 6959712 15752879 15806104 15440404 22789787 29507575 22139981 6116236
10639 6116236 1104814 11667269 20318508 14788001 5271333 5682381 12336470 13129954
10631 13129954 7015139 1617819 -1077456 -4632124 -8629718 -9537941 -7655788 -5317244
10623 -5317244 -2053364 2092050 3681140 2333860 3500430 8595468 10352779 5144610
10615 5144610 788526 3574549 7524252 6659770 6930401 13306296 16546854 8955305
$$ packed form
10671h321639j64003O644629Q389835N249365N87622l299291n150043m650020
10663g13545k909886m62869L660371P935422O934376j001273q274718p093329
10655a925451j068147K73267l912305o074930l472088l27360K541594Q141693
10647e823727J2783439Q793167N3225l65700P349383O717788p367594j6023745
10639F116236n011422J0562455Q651239n530507r516668M11048O654089P93484
10631A3129954o114815n397320k695275l554668l997594r08223J882153K338544
10623e317244L263880M145414J589090j347280J166570N095038J757311n208169
10615E144610m356084K786023L949703q64482K70631O375895L240558p591549
$$ plain form
10607 8955305 2643592 12238929 27544725 26335066 9987798 1613644 8696214 13107158
10599 13107158 3517116 -6500011 -2880502 6924700 9297079 5750471 5336289 8012604
10591 8012604 8534741 7750993 8682496 8688501 5016746 1532802 1933437 2780623 255416
10582 255416 -2871389 -3438936 -4155462 -7310733 -8759675 -4221223 4162297 12197977 18522569
10573 18522569 21773136 20223953 17421022 19911557 26147817 26810415 19642780 13836953
10565 13836953 15390111 18745784 18253359 17256917 19546674 21763470 20756718 19229188
10557 19229188 18339483 14314444 7816469 6302310 11322994 14142461 9887199 5122855
10549 5122855 5540536 7626364 8342347 10612695 13205770 8959420 -68334 -606084 10588837
$$ packed form
10607H955305o311713R595337J5305796j209659j6347268q374154P082570M410944
10599A3107158r590042j0017127L619509R805202K372379l546608m14182K676315
10591H012604N22137p83748R31503O005l671755l483944M00635Q47186k525207
10582B55416l126805n67547p16526l155271j448942M538452Q383520Q035680O324592
10573A8522569L250567j549183k802931K490535O236260O62598p167635n805827
10565A3836953J553158L355673m92425r96442K289757K216796j006752j527530
10557A9229188q89705m025039o497975j514159N020684K819467m255262m764344
10549E122855M17681K085828P15983K270348K593075m246350r027754n37750J1194921
$$ plain form
10540 10588837 19181872 16319008 12585355 17506485 22226370 16959319 9835975 11985285
10532 11985285 17646301 16169317 11769185 14381122 21523188 25372771 27627242 32024680
10524 32024680 32715703 25096672 17266717 16357348 15705841 9841676 7802650 15773740
10516 15773740 22084822 16943365 10887547 14942849 19784654 15067127 10992296 17958657
10508 17958657 23980302 17323801 11711756 21855465 34861566 35358436 35929885 49600170
10500 49600170 57907546 44900963 34950675 51458869 68407938 57592278 50758798
10493 50758798 85404783 122276004 108168658 94911985 173636438 285942387 243805391
10486 243805391 -4925272 -259014657 -306195306 -184130125 -87320088 -91746737 -109324778
$$ packed form
10540A0588837Q593035k862864l733653M921130M719885n267051p123344K149310
10532A1985285N661016j476984m400132K611937P142066L849583K254471M397438
10524C2024680O91023p619031p829955r09369o51507n864165k039026P971090
10516A5773740O311082n141457o055818M055302M841805m717527m074831O966361
10508A7958657O021645o656501n612045J0143709J3006101M96870N71449J3670285
10500D9600170Q307376j3006583r950288J6508194J6949069j0815660o833480
10493E0758798L4645985L6871221j4107346j3256673P8724453J12305949m2136996
10486B43805391k48730663k54089385m7180649J22065181R6810037m426649j7578041
$$ plain form
10479 -109324778 -77144991 -43788967 -54109681 -71595890 -57402842 -36621729 -39445012
10472 -39445012 -44953778 -28891914 -12820845 -21760913 -36430322 -29004554 -11107657
10465 -11107657 -7744606 -13066097 -8781582 -2087933 -9712305 -23135240 -23054212 -14322384
10457 -14322384 -15857180 -26134203 -26974533 -15386460 -6914608 -10342666 -19119568 -25915432
10449 -25915432 -29374852 -28221675 -21979210 -15762658 -14272810 -14281891 -11275432 -8320044
10441 -8320044 -10052793 -13504311 -13150361 -9945425 -8111572 -8085238 -8719679 -10937114 -14101088
10432 -14101088 -14834754 -13385469 -14004429 -16075833 -14011150 -8941761 -9258123 -15254391
10424 -15254391 -15863807 -6855241 637976 -2455025 -9932840 -13531445 -16468173 -22824882
$$ packed form
10479a09324778L2179787L3356024j0320714j7486209J4193048K0781113k823283
10472c9445012n508766J6061864J6071069q940068j4669409P425768J7896897
10465a1107657L363051n321491M284515O693649p624372j3422935Q1028Q731828
10457a4322384j534796j0277023q40330J1588073Q471852l428058q776902o795864
10449b5915432l459420J153177O242465O216552J489848r081L006459K955388
10441h320044j732749l451518L53950L204936J833853K6334o34441k217435l163974
10432a4101088p33666J449285o18960k071404K064683N069389l16362n996268
10424a5254391o09416R008566P493217l093001p477815l598605k936728o356709
$$ plain form
10416 -22824882 -25595462 -18507534 -9758397 -10040728 -14961685 -13396456 -6575645 -4324754
10408 -4324754 -7058955 -5944899 1267240 7228718 6694433 869863 -8081146 -17139136
10400 -17139136 -19527784 -11928502 -2782410 -3443583 -12345794 -17495330 -13613954 -7183666
10392 -7183666 -4691902 -5190015 -5563238 -5187484 -3660990 -87786 4018936 5662350 4468055
10383 4468055 2455903 998304 1040207 3451756 5872028 3524979 -2935592 -6120677
10375 -6120677 -3314317 -1909175 -6536244 -9085736 -1813174 6919140 3112727 -11253537
10367 -11253537 -21054739 -20174332 -16764483 -16884165 -17077812 -14973326 -13979859 -14145327 -10245818
10358 -10245818 -2876371 -577236 -6732734 -14252960 -17049655 -16920520 -15513305 -10217364
$$ packed form
10416b2824882k770580P087928Q749137k82331m920957J565229O820811K250891
10408d324754k734201J114056P212139N961478n34285n824570q951009r057990
10400a7139136k388648P599282R146092o61173q902211n149536L881376O430288
10392g183666K491764m98113l73223L75754J526494L573204M106722J643414j194295
10383D468055k012152j457599M1903K411549K420272k347049o460571l185085
10375f120677K806360J405142m627069k549492P272562Q732314l806413j4366264
10367a1253537r801202Q80407L409849j19682j93647K104486R93467j65468L899509
10358a0245818P369447K299135o155498p520226k796695J29135J407215N295941
$$ plain form
10350 -10217364 -2633781 -367476 -4900913 -8014163 -5674294 -4131177 -5802551 -2022112
10342 -2022112 10640205 19418831 13291643 1030647 -3212711 -2674815 -8770484 -16390819
10334 -16390819 -9684814 8989050 17758634 7343665 -5182451 -3412826 4532359 1716765
10326 1716765 -10656181 -16923462 -10564600 16073 6142116 6834648 2912307 -5645598
10318 -5645598 -14566192 -16298124 -9539003 -2082004 -1432406 -6746738 -12016901 -13377714
10310 -13377714 -11008144 -6737460 -2301367 1209126 3557520 4756877 4585205 3454406
10302 3454406 2611203 2170232 540487 -2465416 -4070837 -2549301 -490594 -878171 -2305404
10293 -2305404 -2044161 -1367057 -2726934 -3874260 -1211353 2376096 707607 -4623067
$$ packed form
10350a0217364P583583K266305m533437l113250K339869J543117j671374L780439
10342b022112J2662317Q778626o127188j2260996m243358N37896o095669p620335
10334a6390819O706005J8673864Q769584j0414969j2526116J769625P945185k815594
10326A716765j2372946o267281O358862J0580673O126043O92532l922341q557905
10318e645598q920594j731932O759121P456999O49598n314332n270163j360813
10310a3377714K369570M270684M436093L510493K348394J199357j71672j130799
10302C454406q43203m40971j629745l005903j605421J521536K058707l87577j427233
10293b305404K61243O77104j359877j147326K662907L587449j668489n330674
$$ plain form
10285 -4623067 -4893005 2076246 7624265 5522305 917726 -96846 -1836429 -10871558
10277 -10871558 -21863991 -22265505 -9704869 4913811 12197330 13564609 13809339 12253458
10269 12253458 5657862 -4936599 -14460383 -18414991 -15258991 -7358644 -1201716 -2726173
10261 -2726173 -9851128 -13330403 -8303974 -1599113 -3128727 -12382781 -18938131 -16062743
10253 -16062743 -8312307 -3845620 -4018880 -4621724 -4467755 -6955112 -12732560 -16300063
10245 -16300063 -13281380 -7741435 -7745976 -14907566 -22709880 -24922088 -21253334 -14298061
10237 -14298061 -5973471 938743 2354197 -2445472 -8608287 -11177636 -10173693 -7881336
10229 -7881336 -4857758 -2250404 -4208032 -12672409 -22148405 -25099258 -21162697 -16141204
$$ packed form
10285d623067k69938O969251N548019k101960m604579j014572j739583r035129
10277a0871558j0992433m01514J2560636J4618680P283519J367279K44730j555881
10269A2253458o595596j0594461r523784l954608L156000P900347O156928j524457
10261b726173p124955l479275N026429O704861j529614r254054o555350K875388
10253a6062743P750436M466687j73260o02844J53969k487357n777448l567503
10245a6300063L018683N539945m541p161590p802314k212208L668754O955273
10237a4298061Q324590O912214J415454m799669o162815k569349J003943K292357
10229g881336L023578K607354j957628q464377r475996k950853L936561N021493
$$ plain form
10221 -16141204 -13590503 -12947120 -14299802 -18080399 -20293782 -15468363 -5703305 210467
10213 210467 -1070822 -3099230 -717590 1647545 -1660484 -6759011 -5498070 1443276
10205 1443276 4714629 -488205 -8091628 -9780693 -4872450 1028640 3435882 1725053
10197 1725053 -3124466 -9583298 -14682964 -15431524 -12260535 -8867605 -7260497 -5133240
10189 -5133240 -489262 3257356 1092435 -5078962 -6989146 -1051237 5920047 5569778
10181 5569778 -1287410 -7183951 -7940576 -5000336 -778858 2086398 -910031 -10990985
10173 -10990985 -20102148 -18356553 -8222427 -2591311 -6541432 -10567456 -6645382 -1350854
10165 -1350854 -4617318 -12715001 -13047758 -2230063 10905068 18506422 19737074 14245004
$$ packed form
10221a6141204K550701O43383j352682l780597k213383M825419R765058N913772
10213B10467j281289k028408K381640K365135l308029n098527J260941O941346
10205A443276L271353n202834p603423j689065M908243N901090K407242j710829
10197A725053m849519o458832n099666p48560L170989L392930J607108K127257
10189e133240M643978L746618k164921o171397j910184N937909O971284l50269
10181E569778o857188n896541p56625K940240M221478K865256k996429j0080954
10173a0990985r111163J745595J0134126N631116l950121m026024L922074N294528
10165a350854l266464q097683l32757J0817695J3135131P601354J230652n492070
$$ plain form
10157 14245004 905673 -14367379 -20104727 -13912306 -7218464 -9152073 -13300028 -8682469
10149 -8682469 2308502 7510078 3511049 -878532 -182690 -109340 -5687954 -10899600
10141 -10899600 -7361065 2353552 7813650 4474404 -2359442 -5969946 -4630129 -9770
10133 -9770 5223000 7510893 4666939 -852466 -4270088 -4477326 -4397644 -5496639 -6038920
10124 -6038920 -5284552 -5103980 -6141534 -6172703 -3765869 -374182 2228502 3397086 2166097
10115 2166097 -1610103 -4372955 -2208641 1997680 719176 -6821858 -11775092 -7731066
10107 -7731066 238685 3182417 -287200 -5234722 -8366290 -9060469 -6392670 -1062139
10099 -1062139 2822893 3293863 4516247 9761454 14337726 12273002 6616344 5290836
$$ packed form
10157A4245004j3339331j5273052n737348O192421O693842j933609m147955M617559
10149h682469J0990971N201576l999029m389581O95842P3350n578614n211646
10141a0899600L538535R714617N460098l339246o833846l610504J339817M620359
10133i770N232770K287893k843954n519405l417622k07238P9682j098995n42281
10124f038920P54368J80572j037554l1169K406834L391687K602684J168584j230989
10115B166097l776200k762852K164314M206321j278504p541034m953234M044026
10107g731066P969751K943732l469617m947522l131568o94179K667799N330531
10099a062139L885032M70970J222384N245207M576272k064724n656658j325508
$$ plain form
10091 5290836 8861458 10407519 6466027 408199 -4583335 -8487580 -10611790 -10146791
10083 -10146791 -10641137 -16471817 -24344948 -25878763 -19661428 -13042584 -10382771 -7687196
10075 -7687196 -1870927 2538085 604531 -5298093 -9936178 -12562651 -15046648 -16590606
10067 -16590606 -15149591 -11614327 -8590173 -6693797 -4971845 -3447048 -2900626 -3234893
10059 -3234893 -3492550 -2683272 -470035 1752017 1426192 -1575273 -3667814 -2490998 -448353
10050 -448353 373889 2986802 9302066 13200119 8482152 1106422 2697815 12210694
10042 12210694 16032140 8723695 1508708 4844359 13588430 17015372 14447746 12136409
10034 12136409 11605863 10278881 8749650 8902179 8552661 5610358 3989932 7826850
$$ packed form
10091E290836L570622J546061l941492o057828m991534l904245k124210M64999
10083a0146791m94346n830680p873131j533815O217335O618844K659813K695575
10075g687196N816269M409012j933554n902624m638085k626473k483997j543958
10067a6590606J441015L535264L024154J896376J721952J524797N46422l34267
10059c234893k57657Q09278K213237K222052l25825l001465k092541J176816K042645
10050d48353Q22242K612913O315264L898053m717967p375730J591393R512879
10042A2210694L821446p308445p214987L335651Q744071L426942k567626k311337
10034A2136409n30546j326982j529231J52529l49518k942303j620426L836918
$$ plain form
10026 7826850 13046995 12407408 6378916 1516277 300503 287078 1335172 5193894 8680347
10017 8680347 6071782 -822766 -3241866 1796311 7053350 6620487 4495439 6207892
10009 6207892 7887893 1654283 -10445890 -16437668 -10223318 -659321 -159894 -8454028
10001 -8454028 -14151633 -11001682 -4982064 -3350037 -4094504 -1480475 3588532 5939483
9993 5939483 5359513 5607037 6138636 3075684 -2261061 -4407019 -3799975 -6739286 -13539425
9984 -13539425 -16166569 -11305365 -6572498 -8181416 -10723504 -6534330 1353329 3979700
9976 3979700 -218007 -5147278 -7424080 -8955333 -10182445 -8271380 -3170754 92872
9968 92872 -2663778 -9620608 -15218426 -15770613 -11855803 -6362353 -1669099 615672 -1447010
$$ packed form
10026G826850N220145o39587o028492m862639j215774j3425J048094L858722L486453
10017H680347k608565o894548k419100N038177N257039m32863k125048J712453
10009F207892J680001o233610j2100173n991778O214350R563997M99427q294134
10001h454028n697605L149951O019618J632027p44467K614029N069007K350951
9993E939483n79970K47524N31599l062952n336745k145958O07044k939311o800139
9984a3539425k627144M861204M732867j608918k542088M189174P887659K626371
9976C979700m197707m929271k276802j531253j227112J911065N100626L263626
9968I2872k756650o956830n597818n52187L914810N493450M693254K284771k062682
$$ plain form
9959 -1447010 -7992063 -13326291 -9190959 3987729 13969783 10923334 431239 -5385634
9951 -5385634 -5251504 -6796247 -10620484 -9723764 -4540330 -4021611 -9053396 -9320825 -1731200
9942 -1731200 2405321 -3924433 -11088623 -8884056 -2925436 -3388702 -7249653 -4525453
9934 -4525453 4687505 11530351 11792411 7475200 -396651 -10430583 -16258961 -12778727
9926 -12778727 -4206919 1522039 2789851 2425803 981729 -1373805 -1726198 136340
9918 136340 -1121931 -7764215 -14346094 -17329265 -20609188 -25108123 -23469697 -13537376
9910 -13537376 -6095661 -9083934 -14708598 -12815506 -6100501 -1208896 2985946 6577787
9902 6577787 2291415 -8833110 -11798904 -3230265 -2899580 -19388906 -27697226 -11412986
$$ packed form
9959a447010o545053n334228M135332J3178688R982054l046449j0492095n816873
9951e385634J34130j544743l824237Q96720N183434N18719n031785k67429P589625
9942a731200M136521o329754p164190K204567N958620m63266l860951K724200
9934d525453R212958O842846K62060m317211p871851j0033932n828378L480234
9926a2778727Q571808N728958J267812l64048j444074k355534l52393J862538
9918A36340j258271o642284o581879k983171l279923m498935J638426R932321
9910a3537376P441715k988273n624664J893092O715005M891605M194842L591841
9902F577787m286372j1124525k965794Q568639L30685j6489326q308320J6284240
$$ plain form
9894 -11412986 -4463568 -47037084 -112072412 -126998218 -71689634 -5566403 15891144
9887 15891144 5352841 2479547 10991915 10351456 320078 -3279268 -627243 -3477095
9879 -3477095 -9086161 -5975598 2117561 2498549 -2472753 -174542 8165410 9427681
9871 9427681 1923988 -2851615 -772799 295337 -3278855 -5742436 -4456956 -4142825
9863 -4142825 -6586777 -7123762 -3570189 -138467 -779567 -4682722 -8626517 -9570315 -6571235
9854 -6571235 -3165579 -4072798 -7274217 -5763336 454335 3323545 1303388 3252323
9846 3252323 11664979 15164745 6946499 -2317299 -1689263 2420378 -209816 -4169634
9838 -4169634 918973 9825696 10005264 3674557 3103427 8473561 8926708 3177880 1148947
$$ packed form
9894a1412986O949418m2573516o5035328j4925806N5308584O6123231K1457547
9887A5891144j0538303k873294Q512368o40459j0031378l599346K652025k849852
9879c477095n609066L110563Q093159L80988m971302K298211Q339952J262271
9871I427681p503693m775603K078816J068136l574192k463581J285480L14131
9863d142825k443952n36985L553573L431722o41100l903155l943795r43798K999080
9854f571235L405656r07219l201419J510881O217671K869210k020157J948935
9846C252323Q412656L499766q218246r263798O28036M109641k630194l959818
9838d169634N088607Q906723J79568o330707n71130N370134M53147n748828k028933
$$ plain form
9829 1148947 5749969 9686437 10407700 12331274 13839584 7952755 -2659117 -6715299
9821 -6715299 -2585079 -839387 -5875353 -9435923 -6173568 -1963433 -2050153 -3335311 -3265467
9812 -3265467 -4873499 -8159946 -7252219 -909176 4148704 4493930 4510298 5930452 3708512
9803 3708512 -2969490 -6308799 -2295851 2378310 1869990 409875 3377354 7456702
9795 7456702 6645053 1294058 -4795182 -9776456 -11092316 -4659472 7365296 14777710
9787 14777710 11555419 3976187 726274 1026829 -981139 -5647740 -8774148 -9130929
9779 -9130929 -8464989 -7035116 -4689750 -3537418 -4512905 -3993119 1334302 8335656 10396415
9770 10396415 5150588 -3525756 -9622398 -9541814 -4942819 -1784053 -3278238 -4189862 2297337
$$ packed form
9829A148947M601022L936468P21263J923574J508310n886829j0611872m056182
9821f715299M130220J745692n035966l560570L262355M210135q6720j285158O9844
9812c265467j608032l286447R07727O343043N057880L45226J6368J420154k221940
9803C708512o678002l339309M012948M674161n08320j460115K967479M079348
9795G456702q11649n350995o089240m981274j315860O432844J2024768P412414
9787A4777710l222291p579232l249913L00555k007968m666601l126408l56781
9779i130929O65940J429873K345366J152332r75487N19786N327421P001354K060759
9770A0396415n245827q676344o096642Q0584M598995L158766j494185r11624O487199
$$ plain form
9761 2297337 11998534 12125293 -876903 -14145481 -14510990 -5008138 1438104 -498961
9753 -498961 -5216469 -7291804 -7793324 -9279134 -10444233 -7882480 -940076 6305809 8024146
9744 8024146 2673817 -4374057 -6498504 -3229804 1299189 5457049 9849276 11135424
9736 11135424 4486501 -6253934 -9579210 -1293297 9244650 12278492 9215161 5403725
9728 5403725 -395741 -10774245 -19978428 -19544064 -10970919 -4009450 -3686419 -6729003
9720 -6729003 -9720711 -12775488 -14725690 -12129648 -5287632 57211 -564382 -5239706
9712 -5239706 -8634192 -7539122 -3103777 72308 -2584894 -10373214 -16142682 -13512221
9704 -13512221 -5031617 17103 -3714672 -11824293 -15581770 -11232932 -3350951 -79512
$$ packed form
9761B297337R701197J26759j3002196j3268578l65509R502852O446242j937065
9753d98961m717508k075335n01520j485810j165099K561753O942404P245885J718337
9744H024146n350329p047874k124447L268700M528993M157860M392227J286148
9736A1135424o648923j0740435l325276Q285913J0537947L033842l063331l811436
9728E403725n799466j0378504r204183M34364Q573145O961469L23031l042584
9720f729003k991708l054777j950202K596042O842016N344843o21593m675324
9712e239706l394486J095070M435345L176085k657202p788320n769468K630461
9704a3512221Q480604N048720l731775q109621l757477M348838P881981L271439
$$ plain form
9696 -79512 -5208974 -14457006 -19949669 -18132200 -11775201 -4869017 940876 4222221 2585317
9687 2585317 -3568385 -9468218 -11275160 -10303914 -9175823 -7044461 -2575894 1099521
9679 1099521 -522144 -6203557 -9395127 -6052622 969561 5475856 3768559 -2658610
9671 -2658610 -8315274 -8018607 -1490304 6656914 11688295 12008583 8258174 2725453 -133398
9662 -133398 2590219 6881076 5997897 2047611 5538178 18501135 26627497 17370304
9654 17370304 -463051 -7061783 1564316 10210116 8131365 2296398 2394518 4977774
9646 4977774 1386858 -6792518 -10467811 -7124514 -2909937 -2400453 -4378572 -7342578
9638 -7342578 -11711655 -15593827 -15073051 -10900947 -9172997 -12268828 -14142685 -8972108
$$ packed form
9696g9512n129462r248032n492663J817469O356999O906184N809893L281345j636904
9687B585317o153702n899833j806942R71246J128091K131362M468567L675415
9679A099521j621665n681413l191570L342505P022183M506295j707297o427169
9671b658610n656664K96667O528303Q147218N031381L20288l750409n532721k858851
9662a33398K723617M290857q83179l950286L490567J2962957Q126362r257193
9654A7370304j7833355o598732Q626099Q645800k078751n834967R8120K583256
9646D977774l590916q179376l675293L343297M214577N09484j978119k964006
9638g342578m369077l882172N20776M172104J727950l095831j873857N170577
$$ plain form
9630 -8972108 -663026 1906633 -2627515 -6437047 -3805558 1476824 2554662 -1058025
9622 -1058025 -4531684 -5488596 -5790917 -6266714 -4610883 33312 4127743 3865992 114235
9613 114235 -3073826 -3454869 -1991972 -446618 -2220 -1663600 -5275240 -7827323 -5567861
9604 -5567861 597888 4144820 283813 -6915904 -8796782 -4007445 -1228897 -6898050
9596 -6898050 -14988796 -15424819 -9783027 -9365369 -16799076 -19956709 -9691075 5328671
9588 5328671 10553525 6207316 4776202 10476673 13348242 5414025 -7676183 -15186417
9580 -15186417 -13715972 -6880981 932343 6036176 5908200 2473101 850294 1794312
9572 1794312 -20753 -7316979 -15082767 -17654024 -15766000 -12778373 -9319062 -6144441
$$ packed form
9630h972108Q309082K569659m534148l809532K631489N282382J077838l612687
9622a058025l473659r56912l02321m75797J655831M644195M094431k61751l751757
9613A14235l188061l81043J462897J545354M44398j661380l611640k552083K259462
9604e567861O165749L546932l861007p199717j880878M789337K778548n669153
9596f898050q090746m36023N641792M17658p433707l157633J0265634J5019746
9588E328671N224854m346209j431114N700471K871569p934217j3090208p510234
9580a5186417J470445O834991P813324N103833j27976l435099j622807R44018
9572A794312j815065p296226p765788k571257J888024K987627L459311L174621
$$ plain form
9564 -6144441 -6710859 -11173450 -12645502 -5847966 4258935 8759979 6329417 2158996
9556 2158996 -1291818 -5195151 -8345281 -8010547 -6029399 -6955517 -10081191 -9754852 -4172327
9547 -4172327 2019089 4806399 5296152 5984638 7024340 7464858 6821878 4828385 2322612
9538 2322612 1679536 3345089 3664900 155440 -3240691 -1516168 2539108 1326344 -6258594
9529 -6258594 -13196771 -14413040 -11915191 -8905521 -5453348 -2025242 -1037607 -2028553 -661496
9520 -661496 4434438 8571569 7652325 3432868 -695069 -4583891 -8637204 -10592134 -9090439
9511 -9090439 -7147088 -8031179 -10238098 -10215043 -7907368 -6169850 -6478443 -8316719 -11155805
9502 -11155805 -14079540 -14801175 -11841092 -6917389 -3245460 -2259424 -3041813 -3487312 -1338675
$$ packed form
9564f144441n66418m462591j472052O797536J0106901M501044k430562m170421
9556B158996l450814l903333l150130L34734J981148r26118l125674L26339N582525
9547d172327O191416K787310M89753O88486J039702M40518o42980j993493k505773
9538B322612o43076J665553L19811l509460l396131J724523M055276j212764p584938
9529f258594o938177j216269K497849L009670L452173L428106R87635r90946J367057
9520f61496N095934M137131r19244m219457m127937l888822m053313j954930J501695
9511i090439J943351q84091k206919K3055K307675J737518l08593j838276k839086
9502a1155805k923735p21635K960083M923703L671929R86036p82389m45499K148637
$$ plain form
9493 -1338675 3615585 7640551 6454396 1590139 -576168 2011263 3614881 -253983
9485 -253983 -5149382 -4422750 32903 727222 -3307940 -4935854 -478139 4103508 2058354
9476 2058354 -4125641 -6405286 -2487034 1397931 -1029061 -8493218 -14315574 -13972685
9468 -13972685 -8829298 -3440984 -1020140 -1545824 -2778405 -2494363 -702673 -35302 -2556836
9459 -2556836 -5700663 -3890924 3647620 9163164 4657066 -6763437 -12691557 -6051076
9451 -6051076 6216025 11795380 7130818 -704933 -4253129 -3328164 -2175005 -2693650
9443 -2693650 -2915771 -1258355 -68123 -3415083 -11232393 -17227980 -14620747 -3923904
9435 -3923904 6777833 9814302 4894278 -2005013 -4932886 -2658678 1237178 2190839
$$ packed form
9493a338675M954260M024966j186155m864257k166307K587431J603618l868864
9485b53983m895399P26632M455653O94319m035162j627914M457715M581647k045154
9476B058354o183995k279645L918252L884965k426992p464157n822356L42889
9468a3972685N143387N388314K420844n25684j232581K84042J791690O67371k521534
9459b556836l143827J809739P538544N515544m506098j1420503n928120O640481
9451f051076J2267101N579355m664562p835751l548196R24965J153159n18645
9443b693650k22121J657416J190232l346960p817310n995587K607233J0696843
9435c923904J0701737L036469m920024o899291k927873K274208L895856R53661
$$ plain form
9427 2190839 -447840 -2584669 -919284 1842362 512708 -4442551 -6893278 -4009047
9419 -4009047 -34282 1393625 3391192 9674183 16444162 16754004 11073400 7025002
9411 7025002 8633116 11787014 11666387 9281136 7942317 7394112 5128020 1270134 -1259390
9402 -1259390 -630123 2209628 5103695 6067326 3790939 -1082888 -5238468 -5323950 -2041816
9393 -2041816 54548 -1777693 -4289478 -2224576 3465932 4743276 -3568400 -15230108
9385 -15230108 -18492375 -10460775 -560862 2204864 229722 1076104 4561755 3567770
9377 3567770 -2905569 -5552858 2895147 16733842 23946344 20974264 15325374 13995787
9369 13995787 14597122 10268688 385688 -7206379 -5069360 4545359 11196402 7657920
$$ packed form
9427B190839k638679k136829J665385K761646j329654m955259k450727K884231
9419d009047L974765J427907J997567O282991O769979L09842n680604m048398
9411G025002J608114L153898j20627k385251j338819n48205k266092l857886k529524
9402a259390O29267K839751K894067R63631k276387m873827m155580q5482L282134
9393b041816K096364j832241k511785K064902N690508J277344q311676j1661708
9385a5230108l262267Q031600R899913K765726j975142Q46382L485651r93985
9377C567770o473339k647289Q448005J3838695P212502k972080n648890j329587
9369A3995787O01335m328434r883000p592067K137019R614719O651043l538482
$$ plain form
9361 7657920 -1564926 -5256253 1297966 11200219 15187221 12381757 8497142 6272430
9353 6272430 3378358 -597798 -1528911 2401847 6543891 6620256 5626663 8561617 13229042
9344 13229042 13056642 8177910 6323068 11152706 16588344 16207159 12348225 10827529
9336 10827529 11194349 8628983 2973689 -837043 -796321 -235168 -1527568 -2561362 -1005492
9327 -1005492 1978609 3943722 3986100 2386718 465781 1271160 6776330 13704451 16090875
9318 16090875 12861309 8513340 5416655 1177660 -4092877 -4609200 1937033 7529771
9310 7529771 3093255 -8551817 -16130928 -14648577 -9474455 -6089921 -3312419 1339597
9302 1339597 5956976 7567858 7071535 7328734 8734400 9170482 6503312 -247158 -9740427
$$ packed form
9361G657920r222846l691327O554219R902253L987002k805464l884615k224712
9353F272430k894072l976156r31113L930758M142044P6365r93593K934954M667425
9344A3229042j72400m878732j854842M829638N435638l81185l858934j520696
9336A0827529L66820k565366n655294l810732M0722N61153j292400j033794J555870
9327a005492K984101J965113M2378j599382j920937Q05379N505170O928121K386424
9318A6090875l229566m347969l096685m238995n270537n16323O546233N592738
9310G529771m436516j1645072p579111J482351N174122L384534K777502M652016
9302A339597M617379J610882m96323K57199J405666M36082k667170o750470r493269
$$ plain form
9293 -9740427 -17016811 -16499754 -8448435 282687 4172797 5010236 7447381 11740053 14796799
9284 14796799 15955549 16477217 14199598 4852744 -9428084 -18128553 -13186181 632138
9276 632138 10450910 9561475 2932585 -1679354 -3340431 -5820751 -9468140 -10441400 -7607502
9267 -7607502 -4994423 -5374896 -5589783 -1867674 3075340 3083950 -2248049 -6448776 -4981145
9258 -4981145 -678826 1511938 1163567 576573 -560579 -4374232 -9682115 -11653815 -7273617
9249 -7273617 1065210 7739055 8240738 2102787 -6277439 -10253235 -7007602 -952551
9241 -952551 1473745 -2026 -10541 3719998 7053795 6788216 5970708 7439319 6509850
9232 6509850 -2801286 -15945610 -20381441 -11652932 156266 3769120 511251 -764663
$$ packed form
9293i740427p276384N17057Q051319Q731122L890110Q37439K437145M292672L056746
9284A4796799J158750N21668k277619r346854j4280828q700469M942372J3818319
9276F32138R818772q89435o628890m611939j661077k480320l647389r73260K833898
9267g607502K613079l80473k14887L722109M943014Q610n331999m200727J467631
9258d981145M302319K190764l48371n86994j137152l813653n307883j971700M380198
9249g273617Q338827O673845N01683o137951q380226l975796L245633O055051
9241i52551K426296j475771q515L730539L333797k65579q17508J468611r29469
9232F509850r311136j3144324m435831Q728509J1809198L612854l257869j275914
$$ plain form
9224 -764663 2058817 2764499 -1975685 -7312832 -7557487 -3111106 2080044 5415740 5629575
9215 5629575 2115656 -2670932 -3640164 599418 4510971 2275057 -4550470 -9643509
9207 -9643509 -10224316 -8707796 -7468721 -6362553 -4994529 -3417066 -796548 2686251
9199 2686251 3042207 -3553429 -13510998 -17915393 -13787976 -8260187 -8583064 -12699700 -14037370
9190 -14037370 -11801587 -10763972 -12588899 -13222595 -9277594 -2564666 2765091 4423126
9182 4423126 2636898 -598703 -2424345 -1913253 -2143287 -6451108 -12447210 -13630375 -8127208
9173 -8127208 -1852937 -817657 -3945729 -6402470 -6521076 -5408980 -2546166 2954004
9165 2954004 7994155 8036842 4324912 3296598 7343542 11066949 9318302 4559427 2344286
$$ packed form
9224g64663K823480P05682m740184n337147k44655M446381N191150L335696K13835
9215E629575l513919m786588r69232M239582L911553k235914o825527n093039
9207i643509n80807J516520J239075J106168J368024J577463K620518L482799
9199B686251L55956o595636r957569m404395M127417N527789l22877m116636j337670
9190a4037370K235783J037615j824927o33696L945001O712928N329757J658035
9182D423126j786228l235601j825642N11092k30034m307821n996102j183165N503167
9173h127208O274271J035280l128072k456741j18606J112096K862814N500170
9165B954004N040151M2687l711930j028314M046944L723407j748647m758875k215141
$$ plain form
9156 2344286 2704199 782950 -5430593 -12491800 -16282592 -15612215 -11093233 -4207025 1817138
9147 1817138 3536391 916287 -3050433 -6855305 -11503555 -16252391 -17255750 -12861839
9139 -12861839 -7176956 -5331785 -7278065 -8986849 -7773472 -3655952 2298362 7478487
9131 7478487 7683014 1929948 -4093743 -4252841 -743281 -947631 -5494235 -6375200 637032
9122 637032 8419906 8071504 800852 -5752402 -9134035 -12618687 -16075161 -14654415 -7763866
9113 -7763866 -2020592 -2117436 -4551662 -4458031 -3645971 -6301010 -10105898 -8471380 -1043594
9104 -1043594 4256587 1271493 -6884985 -12535190 -12116632 -7623315 -2230430 2336868
9096 2336868 5524926 7759813 9812342 10753369 8266511 3076991 486420 3558490
$$ packed form
9156B344286L59913j921249o213543p061207l790792O70377M518982O886208O024163
9147A817138J719253k620104l966720l804872m648250m748836j003359M393911
9139a2861839N684883J845171j946280j708784J213377M117520N954314N180125
9131G478487K04527n753066o023691j59098L509560k04350m546604q80965P012232
9122F37032P782874l48402p270652o553254l381633l484652l456474J420746O890549
9113g763866N743274r6844k434226R3631Q12060k655039l804888J634518P427786
9104a043594N300181k985094q156478n650205M18558M493317N392885M567298
9096B336868L188058K234887K052529R41027k486858n189520k590571L072070
$$ plain form
9088 3558490 6722228 1914360 -8923873 -14175281 -7998638 847768 794121 -6820684
9080 -6820684 -11109825 -8201865 -5753531 -9990624 -16488821 -17963985 -15052467 -13408965
9072 -13408965 -13710918 -11140625 -3934516 3276890 5564569 2976387 -1502287 -5735949
9064 -5735949 -8451136 -8497741 -6774081 -7118180 -12255066 -19155030 -21100193 -15328342 -6862408
9055 -6862408 -3098547 -5361242 -7772347 -4656834 2949082 9238377 10277901 6946033
9047 6946033 2745809 1086332 3562151 7942094 8706319 3238732 -2976565 -1929458
9039 -1929458 5750392 10586679 6783531 -1115598 -7187141 -12881576 -20818650 -25758855
9031 -25758855 -20668705 -9013375 -1736355 -2453649 -4461210 -3261921 -3002818 -7554151
$$ packed form
9088C558490L163738m807868j0838233n251408O176643Q846406n3647p614805
9080f820684m289141K907960K448334m237093o498197j475164K911518J643502
9072a3408965l01953K570293P206109P211406K287679k588182m478674m233662
9064e735949k715187m6605J723660l44099n136886o899964j945163N771851Q465934
9055f862408L763861k262695k411105L115513P605916O289295J039524l331868
9047F946033m200224j659477K475819M379943P64225n467587o215297J047107
9039a929458P679850M836287l803148p899129o071543n694435p937074m940205
9031b5758855N090150J1655330P277020p17294k007561J199289K59103m551333
$$ plain form
9023 -7554151 -13428548 -16111303 -16596560 -16427056 -12383885 -2684612 6022153 5285322 -3443556
9014 -3443556 -10160110 -8831597 -3357139 -880865 -3408909 -7045623 -7192936 -3944778
9006 -3944778 -2789456 -8360928 -17026846 -19326832 -11900441 -2921048 -2042280 -8530462
8998 -8530462 -13880086 -13246742 -9171274 -5963617 -5425498 -6951729 -7775889 -4710907 844155
8989 844155 2623061 -1550957 -4750540 -1019423 4032807 1311993 -6505958 -8607395
8981 -8607395 -3766185 -2384771 -9141875 -15707842 -15150544 -12253954 -12705767 -12011270 -4221118
8972 -4221118 5761132 8542222 4143214 256764 25437 437038 424488 1661318 2408432
8963 2408432 -1090868 -7221587 -10493077 -10456571 -11767781 -14944795 -14808163 -9859373 -5873037
$$ packed form
9023g554151n874397k682755m85257J69504M043171R699273Q706765p36831q728878
9014c443556o716554J328513N474458K476274k528044l636714j47313L248158
9006c944778J155322n571472q665918k299986P426391Q979393Q78768o488182
8998h530462n349624O33344M075468L207657N38119j526231q24160L064982N555062
8989H44155J778906m174018l199583L731117N052230k720814p817951k101437
8981h607395M841210J381414o757104o565967N57298K896590m51813O94497P790152
8972d221118R982250K781090m399008l886450k31327M11601j2550J236830P47114
8963B408432l499300o130719l271490L6506j311210l177014J36632M948790L986336
$$ plain form
8954 -5873037 -7094764 -9988173 -9256247 -4979173 -263925 3509881 5317378 2830263
8946 2830263 -3193436 -6322654 -1569695 6769042 9372649 3299637 -5087887 -8275298
8938 -8275298 -4676302 2537929 9488575 13008115 11354318 5962868 920693 -1025893
8930 -1025893 -829170 -554914 -295125 696160 1603489 1214534 230666 -322419 -1898973
8921 -1898973 -6070304 -9888278 -8341644 -2511816 -227020 -5752271 -13355507 -15103276
8913 -15103276 -10874573 -5430474 553022 9272080 17844809 20078374 16463843 14326541
8905 14326541 16363981 16864402 12123104 6801044 5488508 5021220 985542 -3972375
8897 -3972375 -4900162 -3097342 -3148773 -4688989 -3678310 434902 4714497 7817552 9780702
$$ packed form
8954e873037j221727k893409P31926M277074M715248L773806J807497k487115
8946B830263o023699l129218M752959Q338737K603607o073012q387524l187411
8938h275298L598996P214231O950646L519540j653797n391450n042175j946586
8930a025893J96723K74256K59789R91285R07329l88955r83868n53085j576554
8921a898973m171331l817974J546634N829828K284796n525251p603236j747769
8913a5103276M228703N444099N983496Q719058Q572729K233565l614531k137302
8905A4326541K037440N00421m741298n322060j312536m67288m035678m957917
8897c972375r27787J802820n1431j540216J010679M113212M279595L103055J963150
$$ plain form
8888 9780702 9164406 5677313 2795600 2221046 -717426 -9444423 -17746072 -17538569 -12112200
8879 -12112200 -11448977 -15550378 -13940239 -3347819 5658150 4316632 -1910588 -3128366
8871 -3128366 518067 1939800 -536789 -2138552 -735847 288175 -1426050 -2790668
8863 -2790668 937528 9922284 18493416 20425924 15814868 11332219 11907968 14241270
8855 14241270 12018228 5430604 247316 -1391947 -2979869 -6482079 -9678439 -11363306
8847 -11363306 -12687033 -12426602 -7962443 -2179515 -1537117 -5407361 -6155693 -2686544 -3698269
8838 -3698269 -12210309 -17468753 -10739436 -164911 751159 -7123338 -11782804 -8530632
8830 -8530632 -3334727 -156071 3232944 6852126 6695040 2873346 637586 1500219 1250294
$$ packed form
8888I780702o16296l487093k881713n74554k938472q726997q301649K07503N426369
8879a2112200O63223m101401J610139J0592420R005969j341518o227220j217778
8871c128366L646433J421733k476589j601763J402705J024022j714225j364618
8863b790668L728196Q984756Q571132J932508m611056m482649N75749K333302
8855A4241270k223042o587624n183288j639263j587922l502210l196360j684867
8847a1363306j323727K60431M464159N782928O42398l870244p48332L469149j011725
8838c698269q512040n258444O729317J0574525R16070p874497m659466L252172
8830h530632N195905L178656L389015L619182j57086l821694k235760Q62633k49925
$$ plain form
8821 1250294 -1614666 -3270328 -2336161 -2690291 -5893134 -7779484 -5683926 -2772228 -1987351
8812 -1987351 -1595105 -142938 -187551 -3239508 -6113451 -6374983 -6715049 -9600727 -12057690
8803 -12057690 -10783700 -8670922 -10533558 -14900365 -16040298 -13034921 -11005848 -12872573
8795 -12872573 -15005595 -13038533 -8330689 -5668776 -6231326 -6027906 -1850693 3556059
8787 3556059 4623612 775289 -2027578 759940 5564606 5501488 368030 -2843271 233964
8778 233964 5667976 7332266 4766759 1827404 211060 -1832475 -5327379 -8667529
8770 -8667529 -10415863 -11576229 -13657850 -15435803 -13371914 -6241951 1391439 2625773
8762 2625773 -3682535 -10430359 -10424270 -5379467 -3068451 -6273073 -9478999 -7675966 -3389166
$$ packed form
8821A250294k864960j655662R34167l54130l202843j886350K095558K911698P84877
8812a987351L92246J452167m4613l051957k873943k61532l40066k885678k456963
8803a2057690J273990K112778j862636m366807j139933L005377K029073j866725
8795a2872573k133022J967062M707844K661913n62550K03420M177213N406752
8787C556059J067553l848323k802867K787518M804666o3118n133458l211301L077235
8778B33964N434012J664290k565507k939355j616344k043535l494904l340150
8770h667529j748334j160366k081621j777953K063889P129963P633390J234334
8762B625773o308308o747824O089N044803K311016l204622l205926J803033M286800
$$ plain form
8753 -3389166 -1684314 -2120968 -588910 2716083 2666444 -2755483 -8340673 -8208419 -3904005
8744 -3904005 -2585181 -7538406 -13525364 -13146326 -6388660 -1421192 -5227068 -14975644
8736 -14975644 -20450108 -15178765 -3935598 1906527 -3493166 -13954567 -18019739 -11792061
8728 -11792061 -2898242 -654112 -4927783 -7888690 -5101393 -154335 1933199 810271
8720 810271 -1658197 -5196542 -8957902 -9239007 -3811074 3578869 7183139 6373605 5137357
8711 5137357 5737298 6613056 5878601 3652880 1466028 1765444 6492246 13496058 16709652
8702 16709652 13526511 9564564 11476676 17147347 18604510 13394720 6949198 3861642
8694 3861642 3085999 2874106 4719323 9923637 15941383 18087042 13026297 1275651
$$ packed form
8753c389166J704852m36654J532058L304993m9639n421927n585190J32254M304414
8744c904005J318824m953225n986958L79038O757666M967468l805876r748576
8736a4975644n474464N271343J1243167N842125n399693j0461401m065172O227678
8728a1792061Q893819K244130m273671k960907K787297M947058K087534j122928
8720H10271k468468l538345l761360k81105N427933P389943L604270q09534j236248
8711E137357N99941Q75758p34455k225721k186852K99416M726802P003812L213594
8702A6709652l183141l961947J912112N670671J457163n209790o445522l087556
8694C861642p75643k11893J845217N204314O017746K145659n060745j1750646
$$ plain form
8686 1275651 -10953674 -14677204 -7876104 -344184 -2543546 -11252232 -14054018 -7404243
8678 -7404243 -924333 -2237465 -7015922 -7814492 -4529417 -1350879 -162605 -1509215
8670 -1509215 -5900351 -10146867 -8926680 -3818614 -3309607 -9349880 -12475140 -6633776
8662 -6633776 -146011 -3168709 -11489938 -12934187 -4757165 5362247 11617150 13478709
8654 13478709 10302865 2692274 -3302454 -3209150 -2869790 -9825711 -18522275 -16334749 -3817836
8645 -3817836 4038603 -1060400 -10322084 -12378660 -7357719 -1540436 2385541 3884164
8637 3884164 1465354 -2954036 -3229586 2062282 5933675 3030366 -2908194 -6360567
8629 -6360567 -8019974 -9995907 -9860814 -6157875 -3822762 -6784812 -10213428 -7552044
$$ packed form
8686A275651j2229325l723530O801100P531920k199362q708686k801786O649775
8678g404243O479910j313132m778457p98570L285075L178538J188274j346610
8670a509215m391136m246516J220187N108066N09007o040273l125260N841364
8662f633776O487765l022698q321229j444249Q177022J0119412O254903J861559
8654A3478709l175844p610591n994728R3304L39360o955921q696564K187526J2516913
8645c817836P856439n099003r261684k056576N020941N817283L925977J498623
8637C884164k418810m419390k75550N291868L871393k903309n938560l452373
8629f360567j659407j975933J35093L702939K335113k962050l428616K661384
$$ plain form
8621 -7552044 -757784 3952331 6054781 8181766 7941449 2107969 -3613033 448754
8613 448754 13468564 24173782 25863390 22306847 17851926 11559188 3963297 225026
8605 225026 1880925 3214639 726670 -1050738 1416522 3222057 -210798 -3345048
8597 -3345048 1361226 9760587 10603281 2430861 -4114704 -2048249 2878657 2087031 -4275034
8588 -4275034 -10384118 -13759014 -15610030 -15654162 -12470000 -7950767 -6504876 -9163875 -11515279
8579 -11515279 -8546153 -237757 8055553 10478208 6615446 2772152 5726759 14644801
8571 14644801 21361314 19774036 12432054 6104736 3600103 2622913 320513 -4207823
8563 -4207823 -9860305 -12669337 -7408111 5461173 16346232 15635505 5754573 -1481068
$$ packed form
8621g552044O794260M710115K102450K126985k40317n833480n721002M061787
8613D48754J3019810J0705218J689608l556543m454921o292738p595891l738271
8605B25026J655899J333714k487969j777408K467260J805535l432855l134250
8597c345048M706274Q399361Q42694q172420o545565K066455M926906p91626o362065
8588d275034o109084l374896j851016m4132L184162M519233J445891k658999k351404
8579a1515279K969126Q308396Q293310K422655l862762l843294K954607Q918042
8571A4644801O716513j587278p341982o327318k504633r77190k302400m528336
8563d207823n652482k809032N261226J2869284J0885059p10727r880932p235641
$$ plain form
8555 -1481068 286875 5770106 7704492 5911844 3513552 285547 -4829531 -8489328
8547 -8489328 -6186248 638743 5356876 3776402 -2025620 -7009736 -7947018 -5430639
8539 -5430639 -2770735 -2199062 -1777197 1708665 6489072 6579064 712203 -4163931 -2103015
8530 -2103015 3050124 2982535 -3686379 -10549771 -12393914 -10049975 -6914492 -4937452 -4096005
8521 -4096005 -2915617 49614 3521145 4364886 2893732 3385967 6346727 5473602 -2520964
8512 -2520964 -10349387 -9648435 -3667771 -1903981 -5625982 -8660195 -9903702 -13212414
8504 -13212414 -15443030 -7878429 7759237 17509021 14590888 9135859 11766193 18111686
8496 18111686 18436357 13671722 11443380 12621182 12593802 11609229 13364429 15937198 14052028
$$ packed form
8555a481068J767943N483231J934386j792648k398292l228005n115078l659797
8547h489328K303080O824991M718133j580474n802022m984116r37282K516379
8539e430639K659904N71673M21865L485862M780407Q9992n866861m876134K060916
8530b103015N153139o7589o668914o863392j844143K343939L135483J977040Q41447
8521d096005J180388K965231L471531Q43741j471154M92235K960760q73125p994566
8512b520964p828423P00952N980664J763790l722001l034213j243507l308712
8504a3212414k230616P564601J5637666R749784k918133n455029K630334O345493
8496A8111686L24671m764635k228342J177802k7380r84573J755200K572769j885170
$$ plain form
8487 14052028 9014503 7061000 8259128 6167271 -524212 -4626622 -1495172 3425144
8479 3425144 2008581 -5973389 -13412341 -14839542 -12137722 -11555862 -15755040 -19636604
8471 -19636604 -16195482 -6451946 704059 199565 -3040948 -2992661 -1571474 -3066483 -5144147
8462 -5144147 -3256249 37468 -1089359 -5317954 -6652345 -5103826 -5046481 -4494407 2446667
8453 2446667 12027785 12313754 1476487 -7421222 -5563641 -1199782 -5465200 -14898501
8445 -14898501 -18074954 -13031117 -7539383 -5985696 -6032839 -6369912 -8462903 -10769784 -9091228
8436 -9091228 -3468489 1477973 3630163 5232112 7312230 7786711 6041397 4364627
8428 4364627 3539285 1494111 -2195299 -4561714 -3809984 -2158703 -2120893 -2708370 -1398790
$$ packed form
8487A4052028n037525j953503J198128k091857o691483m102410L131450M920316
8479C425144j416563p981970p438952j427201K701820N81860m199178l881564
8471a9636604L441122R743536P156005n04494l240513M8287J421187j495009k077664
8462e144147J887898L293717j126827m228595j334391J548519N7345N52074O941074
8453B446667R581118K85969j0837267q897709J857581M363859m265418r433301
8445a4898501l176453N043837N491734J553687m7143l37073k092991k306881J678556
8436i091228N622739M946462K152190J601949K080118M74481j745314j676770
8428D364627q25342k045174l689410k366415P51730J651281L7810n87477J309580
$$ plain form
8419 -1398790 2063367 5598698 7206012 6132746 2626387 -2239907 -6469579 -7235235
8411 -7235235 -2125269 7689195 15523740 13896281 3219871 -7408111 -10967548 -10567937
8403 -10567937 -12640541 -16013361 -14554325 -8507020 -4809285 -5718837 -5559671 -1253070
8395 -1253070 1962979 -362238 -4235781 -4380385 -2834656 -3394575 -2741848 4059822 12376441
8386 12376441 12224170 3409016 -2936842 235998 7372406 10359977 9339826 8701192
8378 8701192 8788948 7692875 6623974 7111978 6116865 272586 -7275096 -10454551 -9010094
8369 -9010094 -7488014 -6923872 -4430826 -480783 1056882 945312 4589041 11493882 12806863
8360 12806863 4176394 -5808567 -6435060 903878 6141518 4423800 -717469 -5426798
$$ packed form
8419a398790L462157L535331J607314j073266l506359m866294m229672p65656
8411g235235N109966R814464P834545j627459j0676410j0627982l559437L99611
8403a0567937k072604l372820J459036O047305L697735r09552J59166M306601
8395a253070L216049k325217l873543j44604J545729n59919O52727O801670Q316619
8386A2376441j52271q815154o345858L172840P136408K987571j020151o38634
8378H701192Q7756j096073j068901M88004r95113n844279p547682l179455J444457
8369i010094J522080N64142K493046L950043J537665j11570L643729O904841J312981
8360A2806863q630469r984961o26493P338938N237640j717718n141269m709329
$$ plain form
8352 -5426798 -8780649 -8791461 -3143363 4694685 6663733 -83273 -9184474 -12721447 -8893815
8343 -8893815 -1051023 6199169 8315963 3175287 -5247318 -9454188 -7132987 -3631786
8335 -3631786 -3656914 -4928719 -3165245 976763 4030408 5122822 4673988 933518 -6688154
8326 -6688154 -12982710 -11730444 -4559607 716490 934509 928730 4370656 7070227 3594958
8317 3594958 -3206327 -4907256 929753 6904090 5202259 -2652244 -8678326 -9270293
8309 -9270293 -8817618 -11785229 -15420010 -13762031 -6642726 -274394 946824 -759530
8301 -759530 -900122 1516958 4177072 4826025 2625237 -1883255 -6379714 -7671984 -4433306
8292 -4433306 1558989 6985412 8704808 5068996 -1686585 -5261601 -1565039 4842520
$$ packed form
8352e426798l353851j0812N648098P838048J969048o747006r101201l536973L827632
8343h893815P842792P250192K116794n140676q422605m206870K321201L501201
8335c631786k5128j271805J763474M142008L053645J092414m48834l740470p621672
8326f688154o294556J252266P170837N276097K18019n779L441926K699571l475269
8317C594958o801285j700929N837009N974337j701831p854503o026082n91967
8309i270293M52675k967611l634781J657979P119305O368332J221218j706354
8301g59530j40592K417080K660114O48953k200788m508492m496459j292270L238678
8292d433306N992295N426423J719396l635812o755581l575016L696562O407559
$$ plain form
8284 4842520 5199367 -1849570 -8084748 -6522670 854700 7979226 11391541 9411529
8276 9411529 1309497 -8264206 -10324955 -2733746 5183475 5286028 2097879 4059262
8268 4059262 8778932 6844640 -2790041 -11384805 -13122717 -9850302 -3963430 3775436
8260 3775436 9264532 7698067 2288093 1086242 4031939 3263031 -1812800 -1256018 8989044
8251 8989044 18272946 15916365 6025585 -255863 -492160 -812495 -4908810 -10638784 -14363790
8242 -14363790 -13296984 -7264302 -2093958 -5554638 -15447844 -19130327 -11180209 -3325093
8234 -3325093 -7759198 -18106215 -18773686 -8171139 466830 -856867 -6908263 -11126776
8226 -11126776 -13294995 -13727593 -10771097 -6510265 -5296479 -4745297 1671165 11069727
$$ packed form
8284D842520L56847p048937o235178J562078P377370P124526L412315j980012
8276I411529q102032r573703k060749P591209P917221J02553l188149J961383
8268D059262M719670j934292r634681q594764j737912L272415N886872P738866
8260C775436N489096j566465n409974j201851K945697p68908n075831N56782J0245062
8251H989044R283902k356581r890780o281448k36297l20335m096315n729974l725006
8242a4363790J066806O032682N170344l460680r893206l682483P950118P855116
8234c325093m434105j0347017o67471J0602547Q637969j323697o051396m218513
8226a1126776k168219m32598K956496M260832J213786N51182O416462R398562
$$ plain form
8218 11069727 11699699 950867 -8845065 -8510540 -4593780 -5953047 -8587564 -4583592
8210 -4583592 2452617 3642070 977943 3969982 12743233 17225897 12878767 5543325
8202 5543325 -216024 -6150736 -11495409 -10599202 -3987323 -1462826 -7731251 -13742300
8194 -13742300 -10139810 -1886256 -70523 -4479667 -4990637 2078982 9624613 11973311
8186 11973311 11784816 12576641 12803816 11039766 10119704 11755148 12639002 10298849 7617384
8177 7617384 6799947 4201356 -2727297 -8223986 -5961217 -859359 -3852413 -15521992
8169 -15521992 -24485250 -23776905 -19608765 -19759761 -21536728 -17883576 -9633886 -3947340
8161 -3947340 -3602483 -5109484 -6045043 -7382272 -8518045 -6432204 -1498913 1015088 -1997333
$$ packed form
8218A1069727O29972j0748832r795932L34525L916760j359267k634517M003972
8210d583592P036209J189453k664127K992039Q773251M482664m347130p335442
8202E543325n759349n934712n344673Q96207O611879K524497o268425o011049
8194a3742300L602490Q253554J815733m409144n10970P069619P545631K348698
8186A1973311j88495P91825K27175j764050r20062J635444Q83854k340153k681465
8177G617384q17437k598591o928653n496689K262769N101858k993054j1669579
8169a5521992q963258P08345M168140j50996j776967L653152Q249690N686546
8161c947340L44857j507001r35559j337229j135773K085841M933291K514001l012421
$$ plain form
8152 -1997333 -6429452 -5972903 -221769 4993591 4729301 313510 -2737096 -1136040 2758438
8143 2758438 4177567 1763153 -1222221 -1444584 534593 1531297 -591375 -5340621 -10216829
8134 -10216829 -12316042 -10981989 -9120336 -9545414 -10031713 -5763521 2464437 7309597
8126 7309597 4479994 -1596489 -4994094 -5963932 -6757817 -5334978 -238540 2605728 -3181800
8117 -3181800 -12800571 -14803424 -7037508 984615 2688921 2209680 4619964 7068344
8109 7068344 4912642 387088 -668848 3054072 7994571 10717275 10109262 7256222
8101 7256222 5043283 4827640 3038715 -4037256 -11887409 -11501289 -3279070 1419537 -3475879
8092 -3475879 -10101481 -10315828 -8592735 -12203111 -16740220 -13370854 -5058636 -2250536
$$ packed form
8152a997333m432119M56549N751134N215360k64290m415791l050606J601056L894478
8143B758438J419129k414414k985374k22363J979177R96704k122672m749246m876208
8134a0216829k099213J334053J861653m25078m86299M268192Q227958M845160
8126G309597k829603o076483l397605r69838p93885J422839N096438K844268n787528
8117c181800r618771k002853P765916Q022123J704306m79241K410284K448380
8109G068344k155702m525554j055936L722920M940499K722704o08013k853040
8101G256222k212939k15643j788925p075971p850153L86120Q222219M698607m895416
8092c475879o625602k14347J723093l610376m537109L369366Q312218K808100
$$ plain form
8084 -2250536 -5045451 -3584226 3596399 5665653 -2453780 -10730420 -8995296 -1198923
8076 -1198923 2741144 1376654 -182112 -702363 -2715835 -5432506 -5646950 -3943325 -3427315
8067 -3427315 -3657628 -1945805 362308 -803103 -4668398 -5474357 -1238933 2564182 396769
8058 396769 -6304784 -12167429 -14737462 -14915368 -12515564 -5561954 5300455 14423407
8050 14423407 15304656 6831559 -5683542 -15593524 -19984336 -19692037 -16305797 -10974176
8042 -10974176 -5166058 -147387 4450536 9471727 13366328 12878351 7699753 2387711
8034 2387711 1894113 6177418 10419642 9762202 3236136 -5680748 -11670772 -12119007 -9712140
8025 -9712140 -8962012 -9819771 -7352411 958533 10391321 13881644 9984987 3750350 1136311
$$ packed form
8084b250536k794915J461225P180625K069254q119433q276640J735124P796373
8076a198923L940067j364490j558766n20251k013472k716671k14444J703625N16010
8067c427315k30313J711823K308113j165411l865295q05959M235424L803115k167413
8058C96769o701553n862645k570033j77906K399804O953610J0862409R122952
8050A4423407Q81249q473097j2515101r909982m390812K92299L386240N331621
8042a0974176N808118N018671M597923N021191L894601m87977n178598n312042
8034B387711m93598M283305M242224o57440o526066q916884n990024m48235K406867
8025i712140P50128q57759K467360Q310944R432788L490323l896657o234637k614039
$$ plain form
8016 1136311 4360516 10816220 14439139 10363287 917269 -5230729 -3028576 2258744
8008 2258744 2176568 -3637351 -8587922 -9645316 -9893745 -10644984 -8561449 -3076253 -20658
7999 -20658 -3692265 -10225928 -13279850 -12405764 -11342484 -11474556 -11803066 -12554381 -13704003
7990 -13704003 -12145297 -5710348 1497075 3249523 -166187 -2810722 -1987461 -432910
7982 -432910 475841 3138040 7485178 8413451 2914456 -4827653 -9205371 -10287533 -11150886
7973 -11150886 -11375676 -8160765 -2351331 1482554 1021421 -1430944 -3000940 -3564971 -4075323
7964 -4075323 -4191447 -3349469 -2706652 -3917833 -6191934 -6591166 -4296747 -2875504 -5806707
$$ packed form
8016A136311L224205O455704L622919m075852r446018o147998K202153N287320
8008B258744q2176n813919m950571j057394k48429p51239K083535N485196L055595
7999b0658l671607o533663l053922Q74086J063280j32072l28510p51315j149622
7990a3704003J558706O434949P207423J752448l415710k644535Q23261J554551
7982d32910R08751K662199M347138R28273n498995p742109m377718j082162q63353
7973a1150886k24790L214911N809434L833885m61133k452365j569996n64031n10352
7964d075323j16124Q41978O42817j211181k274101l99232K294419J421243k931203
$$ [...]
##END NTUPLES=NMR SPECTRUM
##END=
