##TITLE=31Pdec_SR146H12
 D2O, 64 sc
 11.4.2023
##JCAMPDX= 6.0         $$ Bruker NMR JCAMP-DX V2.0
##DATA TYPE= NMR SPECTRUM
##DATA CLASS= NTUPLES
##ORIGIN= UXNMR, Bruker Analytische Messtechnik GmbH
##OWNER= root
$$ XWIN-NMR		Version 3.5
$$ Tue Apr 11 14:22:58 2023 Russian Standard Time (UT+4h)  she@DPX200
##.OBSERVE FREQUENCY= 81.013821
##.OBSERVE NUCLEUS= ^31P
##.ACQUISITION MODE= SIMULTANEOUS
##.ACQUISITION SCHEME= undefined
##.AVERAGES= 64
##.DIGITISER RES= 16
##SPECTROMETER/DATA SYSTEM= spect
##.PULSE SEQUENCE= zgpg30
##.SOLVENT NAME= CDCl3
##.SHIFT REFERENCE= (INTERNAL, CDCl3, 0, 248.564)
##AUDIT TRAIL= $$ (NUMBER, WHEN, WHO, WHERE, WHAT)
$$ ##TITLE= Audit trail, XWIN-NMR		Version 3.5
$$ ##JCAMPDX= 5.01
$$ ##ORIGIN= Bruker BioSpin GmbH
$$ ##OWNER= she
$$ F:/spectra/data/she/nmr/P31/1/pdata/1/auditp.txt
$$ ##AUDIT TRAIL=  $$ (NUMBER, WHEN, WHO, WHERE, WHAT)
(   1,<2023-04-11 14:22:11.85 +0400>,<she>,<DPX200>,
      <continue with go, POWCHK disabled, PULCHK disabled
       configuration hash MD5:
       00 E9 B6 7A A2 85 ED C7 34 08 36 98 17 FE 4E 26
       data hash MD5: 32K
       F6 A7 92 DB 5D DA 6D D8 F5 C3 12 4A 07 21 0E 1E>)
(   2,<2023-04-11 14:22:14.03 +0400>,<she>,<DPX200>,
      <Start of raw data processing
       efp BC_mod = 2 LB = 1 FT_mod = 6 PKNL = 1 PHC0 = -11148.39 PHC1 = 502.8854 SI = 64K 
       data hash MD5: 64K
       00 7C F2 C0 6A FA 2F C8 FB 59 65 29 0B CC 20 48>)
(   3,<2023-04-11 14:22:30.28 +0400>,<she>,<DPX200>,
      <pk PHC0 = -57.51336 PHC1 = 54.2 
       data hash MD5: 64K
       62 26 52 45 1C FC 5E 9F 4F 46 77 8E AD 86 7F 1B>)
(   4,<2023-04-11 14:22:34.51 +0400>,<she>,<DPX200>,
      <abs ABSG = 5 
       data hash MD5: 64K
       18 BB 74 BC 8F 81 BC 3E 2D D1 83 F7 7B CD 4C B0>)
$$ ##END=
$$ 
$$ hash MD5
$$ 7F B2 44 05 D2 64 32 42 1D 2E D1 32 12 DE A8 89
##$RELAX= 
##$RELAX= 
##$RELAX= 
##$RELAX= 
##$RELAX= 
##$RELAX= 
##$RELAX= 
##$RELAX= 
##$RELAX= 
$$ Bruker specific parameters
$$ --------------------------
##$DU= <F:/spectra>
##$EXPNO= 1
##$NAME= <P31>
##$PROCNO= 1
##$TYPE= <nmr>
##$USER= <she>
##$AMP= (0..31)
100 100 100 100 100 100 100 100 100 100 100 100 100 100 100 100 100 100 
100 100 100 100 100 100 100 100 100 100 100 100 100 100 
##$AQSEQ= 0
##$AQ_mod= 1
##$AUNM= <au_zg>
##$AUTOPOS= <>
##$BF1= 81.014009
##$BF2= 200.13
##$BF3= 200.13
##$BF4= 200.13
##$BF5= 200.13
##$BF6= 200.13
##$BF7= 200.13
##$BF8= 200.13
##$BYTORDA= 1
##$CFDGTYP= 0
##$CFRGTYP= 5
##$CHEMSTR= <none>
##$CNST= (0..31)
1 1 145 1 1 1 1 1 1 1 1 1 1 1 1 1 1 1 1 1 1 1 1 1 1 1 1 1 1 1 1 1 
##$CPDPRG= <waltz16>
##$CPDPRG1= <>
##$CPDPRG2= <waltz16>
##$CPDPRG3= <>
##$CPDPRG4= <mlev>
##$CPDPRG5= <mlev>
##$CPDPRG6= <mlev>
##$CPDPRG7= <mlev>
##$CPDPRG8= <mlev>
##$CPDPRGB= <>
##$CPDPRGT= <>
##$D= (0..31)
0 1 0 0 0 0 0 0 0 0 0 0.03 2e-05 3e-06 0 0 0 0 0 0 0 0 0 0 0 0 0 0 0 0 
0 0 
##$DATE= 1681208451
##$DBL= (0..7)
120 120 120 11 120 120 24 19 
##$DBP= (0..7)
150 150 150 150 150 150 150 150 
##$DBP07= 0
##$DBPNAM0= <>
##$DBPNAM1= <>
$$ [...]
##$SUBNAM3= <"">
##$SUBNAM4= <"">
##$SUBNAM5= <"">
##$SUBNAM6= <"">
##$SUBNAM7= <"">
##$SUBNAM8= <"">
##$SUBNAM9= <"">
##$SW= 501.771253377433
##$SWIBOX= (0..15)
0 1 3 0 0 0 0 0 0 0 0 0 0 0 0 0 
##$SW_h= 40650.406504065
##$TD= 32768
##$TD0= 1
##$TE= 0
##$TE2= 300
##$TE3= 300
##$TEG= 300
##$TL= (0..7)
0 120 53 12 22 120 120 120 
##$TP= (0..7)
150 150 150 150 150 150 150 150 
##$TP07= 0
##$TPNAME0= <>
##$TPNAME1= <>
##$TPNAME2= <>
##$TPNAME3= <>
##$TPNAME4= <>
##$TPNAME5= <>
##$TPNAME6= <>
##$TPNAME7= <>
##$TPOAL= (0..7)
0.5 0.5 0.5 0.5 0.5 0.5 0.5 0.5 
##$TPOFFS= (0..7)
0 0 0 0 0 0 0 0 
##$TUNHIN= 0
##$TUNHOUT= 0
##$TUNXOUT= 0
##$USERA1= <user>
##$USERA2= <user>
##$USERA3= <user>
##$USERA4= <user>
##$USERA5= <user>
##$V9= 5
##$VALIST= <valist>
##$VCLIST= <CCCCCCCCCCCCCCC>
##$VD= 0
##$VDLIST= <DDDDDDDDDDDDDDD>
##$VPLIST= <PPPPPPPPPPPPPPP>
##$VTLIST= <TTTTTTTTTTTTTTT>
##$WBST= 1024
##$WBSW= 4
##$XGAIN= (0..3)
0 0 0 0 
##$XL= 0
##$YL= 0
##$YMAX_a= 4053
##$YMIN_a= -3290
##$ZGOPTNS= <>
##$ZL1= 120
##$ZL2= 120
##$ZL3= 120
##$ZL4= 120
##$ABSF1= 248.5645
##$ABSF2= -253.2056
##$ABSG= 5
##$ABSL= 3
##$ALPHA= 0
##$AQORDER= 0
##$ASSFAC= 0
##$ASSFACI= 0
##$ASSFACX= 0
##$ASSWID= 0
##$AUNMP= <proc_1d>
##$AZFE= 0.1
##$AZFW= 0.5
##$BCFW= 0
##$BC_mod= 2
##$BYTORDP= 0
##$COROFFS= 0
##$CY= -3
##$DATMOD= 1
##$DC= 0
##$DFILT= <>
##$DTYPP= 0
##$F1P= 0
##$F2P= 0
##$FCOR= 1
##$FTSIZE= 65536
##$FT_mod= 6
##$GAMMA= 0
##$GB= 0
##$INTBC= 1
##$INTSCL= 6.047779e-11
##$ISEN= 30
##$LB= 1
##$LEV0= 0
##$LPBIN= 0
##$MAXI= 10000
##$MC2= 0
##$MEAN= 0
##$ME_mod= 0
##$MI= 50
##$NCOEF= 0
##$NC_proc= -8
##$NLEV= 6
##$NOISF1= 182.463
##$NOISF2= 159.3651
##$NSP= 0
##$NTH_PI= 0
##$NZP= 0
##$OFFSET= 248.5645
##$PC= 4
##$PHC0= -11205.9
##$PHC1= 557.0854
##$PH_mod= 1
##$PKNL= yes
##$PPARMOD= 0
##$PSCAL= 0
##$PSIGN= 0
##$REVERSE= no
##$SF= 81.0140089999694
##$SI= 65536
##$SIGF1= 159.3651
##$SIGF2= -187.1042
##$SINO= 113.3802
##$SIOLD= 16384
##$SREGLST= <1H.CDCl3>
##$SSB= 0
##$STSI= 65536
##$STSR= 0
##$SW_p= 40650.406504065
##$SYMM= 0
##$S_DEV= 0
##$TDeff= 32768
##$TDoff= 0
##$TI= <>
##$TILT= no
##$TM1= 0
##$TM2= 0
##$TOPLEV= 0
##$USERP1= <user>
##$USERP2= <user>
##$USERP3= <user>
##$USERP4= <user>
##$USERP5= <user>
##$WDW= 1
##$XDIM= 65536
##$YMAX_p= 403618922
##$YMIN_p= -32944457
$$ End of Bruker specific parameters
$$ ---------------------------------
##NTUPLES= NMR SPECTRUM
##VAR_NAME=  FREQUENCY,     SPECTRUM/REAL,   SPECTRUM/IMAG
##SYMBOL=    X,             R,               I
##VAR_TYPE=  INDEPENDENT,   DEPENDENT,       DEPENDENT
##VAR_FORM=  AFFN,          ASDF,            ASDF
##VAR_DIM=   65536,         65536,           65536
##UNITS=     HZ,            ARBITRARY UNITS, ARBITRARY UNITS
##FACTOR=    0.620285442955139, 1,           1
##FIRST=     20137.2065510682, 0,            0
##LAST=      -20513.1999529968, 0,           0
##MIN=       -20513.1999529968, -32944457,   0
##MAX=       20137.2065510682, 403618922,    0
$$ Real data points
##PAGE= N=1
##DATA TABLE= (X++(R..R)), XYDATA
$$ [...]
39845B182329k100312o52493J037757L152332K417274k75769N91484M340740K914130
39836A3607472m703494p961796j647189L805558j486306j0243521r411634m18588
39828a8459498M956093L595586K464888L987421L262519n98373k222750J0799
39820c003315J874940K232701M496118P796025O201654p64732n673733m686472
39812H473186l390855o510914q925088l500575O512715J0188517L317889n652851
39804E12024o032641K032409Q300552N656179j499936m371782j500251J636666
39796D733220K204937K065839J109971k779000o104719k045864O490994P029057
39788A2704435l478388j1153016n556542L504006J949273n363558l658952N592365
$$ plain form
39845 2182329 82017 -570476 467281 3619613 6036887 5761118 6352602 10693342 13607472
39836 13607472 8903978 942182 -705007 3100551 1614245 -8629276 -18040910 -18459498
39828 -18459498 -13503405 -9907819 -7442931 -3455510 -192991 -791364 -3014114 -3003315
39820 -3003315 -1128375 1104326 5600444 13396469 19598123 18833391 13159658 8473186
39812 8473186 5082331 -1428583 -10353671 -13854246 -7341531 2846986 6164875 512024
39804 512024 -5520617 -3488208 4812344 10468523 8968587 4596805 3096554 4733220
39796 4733220 6938157 9003996 10113967 7334967 1230248 -815616 5675378 12704435
39788 12704435 9226047 -1926969 -7483511 -3979505 -2030232 -7393790 -11052742 -5460377
39780e460377O654736k950394o447515N267387J7579039J3030776l834970j4382400
39772I456282j1258869l788656j092128j292253P16388L356740J742113k698591
39764d858974k518767M526643R914416N097882n200766q074033n64195O384415
39756D706621M652982k91182q54371L97475j667214l811452j673328j84625m526506
39747c251600p527178k86779J0095780R572821L80210k553359K909992L694470
39739A3034357l641909o254984Q75046M472408l300199r266893j281657R884017
39731D520186P493897m184610q182193k185623J258810k017184k860254K612907
39723c544064N982240J720949l800923l608633j81141J210473J161672K422183
$$ plain form
39780 -5460377 1194359 -1756035 -8203550 -2936163 14642876 27673652 23838682 9456282
39772 9456282 -1802587 -5591243 -6683371 -7975624 -7259236 -3902496 -2160383 -4858974
39764 -4858974 -7377741 -2851098 7063318 12161200 6960434 -1113599 -1677794 4706621
39756 4706621 9359603 9068421 8214050 8611525 6944311 3132859 1459531 1274906 -3251600
39747 -3251600 -10778778 -11065557 -969777 8603044 8983254 6429895 9339887 13034357
39739 13034357 9392448 3137464 4012510 8484918 5184719 -4082174 -5363831 4520186
39731 4520186 12014083 7829473 -352720 -2538343 -1279533 -3296717 -6156971 -3544064
39723 -3544064 2438176 4159125 358202 -3250431 -3431572 -2221099 -1059427 1362756
39715A362756L419080J185211k717048l900830j185768K086115K082861j407394
39707I24983m266515j733349N783899J1532505R375228J141065n592493o314238
39699A0851085l229540o79301l55492j428837k449490k269304j146176j207207
39691a914262l642492n483317k284377M904343Q478590L098595o206852q737405
39683a1787177j387564O748444N831217j735926m918056L01813N736434L855882
39675B645067j012825k31479N288489O827256J435625m646294o388779n751529
39667a834469n173794k830390K004727N105763L427996M82314Q84064K994511
39659E060722J746917l285123o898848m677109K203590Q111887P913641K049995
$$ plain form
39715 1362756 4781836 5967047 3249999 -650831 -1836599 249516 2332377 924983
39707 924983 -3341532 -5074881 709018 12241523 21616751 22757816 17165323 10851085
39699 10851085 7621545 6942244 6586752 5157915 2708425 439121 -707055 -1914262
39691 -1914262 -5556754 -11040071 -13324448 -8420105 58485 3157080 -3049772 -11787177
39683 -11787177 -13174741 -6426297 -595080 -2331006 -7249062 -6947249 -1210815 2645067
39675 2645067 1632242 1400763 6689252 13516508 14952133 10305839 3917060 -1834469
39667 -1834469 -7008263 -9838653 -7833926 -2728163 699833 1182147 2066211 5060722
39659 5060722 6807639 3522516 -3376332 -8053441 -5849851 2262036 10175677 12225672
39651A2225672l208147k803420L24463p09343o115269q336053l123635L979398
39643g766334N500219J610175k237109l432025l318906k607660k71088L692665
39635h830063P481108R143193P504914K655526l182919o670965o319089l379889
39627a598184O4916K108458J176809j627025j478881M377498J0501256Q520236
39619B2045083j194451r147280r043150m174067R1886L085393M948687L013068
39611I625169k841786o550080l230633L338127N638976K274288j452947j139542
39603E661572K005526L377934L63690l916197l270069K908964O445647R19615
39595A4496682p594982q214247j661643J224995k771216m913949l22413M234994
$$ plain form
39651 12225672 9017525 6214105 6538568 5829225 -286044 -8622097 -11745732 -7766334
39643 -7766334 -2266115 -655940 -2893049 -6325074 -9643980 -12251640 -12522728 -8830063
39635 -8830063 -1348955 7794238 15299152 17954678 14771759 8100794 1781705 -1598184
39627 -1598184 -1533268 575190 1751999 124974 -1353907 3023591 13524847 22045083
39619 22045083 20850632 11703352 2660202 -1513865 -1421979 1663414 6612101 9625169
39611 9625169 6783383 233303 -2997330 340797 5979773 8254061 6801114 5661572
39603 5661572 7667098 11045032 11408722 7492525 4222456 7131420 13577067 14496682
39595 14496682 6901700 -1312547 -2974190 -1749195 -4520411 -9434360 -9756773 -5521779
39587e521779L211149J184572K412294K544573j510947l792814l9942L297562
39579A784668O8868m478261l200692J027517K799357M488002Q155357O684343
39571A7329159l954160j2386353o917154M189174M043586o373148j0628635l158438
39563a7855969M677043N069834L306562M125967L620407q10317m530144l852055
39555f248672o41102L202632O803746O117491r64805o575795k096074N923287
39547E520708L321379q456166j2757586l264482P470257Q999796N993904M586397
39539A1414207J997211k681022k744858K345519K058741o912723j1951856m765129
39531a1239910M136295L679450P85179N594880J0926022M459645q044589j0832478
$$ plain form
39587 -5521779 -2310630 -1126058 1286236 3830809 2319862 -1472952 -1512894 1784668
39579 1784668 1853536 -2624725 -5825417 -4797900 -1998543 2489459 10644816 17329159
39571 17329159 13374999 988646 -5928508 -1739334 2304252 -4068896 -14697531 -17855969
39563 -17855969 -13178926 -8109092 -4802530 -676563 2943844 2133527 -2396617 -6248672
39555 -6248672 -6889774 -3687142 3116604 9234095 8269290 1693495 -402579 5520708
39547 5520708 8842087 385921 -12371665 -15636147 -8165890 833906 6827810 11414207
39539 11414207 13411418 10730396 7985538 10331057 12389798 5477075 -6474781 -11239910
39531 -11239910 -7103615 -3424165 -2638986 2955894 13881916 18341561 10296972 -535506
39523e35506l292801J816120J188231K817512O620355K898197p615746j0546435
39515f650073k39988J0381129R557780K743557K69823O55548k970824q176697
39507E570255p014904m92120J976657k748836o637501k657701M910373O743885
39499c49892J377212l593140k784074K23j005438l844848k518055J804481J633750
39490i279781l600745m390612L999581J2020038R028719o39259m700056j492574
39482I45311O5475k677853k058368M845499Q832392K195215q772868j2154095
39474h779292n962466J638816M371123L365292J800861n1505l109245o076025
39466a2802441n774675o94986O124869Q823886M987198o31115j548464J644846
$$ plain form
39523 -535506 -3828307 -2012187 -823956 1993556 8613911 11512108 3896362 -6650073
39515 -6650073 -6890061 3491068 13048848 15792405 16062228 16717776 13746952 5570255
39507 5570255 -1444649 -1936769 39888 -2708948 -9346449 -12004150 -7093777 -349892
39499 -349892 1027320 -2565820 -5349894 -5349671 -6355109 -10199957 -12718012 -10913531 -9279781
39490 -9279781 -12880526 -17271138 -13271557 -1251519 7777200 7137941 2437885 945311
39482 945311 1010786 -1667067 -3725435 1120064 9952456 12147671 3374803 -8779292
39474 -8779292 -14741758 -13102942 -8731819 -5366527 -3565666 -3617171 -6726416 -12802441
39466 -12802441 -18577116 -19272102 -13147233 -4323347 663851 32736 -1515728 129118
39458A29118K093548k818899o826632l823202K831118N202203K371617P62370
39450g8759L064623L603759k158654q687897o600549L990224J2208697R539674
39442A4881118l93585p642528p863246m623130k132632o94026N50732Q64271k41933
39433g294959j229440n19155J413054L076256L535239K356182n2545j632045o90293
39424a037706Q19812p30593m423858m515924J330185P322763O522725k93574o439949
39415a446119p592609m361441J069444O038169O622843J263029m924877m817907
39407h149468Q46248L622150n92428n094091k115574N226081P009461J089926
39399A842305l452750M95493P428796O882385j596530p937492n839126m43773
$$ plain form
39458 129118 2222666 -596233 -7422865 -11246067 -8414949 -3212746 -841129 -78759
39450 -78759 2985864 6589623 4430969 -4256928 -10857477 -6867253 5341444 14881118
39442 14881118 14487533 6845005 -1018241 -5641371 -7774003 -8468029 -7917297 -7053026 -7294959
39433 -7294959 -8524399 -9043554 -7630500 -4554244 -1019005 1337177 1284632 -347413 -1037706
39424 -1037706 -217894 -948487 -5372345 -9888269 -8558084 -1235321 5287404 4993830 -1446119
39415 -1446119 -9038728 -13400169 -12330725 -6292556 330287 1593316 -3331561 -8149468
39407 -8149468 -7303220 -3681070 -4273498 -9367589 -11483163 -6257082 752379 1842305
39399 1842305 -1610445 -1114952 6313844 13196229 11599699 3662207 -2176919 -2620692
39391b620692J197632P65146L608703P506857N153042k958098p180349k777369
39383B694872K656913Q63636m418984l715692L078305O465164J996007l035896
39375F584325q24813N071439M906307k816748q815637o155040N4699P25422l337290
39366d607336l089875L713207Q017818L617998k602594j740124K665759J305501
39358G280354m252574l899170L251462O569712J389060l967087l068717j183762
39350B119278l668290n773829k475888J439272P53650K94005N121749Q460188
39342F270135K235010o839661o091763K380048N023705q88380l999088J044758
39334h65236N587921L058574p54902K78614K072812o17868m006553k439823J210865
$$ plain form
39391 -2620692 -1423060 -657914 2950789 10457646 15610688 12652590 5472241 2694872
39383 2694872 5351785 6215421 1796437 -1919255 1159050 7624214 9620221 6584325
39375 6584325 5759512 10830951 15737258 12920510 4104873 -2050167 -1995468 -1270046 -4607336
39366 -4607336 -7697211 -3984004 4033814 7651812 5049218 3309094 5974853 7280354
39358 7280354 3027780 -871390 2380072 8949784 10338844 6371757 3303040 2119278
39350 2119278 -1549012 -7322841 -9798729 -8359457 -7605807 -7311802 -2190053 6270135
39342 6270135 8505145 1665484 -4426279 -2046231 2977474 2089094 -1909994 -865236
39334 -865236 4722685 7781259 7026357 7304971 9377783 8759915 4753362 2313539 3524404
39325C524404M83260l927654n376378n19857P417295J2237373R036673j432842
39317B1442274j0789963j0309964j992723L503683J635709j004824P48752K419182
39309E652126j26494j665969K904818P501492L554429n193352p582733k194381
39301B849936J328602k069380o116974m248329J152738M192572L833322K657462
39293C579949J620859L36710K46443L428029Q197388Q682191J063941r787142
39285A7368368j3021930m338672O508078O505235l078569q040819j895270M707645
39277D714066R96513p122387p204886l6933L301668K92705p93921K942146M289343
39268A378314m696k931005L9870K874634J53041l201928j234855J987210k60301
$$ plain form
39325 3524404 4007664 80010 -5296368 -5816225 1601070 13838443 22875116 21442274
39317 21442274 10652311 342347 -1650376 1853307 3489016 2484192 3232944 5652126
39309 5652126 5525632 3859663 6764481 14265973 17820402 12627050 5044317 2849936
39301 2849936 4178538 2109158 -4007816 -8256145 -7103407 -2910835 922487 3579949
39293 3579949 5200808 5537518 5783961 9211990 17409378 26091569 27155510 17368368
39285 17368368 4346438 7766 6515844 13021079 9942510 1901691 6421 4714066
39277 4714066 5710579 -1411808 -8616694 -8653627 -5351959 -5059254 -5853175 -2911029 1378314
39268 1378314 1373618 -1557387 -1517517 1357117 1510158 -1691770 -2926625 -939415 -1199716
39259a199716m961212m213135J302562L664689Q22217j205116O22946K014145
39251c152620l4944j997996n82020J400396J64960k472404k218244Q30437K827404
39242e235031K111977M67088q51072k362221l244510q96120M298150O827901K429742
39233C545904m665236n522572J515667P454631M537769k701458m027254J393002
39225A530453M315129K17891l932701j556313K868074J927330j909489p80670
39217B679704M435893M817638j709692o283459k841778K929318L384598L27730
39209G739952M1161K296620J934481j584438l635404k318545m52220k2054l32323
39200C667230j501801m201905n910968l308877J212808J831119r57374k52886
$$ plain form
39259 -1199716 -6160928 -10374063 -9071501 -5406812 -4584595 -5789711 -5166765 -3152620
39251 -3152620 -3187564 -5185560 -5767580 -4367184 -4202224 -6674628 -8892872 -8062435 -5235031
39242 -5235031 -3123054 -2655966 -3507038 -5869259 -9113769 -10009889 -5711739 1116162 3545904
39233 3545904 -1119332 -6641904 -5126237 2328394 6866163 4164705 137451 1530453
39225 1530453 5845582 6063473 2130772 574459 3442533 5369863 3460374 2679704
39217 2679704 7115597 11933235 10223543 3940084 1098306 4027624 7412222 7739952
39209 7739952 7781113 10077733 12012214 10427776 6792372 4473827 4021607 3999553 3667230
39200 3667230 2165429 -2036476 -7947444 -11256321 -10043513 -8212394 -9169768 -9422654
39192i422654N130953O754027J6429o194443j673331Q612990J0460028Q16171
39184A4500170q314804p400544j003427J808521M05935L2305J879731K454314
39176D362201K67846k425602l552230k912415r19799J234685J452746l55043q76914
39167c724525J942064M686340K798013k173826m085230p54234L320146L652554
39159E661302J437568O73682K113757K428382j107224o470145q349319m384961
39151g996958J077550K052794n96776j96770M842432O993621P11466p868077q927825
39142i908543k645719K944321M679407N572835N248689J67201n953485l822469
39134c717763N884240J0239707L015493n195477l774232J515346j64852n625691
$$ plain form
39192 -9422654 -4291701 2462326 2478755 -3715688 -5389019 3223971 13683999 14500170
39184 14500170 6185366 -1215178 -2218605 -410084 -4149 28156 1907887 4362201
39176 4362201 4630047 2204445 -1347785 -4260200 -5179999 -3945314 -2492568 -2847611 -3724525
39167 -3724525 -1782461 2903879 5701892 3528066 -557164 -1311398 2008748 5661302
39159 5661302 7098870 7772552 9886309 12314691 11207467 4737322 -3611997 -7996958
39151 -7996958 -6919408 -4866614 -5463390 -5660160 -817728 6175893 6887359 -980718 -9908543
39142 -9908543 -12554262 -9609941 -4930534 642301 5890990 6058191 104706 -3717763
39134 -3717763 2166477 12406184 15421677 10226200 6451968 7967314 7802462 2176771
39126B176771l613402N006862P700687P8664q160792q874391n319516l013910
39118a4019027j006229K875672O010888N351710K218685r27849l498635m221121
39110g215906j306871K626920K113231k216041l021679K406982P426714O507711
39102G321061L002347J546963J66632l694458o128299l388412J53814j022711
39094b043063l501565r07436L868164K635589l819962o029435o70022M987687
39086e480043N476655M502667O002132O204377P52019o012476n967816J118046
39078F595561P000002N595741o13036n648486p623470q639533q986192n502235
39070a7821648K564368R114409P182720r32961m864780L37564P014590N517998
$$ plain form
39126 2176771 -1436631 3570231 11270918 11349582 3188790 -5685601 -11005117 -14019027
39118 -14019027 -15025256 -12149584 -6138696 -786986 1431699 503850 -2994785 -7215906
39110 -7215906 -8522777 -5895857 -3782626 -5998667 -9020346 -6613364 813350 7321061
39102 7321061 10323408 11870371 12037003 8342545 2214246 -1174166 -1020352 -2043063
39094 -2043063 -5544628 -6452064 -2583900 51689 -3768273 -9797708 -10467730 -5480043
39086 -5480043 -3388 4499279 10501411 16705788 17457807 11445331 5477515 6595561
39078 6595561 13595563 19191304 18578268 12929782 5306312 -3333221 -12319413 -17821648
39070 -17821648 -15257280 -6142871 1039849 106888 -4757892 -4420328 2594262 8112260
39062H112260k072742n128423M35979P108651O739858Q12898l184143k236537
39054A0587801q69269l948058q971962q183079P15857R074109P172098j802862
39046C774635m876244K286226Q753374M917779k976099l312990K786045M911675
39038A6264401Q64359j583669O48408J820944n60421j072502K598155M177370
39030B3157045m47051n480763m224944Q43600K976216Q57081k206367m459938
39022A1014879n811483n204513k517680l34115j78123J98463K712634N169492
39014E049554M480775Q63019l406424o461734o630704l473723j57769k46710j306479
39005a1290195K290848Q875748R476546J525977n557364l829454J682799K048384
$$ plain form
39062 8112260 6039518 911095 1347074 8455725 15195583 16008481 12824338 10587801
39054 10587801 9718532 5770474 -3201488 -11384567 -10668710 -1594601 5577497 3774635
39046 3774635 -1101609 1184617 9937991 14855770 11879671 8566681 11352726 16264401
39038 16264401 17128760 15545091 16193499 18014443 17454022 16381520 18979675 23157045
39030 23157045 22709994 17229231 13004287 13847887 16824103 17681184 15474817 11014879
39022 11014879 5203396 -1117 -2518797 -2852912 -3031035 -2832572 -119938 5049554
39014 5049554 9530329 10393348 6986924 525190 -6105514 -9579237 -9737006 -9983716 -11290195
39005 -11290195 -8999347 -123599 9352947 10878924 5321560 1492106 3174905 5223289
38997E223289j414921q66711M230698O312671J561900n244452q062415n899858
38989d159799j285403K984373M800127L521129M44976k552573l953223k285700
38981b486093J996838M269049L16765n954917n729914J784112O998223L945223
38973E139286j408544j873708L56994O90623J408385M975051N453404k488896
38965A2252595j1506525j0357673j174379M028261J878383L31195L349220N353792
38957D154869K781406p3347j56675j082559n301293q496492o078701L48321O116709
38948g787762Q438613O554528J687120k195737k217908j106712k820222n010805
38940d458885k632946K154997K180904k510497l772181J492803O131200L901901
$$ plain form
38997 5223289 3808368 2941657 7172355 13485026 15046926 9802474 1740059 -4159799
38989 -4159799 -5445202 -2460829 2339298 5860427 6305403 3752830 -200393 -2486093
38981 -2486093 -489255 3779794 4096559 -1858358 -7588272 -5804160 1194063 5139286
38973 5139286 3730742 1857034 2214028 2904651 4313036 9288087 14741491 12252595
38965 12252595 746070 -9611603 -10785982 -6757721 -4879338 -4548143 -1198923 4154869
38957 4154869 6936275 6862928 6706253 5623694 322401 -8174091 -14252792 -13904471 -7787762
38948 -7787762 650851 7205379 8892499 6696762 4478854 3372142 551920 -4458885
38940 -4458885 -7091831 -4936834 -2755930 -5266427 -9038608 -7545805 -1414605 2487296
38932B487296j866523m564736k840735O85346L740833M503397K265398j25101
38924D285175O46521K323595K23239l608986k334936L668699N754635L81440n502807
38915E836575n956578m025773l746001k776882J289979M740598L935233J501988
38907G99139R24940Q41890l95560o44401Q02689L94287k574934l107401K90152
38898b669199J510516k099245l285717K778225Q314876M861570k176918k339684
38890D894424K463109K186982l292960m025058K580731P079576L158139l323838
38882A1721105m444977r73370J572547J450161O64917K89153l46871j555342k415282
38873E962041j361702K075384N269807M304500m11008l375664j585059R33012
$$ plain form
38932 2487296 620773 -3943963 -6784698 -6099352 -2358519 2144878 4410276 4285175
38924 4285175 4931696 7255291 7478530 3869544 1534608 5203307 10957942 11339382 5836575
38915 5836575 -120003 -4145776 -7891777 -10668659 -9378680 -4638082 -702849 799139
38907 799139 1724079 2565969 2170409 1526008 2328697 2722984 148050 -2959351 -2669199
38898 -2669199 -1158683 -3257928 -6543645 -3765420 4549456 9411026 7234108 4894424
38890 4894424 7357533 9544515 6251555 2226497 4807228 11886804 15044943 11721105
38882 11721105 7276128 6302758 7875305 9325466 9990383 10279536 9932665 8377323 5962041
38873 5962041 4600339 6675723 11945530 16250030 15839022 12463358 10878299 11811311
38865A1811311L3717j534782L34397K694280J11620m963228m659353K178584Q142817
38856A4149363Q035490M351849Q47170k618830o511708q390679o233261j673936
38848A955458J997744K961315J703756O82534K009109L399756m55363q886146
38840E368163j2114275l657684P952360Q787897r77609p371751k908807M105032
38832h16674L853666j232892k946154j53727J843726L37522k630252m403064l306179
38823i454028J310402O570747O416055j092473q902979q010456J460151J0057381
38815a645200R844954K543512l568470k950020J889560M026794N30972m155680
38807F516422m354634p12910J367456m21295l134344l977235l225182j105849
$$ plain form
38865 11811311 11845028 10310246 10644643 13338923 13450543 8487315 3827962 6006546 14149363
38856 14149363 22184853 26536702 27383872 24765042 18253334 9862655 3629394 1955458
38848 1955458 3953202 6914517 8618273 9300807 11309916 14709672 14254309 5368163
38840 5368163 -6746112 -10403796 -2451436 6336461 5358852 -2012899 -4921706 -816674
38832 -816674 3036992 1804100 -1142054 -1295781 547945 885467 -1744785 -6147849 -9454028
38823 -9454028 -8143626 -1572879 4843176 3750703 -5152276 -13162732 -11702581 -1645200
38815 -1645200 8199754 10743266 7174796 4224776 6114336 10141130 10672102 6516422
38807 6516422 2161788 1448878 2816334 2395039 -739305 -4716540 -7941722 -9047571
38799i047571L244976P922645Q229638L481124l60261J395428M983046L323831
38791B3172856l798738r275466p711523j158827M222450M314584l16350n422911
38783D026075o250671j685304M153555N860585K654827j067595j522066k1847
38775F147559p2189j433066l73514L518203M626541j092532q333403p854441M86575
38766d380267O482131L566309k331003k461889J910832L249104M27353p57633
38758E704937J511753K285956q66094l398711j365761K625766M245172L322197
38750A4065215J814447K14394j011963m17712J045281l00807m569184n945668
38742D894003r13681M838357L188336m811997r784089o176444J444684N278144
$$ plain form
38799 -9047571 -5802595 2120050 10349688 13830812 13470551 14865979 19849025 23172856
38791 23172856 19374118 10098652 2387129 1228302 5450752 9765336 9448986 4026075
38783 4026075 -2224596 -3909900 243655 6104240 8759067 7691472 6169406 6147559
38775 6147559 6075370 4642304 4268790 7786993 12413534 11321002 2987599 -4866842 -4380267
38766 -4380267 2101864 5668173 3337170 875281 2786113 6035217 6462570 5704937
38758 5704937 7216690 9502646 8636552 5237841 3872080 6497846 10743018 14065215
38750 14065215 15879662 16094056 15082093 14664381 15709662 15408855 10839671 4894003
38742 4894003 3980322 8818679 12007015 7195018 -2589071 -8765515 -7320831 -2042687
38734b042687L448173J70096p17321L79863R74613L27393j97065K9763l87124
38725A985704k312423l755119k159402J609025L878937K858451N90676k36291
38717B459558L75087L50297j579239m078669m000746K49671N642210O719742K296515
38708H434426k455050k907454j056308j116979k101719k24737L217676K962940
38700D752795j398658m216523k400584P56107J930484K159434K747599K256180
38692F586834K50478p74377J41276M93570q49189j534743n69172q0553o7947K412143
38682F008320N818073L182395o310243j1988287n457161N809261P662977j110944
38674C614391p911798m429088L424954N695184J324561k841695j757749K871191
$$ plain form
38734 -2042687 1405486 1575582 858261 1238124 2212737 2540130 2343065 2372828 1985704
38725 1985704 -326719 -4081838 -6241240 -4632215 -753278 2105173 2695849 2459558
38717 2459558 2834645 3184942 1605703 -2472966 -6473712 -6224041 -581831 6137911 8434426
38708 8434426 5979376 3071922 2015614 898635 -1203084 -1427821 1789855 4752795
38700 4752795 3354137 -862386 -3262970 -2506863 -576379 1583055 4330654 6586834
38692 6586834 6837312 6062935 6204211 6697781 5848592 4313849 3744677 3664124 3596177 6008320
38682 6008320 11826393 15008788 8698545 -3289742 -8746903 -2937642 4725335 3614391
38674 3614391 -4297407 -8726495 -5301541 393643 1718204 -1123491 -2881240 -10049
38666a0049N790163L989564p55529m552322n663439m663923j469320L860328P257258
38657C782731L368542n441245q895139k054352O774702P194026Q55144k637584
38649B946825j7499L585785M397516L391412J122343k671454m773650j783318
38641F197960K421701P62915n129479n974687O15350N792621K881177l431695
38633D135863n795226m430938l199948j939726J048294L656393L044250O06806
38625b874232q11771j185917q80137J725910N885210O440068J153812m409245
38617E043698m706125k293815k087618k466929L96351L604857J751263k866207
38609c624525l570040q48645o29202k218194P52361O716719N836001l325932q921521
$$ plain form
38666 -10049 5780114 9769678 9014149 4461827 -1201612 -5865535 -7334855 -3474527 3782731
38657 3782731 7151273 1710028 -7185111 -9239463 -2464761 4729265 5584409 2946825
38649 2946825 2929326 6515111 10912627 14304039 15426382 12754928 7981278 6197960
38641 6197960 8619661 9382576 4253097 -1721590 -1106240 4686381 7567558 4135863
38633 4135863 -1659363 -6090301 -9290249 -11229975 -10181681 -6525288 -3481038 -2874232
38625 -2874232 -3686003 -4871920 -5752057 -4026147 1859063 8299131 9452943 5043698
38617 5043698 337573 -1956242 -4043860 -6510789 -6114438 -2509581 -758318 -3624525
38609 -3624525 -7194565 -8043210 -8672412 -10890606 -10138245 -3421526 2414475 -911457 -9832978
38600i832978l681529L587254K805409j192123J544698P926008P021646p85529
38592G392856m151416K82096L078167j347012n897488l777167N42628N16304r47061
38583d308093K315103Q012273Q667900K954729l961216q531267j0060129o752838
38575a1663538J391448P652937N249166j631022k306029M318804P576678J426803
38567A2015247o458974o979724k706032j652762m121953l994097L57120M396412
38559i144763N200300M161566K609917M88310j166810j569733k947340o533715
38551h902268p419514m79949R143016R970517L36164p867221n487198J664754
38543i041699K936585j212681j546042N025034J1276274J0159460K759541n193780
$$ plain form
38600 -9832978 -13514507 -9927253 -7121844 -8313967 -6769269 1156739 8178385 7392856
38592 7392856 3241440 3523536 6601703 5254691 -642797 -4419964 -3877336 -3361032 -4308093
38583 -4308093 -1992990 6019283 14687183 17641912 13680696 5149429 -4910700 -11663538
38575 -11663538 -10272090 -2619153 2630013 998991 -1307038 3011766 10588444 12015247
38567 12015247 5556273 -1423451 -4129483 -5782245 -9904198 -13898295 -13541175 -9144763
38559 -9144763 -3944463 217103 2827020 3315330 2148520 578787 -2368553 -8902268
38551 -8902268 -16321782 -16801731 -7658715 2311802 2647966 -5219255 -10706453 -9041699
38543 -9041699 -6105114 -7317795 -8863837 -3838803 7437471 17596931 20356472 15162692
38535A5162692r656709r793226p056731m139521k423541l67065L264632N804429
38527i205040M030862M6744r80410J290730K119139j9929p78875K283672M957076
38518C743969L027026j001601k250860r93212j030139k938598l743991k166574
38510g353980j7296J274440K326882M026973N955009O142474K098508n463461
38502H989549r863314m571009O017067Q647454j300358j1302994q036532L922661
38494g497476R650066N518318J014869R28638l06018m719763n117455J399056
38486H70235O149883K339477m188279n576711m258107n563074o169654o85081
38478a7081311O311551O329089J187947j99354L087973L554971p44147l217227
$$ plain form
38535 15162692 5505983 -4287243 -11343974 -15483495 -17907036 -18274101 -15009469 -9205040
38527 -9205040 -5174178 -5127434 -6107844 -4817114 -2697975 -2717904 -3496779 -1213107 3743969
38518 3743969 6770995 5769394 3518534 2525322 1495183 -1443415 -5187406 -7353980
38510 -7353980 -7371276 -6096836 -3769954 257019 6212028 12354502 14453010 8989549
38502 8989549 -873765 -5444774 572293 9219747 7919389 -3383605 -11420137 -7497476
38494 -7497476 2152590 7670908 8685777 9614415 9308397 4588634 -528821 870235
38486 870235 7020118 9359595 5171316 -405395 -4663502 -10226576 -16396230 -17081311
38478 -17081311 -10769760 -4440671 -3252724 -3452078 -364105 3190866 2446719 -770508
38470g70508j111508k36851l817634n707125r5417Q389306J0276450L728364l525995
38461G129082l939013J224544L967279p3891n159831k717886N420046P573474
38453A3423804j188739j0500152q857161N22210O417087O180494N008823L306354
38445A4312720k413445q042213n017525M215047P045362k47898o645889l699004
38437d92845K885686M312179R64793k372410m430018m750092j504387K689497
38429b697597J360210m481544n207941J726657N758165J56437o145177l131489
38421a2662279M282528O003797L183329K303333J138276n098719j0090940m560199
38413a5500874N944950P447137o3722k821673L620511P685628J739797n986449
$$ plain form
38470 -770508 -1882016 -2118867 -5936501 -11643626 -11739043 -3349737 6926713 10655077 7129082
38461 7129082 3190069 4414613 8381892 8308001 3148170 430284 5850330 13423804
38453 13423804 12235065 1734913 -7122248 -6600038 -182951 5997543 11006366 14312720
38445 14312720 11899275 3857062 -1160463 3054584 10099946 9852048 3206159 -492845
38437 -492845 2392841 6705020 7669813 5297403 867385 -3882707 -5387094 -2697597
38429 -2697597 -1337387 -5818931 -11026872 -9300215 -3542050 -3385613 -9530790 -12662279
38421 -12662279 -8379751 -2375954 807375 3110708 4248984 -849735 -10940675 -15500874
38413 -15500874 -9555924 -2108787 -2172509 -4994182 -1373671 6311957 8051754 2065305
38405B065305n607610L10491L926367L836656K655693P28782j235806k815L771623
38396A0448686L344027l935822j0363795q291674j332959J939191Q75965J306213
38388f010168M175376M275798k5093l533890k395809N22270J104400K70678J280448
38379c35990L672655L856294P56749k555657l068184r77090J869005M037472M110557
38370A1365811J237803k124650j350727L545469N721667M96780o780473p707033
38362D404647k773703J003071J877249L386470M040018j191539q244168o310731
38354c808686L526303O553759j942022o667590L143120J3974537Q394103o702539
38346A6470985j0976892j813645N451097L910144J109164J59193m512862j0900130
$$ plain form
38405 2065305 -3542305 -3231814 694553 4531209 7186902 7915684 6679878 6677063 10448686
38396 10448686 13792713 9856891 -506904 -8798578 -10131537 -8192346 -7316381 -6010168
38388 -6010168 -1834792 2441006 2415913 -1117977 -3513786 -2991516 -1887116 -1616438 -335990
38379 -335990 3336665 7192959 7949708 5394051 2325867 1348777 3217782 7255254 11365811
38370 11365811 12603614 10478964 9128237 12673706 18395373 18892153 12111680 4404647
38362 4404647 1630944 2634015 4511264 7897734 11937752 10746213 2502045 -3808686
38354 -3808686 -282383 6271376 4329354 -2338236 804884 14779421 23173524 16470985
38346 16470985 5494093 3680448 9131545 13041689 14150853 14310046 9797184 -1102946
38338a102946q685159J311753N482710J90924k205551L650467O182058r75717
38330C848539n741142R51727P588397J562686q161069n747851N005519P830511
38322G137317M92372m739457l260949k624761n606880n292800J035882O788650
38314f070626P471690N874352L774979q81829o233472o086990l52841L012417
38306E07680k81595n074014n659035l056492l09115K460384M804221L967367j97585
38297b838184l431932l185809j772725j080100N32557L263398L343170o12523
38289e782148l433999k25320N935186P739424L171580k657292m188624r02950
38281c44143L295237M009900J35895m856074o028790k291449K321018L386730
$$ plain form
38338 -1102946 -9788105 -8476352 -2993642 -2802718 -5008269 -1357802 4824256 3848539
38330 3848539 -1892603 -940876 6647521 8210207 49138 -5698713 -693194 7137317
38322 7137317 7629689 2890232 -370717 -2995478 -8602358 -13895158 -12859276 -6070626
38314 -6070626 1401064 7275416 11050395 10168566 3935094 -2151896 -2504737 507680
38306 507680 226085 -4847929 -10506964 -13563456 -13872571 -11412187 -6607966 -2640599 -2838184
38297 -2838184 -6270116 -9455925 -11228650 -12308750 -11776193 -8512795 -5169625 -5782148
38289 -5782148 -9216147 -9441467 -3506281 4233143 7404723 4747431 558807 -344143
38281 -344143 2951094 6960994 7096889 2240815 -3787975 -6079424 -3758406 -371676
38273c71676Q59193j737292j467548J840360O271199Q867118O622626j115611
38265A9768369j0122922j3055512o580141L352639O752531J526692l651677j486064
38257c496085L473457K701391j678600J9858P697381R022069j367765j1364153
38249E007553q344095K157491N436909o64896n180635k413848J508636J130507
38241a362378l89993R92863L158158K563358j7706j858877j852274J96301L464038
38232D893490M475228N37519m809439n475901k129267j048164l169372k399054
38224i124960L235726P429027O066141L322362K752843J044421l272932l857986
38216G594642K228535N592025k051602j1861457q990249L489799P290740l198271
$$ plain form
38273 -371676 487517 -1249775 -2717323 -876963 5394236 14261354 20883980 19768369
38265 19768369 9645447 -3410065 -9990206 -6637567 114964 1641656 -2010021 -3496085
38257 -3496085 -22628 2678763 1000163 1020021 8717402 17739471 16371706 5007553
38249 5007553 -3336542 -1179051 4257858 3592962 -1587673 -4001521 -2492885 -1362378
38241 -1362378 -1752371 -759508 2398650 4962008 4944302 3085425 1233151 1429452 4893490
38232 4893490 9368718 9906237 5096798 -379103 -2508370 -3556534 -6725906 -9124960
38224 -9124960 -5889234 1539793 7605934 10928296 13681139 14725560 11452628 7594642
38216 7594642 9823177 15415202 13363600 1502143 -7488106 -3998307 3292433 94162
38208I4162j1462796l792451R913601J1328091M69065o362930j553568M869720
38200C502894K644481m367441o652998l333902m99457j62538J147504M394571
38192c326886N895305M013709K213823L136067L954138R06080m258804o096348
38184F437084k900510R15301N54750l114011m862223j990588J916746J604184
38176a439267k414735m098812n51586L229616J612803k748714k696137K178837
38168f927995M761899J567285k318647k033382M4753L57977J023910M531704O655300
38159G662804K390212m149869m310934J585933L977600j371979o612027l332343
38151d160603N318024R241210M648443k457478m905798k192836R92012J283683
$$ plain form
38208 94162 -11368634 -15161085 -5247484 6080607 6549672 186742 -1366826 3502894
38200 3502894 6147375 1779934 -4873064 -8206966 -8706423 -8868961 -7721457 -3326886
38192 -3326886 2568419 6582128 8795951 11932018 15886156 16792236 12533432 6437084
38184 6437084 3536574 4451875 5006625 1892614 -2969609 -4960197 -3043451 -1439267
38176 -1439267 -3854002 -7952814 -8504400 -5274784 -3661981 -6410695 -9106832 -6927995
38168 -6927995 -2166096 -598811 -2917458 -4950840 -4906087 -4548110 -3524200 1007504 7662804
38159 7662804 10053016 5903147 1592213 3178146 7155746 5783767 -828260 -4160603
38151 -4160603 1157421 10398631 15047074 12589596 7683798 5490962 6482974 7766657
38143G766657m31668k102847l968466o682414p447147k433373O084948J0076656
38135H62346O195164R76590J110202L507607J774415j783908o8262M882143L052915
38126B0509212o864299j2987901p300825K316816M246671l00727j900117J050202
38118a230968J396068l103905n277279Q9335P970470J0126266N556030j57121
38110A5368896k919551l386603l344531k610038l54052K508393L606278J486446
38102A0355238k707514n774596m854017j62125M326914M126247o02419m117154
38094E90574j390390N162334Q039385L961430k498172n583573m785579k536100
38086I59909K41768K613198J540092l598635p147320l549787M077391P449321
$$ plain form
38143 7766657 7334989 5232142 1263676 -5418738 -12865885 -15299258 -9214310 862346
38135 862346 7057510 8034100 9144302 12651909 14426324 12642416 12574154 17456297 20509212
38126 20509212 13644913 657012 -6643813 -4326997 -80326 -381053 -2281170 -1230968
38118 -1230968 165100 -2938805 -8216084 -8126749 -156279 9969987 15526017 15368896
38110 15368896 12449345 9062742 5718211 3108173 2754121 5262514 8868792 10355238
38102 10355238 7647724 1873128 -2980889 -3143014 1183900 5310147 4707728 590574
38094 590574 -799816 4362518 12401903 16363333 13865161 8281588 3496009 959909
38086 959909 1201677 3814875 5354967 1756332 -5390988 -8940775 -4863384 2585937
38078B585937M037631j214177l972782m001513j375687L608642O611543K905649
38070I185243m111042n764052j027888J786989j067646k369101L636075J0841408
38062A1109986J0221123K714213l863979n575712l464567R57134M539530J910362
38054A8548090o544856j0928241m095911O748588R382787L292894k519985m471583
38046I411783n735539n340542Q65245Q329161O496173l909277r377644m040718
38038c301358J227766k722652p934988k998710P373991R449647J850422l472179
38030e28061j47672M952891M560693J190019M27556J541909J58189l784464n741937
38021B629123l151773Q05295P31828m208363p993400m226321M898519R756073
$$ plain form
38078 2585937 6623568 5409391 1436609 -2564904 -3940591 -331949 6279594 9185243
38070 9185243 5074201 -689851 -1717739 69250 -998396 -3367497 268578 11109986
38062 11109986 21331109 24045322 20181343 14605631 11141064 12098198 16637728 18548090
38054 18548090 12003234 1074993 -3020918 3727670 13110457 16403351 13883366 9411783
38046 9411783 3676244 -1664298 -799053 7530108 14026281 10117004 739360 -3301358
38038 -3301358 -2073592 -4796244 -12731232 -15729942 -8355951 1093696 2944118 -528061
38030 -528061 -675733 4277158 8837851 10027870 10455426 11997335 12155524 8371060 2629123
38021 2629123 -522650 282645 1014473 -3193890 -11187290 -15413611 -10515092 -759019
38013g59019N456685j383176j988708K557649M533154J677618j352656k133718
38005F607829k849028l318210k41659M597843L921281l323360p585704j652257
37997c843265Q390371J1601794O586404N26034k265994l362338m145087l946761
37989I541158l330755l227651j801173K326070N332209K795982k493304m101397
37981E041139k134588k307598n324674n547690j137933K763434K749068J030219
37973d868623j201724n437759q310647k596767R469297J4369423O014594l687096
37965C750698k493174L281155L00338q425231p747421M203397J1466199M274452
37957H610413o827528p697555j09384M562581L378812K945777N838459O193215
$$ plain form
38013 -759019 4697666 3314490 1325782 3883431 8416585 10094203 8741547 6607829
38005 6607829 3758801 440591 198932 4796775 8718056 5394696 -2191008 -3843265
37997 -3843265 4547106 16148900 22735304 23261338 20995344 17633006 13487919 9541158
37989 9541158 6210403 2982752 1181579 3507649 8839858 11635840 9142536 5041139
37981 5041139 2906551 598953 -4725721 -10273411 -11411344 -8647910 -5898842 -4868623
37973 -4868623 -6070347 -11508106 -19818753 -22415520 -12946223 1423200 7437794 3750698
37965 3750698 1257524 4538679 4839017 -3586214 -11333635 -7130238 4335961 8610413
37957 8610413 1782885 -5914670 -6024054 -1461473 1917339 4863116 10701575 16894790
37949A6894790R9605p123503q002265l284691m13895k561873m279602l65285N227131
37940c809588M683531j506131m722645j099404L239381K409128j124952k724808
37932d655488k687940k076353J255297O268851O042662r41595m836221Q68093
37924g62694O961602K603102o202279o754657j414346j793291o016131j912211
37916a5290905Q568717R804533m19554o154883q32954K509800l120689n079538
37908a0015473M398693J1023593K200729j0024168q515313J472615M397009J314308
37900c748007L178802P292828L144251m942304l684060M490649M638088m603630
37892E766617r368513m890080q15355q99453K246186Q991089Q871030j46997o475108
$$ plain form
37949 16894790 16994395 9870892 1868627 -1416064 -1829959 -4391832 -8671434 -9036719 -3809588
37940 -3809588 873943 -632188 -5354833 -6454237 -3214856 -805728 -1930680 -4655488
37932 -4655488 -7343428 -9419781 -8164484 -1895633 4147029 3205434 -1630787 -762694
37924 -762694 6198908 8802010 2599731 -4154926 -5569272 -7362563 -13378694 -15290905
37916 -15290905 -6722188 3082345 2662791 -3492092 -4325046 -1815246 -4935935 -10015473
37908 -10015473 -5616780 5406813 7607542 -2416626 -10931939 -9459324 -5062315 -3748007
37900 -3748007 -569205 6723623 9867874 4925570 1241510 5732159 10370247 5766617
37892 5766617 -3601896 -8491976 -9307331 -10206784 -7960598 1030491 9901521 9754524 3279416
37883C279416m282474j166715j443038P95418O064764M978222l127959n059804
37875C7830L580377Q620978J451220m984898J330822R492094L736530r674605
37867A3590348j2922868m542628K410367L417214M583026N831705R88861o537636
37859F818389n927770K037708M218714l835793j0645409p005411J225172M263150
37851h851250K086527O22602J711364K805283J982632p05657l566816l484719
37843g400034M95036M030766K763914l19853Q83085M958449M363262k274305p586060
37834h5740o845839l746352k092779K62772M983667P752823M693136o66793k154029
37825B100866P11237L577655L723543J754055r99089l332106l825314k159521
$$ plain form
37883 3279416 -1003058 -2169773 -3612811 -2817393 3247371 8225593 5097634 37830
37875 37830 3618207 12239185 13690405 8705507 10036329 19528423 23264953 13590348
37867 13590348 667480 -3875148 -1464781 1952433 6535459 12367164 13356025 6818389
37859 6818389 890619 2928327 7147041 3311248 -7334161 -14339572 -13114400 -8851250
37851 -8851250 -6764723 -6142121 -4430757 -1625474 357158 -348499 -3915315 -7400034
37843 -7400034 -6904998 -2874232 -110318 -430171 452914 5411363 9774625 7500320 -85740
37834 -85740 -6931579 -10677931 -12770710 -12507938 -7524271 228552 4921688 4254895 2100866
37825 2100866 2812103 6389758 10113301 11867356 10868267 7536161 3710847 1551326
37817A551326J84959J737145K185474J499003J27979n5466J953728L344665P53737
37808A3282550l659962m363724j223583k42981l654682n568859j293892M525902
37800b199231M401325j188942n204107m093955j019057J42156o99990j528672
37792a1390473r51455J168604L506388L803583J500745p55101k52630J791855
37784a578484J642574j709834m740802l386723K065348O578363N274187o83680
37776C460949m257866p23959N382371N321248j962100q134801p134358k619459
37768a0667975k88961J058202M593413O704555J991576n376858n253176K919054
37760d320170P914869L258089l256229k222034L139096L483608j515604m130569
$$ plain form
37817 1551326 1736285 3473430 5658904 7157907 7285886 7230420 9184148 12528813 13282550
37808 13282550 9622588 5258864 4035281 3792300 137618 -5431241 -6725133 -2199231
37800 -2199231 2202094 1013152 -4190955 -8284910 -9303967 -9161811 -9861801 -11390473
37792 -11390473 -12341928 -11173324 -7666936 -3863353 -2362608 -3117709 -3370339 -1578484
37784 -1578484 64090 -1645744 -6386546 -9773269 -7707921 -1129558 4144629 3460949
37776 3460949 -796917 -1520876 3861495 9182743 7220643 -914158 -8048516 -10667975
37768 -10667975 -10956936 -9898734 -5305321 1399234 3390810 -1986048 -7239224 -4320170
37760 -4320170 3594699 6852788 3596559 1374525 4513621 7997229 6481625 2351056
37752B351056j895091J0499n15387Q81190N432076P070131K064682m283250n654748
37743E461158l466667k075850p71033K683075N052635K127805k750755k997166
37735C263202J55285l38101m917926o458138k669800L10323n22248L07589N765373
37726e104441R198556N011762j401351k391961o9873o21480k318666L97806M881571
37717G581923L811040j131814j030385M568542N796281r67683o170883k066927
37709A0390094N170497N485811l97917m361641l651533j994265j069470J078032
37701A0649608L844523L087798k398444p729694p014655m924O933348O634717
37693A4002277p49323o239335k114302O982066Q733037k7678q542326p682938
$$ plain form
37752 2351056 455965 466464 -48923 832267 6264343 13334474 15399156 11115906 5461158
37743 5461158 1994491 -81359 -852392 1830683 6883318 9011123 6260368 3263202
37735 3263202 3418487 3080386 -1837540 -8295678 -10965478 -10655155 -11177403 -10869814 -5104441
37726 -5104441 4094115 9105877 7704526 5312565 5242692 4621212 2302546 2700352 7581923
37717 7581923 11392963 10261149 9230764 13799306 19595587 18627904 12457021 10390094
37709 10390094 15560591 21046402 20648485 16286844 12635311 10641046 9571576 10649608
37701 10649608 14494131 17581929 15183485 7453791 439136 434212 7367560 14002277
37693 14002277 13252954 7013619 4899317 11881383 20614420 20586742 12044416 4361478
37685D361478k336913j762823m744192l739818J027199K640402N11253R35254
37677c108160M465428M204069q69988k225208L528260O781029l60528r935445
37669B479457q814731J796180Q536800N405835J65640L23052K667638P48220m558698
37660H749393p232082m425705J914437Q410865J1273459P307356j437894o720332
37652A7839497l156759L628007L995803j559069k933260L478258P754321Q86448
37644B9933246j0705498j3497116n767665J619704K349624J918215N303569P734009
37636A8888088L956842j453165j495061J140455j154202p315466q821933l388561
37628C56997K392483M384464M917709M090634j925959j0132842r745394J049014
$$ plain form
37685 4361478 2024565 261742 -4482450 -8222268 -7195069 -4554667 -4043414 -3108160
37677 -3108160 1357268 5561337 4691349 2466141 5994401 12775430 12414902 2479457
37669 2479457 -6335274 -4539094 3997706 9403541 9569181 9892233 12559871 13308091 8749393
37660 8749393 1517311 -2908394 -993957 7416908 18690367 25997723 24559829 17839497
37652 17839497 14682738 18310745 22306548 20747479 17814219 21292477 29046798 29933246
37644 29933246 19227748 5730632 -37033 1582671 3932295 5850510 11154079 18888088
37636 18888088 22844930 21391765 19896704 21037159 19882957 12567491 3745558 356997
37628 356997 2749480 7133944 12051653 16142287 14216328 4083486 -5661908 -4612894
37620d612894Q086524R79021r349747o023786P479122J2381134L505150m391788
37612H052736j654029K298412k261166p837251l232626O364902P450708N834l766640
37603E420880R7467K807642m05682k619598J643321O910771O309887J943527o11647
37594B1496568j282422k552308l168926j269043P15676L70236K53708K340340
37586A6903829K043817m525617j1050649q126115J670153N923978N57880m209567
37578h12291J67542P673395P417209k73087n732607m675486k424295l477351m612113
37569f749084j350783M137865O156827L789052J396726J466555J414806j234128
37561I027836m203116l807619n40055K242608L799491N901160P600112N223638
$$ plain form
37620 -4612894 3473630 4452651 -4897096 -10920882 -3441760 8939374 12444524 8052736
37612 8052736 6398707 8697119 6435953 -1401298 -4633924 1730978 9181686 9187520 5420880
37603 5420880 5518347 8325989 7920307 5300709 6944030 13854801 20164688 22108215 21496568
37594 21496568 20214146 17661838 14492912 13223869 13939545 14309781 14563489 16903829
37586 16903829 18947646 14422029 3371380 -4754735 -3084582 2839396 3397276 -812291
37578 -812291 -644749 7028646 14445855 14172768 8440161 3764675 1340380 -2136971 -6749084
37569 -6749084 -8099867 -3962002 2194825 5983877 7380603 8847158 10261964 9027836
37561 9027836 4824720 1017101 477046 2719654 6519145 12420305 20020417 25244055
37553B5244055r15251m769078k621984J266916J151064j593149j504633J617037
37545A7874977K277323k188000p745276r017336m940644J161820M375608J907103
37537C705575l062954l157014L732774R530288O131458k258892m635619N27421
37529A0513037L930255R16294k019472N68846M110990K677088j526185l522779
37521A5648074l585297l673487k270731Q53707J108999k918467m572373J97046
37513G87471M417002J580522j820295K799013Q932618L718235r246836j2461238
37505a293508q71311J0493038R380422J791091k042918l224198o178171o638197
37497A416248M13432Q505974P466622r99716o221377m144647k80161J040471J146252
$$ plain form
37553 25244055 24328804 19559726 16937742 18204658 19355722 17762573 16257940 17874977
37545 17874977 20152300 17964300 10219024 1201688 -3738956 -2577136 1798472 3705575
37537 3705575 642621 -2514393 1218381 10748669 16880127 14621235 9985616 10513037
37529 10513037 14443292 15359586 13340114 13908960 18019950 20697038 19170853 15648074
37521 15648074 12062777 8389290 6118559 6972266 8081265 5162798 590425 787471
37513 787471 5204473 6784995 4964700 7763713 16696331 20414566 11167730 -1293508
37505 -1293508 -2164819 8328219 17708641 19499732 17456814 14232616 8054445 1416248
37497 1416248 1829680 10335654 17802276 16802560 10581183 6436536 6156375 7196846 8343098
37488H343098J313739O55277j8221J107608K278517L97614k545994j688472K095419
37479A1938585K601017j610759m147012l25901N617089O270621M98082n916415
37471A4925307p082977k491643L043154M129294N24108k464684q79165K423176
37463A2126570K449019L66241J937882P721386J0453343M424893o524944j3182643
37455A9771747j0912579l421812K013193J856839m56604J128757O929833R772107
37447B6681481M357397m313526o875833k267924J953830J724011J444584M841612
37439B7545632Q020419N803671m23037n729229q160264p857973l847471L185675
37431A8537423Q159864O962816K365672p4948K81856L54830j46246R77149L084917
$$ plain form
37488 8343098 9656837 10312114 10293893 11401501 13680018 14077632 11531638 9843166 11938585
37479 11938585 14539602 12928843 8781831 8455930 14073019 20343640 20841722 14925307
37471 14925307 7842330 5350687 8393841 12523135 13047243 10582559 9703394 12126570
37463 12126570 14575589 14941830 16879712 24601098 35054441 39479334 32954390 19771747
37455 19771747 8859168 5437356 7450549 9307388 8850784 9979541 16909374 26681481
37447 26681481 31038878 26725352 19849519 17581595 19535425 21259436 22704020 27545632
37439 27545632 35566051 41369722 40946685 35217456 27057192 19199219 15351748 18537423
37431 18537423 26697287 33660103 36025775 35950827 36232683 36587513 36441267 37418416 40503333
37422D0503333L429178K489306K985707L974424J853093k408724l270746N53838
37414E0109409L121668j38647n781289p727493n329278k229491k02999J584582
37406C3406462K721026J061055l552489p397070n691119K544068J1911926J4064835
37398D9068694O323375l556475m974239K669790R217838P375408J723636M82246
37390F8330273L347629L603679n97322l993468k677050J383944M880523O771704
37382H1049912O296081K713070j099259M7534N859849Q817208M233461j908227
37374A06009629m29721Q209292J4536794J2961726Q014526O226919P136008N971452
37366A68636625J850456j385880j432148k23062K11201Q27376K642305L785693
$$ plain form
37422 40503333 43932511 46421817 49407524 53381948 55235041 52826317 49555571 50109409
37414 50109409 53231077 53092430 47311141 39583648 34254370 32024879 31821880 33406462
37406 33406462 36127488 37188543 33636054 26238984 20547865 23091933 35003859 49068694
37398 49068694 55392069 51835594 46861355 49531145 58748983 66124391 67848027 68330273
37390 68330273 71677902 75281581 74684259 70690791 68013741 69397685 74278208 81049912
37382 81049912 87345993 90059063 88959804 89007338 94867187 103684395 107917856 106009629
37374 106009629 105579908 113789200 128325994 141287720 149302246 155529165 162665173 168636625
37366 168636625 170487081 169101201 167669053 167445991 167657192 168484568 171126873 174912566
37358A74912566K575192J538034M208920Q409487P561937K17623o353630n462803
37350A87607326j57299J711378j027642k491879j24756J537619o86499k822458
37342A83545790m67057L325186K068316m720844j0980332j1956369q684747n203036
37334A46926907m474310o615963q713770p300492l018862p66175k625137l788197
37326A09624001J20007M723124K359698n576394r321504m478223K380658M219988
37318A04051355K591709K145731K277492m7537l344968l661162j404004o97466
37310A01911150k905454n169553m811717j809649K222323M601921K610635k882888
37302I3766768o473750m318762N04936K399457J054890L72198J232231P71189
$$ plain form
37358 174912566 177487758 179025792 183234712 191644199 199206136 199423759 193070129 187607326
37350 187607326 187450027 189161405 188133763 185641884 185517128 187054747 186368248 183545790
37342 183545790 183078733 186403919 188472235 183751391 172771059 160814690 152129943 146926907
37334 146926907 142452597 135836634 127122864 119822372 116803510 116037335 113412198 109624001
37326 109624001 109744008 114467132 116826830 111250436 101928932 97450709 99831367 104051355
37318 104051355 106643064 108788795 111066287 111018750 107673782 104012620 102608616 101911150
37310 101911150 99005696 93836143 89024426 87214777 89437100 94039021 96649656 93766768
37302 93766768 87293018 82974256 83479192 85878649 86933539 87305737 88537968 89309157
37294H9309157j650918l311084l365005l954703n198321m403648j855716j976249
37286F3593513n986707q349998m427231K082387L902796J21671l165099j442793
37278D6328539K771402L632417j068268p417338r295131m861531J171938L002292
37270C4264320Q57164p0940K215916L573415P64189k768523k044045J362702J247998
37261C9402196m044698q914563p662955j087392N115675O219731J961822l745170
37253B7244646n730096j996676L801747N765094K380633j871566k563564j002971
37245B6027247j607070m769144n764718j691137L551957L942067o29401m492043
37237A4567758m109134k015536j722563k488052j735691L62345K062946L462987
$$ plain form
37294 89309157 87658239 84347155 80982150 77027447 71829126 67425478 65569762 63593513
37286 63593513 57606806 49256808 44829577 46911964 50814760 50936431 47771332 46328539
37278 46328539 49099941 52732358 51664090 44246752 34951621 30090090 31262028 34264320
37270 34264320 35121484 35050544 37266460 40839875 41604064 38835541 36791496 38154198 39402196
37261 39402196 35357498 26442935 18779980 17692588 22808263 29027994 30989816 27244646
37253 27244646 21514550 19517874 23319621 29084715 31465348 29593782 27030218 26027247
37245 26027247 24420177 19651033 13886315 12195178 15747135 19689202 19059801 14567758
37237 14567758 10458624 8443088 6720525 4232473 2496782 2859127 4922073 8385060
37229H385060N002320M537442K72167m697192n439440k057818J184078K756533
37221I943150M334339M918445J442520l795864l931319J507090M083803o17752
37213A7884412n017349j173773N892621N384628k475035o635818j674145M948713
37205A7134254M157817l057618q456990o657653L28456N870634M411881l249914
37197A0480867r573082p579350J050150P672832O564294L48217m492499m416649
37189E4780n59935L515234M809765L386951K098925K486874K166234j307156n571415
37180A1080257o190035l369905j629033k711111l259272o22908K932801L655030
37172a14176J157490j877374k972046j670295N51651J658718J278136J100883
$$ plain form
37229 8385060 13387380 17924822 18196989 13499797 8060357 6002539 7186617 9943150
37221 9943150 14277489 19195934 20638454 16842590 12911271 14418361 18502164 17884412
37213 17884412 12867063 11693290 17585911 22970539 20495504 13859686 12185541 17134254
37205 17134254 21292071 18234453 9777463 3119810 3448266 9318900 13730781 10480867
37197 10480867 907785 -6671565 -5621415 2051417 8615711 8963928 4471429 54780
37189 54780 -505155 3010079 7819844 11206795 13305720 15792594 17958828 16651672 11080257
37180 11080257 4890222 1520317 -108716 -2819827 -6079099 -6702007 -3769206 -114176
37172 -114176 1043314 -834060 -3806106 -5476401 -4924750 -3266032 -1987896 -887013
37164h87013K129807L036164K672024J904673J010824j495466m625560l804726
37156e9273J626240M651212O06335m013926j333985L894080J447657o060713o062059
37147e304432K473823N881934j691086q057979l225530M358943L170285j746012
37139d140054J291535R546875J0382263K124703m773830n364043m566834m203840
37131B96775J70229P379869Q599820J332852n548905n366575k433936k272477
37123B157652k358654J028597M660009M208975K064784K199180K322680j545621
37115A4737602o565149o588743j942753J141480j21905k124325r92345L034655
37107E78517P195324Q409116M565666k689235p324218n033280O10096K089532
$$ plain form
37164 -887013 1242794 4278958 6950982 8855655 9866479 8371013 3745453 -59273
37156 -59273 1566967 6218179 6824514 2810588 1476603 5370683 6818340 757627 -5304432
37147 -5304432 -2830609 3051325 1360239 -6697740 -9923270 -5564327 -2394042 -4140054
37139 -4140054 -2848519 6698356 17080619 19205322 14431492 9067449 4500615 296775
37131 296775 467004 7846873 16446693 17779545 12230640 6864065 4430129 2157652
37123 2157652 -201002 827595 5487604 9696579 11761363 13960543 16283223 14737602
37115 14737602 8172453 1583710 -359043 782437 660532 -1463793 -2456138 578517
37107 578517 7773841 16182957 20748623 18059388 10735170 5701890 6311986 8401518
37099H401518k335812o976880o716621k209525L502943Q709285J1393448Q464957
37091B2233313L27190o693882o711556j797087P29845j953690n136659l985569
37083b988095r0388J743499M84345o93496J92429J527728J333683R0008o88614
37074I11099o76722l90093j50628m37812j815296l358313k561849J659710O727962
37065i1942Q525581N410620n26438n479258o726311m462660j382446M45784K035300
37056b251770N004359P196481M370629k789844p421325m834543J199957L781754
37048D255698J711906p62113q35076L55968Q57542j10337k262850l471698q30826
37039a091786M377825N871029J065262k928476J289605Q759195P823754k135467
$$ plain form
37099 8401518 6065706 -911174 -7627795 -9837320 -6334377 2374908 13768356 22233313
37091 22233313 22560503 15866621 9155065 7357978 8087823 6134133 997474 -2988095
37083 -2988095 -3078483 -1334984 -850639 -1544135 -1351706 176022 1509705 1599713 911099
37074 911099 234377 -155716 -306344 -744156 -2559452 -5917765 -8479614 -6819904 -91942
37065 -91942 8433639 13844259 13317821 7838563 1112252 -3350408 -4732854 -4287070 -2251770
37056 -2251770 2752589 9949070 14319699 11529855 4108530 -726013 473944 4255698
37048 4255698 5967604 5205491 4370415 4726383 5583925 5473588 3210738 -260960 -1091786
37039 -1091786 3286039 9157068 10222330 7293854 8583459 17342654 25166408 23030941
37031B3030941q839566n374624k982k067787p199617n519593J425940K792779
37023a754509m223907r571363m965083M725633R017787N457603N46065k70769
37015a038543J812299L238933L279102K763499P47204l745341p590610n672616
37007f206073J505968O373130L507034k951323n288414k911189j327101j882700
36999i180668J90717O193220R555547N038731k783885n319023j287051K596631
36991E004219R76285m119372o472302k385600N759413J1413551R886977K888434
36983B2951605m078681q118454r840143q743455l131369M101790N739608j7566
36975a136665n255631k630942M292551O571402K309948k778056m872271n155892
$$ plain form
37031 23030941 14191375 8816751 8813769 6745982 -453635 -5973228 -4547288 -1754509
37023 -1754509 -5978416 -15549779 -20514862 -15789229 -6771442 -1313839 -767774 -1038543
37015 -1038543 773756 4012689 7291791 10055290 10802494 7057153 -533457 -6206073
37007 -6206073 -4700105 1673025 5180059 2228736 -3059678 -5970867 -7297968 -9180668
36999 -9180668 -8989951 -2796731 6758816 11797547 9013662 3694639 2407588 5004219
36991 5004219 5980504 1861132 -4611170 -6996770 -1237357 10176194 20063171 22951605
36983 22951605 18872924 10754470 914327 -7829128 -10960497 -6858707 -1119099 -1136665
36975 -1136665 -6392296 -9023238 -4730687 1840715 4150663 1372607 -3499664 -8655556
36967h655556m242804m88029N065346P771437N339081O45917k692734l850608
36959a107950k974044P6954L565946M055860Q04777k662217l077628j252723M7486
36950b523539q1143m27540L94836K767481N520392O297927M031462P73825j012954
36941A5740747k254727n141691p729313n337869J488815N367139J586632m591706
36933h71973m552365J969685O730218M225946j510963k991222J103931N190472
36925I293729M411650J01774k970416k756243j425082j289051j503229O9797L020433
36916F953362M132209R75244n106057r726263r088568l473091K678083M954129
36908g700952L331744J150095L2959j512893l670991l062450K186160P767180
$$ plain form
36967 -8655556 -12898360 -13386389 -8321043 -549606 4789475 5435392 2742658 -1107950
36959 -1107950 -4081994 -4005040 -439094 3616766 4421543 1759326 -1318302 -2571025 -2523539
36950 -2523539 -2604682 -3032222 -2637386 130095 5650487 11948414 15979876 16753701 15740747
36941 15740747 13486020 8344329 615016 -4722853 -3234038 2133101 3719733 -871973
36933 -871973 -5424338 -3454653 3275565 7501511 5990548 2999326 4103257 9293729
36925 9293729 13705379 13807153 10836737 8080494 6655412 5366361 3863132 3932929 6953362
36916 6953362 11085571 12060815 6954758 -2771505 -11860073 -15333164 -12655081 -7700952
36908 -7700952 -4369208 -3219113 -3186154 -4699047 -8370038 -11432488 -9246328 -1479148
36900a479148P675876K272519k227768k215042o43313j586293m331313n009176
36892g543658k178318J330871J816524r50022l091094r90706L661552N169222
36884b775629J400728k486382o89620M922929P040928K571251l890687o173805
36876h0287k646911L663761P650825N144869k784766q742978o480371N96665L218349
36867d60844j233587n804517m785080r47764R29288J443275K951259L938689K496606
36858a472675J169148K450398L074671o70195m900819l001732L001714M236489
36850C886999j383828n612146k589830K433879J919173k272946k579729J971759
36842d226669M323906M17205m298779k200997N936922J1383801P906166j238638
$$ plain form
36900 -1479148 6196728 8469247 6241479 4026437 3383124 1796831 -2534482 -7543658
36892 -7543658 -9721976 -8391105 -6574581 -7524603 -10615697 -11606403 -7944851 -2775629
36884 -2775629 -1374901 -3861283 -4550903 372026 7412954 9984205 6093518 -80287
36876 -80287 -2727198 936563 8587388 13732257 10947491 2204513 -4275858 -3679193 -460844
36867 -460844 -1694431 -7498948 -12284028 -13231792 -12302504 -10859229 -7907970 -3969281 -1472675
36858 -1472675 -303527 2146871 5221542 4551347 -349472 -3351204 -349490 3886999
36850 3886999 2503171 -3108975 -5698805 -3264926 -1345753 -3618699 -6198428 -4226669
36842 -4226669 97237 514442 -3784337 -5985334 -48412 11335389 19241555 18002917
36834A8002917p913957q463306n759206k955937M11915M402996N132477q9619
36826B768280o344101n673894J833525P198651M504794j511350k918867Q48318
36818G05356M228442M031825J622320j456038m674296n901069k711456K985288
36810a169628N766852L154425k008476n895569o677308l208718M049616R575336
36802C586530O255692m357892j0691741m978855N810969Q742179J471798o629362
36794g90682q042452m405166k87014K966632N150348N036756L254072K748288
36786E630782L745158K514397k163685n576472l466904J781534M875621M418529
36778A1758960K448850Q8760k390764l363513j719606L84651M5871k098046k815023
$$ plain form
36834 18002917 10088960 1625654 -4133552 -7089489 -6677574 -2274578 2857899 2768280
36826 2768280 -3575821 -9249715 -7416190 -217539 4287255 2775905 -142962 705356
36818 705356 4933798 8965623 10587943 9131905 4457609 -1443460 -4154916 -1169628
36810 -1169628 4597224 7751649 5743173 -152396 -6829704 -10038422 -5988806 3586530
36802 3586530 9842222 5484330 -5207411 -10186266 -4375297 4366882 5838680 -790682
36794 -790682 -8833134 -13238300 -13525314 -10558682 -5408334 -371578 2882494 5630782
36786 5630782 9375940 11890337 9726652 4150180 683276 2464810 7340431 11758960
36778 11758960 14207810 14296570 11905806 8542293 6822687 7207338 7253209 5155163 2340140
36769B340140n77531K999346M698311J704556n222348r675175n194935M867748
36761d059888Q603672P47943q845350p774474K516894R953031P936154O62546
36753I740528n216379o516797k696078L449048N558016J178765k702421O43260
36745C437942N656252K369786o326966q300961k633057j431855q184846j0088529
36737b5502234P63381J2890511J2563920L743132j008806m845R9210j155328K84807
36728B673748J870802j514376n898312l653607K024629J363567m822042o035180
36720a3990771k31619L063056j16595j757823L052537P248527M144087j945461
36712e34062m118403k871762j192264J839069N743775M944874k207029p722611
$$ plain form
36769 2340140 1762609 4761955 9460266 11164822 5942474 -3732701 -8927636 -4059888
36761 -4059888 4543784 5291727 -3553623 -11328097 -8811203 1141828 9077982 9740528
36753 9740528 4524149 -1992648 -4688726 -1239678 4318338 5497103 2794682 3437942
36745 3437942 9094194 11463980 5137014 -3163947 -5797004 -7228859 -15413705 -25502234
36737 -25502234 -24738853 -11848342 715578 4458710 3449904 3445059 3544269 2388941 2673748
36728 2673748 4544550 3030174 -2868138 -6521745 -4497116 -3133549 -7955591 -13990771
36720 -13990771 -14222390 -11159334 -11275929 -13033752 -9981215 -2732688 1411399 -534062
36712 -534062 -4652465 -7524227 -8716491 -6877422 -1133647 3811227 1604198 -6118413
36704f118413m767100K254561N686762N882689O255898M029106l804025j0692830
36696a273352q226048l53263J708615k899319l934851K942203R993309J0349555
36688H306849O703147L704841R19425k475486l975203l155702l769205o265967
36680g301n174074J475349O896629N073277m73917k921831j507797R00953L819604
36671H080892O501448M971102j263914m994278j603619K014147j792238p158463
36663D755077l180314O843847Q844562M47984m958244K9715N657819K523725k905924
36654A8058247o41669N180646L648482m209961p216935k118751K213929p59395
36646A4154593o492354p369905k315683L986100O477455L137167k879398m692874
$$ plain form
36704 -6118413 -10885513 -8630952 -2944190 2938499 9194397 13223503 9419478 -1273352
36696 -1273352 -9499400 -9852663 -8144048 -11043367 -14978218 -12036015 -2042706 8306849
36688 8306849 15009996 18714837 19634262 17158776 13183573 10027871 6258666 -7301
36680 -7301 -5181375 -3706026 3190603 8263880 7789963 4868132 3360335 4261288 8080892
36671 8080892 14582340 19553442 18289528 13295250 11691631 13705778 11913540 4755077
36663 4755077 1574763 8418610 17263172 17711156 12752912 12782627 18440446 20964171 18058247
36654 18058247 17416578 22597224 26245706 22035745 14818810 12700059 14913988 14154593
36646 14154593 7662239 292334 -2023349 1962751 8440206 11577373 8697975 4005101
36638D005101L79469N668224L466163l116436m054541K187824N917525R64150
36630A5417479o299600o963797j568523L319112M852318M043287M79600n973827
36622G306049j0283622o202649M329988J1211330P538240k464781q880037p155496
36614d600978j402104K171355K051487O07877p91409k348452k488465J004764
36606e795925N256601L568838l889573o810350J218834J0821671Q641313k343199
36598A0668210o547808L28849N043798j306902q819389n192581M384781O069547
36590D628505q25646m432017j3702M096461J299064l729238l952446j46404K389059
36581f86364J657712o97942l050423m258889l124935q8716K391164K942797L047189
$$ plain form
36638 4005101 4384570 10052794 13518957 10402521 6347980 8535804 14453329 15417479
36630 15417479 9117879 2154082 585559 3904671 8756989 12800276 13279876 7306049
36622 7306049 -2977573 -9180222 -4850234 6361096 13899336 11434555 2554518 -4600978
36614 -4600978 -6003082 -3831727 -1780240 -1172363 -1963772 -4312224 -6800689 -5795925
36606 -5795925 -539324 3029514 -860059 -7670409 -6451575 4370096 13011409 10668210
36598 10668210 4120402 4449251 9493049 8186147 -633242 -5825823 -1441042 4628505
36590 4628505 3802859 -629158 -642860 3453601 4752665 1023427 -2929019 -3075423 -686364
36581 -686364 971348 273406 -2777017 -7035906 -10160841 -10249557 -7858393 -4915596 -1868407
36572a868407M356440N875514N174822J511105l052514n320284l967821j211216
36564A497639m88191k056742k809957j323837k30404j619575l253430k485367
36556a2769864j004520j566489k416867M1359M446169N701841K729589q3636L41377
36547d581041K216189L006439K712293J620372j126536m652406n474855k059819
36539h339364K182238K965852N48405j276576n88549O65369J97908j060022l82444
36530e087183K333045L671631J459986j394477n93479K894166L608845n69668
36522F322866n299959n859990k696171Q17863K575626J875646q34684k504435
36514e603238p1797L657396K272262l466226m114869M368428J2296395R277810
$$ plain form
36572 -1868407 2488033 8363547 13538369 15049474 11996960 6676676 2708855 1497639
36564 1497639 1009448 -1047294 -3857251 -5181088 -5411492 -7031067 -10284497 -12769864
36556 -12769864 -13774384 -15340873 -17757740 -17716381 -13270212 -7568371 -4838782 -4922418 -4581041
36547 -4581041 -2364852 641587 3353880 4974252 3847716 -804690 -6279545 -8339364
36539 -8339364 -6157126 -3191274 -2642869 -3919445 -4507994 -3842625 -3644717 -4704739 -5087183
36530 -5087183 -2754138 917493 2377479 983002 389523 3283689 6892534 6322866
36522 6322866 1022907 -4837083 -7533254 -6715391 -4139765 -2264119 -3098803 -5603238
36514 -5603238 -5675035 -2017639 254623 -3211603 -7326472 -2958044 9338351 18616161
36506A8616161o70269n982790m515441l242764m329849l140193O59806J549241
36498a056098j019630r76673K660863K798018k889234n785095P65275J0007937
36490D505363J0630634K146512n713609o241654k035361J029602Q85897o16811
36482D590573j648477k449662l554246l391342J6546M710048N614483J454135
36474E342058l100023m650223n202598n339293l87188R571049J3230887K560022
36466A2024691j1505029j1315823J938461R612682K985451n954815m816689K425596
36458d605475N478373K544454k370090o996167q473803k621707P441246J0724616
36450A121447L456295m026494k816148J316250j022118p120936p826564k387073
$$ plain form
36506 18616161 17945892 11963102 7447661 4204897 -124952 -3265145 -2605339 -1056098
36498 -1056098 -2075728 -3052401 -391538 2406480 -482754 -6267849 -5502574 4505363
36490 4505363 15135997 17282509 11568900 5327246 3291885 4321487 5207384 4590573
36482 4590573 2942096 492434 -3061812 -6453154 -6436608 -1726560 3887923 5342058
36474 5342058 2242035 -2408188 -7610786 -12950079 -13337267 -3766218 9464669 12024691
36466 12024691 519662 -10796161 -8857700 754982 3740433 -2214382 -7031071 -4605475
36458 -4605475 872898 3417352 1047262 -5948905 -14422708 -17044415 -9603169 1121447
36450 1121447 4577742 551248 -2264900 -948650 -1970768 -9091704 -16918268 -19305341
36442a9305341K611655M220157L875550J803410r54559M3991M996305N552447
36434B843615k634667r385749l257706R738547J3368436M318700m790163m953243
36426E247770r29734j07646k033602k672924j278521N67230J646363R43475j320713
36417F1698k455251q38741P47381n24818k356339j408142N29923J40189r06144
36408g010244P71011L750471M812070M559598L719422p05097p766766p945879
36400e815414K885946J1461819L459091j2559575j4565566M65437J1804000O032347
36392C168085n066753n396816K282647N298250J626022j188794o33373p65956
36384f76688k558115k575044j58886J319744J03043j901481k302584m82330K274805
$$ plain form
36442 -19305341 -16693686 -12473529 -8597979 -6794569 -7749128 -7705137 -2708832 2843615
36434 2843615 208948 -9176801 -12434507 -2695960 10672476 14991176 10201013 5247770
36426 5247770 4318036 4210390 2176788 -496136 -1774657 -1207427 438936 1382411 61698
36417 61698 -2393553 -3232294 -2484913 -3009731 -5366070 -6774212 -6244289 -6104100 -7010244
36408 -7010244 -6239233 -2488762 2323308 6882906 10602328 9897231 2130465 -5815414
36400 -5815414 -2929468 8532351 11991442 -568133 -15133699 -14668262 -2864262 3168085
36392 3168085 -1898668 -7295484 -5012837 285413 1911435 722641 89268 -676688
36384 -676688 -3234803 -5809847 -5968733 -4648989 -4545946 -6447427 -8750011 -9232341 -6957536
36375f957536L210387N67160l372275m310394j390008K565782N807267Q162580
36367D282963P538020K120232l750772l042264L229275N995979J232267m233592
36359A3372108l445267R53540K254858n23357l219662l138314j122859M98643
36351E629690n2591j774116q89856L398879N150928l26402p059753n583360J951425
36342D44844M481540l19783l506114j585748j764616o161697n595111L257756
36334a0748929Q690312K431225n428973k614108N200101M958824j750156l178299
36326b440003J851666L840404K21294k208372j300180j856410m062284k831926
36318h785811R42993J227843o16751K650991Q919066P266386k900244p656507
$$ plain form
36375 -6957536 -3747149 -3179989 -6552264 -10862658 -12252666 -9686884 -3879617 4282963
36367 4282963 11820983 13941215 10190443 7148179 10377454 16373433 17605700 13372108
36359 13372108 9926841 10880381 13135239 12611882 9392220 6253906 5131047 5629690
36351 5629690 5577099 3802983 2913127 6312006 11462934 11136532 4076779 -1506581 444844
36342 444844 4926384 4606601 1100487 -485261 -2249877 -8411574 -14006685 -10748929
36334 -10748929 -2058617 372608 -5056365 -7670473 -2470372 2488452 738296 -2440003
36326 -2440003 -588337 3252067 3473361 1264989 -35191 -1891601 -5953885 -8785811
36318 -8785811 -7842818 -6614975 -7231726 -4580735 4338331 11604717 8704473 1047966
36310A047966K95719R366010O491066m004056q939973n467613j127473k01555
36302b539909l24703Q0666j68670p28221k58266j34274k043674l545855j553324
36293a1216230J565003J298941j016912p1219L935584M554711p89237o190712
36285g930071n612309p98142K846929M281649O005178P609053N649013O8603l962298
36276H157605k573724J506457K640538o11338m636475n921126m327078j467812
36268g232953J502663L757249M449701L599209K181340P01380j241451l521316
36260D195822m784165l730577l14986M294708P848093P528807K352232m602919
36252A2787015q178311o106867r52627K997321L649816K233339J737773L576761
$$ plain form
36310 1047966 1343685 10709695 17200761 13196705 4256732 -1210881 -2338354 -2539909
36302 -2539909 -2864612 -2783946 -2952616 -3680837 -3939103 -4073377 -6117051 -9662906 -11216230
36293 -11216230 -9651227 -8352286 -9369198 -9440417 -5504833 -950122 -1739359 -7930071
36285 -7930071 -13542380 -14340522 -11493593 -7211944 -1206766 6402287 12051300 12119903 8157605
36276 8157605 5583881 7090338 9730876 9119538 4483063 -1438063 -5765141 -7232953
36268 -7232953 -5730290 -1973041 2476660 6075869 8257209 8958589 7717138 4195822
36260 4195822 -588343 -4318920 -4633906 -339198 7508895 15037702 17389934 12787015
36252 12787015 4608704 -1498163 -2450790 546531 4196347 6429686 8167459 11744220
36244A1744220M939691J645765m644991n927806J143222P698393L302219q190723
36236A1709990j2627459n424145K729873K632977j325251j235583J520054J389040
36228f30504n15234M82443L398289L734717J388447p97922k757399m478843j955341
36219b131347N989749J1083976N475753m861315p105471j52117M925663K525608
36211A5750499j149958r54142k68374j851141j854424J654690L303564l56612
36203A4274102m114098l104172j408284m242410p617671m357430L533311P260349
36195B23697M223641N90315R76737K613562J390087j637133k496263j68209K284720
36186H001154J752620r65042j890841Q66179L685204J792903l445033n548790
$$ plain form
36244 11744220 16683911 18329676 13684685 7756879 8900101 16598494 19900713 11709990
36236 11709990 -917469 -6341614 -3611741 -978764 -2304015 -3539598 -2019544 -630504
36228 -630504 -1145738 -663295 2734994 6469711 7858158 7060236 4302837 -176006 -2131347
36219 -2131347 3858402 14942378 20418131 15556816 8451345 8299228 13224891 15750499
36211 15750499 14600541 13646399 13378025 11526884 9672460 11327150 14630714 14274102
36203 14274102 10160004 7055832 5647548 1405138 -6212533 -10569963 -7036652 223697
36195 223697 4447338 5037653 6014390 8627952 10018039 8380906 5884643 5716434 8001154
36186 8001154 9753774 8788732 6897891 7764070 11449274 13242177 9797144 4248354
36178D248354j985876K440319L266342K373066K752499K239501k054930o760659
36170F518616o368203k330433j049018l376390l472517O96958L036103r77415
36162g322299o126090m259206M089150J0287537Q591251K028104k654200k361893
36154B272354P26579K490648R31951j960070k486939k14144P62186k430956o055809
36145e964200l761484M422683J1144351J0549206M260295k584006p028674p930996
36137C107175m374761J830660N504839M078354J404171J554691K193039o20159
36129A4678009m367308l855176q68765j753302n870817n484229J359435O764989
36121F02836N068206P42768k23575P82133L59203M54151L446621N279967J026669
$$ plain form
36178 4248354 2262478 4702797 7969139 10342205 13094704 15334205 13279275 6518616
36170 6518616 150413 -2180020 -3229038 -6605428 -10077945 -9380987 -6344884 -7322299
36162 -7322299 -13448389 -17707595 -13618445 -3330908 5260343 7288447 4634247 2272354
36154 2272354 2998933 5489581 6421532 4461462 1974523 1760379 2522565 91609 -5964200
36145 -5964200 -9725684 -5303001 5841350 16390556 20650851 18066845 11038171 3107175
36137 3107175 -1267586 563074 6067913 10146267 11550438 13105129 15298168 14678009
36129 14678009 10310701 6455525 5586760 3833458 -2037359 -7521588 -6162153 602836
36121 602836 5671042 6413810 6190235 6972368 7331571 7785722 11232343 16512310 17538979
36112A7538979o266738r236651o126599j115514K601724M384568L570174J011309
36104F361252M98199L257443M336657K40359l895900j953986K214871L15316o400336
36095D973875q375384k469692L895157M240150L23551l606087o213946o641146
36087a3873522l369122K046810N338733N163767L913092K883888J692738J627075
36079E423459L562424L814206q32815n437123k863810L559795L587871l367174
36071G446833o609236j527758L184593M68944l989321k405896K686418M469162
36063C723739K784728J236142m51511l590769n224177k690924R95584K437879
36055g79309L613832O298984O179895l42092q084182r254694m190582Q05858K949405
$$ plain form
36112 17538979 11272241 2035590 -4091009 -5206523 -2604799 1779769 5349943 6361252
36104 6361252 6859451 10116894 14453551 14693910 10798010 8844024 11058895 11374211 4973875
36095 4973875 -3401509 -5871201 -1976044 2264106 2587657 -1018430 -7232376 -13873522
36087 -13873522 -17242644 -15195834 -9857101 -4693334 -780242 2103646 3796384 5423459
36079 5423459 8985883 12800089 11967274 6530151 3666341 7226136 10814007 7446833
36071 7446833 837597 -690161 2494432 2963376 -1025945 -3431841 -745423 3723739
36063 3723739 6508467 7744609 7293098 3702329 -1521848 -4212772 -3217188 -779309
36055 -779309 2834523 9133507 15313402 14971310 6887128 -2367566 -6558148 -5752290 -2802885
36046b802885L727397L428492J493370k44289l03708p14268k712700l394240j455382
36037b978213p51129k407534l12585P706937J1705310L453873p794725o710847
36029A911087M782520J0365929M421368j375333J059955M044497q66919q446504
36021A5896600r112480l588250O79788J368941J232827P29033j675307m520036
36013A011116m781295k543032j07666J260815O86001k638965n931780l609281
36005a6654087M126926Q379243K920170n809821o877397K43971O542873P024492
35997a03630M905883K897990m99622m294151l479575J938626M260392l03425m517449
35988H05039j526616L161100M86235o181814n820303J239327K824770m259756
$$ plain form
36046 -2802885 924512 4353004 5846374 5602085 5298377 4584109 1871409 -1522831 -2978213
36037 -2978213 -3729342 -6136876 -6449461 1257476 12962786 16416659 8621934 1911087
36029 1911087 6693607 17059536 21480904 20105571 21165526 25210023 24343104 15896600
36021 15896600 6784120 3195870 3875658 5244599 6477426 7206459 5531152 1011116
36013 1011116 -3770179 -6313211 -6420877 -5160062 -4474061 -7113026 -13044806 -16654087
36005 -16654087 -12527161 -4147918 -1227748 -7037569 -13914966 -13670995 -7128122 -103630
35997 -103630 4802253 7700243 7200621 2906470 -573105 1365521 5625913 5322488 805039
35988 805039 -721577 2439523 2925758 -3256056 -9076359 -7837032 -5012262 -9272018
35980i272018p322848J330842J0098489O296711k405736n94778Q168227O554761
35972A2853650o439243j1609881m19143J0252603M797978o696069o014756L807214
35964E32353N307911m046592q940653j766854O867349O816385K501580J786969
35956I058448K593998q64642o423418p281545k717144J686225K324532P12569
35948i10977m00218j14960P71668O81458j124297k740678j238740K933998N488468
35939C345722L505900j078031m414328m942704l353379n96923K203627L251050
35931b079066J390479k104955l833701j111639M444815O758984J612432o326278
35923a248929p174811R35231P335883K532425p994595j0921396l265773N133149
$$ plain form
35980 -9272018 -16594866 -15264024 -5165535 1131176 -1274560 -1869338 6298889 12853650
35972 12853650 6414407 -5195474 -5614617 4637986 9435964 2739895 -3274861 532353
35964 532353 5840264 1793672 -7146981 -8913835 -2046486 4769899 7271479 9058448
35956 9058448 11652446 10787804 4364386 -2917159 -5634303 -3948078 -1623546 -910977
35948 -910977 -1311195 -1426155 -654487 26971 -1097326 -3838004 -5076744 -2142746 3345722
35939 3345722 6851622 5773591 1359263 -3583441 -6936820 -7533743 -5330116 -2079066
35931 -2079066 -688587 -2793542 -6627243 -7738882 -3294067 3464917 5077349 -1248929
35923 -1248929 -8423740 -7488509 -152626 2379799 -5614796 -16536192 -19801965 -14668816
35915a4668816O688435M463696L604263K919148o11011n102484o510420m324932
35907a3542121q07798K402917M253213L958748K844362L235259M027017J484789
35899G856386l853269n987654j875939L665467M765074J871930j167026l090101
35891B184868m192440l265302k02800J541845k58258k249056o85790J827372L28164
35882d971397l756668m060373Q88539N174052L991164j76505j959342j87156J987512
35873c070174K056868P61319J86182R14221J619466J053448k93029r54361l88427
35864A885513O79408J322474R56716l34181r83309R10714L852084K868677l478305
35855G679791q662735o026138R25195L028290m64761r98987M560127P906996K634850
$$ plain form
35915 -14668816 -7980381 -3516685 87578 3006726 2395715 -2706769 -9217189 -13542121
35907 -13542121 -14349919 -11947002 -7693789 -3735041 -890679 2344580 6371597 7856386
35899 7856386 4003117 -1984537 -3860476 -195009 4570065 6441995 5274969 2184868
35891 2184868 -2007572 -5272874 -5475674 -3933829 -4192087 -6441143 -7126933 -5299561 -4971397
35882 -4971397 -8728065 -12788438 -11899899 -6725847 -2734683 -2911188 -4870530 -5057686 -3070174
35873 -3070174 -1013306 -251987 -65805 848416 2467882 3521330 3228301 2273940 1885513
35864 1885513 2564921 3887395 4844111 4509930 3526621 4437335 8289419 11158096 7679791
35855 7679791 -982944 -7009082 -6083887 -3055597 -3520358 -4519345 40782 7947778 10582628
35846A0582628n172968o647124l171922j318336o84405L150551P357020M711157
35838H806601l238294o683381k526840J202818j025092l587825q0738N311109
35830a821642M330986k011973m779737o19387L385525K67398o553906p519583
35822a5322319M04134R473420J0630368M099443k504859m777681n252772o129565
35814i379831m369194K145473Q354941P773917J852061k478200k962001l102391
35806b165225l642959n20921O758329J1371438P575224j585410q465750r319342
35798E384n676977o00334L092757L356433P88606j603091k253698k364805k203840
35789g459565J15819L944610M622609M23957l158813j092093K704094Q96854n324408
$$ plain form
35846 10582628 5409660 -1237464 -4409386 -5727722 -6412127 -3261576 4095444 8806601
35838 8806601 5568307 -1115074 -3641914 -2439096 -3464188 -7052013 -7132751 -1821642
35830 -1821642 2509344 497371 -4282366 -4901753 -1516228 -1248830 -7802736 -15322319
35822 -15322319 -14918185 -5444765 5185603 9285046 6780187 2002506 -3250266 -9379831
35814 -9379831 -13749025 -11603552 -3248611 4525306 6377367 3899167 937166 -2165225
35806 -2165225 -5808184 -6329105 429224 11800662 19375886 17790476 9324726 5384
35798 5384 -5671593 -6271927 -3179170 177263 965869 -637222 -2890920 -5255725 -7459565
35789 -7459565 -7343746 -3399136 1223473 1647430 -1511383 -2603476 100618 997472 -4326936
35780d326936p237852j594975M633145M623801M74946j952572j734519j548098
35772h663060j273973J214968M238023L074616k518568o111453k358783N752922
35764f645308J0186137P181767P99775k645752j424488J115855J259373j380305
35756H447054m261245m559646j457500K940993M797911J953765l340656o257028
35748a736352m479427k65270K882495L632617K157509j122320m053714k961661
35740e946123K171508N274562J682092l876119k991933L502591O064186J138742
35732G019506l369033j274476K037576q1539l198838L07676O574690N485930k091732
35723A1409760n295602j556359l19202n441938p507285k01109P917854P153277
$$ plain form
35780 -4326936 -11564788 -13159763 -8526618 -3902817 -3427871 -5380443 -7114962 -8663060
35772 -8663060 -9937033 -8722065 -4484042 -1409426 -3927994 -10039447 -12398230 -6645308
35764 -6645308 3540829 10722596 11522371 8876619 7452131 8567986 9827359 8447054
35756 8447054 4185809 -373837 -1831337 1109656 5907567 7861332 4520676 -1736352
35748 -1736352 -6215779 -6481049 -3598554 34063 2191572 1069252 -2984462 -5946123
35740 -5946123 -3774615 1499947 3182039 -694080 -3686013 -183422 5880764 7019506
35732 7019506 3650473 2375997 4413573 4332034 1133196 1440872 8015562 13501492 11409760
35723 11409760 6114158 4557799 4238597 -1203341 -8710626 -8911735 -993881 6159396
35715F159396J804348P20850J598057k402691p116113l336421N263340N805397
35707H496163k597339o843381j439122L149853p61944n229515j360201N032465
35699a553021L785274k160452k249707L676663N471866n53893o176282m164280
35691c923832J896899L766096q37824o567440o743861l86165N718838L646152
35683c431137m972132q557646j16873J1718518J2703540J615901q677622q113079
35675g830530K46412P502906R137992N804304M05693k623778l27673L772935K500469
35666A8588730m764344r960108p417613j552402O19741m78885J56372L056260
35658a752249M122536J521603k495142n376384n627993k092541L826789P116518
$$ plain form
35715 6159396 7963744 8684594 10282651 7879960 763847 -2572574 2690766 8496163
35707 8496163 5898824 -944557 -2383679 766174 4230 -5225285 -6585486 -1553021
35699 -1553021 2232253 71801 -2177906 1498757 6970623 6416730 240448 -3923832
35691 -3923832 -2026933 1739163 901339 -5666101 -12409962 -12796127 -7077289 -3431137
35683 -3431137 -8403269 -16960915 -17077788 -5359270 7344270 8960171 282549 -7830530
35675 -7830530 -7584118 -81212 9056780 14861084 15266777 12642999 12315326 16088261 18588730
35666 18588730 13824386 3864278 -3553335 -5105737 -4485996 -4964881 -4808509 -1752249
35658 -1752249 2370287 3891890 1396748 -3979636 -9607629 -11700170 -7873381 -756863
35650g56863M956212J561035K053105L848546R71838m641809m859507R61670L462394
35641G556621k066588p523220m591436K121695K840748j984355l815811o13924
35633h076270J174863j003211j713661J863385M533224K523216J91118J566468
35625A059132K281431k530383p771941n161475K358471L345345m426773r030242
35617a9876435j410504J0642539J2680474L334080m386885j171538O637466O466232
35609A2915429l719502j3232102j2216384k618535N857098P149519L087828j594383
35601d371032m157865l748467n21361L294970M161393J159384k399302k654404
35593i236684R65787O177821R853287R034268L127255l669910n642194k929010
$$ plain form
35650 -756863 4199349 5760384 7813489 11662035 12633873 7992064 3132557 4094227 7556621
35641 7556621 5490033 -2033187 -6624623 -4502928 -1662180 -3646535 -7462346 -8076270
35633 -8076270 -6901407 -7904618 -9618279 -7754894 -3221670 -698454 -507336 1059132
35625 1059132 3340563 810180 -6961761 -12123236 -9764765 -6419420 -10846193 -19876435
35617 -19876435 -21286939 -10644400 2036074 5370154 983269 -188269 6449197 12915429
35609 12915429 9195927 -4036175 -16252559 -18871094 -13013996 -5864477 -2776649 -4371032
35601 -4371032 -8528897 -12277364 -12798725 -9503755 -5342362 -4182978 -6582280 -9236684
35593 -9236684 -8270897 -2093076 7760211 16794479 19921734 16251824 10609630 7680620
35585G680620j653752m591210o676301l406295J533436K444403Q34396J692007
35577b142696M078024L242935K1789j28331L173604M429680J406778k292872m182040
35568G606871n054432l867967J490536P342085O615572n3470m169047k457862
35560G452286p97252k174279j339327L454587M390575k377420p150953r41770
35552E16447Q749092Q360858j111968o721214l734300j28638j143962j896371
35544B889944J669497M844223K186203l614601o045037l599293j96927O54586
35536a211405p73846j767679o96216O10614o93018l061543j225143N316320R165687
35527E663771M957495k155315m065005j549506j004184k952665k898046j332298
$$ plain form
35585 7680620 6026868 1435658 -5240643 -8646938 -7113502 -4669099 -3834703 -2142696
35577 -2142696 1935328 5178263 5200052 5071721 8245325 12675005 14081783 11788911 7606871
35568 7606871 2552439 -1315528 175008 7517093 14132665 14079195 9910148 7452286
35560 7452286 6655034 4480755 3141428 6596015 10986590 8609170 1458217 516447
35552 516447 9265539 17626397 16514429 9793215 6058915 5930277 4786315 2889944
35544 2889944 4559441 9403664 11589867 7975266 1930229 -1669064 -1865991 -1211405
35536 -1211405 -1985251 -3752930 -4449146 -3838532 -4531550 -7593093 -8818236 -3501916 5663771
35527 5663771 10621266 8465951 4400946 2851440 1847256 -1105409 -4003455 -5335753
35519e335753k822159n891155m350143P09577J203508l641980m594606K018087
35511b2704624P244745M146428q59875N06132M458744K789231k247940k051767
35503h718926L137321M692323K64434k736078K27252L937381K522048j658122
35495A667633k529966R97727M929513N769401K964821j967983n981936n903824
35487e4614j783219K355375L023057J274160M12969J254663K128500K313024K198021
35478A3121936O02738l882081q075536n646684L452550R397664L916020p289459
35470E597148j0593277k569683N666790M316412k532257m811116o59702L744056
35462a841629M419450K794033Q57862p13630o92776J368472K974758K015435M07189
$$ plain form
35519 -5335753 -8157912 -14049067 -18399210 -17689633 -16486125 -20128105 -24722711 -22704624
35511 -22704624 -15459879 -11313451 -12173326 -11667194 -7208450 -4419219 -6667159 -8718926
35503 -8718926 -5581605 -889282 -624848 -3360926 -3133674 803707 3325755 1667633
35495 1667633 -862333 135394 5064907 10834308 13799129 11831146 5849210 -54614
35487 -54614 -1837833 517542 3540599 4814759 5227728 6482391 8610891 10923915 13121936
35478 13121936 13724674 9842593 1767057 -3879627 -427077 8970587 12886607 5597148
35470 5597148 -4996129 -7565812 -1899022 2417390 -114867 -4925983 -5585685 -1841629
35462 -1841629 2577821 5371854 6229716 5516086 4823310 6191782 9166540 11181975 11589164
35453A1589164L36774k71559l635589o742932n877006l074090j626336O38921
35445h662653N500670O552213j648922j0217753n713498P441800J0096324k990443
35437C57738j3775325p482781O218257R576180K423111k100307M47350K624819
35429a710958M01873j697094o41736N33814l52934j056534J20794J570306J774489
35420a057980J226446N52986j24376m39752p06161j962872l271489j923356J774598
35411e931956M015906L766252M016923M366015j92043q803737j1635244m014179
35403a4412063M526173L984211j086530p19865L458684L117922k06045K112168
35395G74655Q912360R717352J968904n784738q671189j0037977r818698k707310
$$ plain form
35453 11589164 11925938 11654379 8018790 1275858 -4601148 -7675238 -9301574 -8662653
35445 -8662653 -3161983 3390230 1741308 -8476445 -14189943 -6748143 3348181 357738
35437 357738 -13417587 -20900368 -14682111 -5105931 -2682820 -4783127 -4335777 -1710958
35429 -1710958 -1309085 -3006179 -3647915 -3114101 -3467035 -4523569 -4402775 -2832469 -1057980
35420 -1057980 168466 721452 597076 157324 -548837 -2511709 -5783198 -7706554 -5931956
35411 -5931956 -1916050 1850202 5867125 10233140 10041097 1237360 -10397884 -14412063
35403 -14412063 -9885890 -5901679 -6988209 -7708074 -4249390 -1131468 -1337513 774655
35395 774655 9687015 19404367 21373271 15588533 6917344 -3120633 -12939331 -15646641
35387a5646641Q357558J0919522J324103p919561o060196J619267M921547L662537
35379A178136K667728R47990m099873q261323n823184J215603O775616Q797796
35371C398489P448378J602088n739006n745000L543447R702125J882738j1528514
35363D564745j3655499l469615M468421K977764Q8926K018204K844496k876877
35355c039435q987957p457728r26846K976752L873100O458008R887187Q266365
35347A1049446R68677n058500m596272m34356J528357l39381l088360l688347
35339c658736j506536K328402N762441O347230L015256j963919m323513k454361
35331C546264L24762J2178k406632k469198N32192J817158j375856m419719j536086
$$ plain form
35387 -15646641 -7289083 3630439 4954542 -2965019 -9025215 -7405948 -2484401 1178136
35379 1178136 3845864 4793854 693981 -7567342 -13390526 -12174923 -5399307 3398489
35371 3398489 10846867 12448955 6709949 964949 4508396 14210521 16093259 4564745
35363 4564745 -9090754 -12560369 -8091948 -5114184 -5025258 -3007054 -162558 -3039435
35355 -3039435 -12027392 -19485120 -20411966 -17435214 -13562114 -7104106 2783081 11049446
35347 11049446 12018123 6959623 2363351 1928995 3457352 3117971 29611 -3658736
35339 -3658736 -5165272 -2836870 2925571 9272801 12288057 10324138 6000625 3546264
35331 3546264 3871026 3883204 1476572 -992626 -460434 1356724 -19132 -4438851 -5974937
35322e974937M970980O943441J520279n041781o051555k453747M92040J185414
35314d409866K258504M487465M501969q1469n908014o826359j195659N710449
35306a462980P300016K498360l896353o658998m597133l76736K237413J202383
35298c754028j856317k565292J366569O353359O469647J030594m286006m743267
35290a984741j897939j34264p16413j354780M32839N088358R962154R741363J515027
35281B0651604r221937j2264112n119703L062416L693593l93482j663053j75932
35273a430606j270622m414674l771627Q77767K951807m8220k745927j172821J674151
35264i350772K418755K484708L219990K278295j080619k842977p18604J471380
$$ plain form
35322 -5974937 -1003957 5939484 7459763 2417982 -3633573 -6087320 -5595280 -4409866
35314 -4409866 -2151362 2336103 6838072 6756603 848589 -5977770 -7173429 -1462980
35306 -1462980 5837036 8335396 4439043 -2219955 -6817088 -7193824 -4956411 -3754028
35298 -3754028 -5610345 -8175637 -6809068 -455709 6013938 7044532 2758526 -1984741
35290 -1984741 -3882680 -4016944 -4733357 -6088137 -5655298 -566940 9395214 19136577 20651604
35281 20651604 11429667 -834445 -5954148 -2891732 801861 408379 -1254674 -1430606
35273 -1430606 -2701228 -7115902 -10887529 -10009762 -7057955 -7106175 -9852102 -11024923 -9350772
35264 -9350772 -6932017 -4447309 -1227319 1050976 -29643 -2872620 -3591224 -2119844
35256b119844K77111j607884p55103Q79918N68103O71438L703662N761901J898092
35247I277394n007084p801871n254710j854723M70884L104340M757970K703406
35239C95606m55464P76318N153985N514237M17699l245151j565932P17406n49655
35230G159049k047443l61600J061060j225879l073862L37960M778326K863303
35222I490914l189074m021400K036109N558530l50818j0201793j3571701p578111
35214b1827344J804886P607962P536147L727210n6748j365637o45369J87933M88860
35205b542100R64645J536722J101668p96080l843311p521898r404536m945048
35197b5449938O309968J5510728J2295036q98285r321407m151862O337456Q970030
$$ plain form
35256 -2119844 -1842733 -3450617 -4205720 -3325802 -2757699 -2086261 1617401 7379302 9277394
35247 9277394 4270310 -3531561 -8786271 -10640994 -10170110 -7065770 -2307800 395606
35239 395606 -59858 716460 5870445 11384682 11802381 8557230 6991298 7708704 7159049
35230 7159049 5111606 4750006 5811066 4585187 1511325 1849285 6627611 9490914
35222 9490914 6301840 2280440 4316549 9875079 9524261 -677532 -14249233 -21827344
35214 -21827344 -20022458 -12414496 -4878349 -1151139 -1207887 -2573524 -3218893 -3030960 -2542100
35205 -2542100 -1577455 -40733 1060935 264855 -3578456 -11100354 -20504890 -25449938
35197 -25449938 -19139970 -3629242 8665794 7767509 -1553898 -5705760 631696 9601726
35189I601726K885549k757420l560168k988076k797977n40681K593174J152560
35181C588687m337654n324195J841492Q643272O293404j562547n429145m105746
35173c92432l597829n123905l692195J923927O540383P063760O171510N736875
35165A4630094L440973j577842n753327o531163n496578l814024k55431L771041
35157a586257L643136n84528k284467J400990M123063P77375l603928k702281
35149h16897J4312j608976l923663L93963P351244N925513l406989q000723k818170
35140f890386K527641Q40219j640368J612198N167657K286147j963990K95557
35132B234675N028609L026242l745532n581599j820526p15123l337249j511245
$$ plain form
35189 9601726 12487275 9729855 6169687 3181611 383634 -157047 2436127 3588687
35181 3588687 -748967 -6073162 -4231670 4411602 10705006 9142459 3713314 -392432
35173 -392432 -3990261 -9114166 -12806361 -10882434 -4342051 2721709 8893219 14630094
35165 14630094 18071067 16493225 10739898 4208735 -1287843 -5101867 -5357298 -1586257
35157 -1586257 2056879 1472351 -812116 588874 4711937 5489312 1885384 -816897
35149 -816897 -802585 -2411561 -6335224 -5941261 1409983 7335496 3928507 -4072216 -6890386
35140 -6890386 -4362745 -3522526 -5162894 -3550696 1616961 3903108 1939118 2234675
35132 2234675 7263284 10289526 6543994 962395 -858131 -1573254 -4910503 -6421748
35124f421748O090395R162549K195090n732688m625067K019135M314994N10957
35116G513617l670353m992784m240054j677927J970660L333217J412358R39006
35108E87740M384141N678111O6369n146870q88891O569670L066480r359935j2084929
35099g128114J825712J4801436R746741n460317j1479339n444023K24125N73143
35091b340636K141258N827789L468113n255200q346420m85962O959753L510375
35083E479070m216839m271835J731158L431416o52930k655900N72783M195845
35075C612768M807907L335615k47574n672602p226954q6296Q927202Q076844j298591
35066A4228319n588942K1867M245421j310220q386905n962932K260826M893968
$$ plain form
35124 -6421748 -331353 8831196 11026286 5293598 668531 2687666 7002660 7513617
35116 7513617 3843264 -1149520 -5389574 -7067501 -5096841 -1763624 -351266 587740
35108 587740 4971881 10649992 10716361 5569491 4680600 11250270 14316750 4956815 -7128114
35099 -7128114 -5302402 9499034 19245775 13785458 2306119 -3137904 -2913779 -2340636
35091 -2340636 -199378 5628411 9096524 3841324 -4505096 -4991058 1968695 5479070
35083 5479070 1262231 -3009604 -1278446 2152970 1500040 -1155860 -583077 3612768
35075 3612768 8420675 11756290 11508716 5836114 -1390840 -1477136 7450066 15526910 14228319
35066 14228319 8639377 8661244 12906665 11596445 3209540 -2753392 -492566 4401402
35058D401402L64400l474117k759751m52488J434145L212958L095425l23687l049562
35049B448725j093698J416655j732472o855731m685199L898645P647495K199768
35041C244188l546818k308359Q27352j052854m316421j645376M791889O529420
35033B523021K112467j722147j220392K12365k65729m62351J109669J230736k241075
35024A276564n043374k038637M335228O500157K113176l128693m010676k111434
35016b107689j041639j77770K204780L290619j96831m187406j514170N605291
35008A875185O136192l392265j1604898p698599K839984O535860J240762k985775
35000g053554m70135L307812L009748J693361L369481M873683J379689m616935
$$ plain form
35058 4401402 4765802 1291685 -1468066 -1920554 -486409 2726549 5821974 5498287 2448725
35049 2448725 1355027 2771682 1039210 -5816521 -10501720 -6603075 1044420 3244188
35041 3244188 -302630 -2610989 -1783637 -2836491 -7152912 -8798288 -4006399 2523021
35033 2523021 4635488 2913341 1692949 1905314 1639585 1177234 2286903 3517639 1276564
35024 1276564 -3766810 -5805447 -1470219 5029938 7143114 4014421 3745 -2107689
35016 -2107689 -3149328 -3327098 -1122318 2168301 1971470 -2215936 -3730106 1875185
35008 1875185 8011377 4619112 -6985786 -14684385 -11844401 -5308541 -4067779 -7053554
35000 -7053554 -7523689 -4215877 -1206129 487232 3856713 8730396 10110085 5493150
34992E493150o362768k854221J74090p63483k139075L12610M348424M247061k80080
34983B175708l173109j320716M19257k417069n329039j839824M265851L785131
34975c433810j602390l61672Q740730J1413148J88683j1473652r165415P4038
34967e620340O74284n282938l468241O178201Q822163L95755o040375k902641
34959g244132J539577R10567J042730M803272L653442n325275r592529r77614
34951a1189962Q338193M308090n877077n642636M232909Q295544J597567m757362
34943f94734k733806K701766M604085L090217N81893k659976n385771m743195
34935e239521r57677K457015L717540L666619K614547P28086j77640M50932p6723
$$ plain form
34992 5493150 -869618 -3723839 -3549749 -4313232 -6452307 -6139697 -1791273 2455788 2175708
34983 2175708 -997401 -2318117 -1898860 -4315929 -9644968 -11484792 -7218941 -3433810
34975 -3433810 -5036200 -5397872 3342858 14756006 14944689 3471037 -5694378 -5620340
34967 -5620340 -4946056 -10228994 -13697235 -7519034 1303129 1698884 -4341491 -7244132
34959 -7244132 -5704555 -4793988 -3751258 1052014 4705456 -619819 -10212348 -11189962
34951 -11189962 -2851769 1456321 -4420756 -10063392 -5830483 2465061 4062628 -694734
34943 -694734 -3428540 -726774 3877311 6967528 7549421 4889445 -496326 -5239521
34935 -5239521 -6197198 -3740183 -22643 3643976 6258523 6986609 6808969 7259901 7183178
34926G183178k489862k539355J641611M354642J073313l210526k298656K66587
34918C980932j914827n619724l607703J550922J682448j883665q03915M011157
34910b604375K748279n753179j0536286n491119K634575O733223Q130214Q721589
34902D582921N645318q14230l874586m07989L934078M288480K918092K058008
34894A8330092n41017m630110n211690j801496o69927l477433l893874l38504
34886b233959l64464n795109o166046L706343J1907595P161629k487939k892112
34878B835938L308691L162690l548300n313091j54378J640523l364511o153697
34870g586135j824333K705991K057148N23290J404784J37932n196315p250882
$$ plain form
34926 7183178 4693316 2153961 3795572 8150214 9223527 6013001 3714345 3980932
34918 3980932 2066105 -3553619 -7161322 -5610400 -3927952 -5811617 -6615532 -2604375
34910 -2604375 143904 -5609275 -16145561 -21636680 -19002105 -12268882 -4138668 4582921
34902 4582921 10228239 9414009 5539423 5131434 9065512 13353992 16272084 18330092
34894 18330092 17789075 13158965 7947275 6145779 5475852 1998419 -1895455 -2233959
34886 -2233959 -2598423 -8393532 -14559578 -10853235 1054360 8215989 5728050 2835938
34878 2835938 6144629 9307319 5759019 445928 291550 1932073 -1432438 -7586135
34870 -7586135 -9410468 -6704477 -4647329 -4124039 -2719255 -2581323 -7777638 -15028520
34862a5028520j395200M762464K895285k418126j628647L663548L605855l271732
34854h815073p299096k623632M213933M285808j384690m236446J27937O944156
34846h787103Q567815L178268l626216n265083j314424K590538J784187k070210
$$ plain form
34862 -15028520 -16423720 -11661256 -8765971 -11184097 -12812744 -9149196 -5543341 -8815073
34854 -8815073 -16114169 -18737801 -14523868 -10238060 -11622750 -15859196 -15731259 -8787103
34846 -8787103 -219288 2958980 -667236 -5932319 -7246743 -4656205 -2872018 -4942228
$$ [...]
##END NTUPLES=NMR SPECTRUM
##END=
