##TITLE=31Pdec_SR146H
 D2O, 64 sc
 24.3.2023
##JCAMPDX= 6.0         $$ Bruker NMR JCAMP-DX V2.0
##DATA TYPE= NMR SPECTRUM
##DATA CLASS= NTUPLES
##ORIGIN= UXNMR, Bruker Analytische Messtechnik GmbH
##OWNER= root
$$ XWIN-NMR		Version 3.5
$$ Fri Mar 24 15:36:35 2023 Russian Standard Time (UT+4h)  she@DPX200
##.OBSERVE FREQUENCY= 81.013821
##.OBSERVE NUCLEUS= ^31P
##.ACQUISITION MODE= SIMULTANEOUS
##.ACQUISITION SCHEME= undefined
##.AVERAGES= 64
##.DIGITISER RES= 16
##SPECTROMETER/DATA SYSTEM= spect
##.PULSE SEQUENCE= zgpg30
##.SOLVENT NAME= CDCl3
##.SHIFT REFERENCE= (INTERNAL, CDCl3, 0, 248.564)
##AUDIT TRAIL= $$ (NUMBER, WHEN, WHO, WHERE, WHAT)
$$ ##TITLE= Audit trail, XWIN-NMR		Version 3.5
$$ ##JCAMPDX= 5.01
$$ ##ORIGIN= Bruker BioSpin GmbH
$$ ##OWNER= she
$$ F:/spectra/data/she/nmr/P31/1/pdata/1/auditp.txt
$$ ##AUDIT TRAIL=  $$ (NUMBER, WHEN, WHO, WHERE, WHAT)
(   1,<2023-03-24 15:35:39.90 +0400>,<she>,<DPX200>,
      <continue with go, POWCHK disabled, PULCHK disabled
       configuration hash MD5:
       00 E9 B6 7A A2 85 ED C7 34 08 36 98 17 FE 4E 26
       data hash MD5: 32K
       37 BA 0C 51 3A C5 40 34 9F 5F 49 7C E2 00 7C D9>)
(   2,<2023-03-24 15:35:41.89 +0400>,<she>,<DPX200>,
      <Start of raw data processing
       efp BC_mod = 2 LB = 1 FT_mod = 6 PKNL = 1 PHC0 = -10445.93 PHC1 = -267.9153 SI = 64K 
       data hash MD5: 64K
       E1 98 FE 9F 34 FD FF 89 9D 35 BE 3E F7 31 C1 56>)
(   3,<2023-03-24 15:36:03.82 +0400>,<she>,<DPX200>,
      <pk PHC0 = -31.3456 PHC1 = 0 
       data hash MD5: 64K
       18 60 ED 9E 19 00 0C 15 73 65 53 C9 56 66 2C 4B>)
(   4,<2023-03-24 15:36:11.23 +0400>,<she>,<DPX200>,
      <abs ABSG = 5 
       data hash MD5: 64K
       4D 8A 63 CF D0 6A 4C 77 49 F4 DC 87 8E 9F 39 B0>)
$$ ##END=
$$ 
$$ hash MD5
$$ 36 44 32 9A F6 40 54 B9 84 C9 42 87 09 63 B3 4E
##$RELAX= 
##$RELAX= 
##$RELAX= 
##$RELAX= 
##$RELAX= 
##$RELAX= 
##$RELAX= 
##$RELAX= 
##$RELAX= 
$$ Bruker specific parameters
$$ --------------------------
##$DU= <F:/spectra>
##$EXPNO= 1
##$NAME= <P31>
##$PROCNO= 1
##$TYPE= <nmr>
##$USER= <she>
##$AMP= (0..31)
100 100 100 100 100 100 100 100 100 100 100 100 100 100 100 100 100 100 
100 100 100 100 100 100 100 100 100 100 100 100 100 100 
##$AQSEQ= 0
##$AQ_mod= 1
##$AUNM= <au_zg>
##$AUTOPOS= <>
##$BF1= 81.014009
##$BF2= 200.13
##$BF3= 200.13
##$BF4= 200.13
##$BF5= 200.13
##$BF6= 200.13
##$BF7= 200.13
##$BF8= 200.13
##$BYTORDA= 1
##$CFDGTYP= 0
##$CFRGTYP= 5
##$CHEMSTR= <none>
##$CNST= (0..31)
1 1 145 1 1 1 1 1 1 1 1 1 1 1 1 1 1 1 1 1 1 1 1 1 1 1 1 1 1 1 1 1 
##$CPDPRG= <waltz16>
##$CPDPRG1= <>
##$CPDPRG2= <waltz16>
##$CPDPRG3= <>
##$CPDPRG4= <mlev>
##$CPDPRG5= <mlev>
##$CPDPRG6= <mlev>
##$CPDPRG7= <mlev>
##$CPDPRG8= <mlev>
##$CPDPRGB= <>
##$CPDPRGT= <>
##$D= (0..31)
0 1 0 0 0 0 0 0 0 0 0 0.03 2e-05 3e-06 0 0 0 0 0 0 0 0 0 0 0 0 0 0 0 0 
0 0 
##$DATE= 1679657660
##$DBL= (0..7)
120 120 120 11 120 120 24 19 
##$DBP= (0..7)
150 150 150 150 150 150 150 150 
##$DBP07= 0
##$DBPNAM0= <>
##$DBPNAM1= <>
$$ [...]
##$SUBNAM3= <"">
##$SUBNAM4= <"">
##$SUBNAM5= <"">
##$SUBNAM6= <"">
##$SUBNAM7= <"">
##$SUBNAM8= <"">
##$SUBNAM9= <"">
##$SW= 501.771253377433
##$SWIBOX= (0..15)
0 1 3 0 0 0 0 0 0 0 0 0 0 0 0 0 
##$SW_h= 40650.406504065
##$TD= 32768
##$TD0= 1
##$TE= 0
##$TE2= 300
##$TE3= 300
##$TEG= 300
##$TL= (0..7)
0 120 53 12 22 120 120 120 
##$TP= (0..7)
150 150 150 150 150 150 150 150 
##$TP07= 0
##$TPNAME0= <>
##$TPNAME1= <>
##$TPNAME2= <>
##$TPNAME3= <>
##$TPNAME4= <>
##$TPNAME5= <>
##$TPNAME6= <>
##$TPNAME7= <>
##$TPOAL= (0..7)
0.5 0.5 0.5 0.5 0.5 0.5 0.5 0.5 
##$TPOFFS= (0..7)
0 0 0 0 0 0 0 0 
##$TUNHIN= 0
##$TUNHOUT= 0
##$TUNXOUT= 0
##$USERA1= <user>
##$USERA2= <user>
##$USERA3= <user>
##$USERA4= <user>
##$USERA5= <user>
##$V9= 5
##$VALIST= <valist>
##$VCLIST= <CCCCCCCCCCCCCCC>
##$VD= 0
##$VDLIST= <DDDDDDDDDDDDDDD>
##$VPLIST= <PPPPPPPPPPPPPPP>
##$VTLIST= <TTTTTTTTTTTTTTT>
##$WBST= 1024
##$WBSW= 4
##$XGAIN= (0..3)
0 0 0 0 
##$XL= 0
##$YL= 0
##$YMAX_a= 3433
##$YMIN_a= -3831
##$ZGOPTNS= <>
##$ZL1= 120
##$ZL2= 120
##$ZL3= 120
##$ZL4= 120
##$ABSF1= 248.5645
##$ABSF2= -253.2056
##$ABSG= 5
##$ABSL= 3
##$ALPHA= 0
##$AQORDER= 0
##$ASSFAC= 0
##$ASSFACI= 0
##$ASSFACX= 0
##$ASSWID= 0
##$AUNMP= <proc_1d>
##$AZFE= 0.1
##$AZFW= 0.5
##$BCFW= 0
##$BC_mod= 2
##$BYTORDP= 0
##$COROFFS= 0
##$CY= -3
##$DATMOD= 1
##$DC= 0
##$DFILT= <>
##$DTYPP= 0
##$F1P= 0
##$F2P= 0
##$FCOR= 1
##$FTSIZE= 65536
##$FT_mod= 6
##$GAMMA= 0
##$GB= 0
##$INTBC= 1
##$INTSCL= 6.047779e-11
##$ISEN= 30
##$LB= 1
##$LEV0= 0
##$LPBIN= 0
##$MAXI= 10000
##$MC2= 0
##$MEAN= 0
##$ME_mod= 0
##$MI= 50
##$NCOEF= 0
##$NC_proc= -7
##$NLEV= 6
##$NOISF1= 182.463
##$NOISF2= 159.3651
##$NSP= 0
##$NTH_PI= 0
##$NZP= 0
##$OFFSET= 248.5645
##$PC= 4
##$PHC0= -10477.28
##$PHC1= -267.9153
##$PH_mod= 1
##$PKNL= yes
##$PPARMOD= 0
##$PSCAL= 0
##$PSIGN= 0
##$REVERSE= no
##$SF= 81.0140089999694
##$SI= 65536
##$SIGF1= 159.3651
##$SIGF2= -187.1042
##$SINO= 113.3802
##$SIOLD= 16384
##$SREGLST= <1H.CDCl3>
##$SSB= 0
##$STSI= 65536
##$STSR= 0
##$SW_p= 40650.406504065
##$SYMM= 0
##$S_DEV= 0
##$TDeff= 32768
##$TDoff= 0
##$TI= <>
##$TILT= no
##$TM1= 0
##$TM2= 0
##$TOPLEV= 0
##$USERP1= <user>
##$USERP2= <user>
##$USERP3= <user>
##$USERP4= <user>
##$USERP5= <user>
##$WDW= 1
##$XDIM= 65536
##$YMAX_p= 109653409
##$YMIN_p= -354587644
$$ End of Bruker specific parameters
$$ ---------------------------------
##NTUPLES= NMR SPECTRUM
##VAR_NAME=  FREQUENCY,     SPECTRUM/REAL,   SPECTRUM/IMAG
##SYMBOL=    X,             R,               I
##VAR_TYPE=  INDEPENDENT,   DEPENDENT,       DEPENDENT
##VAR_FORM=  AFFN,          ASDF,            ASDF
##VAR_DIM=   65536,         65536,           65536
##UNITS=     HZ,            ARBITRARY UNITS, ARBITRARY UNITS
##FACTOR=    0.620285442955139, 1,           1
##FIRST=     20137.2065510682, 0,            0
##LAST=      -20513.1999529968, 0,           0
##MIN=       -20513.1999529968, -354587644,  0
##MAX=       20137.2065510682, 109653409,    0
$$ Real data points
##PAGE= N=1
##DATA TABLE= (X++(R..R)), XYDATA
$$ [...]
12443f820683K516882L816487j333454m656572P81459Q345797P088966j711937
$$ -6820683 -4303801 -487314 -1820768 -6477340 -5695881 2649916 9738882 8026945
12435H026945o889662l679797J601005K583911K26259j864681k717951k627086
$$ 8026945 1137283 -2542514 -941509 1642402 1868661 3980 -2713971 -5341057
12427e341057j261382R41376K434701K508172J649777L35367q70843j254284j391188
$$ -5341057 -6602439 -5661063 -3226362 -718190 931587 1266954 396111 -858173 -2249361
12418b249361k416844k746894N75296N530864N605253j52013l918936r46576K269448
$$ -2249361 -4666205 -7413099 -6837803 -1306939 4298314 4146301 227365 -719211 1550237
12409A550237j093675n753711k735951M721069N550504j072594m473482K33812
$$ 1550237 456562 -5297149 -8033100 -3312031 2238473 1165879 -3307603 -3073791
12401c073791N455027M337791R0587j909882k174726k594533j734096M75013J95366
$$ -3073791 2381236 6719027 6809614 4899732 2725006 130473 -1603623 -1128610 -933244
12392i33244l309489m403409K27393N418659N299632J947337P03069J469349P21673
$$ -933244 -4242733 -8646142 -8418749 -3000090 2299542 4246879 4949948 6419297 7140970
12383G140970j310204j589286k04933J13981r10467j145303k82666q7009r25763
$$ 7140970 5830766 4241480 4036547 4150528 3240061 2094758 1812092 1725083 799320
12374G99320j189170J28940K348590L938845L226345k04747l849814m324462k092019
$$ 799320 -389850 -260910 2087680 6026525 9252870 9048123 5198309 873847 -1218172
12365a218172j112240k483422k426636J022018L690345J581357k161394j691764
$$ -1218172 -2330412 -4813834 -7240470 -6218452 -2528107 -946750 -3108144 -4799908
12357d799908K450090M226357J294313k027778j687048O90126J144091r38911
$$ -4799908 -2349818 1876539 3170852 1143074 -543974 146152 1290243 351332
12349C51332k768447k219311k2087J685887J773812Q83343K38662J40572m9352
$$ 351332 -2417115 -4636426 -4658513 -2972626 -1198814 -315471 -76809 63763 14411
12340A4411o42949j013306m44709Q60626J877964J776348R00153N54912J248675
$$ 14411 -628538 -1641844 -2086553 -1225927 652037 2428385 3328538 3883450 5132125
12331E132125J528793q0465k303605k570200j340775j719897l835270l710509
$$ 5132125 6660918 6580453 4276848 1706648 365873 -1354024 -5189294 -8899803
12323h899803N5899K979203J651008m43195R83052L291749J705609j597035r23330
$$ -8899803 -8843904 -5864701 -4213693 -4656888 -3673836 -382087 1323522 -273513 -1196843
12314a196843K511249K195765k223726m008501p77277J851055L32045j333684
$$ -1196843 1314406 3510171 1286445 -2722056 -3499333 -1648278 -1316233 -2649917
12306b649917M05688K592952J802224j18683n28890n88022j412405r83052J288825
$$ -2649917 -2244229 348723 2150947 2032264 1503374 915352 -497053 -1480105 -191280
12297a91280K144812L12047o30810J076183J621855j253072l347046j191882J523463
$$ -191280 1953532 2265579 1634769 2710952 4332807 3079735 -267311 -1459193 64270
12288F4270K81148k695064k982354j228031j6085J664017M555144M656979k97851
$$ 64270 345418 -2349646 -5332000 -6560031 -6576116 -4912099 -356955 4300024 4002173
12279D002173m388042j407073M500812M586002q80295l657300p65326K278762
$$ 4002173 -385869 -1792942 2707870 7293872 6413577 2756277 1990951 4269713
12271D269713J485590o09473j149522j060233j252920n84158P61728P22674o58183
$$ 4269713 5755303 5145830 3996308 2936075 1683155 1098997 1860725 2583399 1925216
12262A925216j030145r0254R8885o37664l75200O87481J76973j933341k849545
$$ 1925216 895071 804817 903702 266038 -109162 578319 755292 -1178049 -4027594
12253d027594j402631N84723J385933P20951j163267k655651q55641L760098N369472
$$ -4027594 -5430225 -4845502 -3459569 -2738618 -3901885 -6557536 -7413177 -3653079 1716393
12244A716393M81002n203259l938202K341057M930743J631268j240294q7842J404618
$$ 1716393 2197395 -3005864 -6944066 -4603009 327734 1959002 718708 630866 2035484
12235B035484M67275l01328O00775J47322k757668m016983j284693J674693J333053
$$ 2035484 2502759 2201431 2802206 2949528 191860 -3825123 -5109816 -3435123 -2102070
12226b102070k07500J62395J534084K152932K765005L266985R52747m088024o703215
$$ -2102070 -2309570 -2147175 -613091 1539841 4304846 7571831 8524578 4436554 -2266661
12217b266661l957341J8303P91951L97553K257746M029945J763481k331869k932711
$$ -2266661 -6224002 -6205699 -5413748 -5016195 -2758449 1271496 3034977 703108 -2229603
12208b229603j16913J614578J235219J631754K901239J762299j791034l223672
$$ -2229603 -2346516 -731938 503281 2135035 5036274 6798573 5007539 1783867
12200A783867n20211K342513J189031k766398n324999m498607j337449K137103
$$ 1783867 1263656 3606169 4795200 2028802 -3296197 -7794804 -9132253 -6995150
12192f995150L951499K951264L46754q17928P49034K643422J861278j107759k975419
$$ -6995150 -3043651 -92387 254367 -563561 185473 2828895 4690173 3582414 606995
12183F06995k017836P0962J002098Q46329R43945J106580M0199j656941j480518
$$ 606995 -1410841 -1339879 -337781 508548 1452493 2559073 2599272 942331 -538187
12174e38187J028960K774018J463292o99722n19593P60952n91274m121859m944473
$$ -538187 490773 3264791 4728083 4028361 3508768 4269720 3678446 -443413 -5387886
12165e387886j005083L507006L890514P79326k003169k689003k060754q31594
$$ -5387886 -6392969 -2885963 1004551 1783877 -219292 -2908295 -4969049 -5800643
12157e800643O38212J302500O45191J08624J142892K520554J719238j286519l477624
$$ -5800643 -5162431 -3859931 -3214740 -3106116 -1963224 557330 2276568 990049 -2487575
12148b487575k268691J569305M638144M076201K24771l558338m159237j825180
$$ -2487575 -4756266 -3186961 1451183 5527384 5752155 2193817 -1965420 -3790600
12140c790600O23035J346221R19277M39881J56349L44766J541717L065095L042918
$$ -3790600 -3167565 -1821344 -902067 -462186 -305837 38929 1580646 4645741 7688659
12131G688659Q82490j729574l026999k889715j854273j88240J397935J970896
$$ 7688659 8571149 6841575 3814576 924861 -929412 -1117652 280283 2251179
12123B251179J918262K272597K137251m36420m221216m912765j267510K266420
$$ 2251179 4169441 6442038 8579289 8142869 3921653 -991112 -2258622 7798
12115G798J702194q86968j359328k28369q84159k930743k510957R96484L606384
$$ 7798 1709992 823024 -536304 -764673 -1648832 -4579575 -7090532 -6094048 -2487664
12106b487664K977389J607370K028468K689078J257402r80507j310412k94164
$$ -2487664 489725 2097095 4125563 6814641 8072043 7091536 5781124 5486960
12098E486960p27447k601339k676348K89770K963340J915617j332740k292058
$$ 5486960 4759513 2158174 -518174 -228404 2734936 4650553 3317813 1025755
12090A025755K13225K499460J348541j562555k340641m12390J151059M50198q04641
$$ 1025755 1238980 3738440 5086981 3524426 1183785 771395 1922454 2372652 1568011
12081A568011m86228O17284M78271n66047k54210J776275K920076J269505j361594
$$ 1568011 1081783 1699067 2177338 1611291 1357081 3133356 6053432 7322937 5961343
12072E961343j782241M9326J007898n14782k225549j562885L01450N06253p44692
$$ 5961343 4179102 4228428 5236326 4721544 2495995 933110 1234560 1740813 996121
12063I96121o88467J022270J514163k55797j306897M93453K559740J438640j865888
$$ 996121 307654 1329924 2844087 2588290 1281393 1774846 4334586 5773226 3907338
12054C907338l512023k022076J006484L684332M466235K005888k277746l596248
$$ 3907338 395315 -1626761 -620277 3064055 7530290 9536178 7258432 3662184
12046C662184K01056M048773K032005l379751m576527n47138J799932r30980l389163
$$ 3662184 3863240 7912013 9944018 6564267 1987740 1440602 3240534 2309554 -1079609
12037a079609q46784K963998K359478j113231j918387L98702J466194k78486j884106
$$ -1079609 -1926393 1037605 3397083 2283852 365465 764167 2230361 1951875 67769
12028F7769j504474q49841j294828j305087Q17221L864027M760701J977435k389706
$$ 67769 -1436705 -2286546 -3581374 -4886461 -4069240 -205213 4555488 6532923 4143217
12019D143217l981458p14697L873317L947833j135917n436782m234120j57836
$$ 4143217 161759 -552938 3320379 7268212 6132295 695513 -3538607 -3696443
12011c696443J376908O8997j00216J967457K878374M96407k661181l040461m97848
$$ -3696443 -2319535 -2250538 -2350754 -383297 2495077 2991484 330303 -2710158 -3208006
12002c208006K082963K082502n47774l160134k676035Q73487L697275K649193
$$ -3208006 -1125043 957459 409685 -2750449 -5426484 -4552997 -855722 1793471
11994A793471o12302j937845l42984J305695R48277l23876j064998j710021k699835
$$ 1793471 1181169 -756676 -1099660 206035 1154312 830436 -234562 -1944583 -4644418
11985d644418k703762n72875K383765L918225L783101L393722L003094J212468
$$ -4644418 -7348180 -7921055 -5537290 -1619065 2164036 5557758 8560852 9773320
11977I773320k178586m569654l398858J64487K365804J791283Q13618J116883
$$ 9773320 7594734 3025080 -373778 -209291 2156513 3947796 4761414 5878297
11969E878297N57419k847526o091128m583329M52598K873148M87478j992410p15494
$$ 5878297 6435716 3588190 -2502938 -7086267 -6633669 -3760521 -3273043 -5265453 -5980947
11960e980947J648479J382907L81041K427115N772909N019636n89429n680738
$$ -5980947 -4332468 -2949561 -2568520 -141405 5631504 10651140 10061711 4380973
11952D380973n678094j501623K781792L973760J594622j591161j547292J982042
$$ 4380973 -1297121 -2798744 -16952 3956808 5551430 3960269 2412977 4395019
11944D395019L943402P79653l462205k714791J311553J555111k610091l869188
$$ 4395019 8338421 9118074 5655869 2941078 4252631 5807742 3197651 -671537
11936f71537Q78787M818394K000679l068674k841228J478199K943590M01870r67243
$$ -671537 207250 5025644 7026323 3957649 1116421 2594620 5538210 5940080 4972837
11927D972837N70099R14011j691621l282569j331289P78924j73604j601447K96225
$$ 4972837 5542936 6456947 4765326 1482757 151468 930392 756788 -844659 -548434
11918e48434L827528M219886P14250k830718l359967j315756J260765K433221
$$ -548434 3279094 7498980 8213230 5382512 2022545 706789 1967554 4400775
11910D400775J001056j923751k976166p95662J228430l38292l220499k684730
$$ 4400775 5401831 3478080 501914 -293748 934682 596390 -2624109 -5308839
11902e308839O88993J839426l87059j680993n6566J209609O24285J730818N547344
$$ -5308839 -4619846 -2780420 -3167479 -4848472 -4905038 -3695429 -3071144 -1340326 4207018
11893D207018O463883J284601l738237k156879J633330m26066n817751n258140
$$ 4207018 10670901 11955502 8217265 6060386 7693716 7267650 1449899 -3808241
11885c808241R87212K836874k270856m422414J712891O784038J818795o366964
$$ -3808241 -2821029 15845 -2255011 -6677425 -4964534 1819504 3638299 -2728665
11877b728665n520370K886121O816665K707731q87395J285311L607422O67833
$$ -2728665 -8249035 -5362914 1453751 4161482 3274087 4559398 8166820 8834653
11869H834653l460602k495696J864980L161490Q7150k411125p59152K741240L340335
$$ 8834653 5374051 2878355 4743335 7904825 7991975 5580850 4821698 7562938 10903273
11860A0903273n03850n470832o781301l291117J136258K119268j88816k083077
$$ 10903273 10399423 4928591 -1852710 -5143827 -4007569 -1888301 -2077117 -4160194
11852d160194j369784R08733L057386M053584K638322j415402m830238l411917
$$ -4160194 -5529978 -4621245 -1563859 2489725 5128047 3712645 -1117593 -4529510
11844d529510J785070M596936J860324k152129j965397J555438L299197J387273
$$ -4529510 -2744440 1852496 3712820 1560691 -404706 1150732 4449929 5837202
11836E837202j247567j853691r36119k72965n69499j543351k417981k002747J77981
$$ 5837202 4589635 2735944 1799825 1526860 957361 -585990 -3003971 -5006718 -4828737
11827d828737K676834L376956J910863m14638k644430m342482m137609p32904
$$ -4828737 -2151903 1225053 3135916 2721278 76848 -4265634 -8403243 -9136147
11819i136147L950173N262705J343319l580472l747216J083759N481605N092133
$$ -9136147 -5185974 76731 1420050 -2160422 -5907638 -4823879 657726 5749859
11811E749859J166548k209645l118876k514478j491703j0044J901112L229974
$$ 5749859 6916407 4706762 1587886 -926592 -2418295 -2428339 -527227 2702747
11803B702747K665142k19276m111526o092819l915865Q88614L666159J994043
$$ 2702747 5367889 5148613 1037087 -5055732 -8971597 -8082983 -4416824 -2422781
11795b422781j133829j660551k59125l09257j346712M70725M857532N900859P85747
$$ -2422781 -3556610 -5217161 -5476286 -5785543 -7132255 -6661530 -1803998 4096861 4882608
11786D882608m681567l556489K438660N509025K443804k285617l600085j385863
$$ 4882608 201041 -3355448 -916788 4592237 7036041 4750424 1150339 -235524
11778b35524J492139K798186J489552k072528n183973m697764j072930J764157
$$ -235524 1256615 4054801 5544353 3471825 -1712148 -6409912 -7482842 -5718685
11770e718685J613025O13546J358874K861922K455896m2907k433259l484916l894972
$$ -5718685 -4105660 -3492114 -2133240 728682 3184578 3141671 708412 -2776504 -6671476
11761f671476l954216k320976J800539O191431O943685K972844j754624k235599
$$ -6671476 -10625692 -12946668 -11146129 -4954698 1988987 4961831 3207207 971608
11753I71608J262722L086767m34301n672452o112572o78250N205942O271830K329913
$$ 971608 2234330 5321097 4886796 -785656 -6898228 -7576478 -2370536 3901294 6231207
11744F231207l155817o411097n109668Q6093M897088N023770J282518j369686
$$ 6231207 3075390 -3335707 -8445375 -8359282 -3462194 1561576 2844094 1474408
11736A474408o04120O90243j04821r48976R49503L761315L375690l54854l432463
$$ 1474408 870288 1560531 1455710 506734 1456237 5217552 8593242 8238388 4805925
11727D805925l345815j603951m89378k42524k60381o44074j253045r35163P90549
$$ 4805925 1460110 -143841 -633219 -875743 -1136124 -1780198 -3033243 -3968406 -3177857
11718c177857K266653J460350r93799j883979P11003M314532M216636p52380n971375
$$ -3177857 -911204 549146 -444653 -2328632 -1617629 2696903 6913539 6161159 189784
11709A89784o073969j353080L081301M097899L433758L248423K450833l35184
$$ 189784 -5884185 -7237265 -4155964 -58065 3375693 6624116 9074949 8739765
11701H739765l212834l623206k342701j460811l35062K344174M095728J472809
$$ 8739765 5526931 1903725 -438976 -1899787 -2234849 109325 4205053 5677862
11693E677862l152203l514972R02328L303911Q9747l255777j132032K854236J892245
$$ 5677862 2525659 -989313 -86985 3216926 3306673 50896 -1081136 1773100 3665345
11684C665345k571132l134715J303343L725766L31742l817085l331495l65683
$$ 3665345 1094213 -2040502 -737159 2988607 3320349 -496736 -3828231 -4193914
11676d193914K69180r36369j88014K642112M103365K834497Q48874k94311j121492
$$ -4193914 -3924734 -4861103 -5049117 -2407005 1696360 4530857 5379731 5085420 3963928
11667C963928k221035l302123m119124m313962k957392r4033K300014K814867
$$ 3963928 1742893 -1559230 -5678354 -9992316 -12949708 -13043741 -10743727 -7928860
11659g928860K645769L046265K702997M90176j224855K00439K767790K499462
$$ -7928860 -5283091 -2236826 466171 956347 -268508 -68069 2699721 5199183
11651E199183n7215q28315P45832R96618j206738k528649j466630j081069k896086
$$ 5199183 5141968 4313653 5059485 6056103 4849365 2320716 854086 -226983 -3123069
11642c123069l251188N56333M796150M472629Q04333j252791p56188r62689k756499
$$ -3123069 -6374257 -5817924 -1021774 3450855 4255188 3002397 2246209 1283520 -1472979
11633a472979l024945k28661K632556K349121n8130j266307l12217P72382L54638
$$ -1472979 -4497924 -4726585 -2094029 255092 196962 -1069345 -1381562 -609180 -254542
11624b54542p33947j009276p60075j249310k154158j814305j72538R49886J310570
$$ -254542 -988489 -1997765 -2757840 -4007150 -6161308 -7975613 -8148151 -7198265 -5887695
11615e887695K935139N557328N054384r4229m378699k450720K156722K065013
$$ -5887695 -2952556 2604772 7659156 7564927 3186228 735508 2892230 4957243
11607D957243k200159l488018m40389O33312k232820k633259K313381N541982
$$ 4957243 2757084 -730934 -1171323 -538011 -2770831 -5404090 -3090709 2451273
11599B451273J656752l429838k255649J881821J459352k015157j450679K761172
$$ 2451273 4108025 678187 -1577462 304359 1763711 -251446 -1702125 1059047
11591A059047L726184M76755q84755J476973K297338q94904l742518l172256j848058
$$ 1059047 4785231 5261986 4377231 5854204 8151542 7256638 3514120 341864 -1506194
11582a506194j847029q90249J996559L353777J319542o48548L57416J895974Q52478
$$ -1506194 -3353223 -4243472 -2246913 1106864 2426406 1777858 2135274 4031248 4883726
11573D883726j282062j505443k68183J60069l50606m36149K42933J254011K112800
$$ 4883726 3601664 2096221 1828038 1988107 1637501 1201352 1444285 2698296 4811096
11564D811096J476630j679784m950584l915029J637693O132194M878627m18854
$$ 4811096 6287726 4607942 -342642 -4257671 -2619978 3512216 8390843 7971989
11556G971989m600124m893818k239076P51769J727422N57561j02904J523980K726720
$$ 7971989 3371865 -1521953 -3761029 -3009260 -1281838 -724277 -827181 696799 3423519
11547C423519k4837m580286n355682j955591M76349J84245J151127M627337N728855
$$ 3423519 3398682 -1181604 -6537286 -8492877 -8016528 -7832283 -6681156 -2053819 3675036
11538C675036J977312j838479j815376j163375k975569l545911M30413M211732
$$ 3675036 5652348 3813869 1998493 835118 -2140451 -5686362 -5255949 -1044217
11530a044217K524501n90174J479788N554421L351306l906210o592138k125037
$$ -1044217 1480284 890110 2369898 7924319 11275625 7369415 777277 -1347760
11522a347760J607145k1937j681920J148950M076612J962062k246575l131836
$$ -1347760 259385 237448 -1444472 -295522 3781090 5743152 3496577 364741
11514C64741j579502j486960k032428J09941L601339L873111M64929k474982k469216
$$ 364741 -1214761 -2701721 -4734149 -4624208 -1022869 2850242 3315171 840189 -1629027
11505a629027r87085J87476Q33704O70179n86234j567461p89475L94171m87878
$$ -1629027 -2616112 -2428636 -1594932 -924753 -1510987 -3078448 -3867923 -3473752 -3961630
11496c961630k643247k769250k31942K014766K116121J406293J019406J6975j694511
$$ -3961630 -6604877 -9374127 -9606069 -7591303 -5475182 -4068889 -3049483 -3032508 -4727019
11487d727019k000409j05724J562767J147220K12394M00762K01984j744980k801030
$$ -4727019 -6727428 -6833152 -5270385 -4123165 -3910771 -3510009 -3308025 -5053005 -7854035
11478g854035J04243M761174N943049K588497j484739l558492m256780l818496
$$ -7854035 -7749792 -2988618 2954431 5542928 4058189 499697 -3757083 -7575579
11470g575579j029658K987652M470098K374188J44331K27088P39814j63583o93962
$$ -7575579 -8605237 -5617585 -1147487 1226701 1371032 1598120 2337934 2174351 1480389
11461A480389P68122J980563N77633j614904j804995r73589j343957j694128K68919
$$ 1480389 2248511 4229074 4806707 3191803 1386808 413219 -930738 -2624866 -2355947
11452b355947K867275K597665K4409j169817k09873K24017r48517j854707j251849
$$ -2355947 511328 3108993 3133402 1963585 1753712 1977729 1029212 -825495 -2077344
11443b077344K01920J859363K945950J670462j823601l368758k14910L369615
$$ -2077344 -1875424 -16061 2929889 4600351 2776750 -592008 -806918 2562697
11435B562697J624832l228888l937094J74274K414239J02665j646625L66312K211940
$$ 2562697 4187529 958641 -2978453 -2804179 -389940 -287275 -1933900 -1567588 644352
11426F44352Q85690j43241J881775L257907P65351j894721p55887R22569j307654
$$ 644352 1530042 1386801 3268576 6526483 7291834 5397113 4641226 5563795 4256141
11417D256141m388834k779167J481980J931431j317661k034287J385206L565866
$$ 4256141 -132693 -2911860 -1429880 501551 -816110 -2850397 -1465191 2100675
11409B100675J311592j803864j723687P43315K690577K797435Q47807k464692
$$ 2100675 3412267 1608403 -115284 628031 3318608 6116043 6963850 4499158
11401D499158m253722j878875K487807L680527O77051k264227k426555j855212
$$ 4499158 245436 -1633439 854368 4534895 5211946 2947719 521164 -1334048
11393a334048k192447j296795K104189M696022L281372M2879q41301M67044N57431
$$ -1334048 -3526495 -4823290 -2719101 1976921 5258293 5301172 4459871 4926915 5484346
11384E484346j312267k503293j681423m27488Q4783O74778J582070J234489r41473
$$ 5484346 4172079 1668786 -12637 -440125 -355342 319436 1901506 3135995 2194522
11375B194522k735720k034015M4899Q37447l8917o11182J51916J107285J199721
$$ 2194522 -541198 -2575213 -2530314 -1692867 -1731784 -2342966 -2191050 -1083765 115956
11366A15956R98876J247814J453452Q89210k03576j281587k186822k411625j187019
$$ 115956 1114832 2362646 3816098 4705308 4501732 3220145 1033323 -1378302 -2565321
11357b565321O79358Q51004j137583k418887p92869J682037J781381R6407m39021
$$ -2565321 -1885963 -1034959 -2172542 -4591429 -5384298 -3702261 -1920880 -1824473 -2263494
11348b263494L01072q410j204420n06911K246508L561323J662819r78134j940359
$$ -2263494 -1962422 -1970832 -3175252 -3682163 -1435655 2125668 3788487 2810353 869994
11339H69994j945368j971446j041593R03256J497290j0511n12177K024412M343147
$$ 869994 -1075374 -3046820 -4088413 -3185157 -1687867 -1698378 -2210555 -186143 4157004
11330D157004K391350k167822m072069j937975M62287L07270o34738L82572K515881
$$ 4157004 6548354 4380532 308463 -1629512 -1167225 -859955 -1494693 -1112121 1403760
11321A403760K465896o62079l570193k675185J180114L740695L046983J503886
$$ 1403760 3869656 3207577 -362616 -3037801 -1857687 1883008 4929991 6433877
11313F433877J171805M40606j843636k656941J00888K069031j472489o269619
$$ 6433877 7605682 8046288 6202652 3545711 3646599 5715630 4243141 -2026478
11305b026478m116807L453563O040376M59473m120097j045278L686721K464128
$$ -2026478 -6143285 -2689722 3350654 3810127 -309970 -1355248 2331473 4795601
11297D795601j603033j673001O34206l85565l093943j602909K847719L564020
$$ 4795601 3192568 1519567 2153773 1768208 -1325735 -2928644 -80925 3483095
11289C483095p5909k098210m43784P43553l89399q78097J33292l39273k407276
$$ 3483095 3407186 1308976 865192 1608745 1219346 341249 474541 135268 -2272008
11280b272008k082007J221130K676831J22513j964967K71540L945726M034888
$$ -2272008 -4354015 -3132885 -456054 -333541 -2298508 -2026968 1918758 5953646
11272E953646L37016l215041l516143n67212K929822L347083p0310l226503k049691
$$ 5953646 6290662 3075621 -440522 -1007734 1922088 5269171 5198861 1972358 -77333
11263g7333J380013J754479j123828k311510j53383J325402j76977j443442J40915
$$ -77333 1302680 3057159 1933331 -378179 -531562 793840 616863 -826579 -685664
11254f85664J995131J072205j183333j888709j132185l22040O44378J780715J594137
$$ -685664 1309467 2381672 1198339 -690370 -1822555 -2144595 -1500217 280498 1874635
11245A874635j26968r77040K02045J037372l82419k212264k157734j171574r67326
$$ 1874635 1747667 770627 972672 2010044 1627625 -584639 -2742373 -3913947 -4881273
11236d881273n54446J459241L277800K179631r04416k360422r36493Q86089N89305
$$ -4881273 -5435719 -3976478 -698678 1480953 576537 -1783885 -2720378 -1834289 -1244984
11227a244984j315923k310208q39085K153567M373963M567135L254017J191868
$$ -1244984 -2560907 -4871115 -5710200 -3556633 817330 5384465 8638482 9830350
11219I830350j329392l019077j860795J262582J904669j924545n665041m268184
$$ 9830350 8500958 5481881 3621086 4883668 6788337 4863792 -801249 -5069433
11211e069433l7508Q80159j764623k413091P93791L283120J897693p71170j746969
$$ -5069433 -5106941 -4226782 -5991405 -8404496 -7610705 -4327585 -2429892 -3201062 -4948031
11202d948031j654989j173615J076491M540656N559380K787759o16704k161392
$$ -4948031 -6603020 -7776635 -6700144 -2159488 3399892 6187651 5570947 3409555
11194C409555k605240j919513J389280M898323L092773l250483n756794q86683
$$ 3409555 804315 -1115198 274082 5172405 8265178 5014695 -742099 -1628782
11186a628782L833872J873757j517305J381368O935189N590285k552588p854451
$$ -1628782 2205090 4078847 2561542 3942910 10878099 16468384 13915796 6061345
11178F061345n533985n72915J818806K070073J505967n09930k681944j583528
$$ 6061345 527360 -45555 1773251 3843324 5349291 4839361 2157417 573889
11170E73889K335807M054139J405625j845991k389057j811335k160715j764956
$$ 573889 2909696 6963835 8369460 6523469 4134412 2323077 162362 -1602594
11162a602594J144883M169666L698880K7854l366110m243887l076585j181413
$$ -1602594 -457711 3711955 7410835 7438689 4072579 -171308 -3247893 -4429306
11154d429306O99922K258095L028524K157686o19658l294920k553008J799698
$$ -4429306 -3729384 -1471289 1557235 3714921 3095263 -199657 -2752665 -952967
11146i52967N126516L448061q58287k401069o94055k42444k781069m390769j900151
$$ -952967 4173549 7621610 6763323 4362254 3668199 3425755 644686 -3746083 -5646234
11137e646234K112510L293772J459328j93577J45781J453325K117103J632833
$$ -5646234 -3533724 -239952 1219376 1025799 1171580 2624905 4742008 6374841
11129F374841M24651r00639k165779l492555m181036k671957R96784L780627K869754
$$ 6374841 6799492 5898853 3733074 240519 -3940517 -6612474 -5615690 -1835063 1034691
11120A034691l78841k166086j231629N87309J989790L025294K719271j61762l677670
$$ 1034691 655850 -1510236 -2741865 -2154556 -164766 2860528 5579799 5418037 1740367
11111A740367m017695j013782J438846J267494M58879M17267l28837k100933k508746
$$ 1740367 -2277328 -3291110 -1852264 -584770 -125891 291376 -37461 -2138394 -4647140
11102d647140j226937j421412l420853k283967L923910Q516096M907181k873138
$$ -4647140 -5874077 -7295489 -10716342 -13000309 -9076399 -560303 4346878 1473740
11094A473740n404936j270770K236704R21023j462362j027561O76696J270305
$$ 1473740 -3931196 -5201966 -2965262 -2044239 -3506601 -4534162 -3857466 -2587161
11086b587161J738779K910043K576508m07092k941087j976537R98461K731139
$$ -2587161 -848382 2061661 4638169 4231077 1289990 -686547 311914 3043053
11078C043053K687109J993454P05428r45264j232767J28549L95010j696366k771079
$$ 3043053 5730162 7723616 8429044 7483780 6251013 6379562 6774572 5078206 2307127
11069B307127r9579K823272J048415l469571m184493j4607L041298J210066j926238
$$ 2307127 2207548 5030820 6079235 2609664 -1574829 -1589436 1451862 2661928 735690
11060G35690j828096M36773J288291N54483N16036J397858J502887O51757L14132
$$ 735690 -1092406 -655633 632658 1187141 1703177 3101035 4603922 5255679 5569811
11051E569811P05722K83436j676477l683103l673877j387435J110893J442748
$$ 5569811 6275533 6558969 4882492 1199389 -2474488 -3861923 -2751030 -1308282
11043a308282j57039o84644J613279M105376L052741o90569k641840j424403m50540
$$ -1308282 -1465321 -2149965 -536686 3568690 6621431 5930862 3289022 1864619 1414079
11034A414079j688347k155360O93903L926791L278498k97423k247312r60891J037942
$$ 1414079 -274268 -2429628 -1735725 2191066 5469564 5172141 2924829 1963938 3001880
11025C001880J395224J04554j798539k821461j271080K294496M107133J662066
$$ 3001880 4397104 4501658 2703119 -118342 -1389422 905074 5012207 6674273
11017F674273k184526k836493k90018J752042J676914P12009q62496l369455m326518
$$ 6674273 4489747 1653254 1363236 3115278 4792192 5504201 4641705 1272250 -3054268
11008c054268r01205M066681M332943l59888l143454l91315K860567J408232j858961
$$ -3054268 -3955473 111208 4444151 4084263 940809 549494 3410061 4818293 2959332
10999B959332j370814J723102J823900j697503l616112j022930K935362M162028
$$ 2959332 1588518 3311620 5135520 3438017 -178095 -1201025 1734337 5896365
10991E896365K262597q30545l310609l451663l10156M011271N396906K654390
$$ 5896365 8158962 7328417 4017808 566145 255989 4267260 9664166 12318556
10983A2318556p18320j332566l88850j155685l550143m140620j347180J980218
$$ 12318556 11600236 10267670 9878820 8723135 5172992 1032372 -314808 1665410
10975A665410K115334r89944l865720l501814k81803K699306K710530O5543k088766
$$ 1665410 3780744 2790800 -1074920 -4576734 -4858537 -2159231 551299 616842 -1471924
10966a471924j228956J337284K005229k7688j208856J257446M656486L982037
$$ -1471924 -2700880 -1363596 641633 613945 -594911 662535 5319021 9301058
10958I301058r54751m970583m309512q38566J472511J332733o9900j461461j814619
$$ 9301058 8346307 3375724 -933788 -1772354 -299843 1032890 962990 -498471 -2313090
10949b313090l50371J925039K383748J22447k483251k981179j773928n04666L54053
$$ -2313090 -2663461 -738422 1645326 1767773 -715478 -3696657 -5470585 -5975251 -5621198
10940e621198P98205M97509L03828J965607M611767M599187J056272j878739j181701
$$ -5621198 -4822993 -4325484 -4021656 -2056049 2555718 7154905 8211177 6332438 5150737
10931E150737M20223m30187j811224m77865J722982J074365j102614j021576K02463
$$ 5150737 5570960 5140773 3329549 2851684 4574666 5649031 4546417 3524841 3727304
10922C727304j332473m147576k928885J778069L261379m95126l182926l27259
$$ 3727304 2394831 -1752745 -4681630 -2903561 357818 -137308 -3320234 -3647493
10914c647493L644452K715909j564379l149946m09568K622926K331037n78031
$$ -3647493 -3041 2712868 1148489 -2001457 -2411025 211901 2542938 1964907
10906A964907k750229k002368L04110P67781j259168k005314J021219L892466
$$ 1964907 -785322 -2787690 -2483580 -1715799 -2974967 -4980281 -3959062 -66596
10898f6596J423638m070607n198862m11135M051728L953386J977394R44297q84332
$$ -66596 1357042 -2713565 -7912427 -8323562 -4271834 -318448 1658946 2603243 1718911
10889A718911m337176n508531j923952K455644K973005R06335N1068M70943J11947
$$ 1718911 -2618265 -8126796 -10050748 -7595104 -4622099 -3715764 -3664696 -3193753 -3081806
10880c081806n30215K58294J790679K333913J921024J051231p20280k458717j552053
$$ -3081806 -3612021 -3353727 -1563048 770865 2691889 3743120 3022840 564123 -987930
10871i87930J557024K267182j263692m170155j864555K795232L898318R44466
$$ -987930 569094 2836276 1572584 -2597571 -4462126 -1666894 2231424 3175890
10863C175890j761498j744655j9814J849723K537333Q65131j796870j672178J675256
$$ 3175890 1414392 -330263 -350077 1499646 4036979 4902110 3105240 1433062 3108318
10854C108318L095724q02976n649611n304293o70832K545745K187554O00018m19193
$$ 3108318 6204042 5401066 -248545 -5552838 -6223670 -3677925 -1490371 -890353 -1309546
10845a309546n59230R61552L427259L065805j587069n504842l839554J89930M79805
$$ -1309546 -1868776 -907224 2520035 5585840 3998771 -1506071 -5345625 -5155695 -4675890
10836d675890j738732n57805L631510M561047J246831k56046K231088K969905
$$ -4675890 -6414622 -6972427 -3340917 1220130 2466961 2210915 4442003 7411908
10828G411908j586106o216448n060507m18151J672557L42374p09729J92113J434193
$$ 7411908 5825802 -390646 -5451153 -5869304 -4196747 -3854373 -4564102 -4371989 -2937796
10819b937796J766274J341933J45386j525584j861968M07786L285576L308016
$$ -2937796 -1171522 170411 315797 -1209787 -3071755 -2663969 621607 3929623
10811C929623P5907l049442l172658j161414K19417L71183J283025L706799N013295
$$ 3929623 4005530 956088 -2216570 -3377984 -3158567 -2787384 -1504359 2202440 7215735
10802G215735K736902j225665l006500k661024l576421n600077l918862K761495
$$ 7215735 9952637 8726972 5720472 3059448 -516973 -6117050 -10035912 -7274417
10794g274417P936851N550156j258911m754538l100789n81386N99070K163762
$$ -7274417 662434 6212590 4953679 199141 -2901648 -3483034 -2883964 -720202
10786g20202L870109K461350k048600m673125k520620P97681P27263j582501j538839
$$ -720202 3149907 5611257 3562657 -1110468 -3631088 -2833407 -2106144 -3688645 -5227484
10777e227484J832673M394331K470399k203981m348565j645870K193068K420588
$$ -5227484 -3394811 999520 3469919 1265938 -3082627 -4728497 -2535429 -114841
10769a14841J3913r7714K505650K336986k565217n563181r80490N881847N591026
$$ -114841 -100928 -198642 2307008 4643994 2078777 -3484404 -4464894 1416953 7007979
10760G007979j136840m407654k03945M136688J874240l360326m351708j235163
$$ 7007979 5871139 1463485 1259540 5396228 7270468 3910142 -441566 -1676729
10752a676729K52939j512624k051934J656840O101752N546142m44628n854735
$$ -1676729 -1423790 -2936414 -4988348 -3331508 2770244 8316386 7871758 2017023
10744B017023n103410P8586K771725Q2729l002102j211835K946049L207381n29704
$$ 2017023 -3086387 -3007801 -236076 -153347 -3155449 -4367284 -1421235 1786146 1256442
10735A256442k272802L15937K604941J104014j094475l27070J225754j81441k740250
$$ 1256442 -1016360 -700423 1904518 3008532 1914057 1586987 2812741 2631300 -108950
10726a08950j726823K528204M793806K831503P5805n37254p56544k710765m272340
$$ -108950 -1835773 692431 5486237 8317740 8393545 7856291 7099747 4388982 116642
10717A16642k394740J235911K140458j64855j644254m14752M74311j236721k661287
$$ 116642 -2278098 -1042187 1098271 933416 -710838 -1125590 -651279 -1888000 -4549287
10708d549287m94854L061985L467605R74573k15600R16217R66563j632390l869361
$$ -4549287 -5044141 -1982156 1485449 2460022 2244422 3160639 4127202 2494812 -1374549
10699a374549l054485n49638J069904J372348J062223M33514R4418O91531J187936
$$ -1374549 -4429034 -4978672 -3908768 -2536420 -1474197 -1040683 -946265 -254734 933202
10690I33202J20030j254733m22685J743717J920356J52564p0046J686414J588868
$$ 933202 1053232 -201501 -624186 1119531 3039887 3192451 3122405 4808819 6397687
10681F397687j588713l825981k439317j61285J16032j50284J098189K658351K862034
$$ 6397687 4808974 982993 -1456324 -1617609 -1501577 -1651861 -553672 2104679 4966713
10672D966713K253420J206332r15367k569175j053328J813606J098756k502255
$$ 4966713 7220133 8426465 7511098 4941923 3888595 5702201 6800957 4298702
10664D298702k610276J711330L178214j430867n049729k052517K240076Q61641
$$ 4298702 1688426 3399756 6577970 5147103 97374 -1955143 284933 1146574
10656A146574l480673m240070j789892m06378j10490Q35671O28478j630414j818794
$$ 1146574 -2334099 -6574169 -8364061 -8770439 -8880929 -8045258 -7416780 -9047194 -10865988
10647a0865988J788872L392356m89133l280732P66315N527998L182908j809049
$$ -10865988 -9077116 -5684760 -6173893 -9454625 -8688310 -3160312 22596 -1786453
10639a786453p66743L535436K388767k654657k997415J058665J617726j711245
$$ -1786453 -2553196 982240 3371007 716350 -2281065 -1222400 395326 -1315919
10631a315919j885771J485266J668106j793034k251482J083779J902370q28259
$$ -1315919 -3201690 -1716424 -48318 -1841352 -4092834 -3009055 -1106685 -1934944
10623a934944j403640R34277Q82436j524967n09361L455384L497378n71347j544927
$$ -1934944 -3338584 -2404307 -1521871 -3046838 -3556199 -100815 3396563 2825216 1280289
10614A280289J304370P25614l888836l966320K524128O128143J614041l771657
$$ 1280289 2584659 3310273 -578563 -4544883 -2020755 4107388 5721429 1949772
10606A949772l345886p67229q04150j028583J030361K138497P04139P81535L357010
$$ 1949772 -1396114 -2163343 -2967493 -3996076 -2965715 -827218 -123079 658456 4015466
10597D015466K854021k277212m870909q50688L340605J499869k559929k646016
$$ 4015466 6869487 4592275 -278634 -1129322 2211283 3711152 1151223 -1494793
10589a494793k1385J048514R41890J584088J489931n17513j785589n92753N72108
$$ -1494793 -1516178 -467664 474226 2058314 3548245 3030732 1245143 652390 1224498
10580A224498M9549n33J372710J539232l70363j389281j85931Q98655O03543j00211
$$ 1224498 1274047 1273514 2646224 4185456 3815093 2425812 2239881 3138536 3742079 3641868
10570C641868j711013m653053n027763L27801O031383M595671r36855j384176
$$ 3641868 1930855 -2722198 -7749961 -7422160 -1390777 3204894 2268039 883863
10562H83863L065001L871969j61296j646579O94280J95913l669403l838408j48611
$$ 883863 3948864 7820833 7659537 6012958 6707238 6903151 3233748 -604660 -753271
10553g53271m05439m596147l628076K969347M374886k032167m975261J148272
$$ -753271 -1158710 -5754857 -9382933 -6413586 -2038700 -4070867 -9046128 -7897856
10545g897856P043203N514202K257196K564738K122266j575609k788383M47461
$$ -7897856 -854653 4659549 6916745 9481483 11603749 10028140 7239757 7687218
10537G687218J440004j987424l202500m77673k24095k543159R5406O101566M877763
$$ 7687218 9127222 7139798 3937298 3459625 3235530 692371 787777 6889343 11767106
10528A1767106k576449l262323L484557L539367m991762o740247K101842N977081
$$ 11767106 9190657 5928334 9412891 12952258 7960496 1220249 3322091 9299172
10520I299172m79094k576775M482769M924236n867569r295888J936235Q432031
$$ 9299172 8820078 6243303 10726072 15650308 9782739 486851 2423086 10855117
10512A0855117N14n317488L109674P584662j996670o516012M272331Q893067m041957
$$ 10855117 10855631 5538143 8647817 16232479 14235809 7719797 11992128 20885195 16843238
10503A6843238j0331244L522227J0588361n270710j3779151N294196J8613807
$$ 16843238 6511994 10034221 20622582 15351872 1572721 6866917 25480724
10496B5480724Q71621j2227359Q462757K1328216q166142k5017437K0388445M8399004
$$ 25480724 26352345 14124986 22587743 43915959 35749817 10732380 31120825 79519829
10488G9519829m5883597j89601378j88968339r654159J52046949J36806264K3935841
$$ 79519829 33636232 -155965146 -344933485 -354587644 -202540695 -65734431 -41798590
10481d1798590k1766720J4178495L1335494J676891j3027323P024685J4260254
$$ -41798590 -63565310 -49386815 -18051321 -16374430 -29401753 -22377068 -8116814
10474h116814o405490j3866077N952017J6217604O73318j0675040j303762O242827
$$ -8116814 -14522304 -28388381 -22436364 -6218760 -5545442 -16220482 -17524244 -11281417
10466a1281417j012016m673560L731571O108767l655164o310526M530403R247374
$$ -11281417 -12293433 -16966993 -13235422 -7126655 -10781819 -17092345 -12561942 -3314568
10458c314568k71413n892153J752894P186329J213993l367764Q02576K140027
$$ -3314568 -3585981 -9478134 -7725240 -538911 675082 -2692682 -1890106 249921
10450B49921m272762n667840K426986O114439O531k257202M621993O176425l763738
$$ 249921 -4022841 -9690681 -7263695 -1149256 -1142725 -3399927 1222066 7398491 3634753
10441C634753r496131j574175O046043J700269m283073j225339K363554k256443
$$ 3634753 -5861378 -7435553 -1389510 310759 -3972314 -5197653 -2834099 -5090542
10433e090542n601274J494139Q552509L329329o104342n763731O52672J008227
$$ -5090542 -10691816 -9197677 -645168 2684161 -3420181 -9183912 -8531240 -7523013
10425g523013l170260k118750K837335K904379q77227J7266N446698O843302J712846
$$ -7523013 -10693273 -12812023 -9974688 -7070309 -7947536 -7930270 -2483572 4359730 6072576
10416F072576l723235n183595m174910k212032J069040M634180O328390N463775
$$ 6072576 2349341 -2834254 -7009164 -9221196 -8152156 -3517976 2810414 8274189
10408H274189K190211k901351o629794n262981o02793J442995r1881k47359K374587
$$ 8274189 10464400 7563049 933255 -4329726 -4932519 -3489524 -3581405 -3828764 -1454177
10399a454177L227251J081523O74163K970424K216002l163390o231543l112103
$$ -1454177 1773074 2854597 3528760 6499184 8715186 5551796 -679747 -3791850
10391c791850M43643k92300j081551K022061M383036J329483k878562k553715
$$ -3791850 -3348207 -3640507 -4722058 -2699997 1683039 3012522 133960 -2419755
10383b419755j42614l99446j368997P08754L106439J454687j747612j362527J523158
$$ -2419755 -2562369 -2961815 -4330812 -3622058 -515619 939068 -808544 -2171071 -647913
10374f47913K337428J165301J122318J621092R619k454306k365409K4348J877429
$$ -647913 1689515 2854816 3977134 5598226 5607845 3153539 788130 812478 2689907
10365B689907K562474K929059K230340o5615j929494j930443j870162k977271
$$ 2689907 5252381 8181440 10411780 10346165 8416671 6486228 4616066 1638795
10357A638795l009219n39964J802936J917149J758996K649521J901886j616421
$$ 1638795 -1370424 -1910388 -107452 1809697 3568693 6218214 8120100 6503679
10349F503679l706174j674204J67879k272756n029257k402677K878263L556281
$$ 6503679 2797505 1123301 1291180 -981576 -6010833 -8413510 -5535247 -1978966
10341a978966p00476l509142k068020K07357J003950K017888L735947L505498
$$ -1978966 -2679442 -6188584 -8256604 -8049247 -7045297 -5027409 -1291462 2214036
10333B214036N81575j762799j234690M6416q09371l038856l537150j210241J676395
$$ 2214036 2795611 1032812 -201878 -155462 -964833 -4003689 -7540839 -8751080 -7074685
10324g074685K391723J193816R75155K884155L813405O80748l859673l956059
$$ -7074685 -4682962 -3489146 -2513991 370164 4183569 4864317 1004644 -2951415
10316b951415R82910M884809L437683o01549k671182k440162j570755K39311L037907
$$ -2951415 -1968505 2916304 6353987 5752438 3081256 641094 -929661 -690350 2347557
10307B347557L968511J190647k189441k304603m30902n50863k840280l808113
$$ 2347557 6316068 7506715 5317274 3012671 2581769 2030906 -809374 -4617487
10299d617487j818773J296135L385810L584009J673242j192298k091253M33538
$$ -4617487 -6436260 -5140125 -1754315 1829694 3502936 2310638 219385 652923
10291F52923L595497L520288L32068k486299k923707k019604j305253j153777
$$ 652923 4248420 7768708 8100776 5614477 2690770 671166 -634087 -1787864
10283a787864j308036j119247J99854K059282K335650L74309j288470k68650J938568
$$ -1787864 -3095900 -4215147 -4015293 -1956011 379639 753948 -534522 -803172 1135396
10274A135396J962808o62597l161262l439916k096582o16097N16322J568120K605562
$$ 1135396 3098204 2435607 -725655 -4165571 -6262153 -6878250 -6361928 -4793808 -2188246
10265b188246L167871K609665R53785o95351j294679j149851r97395m06839J125575
$$ -2188246 979625 3589290 4543075 3847724 2553045 1403194 405799 -1040 1124535
10256A124535K071806L95727k866307m310312k824694q13530k41221k87346K68752
$$ 1124535 3196341 3592068 725761 -3584551 -6409245 -7222775 -7463996 -7751342 -7482590
10247g482590J056706J424246J331519M41379j165505j417708J352618M534910
$$ -7482590 -6425884 -5001638 -3670119 -3228740 -4394245 -5811953 -4459335 75575
10239G5575L817593p0329j879212K5589J256448j047060l529490k351439R64523
$$ 75575 3893168 3822839 1943627 1969216 3225664 2178604 -1350886 -3702325 -2737802
10230b737802K631435J711364o51119l286013l913238m18898M334378M142906
$$ -2737802 -106367 1604997 953878 -2332135 -6245373 -6664271 -2329893 1813013
10222A813013j138915l801386J34160M150173J767695k701786j702406K693698
$$ 1813013 674098 -3127288 -2993128 1157045 2924740 222954 -1479452 1214246
10214A214246K869954r41894j643648J796494K816858p13577k889094o14198R99977
$$ 1214246 4084200 3142306 1498658 3295152 6112010 5398433 2509339 1895141 2895118
10205B895118j899798m798985k455111K327519L450047R27045l29919J280023
$$ 2895118 995320 -3803665 -6258776 -3931257 -481210 445835 115916 1395939
10197A395939K459448P91651k161262l633515k680057k62647J850420K340447
$$ 1395939 3855387 4647038 2485776 -1147739 -3827796 -4090443 -2240023 100424
10189A00424J604858J233155J533194Q68399j527863l660906l277951r89118Q73322
$$ 100424 1705282 2938437 4471631 5340030 3812167 151261 -3126690 -4115808 -3242486
10180c242486J471851J559532J105265p64964l271956l678487o65188L308639
$$ -3242486 -1770635 -211103 894162 129198 -3142758 -6821245 -7486433 -4177794
10172d177794M443272J877262j690613l403379k908319j430003K50476J782740
$$ -4177794 265478 2142740 452127 -2951252 -5859571 -7289574 -7039098 -5256358
10164e256358K256923Q69361j527832k830830j907431L07975J959933J931725
$$ -5256358 -2999435 -2130074 -3657906 -6488736 -8396167 -8088192 -6128259 -4196534
10156d196534N73398o84732q03426m62965r24163j382905L78619L654956M122388
$$ -4196534 -3623136 -4307868 -5111294 -5574259 -6498422 -7881327 -7502708 -3847752 274636
10147B74636N6104l717408k119201K294091K972907n26528k317999r815J974231
$$ 274636 330740 -3386668 -5505869 -3211778 -238871 -765399 -3083398 -3093213 -1118982
10138a118982M87841j380775m13319J294841P53494o70894l46599J072162J759378
$$ -1118982 -631141 -2011916 -2425235 -1130394 -376900 -1047794 -1394393 -322231 1437147
10129A437147J857327J408482q90397l764968k856578K081686M552730O62248
$$ 1437147 3294474 4702956 3812559 47591 -2808987 -727301 3825429 4487677
10121D487677m022948k900926J226874J450121j437704r85040L174758M509719
$$ 4487677 464729 -2436197 -1209323 240798 -1196906 -2181946 992812 5502531
10113E502531M40193l936782m045226j156636J635950K999177K012090j321881
$$ 5502531 5942724 2005942 -2039284 -3195920 -1559970 1439207 3451297 2129416
10105B129416l512801q73419M072246M887635M48487l749391m111689k822926
$$ 2129416 -1383385 -2256804 1815442 6703077 7151564 3402173 -709516 -3532442
10097c532442k184783j202057M66798Q54580r6277J07625J387241P50415j570456
$$ -3532442 -5717225 -6919282 -6452484 -5597904 -5694181 -5586556 -4199315 -3448900 -5019356
10088e019356j651046Q20296J354857r75054j085554K906247N234510J861900
$$ -5019356 -6670402 -5850106 -4495249 -5470303 -6555857 -3649610 1584900 3446800
10080C446800k380950j726726J217359N44545l079843m333253j905929R19665
$$ 3446800 1065850 -660876 556483 1101028 -1978815 -6312068 -8217997 -7298332
10072g298332K127989K115796J007866o12888n50432J348113J267375k627598
$$ -7298332 -5170343 -3054547 -2046681 -2659569 -3210001 -1861888 -594513 -3222111
10064c222111n727317l323753J946261M314033L274316K053479R19302j525959
$$ -3222111 -8949428 -12273181 -10326920 -6012887 -2738571 -685092 234210 -1291749
10056a291749l071961q19118K643512K809289J077735J822029L532745J123849
$$ -1291749 -4363710 -5182828 -2539316 269973 1347708 3169737 6702482 7826331
10048G826331l879252m399080M70208L668754J722409n58170M02669J120042j307186
$$ 7826331 3947079 -452001 18207 3686961 5409370 4851200 5253869 6373911 5066725
10039E066725l349211j855670k23941k104385m264344j873354K970119M137082
$$ 5066725 1717514 -138156 -362097 -2466482 -6730826 -8604180 -5634061 -1496979
10031a496979N79908k800562k163214J509291M735825M692453J250143k101840
$$ -1496979 -917071 -3717633 -5880847 -4371556 364269 5056722 6306865 4205025
10023D205025j369659K217883K712521k051498o323063m404530Q31859K255908
$$ 4205025 2835366 5053249 7765770 5714272 -608791 -5013321 -4181462 -1925554
10015a925554j094268l341189p82250L448440M456757J614925j827760k925105
$$ -1925554 -3019822 -6361011 -7143261 -3694821 761936 2376861 549101 -2376004
10007b376004j591360R7150N18151J96661K77042O0919j681054l201399j106564
$$ -2376004 -3967364 -3870214 -3352063 -3155402 -2878360 -2817441 -4498495 -7699894 -8806458
9998h806458L814511N987609K515522k316638l024499l14656J165689K5785j088807
$$ -8806458 -4991947 995662 3511184 1194546 -1829953 -2144609 -978920 -953135 -2041942
9989b041942n55031M39722Q55217J211421J764975J680438M95992r92592j579316
$$ -2041942 -2596973 -2157251 -1302034 -90613 1674362 3354800 3850792 2858200 1278884
9980A278884q98499r6707r28372l068515l311992J38015L687799K499941j941310
$$ 1278884 380385 283678 -644694 -3713209 -7025201 -6887186 -3199387 -699446 -2640756
9971b640756l353157o574L167695K997534K225394K935748K516108k70070j748257
$$ -2640756 -5993913 -6000487 -2832792 164742 2390136 5325884 7841992 7571922 5823665
9962E823665l42178n98879m734688o611674j082837O235420O528115Q90881k407498
$$ 5823665 5481487 4882608 147920 -6463754 -7546591 -1311171 5216944 6107825 3700327
9953C700327o96690J349364Q25633l57160o49441n46455K8401P97503l56045l059222
$$ 3700327 3003637 4353001 5178634 4821474 4172033 3625578 3653979 4451482 4095437 1036215
9943A036215k298345L538874P103928K115687n566634n890964J64600L310926
$$ 1036215 -1262130 2276744 9380672 11496359 5929725 38761 203361 3514287
9935C514287R95723j021752m41767p29923k053351n41232K925480L011843l82207
$$ 3514287 4510010 3488258 3046491 2316568 263217 -278015 2647465 5659308 5277101
9926E277101j927850n69177l10977j497109o59709J296514L28150k012663r28256
$$ 5277101 3349251 2780074 2469097 971988 312279 1608793 1936943 -75720 -1003976
9917a003976J764295O39850k226835p57018K591598P34815l633749j961122L605218
$$ -1003976 760319 1400169 -826666 -1583684 1007914 1742729 -1891020 -3852142 -246924
9908b46924L454022j064497N0464N478095M166270k951436l714615J811231J415157
$$ -246924 3207098 2142601 2193065 7671160 11837430 8885994 5171379 6982610 8397767
9899H397767m079855j279397P280554M310622p432627n131003J0471152J0287273
$$ 8397767 4317912 3038515 10319069 14629691 7197064 2066061 12537213 22824486
9891B2824486r143352j1599254J2595746J4380179l6424571q3632469n5161465
$$ 22824486 13681134 2081880 14677626 29057805 -7366766 -90999235 -146160700
9884a46160700K5571725O6682224L6496984m132084l691423J4159697R852110
$$ -146160700 -120588975 -53906751 -17409767 -21541851 -25233274 -11073577 -1221467
9877a221467o165158m413002Q743747Q342184l662319p131748o02510K104635
$$ -1221467 -7386625 -11799627 -3055880 5286304 1623985 -5507763 -6110273 -4005638
9869d005638l95234M33294K678049p99501n256724k156858L779812L283472l69362
$$ -4005638 -4400872 -3967578 -1289529 -2089030 -7345754 -9502612 -5722800 -2439328 -2808690
9860b808690M52159J806276k833418p025892k087795N266680L607914k754396
$$ -2808690 -2356531 -550255 -3383673 -10409565 -12497360 -7230680 -3622766 -6377162
9852f377162k006061L485026K552462l066753j878003N435466O382532j326150
$$ -6377162 -8383223 -4898197 -2345735 -5412488 -7290491 -1855025 4527507 3201357
9844C201357n964015j826308K794365J071259k418763j562356K097981M095916
$$ 3201357 -2762658 -4588966 -1794601 -723342 -3142105 -4704461 -2606480 1489436
9836A489436L060491m38987m656422n776123k291270R17791p13709l249173m34996
$$ 1489436 4549927 4110940 -545482 -6321605 -8612875 -7695084 -8408793 -11657966 -12092962
9827a2092962M928397M998591J59010j645157J923047M771661L103113J33554
$$ -12092962 -7164565 -2165974 -2006964 -3652121 -1729074 3042587 6145700 6279254
9819F279254r32503r96772j081787p40852r24117k717706l715584j250905K093551
$$ 6279254 5346751 4349979 3268192 2527340 1603223 -1114483 -4830067 -6080972 -3987421
9810c987421K101876J01479R6198J058825o33594l201556j893148K050375K990801
$$ -3987421 -1885545 -1784066 -1687868 -629043 -1262637 -4464193 -6357341 -4306966 -1316165
9801a316165N26952n08297R58661J321376P1684M31166K078490J173772j872242
$$ -1316165 -789213 -1297510 -338849 982527 1054211 1485377 3563867 4737639 2865397
9792B865397k412154p8544M39940j704341j581036K533517N424976L064162j514937
$$ 2865397 453243 374699 814639 -889702 -2470738 62779 5487755 8551917 7036980
9783G036980l489204k591284j346778o91482J23360J495720K674861J948312j479414
$$ 7036980 3547776 956492 -390286 -1081768 -958408 537312 3212173 5160485 3681071
9774C681071m607676k665506L488016O234865J554527m254237l835448J60638
$$ 3681071 -926605 -3592111 -104095 6130770 7685297 3431060 -404388 -243750
9766b43750O24203j826883j206200K322586L071225N18691k79981J466190J376333
$$ -243750 380453 -1446430 -2652630 -330044 2741181 3259872 2979891 4446081 5822414
9757E822414r98974j264925R86410J289254q52605j060829Q27642j63710m194571
$$ 5822414 4823440 3558515 4544925 5834179 4981574 3920745 4748387 4584677 390106
9748C90106m879886k11186L563830K339643J32921P70994J450498q01288l186535
$$ 390106 -4489780 -4700966 -1137136 1202507 1335428 2106422 3556920 2755632 -430903
9739d30903k592437j078801j210344j211647O83609J927050K70234j548490j78842
$$ -430903 -3023340 -4102141 -5312485 -6524132 -5840523 -3913473 -3643239 -5191729 -5370571
9730e370571K785179L670821K188706M54366q67790k199107k852856j951548k43144
$$ -5370571 -2585392 1085429 3274135 3728501 2860711 661604 -2191252 -4142800 -4385944
9721d385944O81095K0449j737410k729482r45503K615053L774130Q53253j967500
$$ -4385944 -3704849 -3684400 -5421810 -8151292 -9096795 -6481742 -2707612 -1854359 -3821859
9712c821859p08703J954723J305468j334529j356120Q65515J484300P83003J546798
$$ -3821859 -4530562 -2575839 -1270371 -2604900 -3961020 -3095505 -1611205 -828202 718596
9703G18596J807666k069421o397006l957669L396054O000894J172078l303455
$$ 718596 2526262 456841 -5940165 -9897834 -6501780 -500886 671192 -2632263
9695b632263k215698N05685Q32872N28402Q00169o75782k989817j262184L959157
$$ -2632263 -4847961 -4342276 -3509404 -2981002 -2180833 -2856615 -5846432 -7108616 -3149459
9686c149459N696389K280389L50392K379812J865086l922551p276943k936762
$$ -3149459 2546930 4827319 5177711 7557523 9422609 5500058 -1776885 -4713647
9678d713647K491750J786090j464396j085647N99555r51070k729991k73626K880222
$$ -4713647 -2221897 -435807 -1900203 -2985850 -2386295 -3337365 -6067356 -6340982 -3460760
9669c460760J315008k188145j807874J090892J630890M88772P65644P07424j836816
$$ -3460760 -2145752 -4333897 -6141771 -5050879 -3419989 -2931217 -2165573 -1458149 -3294965
9660c294965k752943J463858N243526K191710k952227j445242M266543M290261
$$ -3294965 -6047908 -4584050 659476 2851186 -101041 -1546283 2720260 7010521
9652G010521k049818n384367j813025K165748J493573p75573q32896L11908R03414
$$ 7010521 4960703 -423664 -2236689 -70941 1422632 647059 -185837 126071 1029485
9643A029485J143425K99697k629417m744167k128383K864846L892708L84476j919081
$$ 1029485 2172910 2472607 -156810 -4900977 -7029360 -4164514 -271806 112670 -1806411
9634a806411n36268R08108K84309Q2593J281364R59475j691053k964328o72829
$$ -1806411 -2342679 -1434571 -1150262 -1067669 213695 1173170 -517883 -3482211 -4155040
9625d155040K417340L148747J668541n60968k307640j868681P84892J758377j692037
$$ -4155040 -1737700 1411047 3079588 2518620 210980 -1657701 -872809 885568 -806469
9616h06469n022265j942391M792432O137205N85764l525659j306349K040725J192494
$$ -806469 -5828734 -7771125 -2978693 3158512 3744276 218617 -1087732 952993 2145487
9607B145487j164250q76280M95747M75142J065484L510730L680247q13562m256281
$$ 2145487 981237 104957 600704 1075846 2141330 5652060 9332307 8518745 4262464
9598D262464j004754M245508K694813m562263p543369k164539M250493M252178
$$ 4262464 3257710 7503218 10198031 5635768 -1907601 -4072140 178353 4430531
9590D430531J49398j227721J114829K170215p89659m385984m225206q18604J576347
$$ 4430531 4579929 3352208 4467037 6637252 5847593 1461609 -2763597 -3582201 -2005854
9581b005854Q47208o63804j85263J428005J559729K63514K8405J443014K027896
$$ -2005854 -1158646 -1822450 -2007713 -579708 980021 1243535 1271940 2714954 4742850
9572D742850J00369k625969l482006k111460j99563O73253M2980j327162j725397
$$ 4742850 4843219 2217250 -1264756 -3376216 -3575779 -2902526 -2859546 -4186708 -5912105
9563e912105j15222K151405K679665J367413O31380J768373K980326K029122o70376
$$ -5912105 -6027327 -3875922 -1196257 171156 802536 2570909 5551235 7580357 6909981
9554F909981k756967k683474q89385R62520J324925P0464j233670j051655J94872
$$ 6909981 4153014 1469540 580155 1542675 2867600 2938064 1704394 652739 847611
9545H47611Q32717K41464q00646j705619k408074k308050p13388J517516K518120
$$ 847611 1680328 1921792 1121146 -584473 -2992547 -5300597 -6013985 -4496469 -1978349
9536a978349J911993J182015J235595J211485K24212j123680j624388q54458P26439
$$ -1978349 -66356 1115659 2351254 3562739 3786951 2663271 1038883 184425 910864
9527I10864K198776K480990J041758j394613l265885l307577j347605J262219
$$ 910864 3109640 5590630 6632388 5237775 1971890 -1335687 -2683292 -1421073
9519a421073K079112n3504k842722k801378p0349J801548J641330K283086M519092
$$ -1421073 658039 604535 -2238187 -5039565 -5109914 -3308366 -1667036 616050 5135142
9510E135142M213881o97868m948089l321446M50681p18690n325107n277397Q36494
$$ 5135142 9349023 8651155 3703066 381620 832301 113611 -5211496 -10488893 -9652399
9501i652399N367144L797628P01414N71313Q17972j531947l268757r52634K183433
$$ -9652399 -4285255 -487627 213787 785100 1603072 71125 -3197632 -4150266 -1966833
9492a966833J552636r56930q40129R43853M41615j450319o74588J960266J603430
$$ -1966833 -414197 -1371127 -2211256 -1267403 -825788 -2276107 -2950695 -990429 613001
9483F13001j903456k929577J023397N186456M613426Q24884j388811n71150P44784
$$ 613001 -1290455 -4220032 -3196635 1989821 6603247 7428131 6039320 5468170 6212954
9474F212954J38112k044728l413731k179296M19519J025087j298938l039132j110708
$$ 6212954 6351066 4306338 892607 -1286689 -867170 157917 -1141021 -4180153 -5290861
9465e290861K068707J995113q75506k095055n10835P16689M93206J304741L198782
$$ -5290861 -3222154 -1227041 -2102547 -4197602 -4708437 -3991748 -3498542 -2193801 1004981
9456A004981K525955q85628j641562K403884N379985K475069j985392j961093
$$ 1004981 3530936 2645308 1003746 3407630 8787615 11262684 9277292 7316199
9448G316199r793k061015n818812m142423J784608L264349j339482l522068R44085
$$ 7316199 7306406 5245391 -573421 -4715844 -2931236 333113 -1006369 -4528437 -3584352
9439c584352M785057J677658l237863k578211J018196O13067k469639j493489
$$ -3584352 1200705 2878363 -359500 -2937711 -1919515 -1306448 -3776087 -5269576
9431e269576L343864N136810J919410r50152o20655o59747l229611m634090j760558
$$ -5269576 -1925712 3211098 5130508 4180356 3559701 2899954 -329657 -4963747 -6724305
9422f724305K603740M061622K105985j025488l360922l372112p56564J741247
$$ -6724305 -4120565 -58943 2047042 1021554 -2339368 -5711480 -6468044 -4726797
9414d726797J056082j033751p7887L189576L118473j176204l207865N09491M184459
$$ -4726797 -3670715 -4704466 -4782353 -1592777 1525696 349492 -2858373 -2348882 1835577
9405A835577J881434k875442l073210N18399J329925k115324m544814k738655
$$ 1835577 3717011 841569 -2231641 -1713242 -383317 -2498641 -7043455 -9782110
9397i782110L18492J031633J47044N31570K969904N358457M712368L00783m223499
$$ -9782110 -9463618 -8431985 -8284941 -7753371 -4783467 574990 5287358 5588141 1364642
9388A364642l761158J410328M585829J315905l977218m302442k56208J675135
$$ 1364642 -2396516 -986188 3599641 4915546 938328 -3364114 -3620322 -1945187
9380a945187o39065k747186j654049J62405L17029N28455K286427K992386J45413
$$ -1945187 -2584252 -5331438 -6985487 -6823082 -6506053 -5977598 -3691171 -698785 -553372
9371e53372l537145l193229J201273M458421K939156r94186k471824m57749J413819
$$ -553372 -4090517 -7283746 -6082473 -1624052 1315104 320918 -2150906 -2608655 -1194836
9362a194836K31402k234748k507394n69149P38518N70574P40557J556729J140994
$$ -1194836 -963434 -3198182 -5705576 -6274725 -5536207 -4965633 -4225076 -2668347 -1527353
9353a527353k25618L73365K817843K661127j547288m509942j930954K367640K246306
$$ -1527353 -1752971 -1379606 1438237 4099364 2552076 -1957866 -3888820 -1521180 725126
9344G25126j481546l404756k282330j209922j068975k14566O45806l80147j304133
$$ 725126 -756420 -4161176 -6443506 -7653428 -8722403 -8936969 -8291163 -8671310 -9975443
9335i975443J189349M846869M321435K68351j313215P72220J250968j612233k487837
$$ -9975443 -8786094 -3939225 382210 650561 -662654 109566 1360534 -251699 -2739536
9326b739536J311031M184483J125204l921621m198958j36038K432813J008404
$$ -2739536 -1428505 2755978 3881182 -40439 -4239397 -4375435 -1942622 -934218
9318i34218j699722k685832j334116J317722K996704J621773j432677j991349
$$ -934218 -2633940 -5319772 -6653888 -5336166 -2339462 -717689 -2150366 -4141715
9310d141715Q52089K642683L33589k540440j290539K572339L960633J788413p79669
$$ -4141715 -3289626 -646943 -313354 -2853794 -4144333 -1571994 2388639 4177052 3397383
9301C397383j952700k492642k353219p13981J086210Q24951n95122l39278J267649
$$ 3397383 1444683 -1047959 -3401178 -4115159 -3028949 -2203998 -2799120 -3138398 -1870749
9292a870749R35253j868885l474255j590038J172056J267688r16906k244151j061244
$$ -1870749 -935496 -2804381 -6278636 -7868674 -6696618 -5428930 -6345836 -8589987 -9651231
9283i651231J637745M002005M541277K459912j436964m351567l492278R35617
$$ -9651231 -8013486 -4011481 529796 2989708 1552744 -2798823 -6291101 -5355484
9275e355484N273184N569861J446007l350185m623717k015812Q83829Q56673j291412
$$ -5355484 -82300 5487561 6933568 3583383 -1040334 -3056146 -2172317 -1315644 -2607056
9266b607056k084872J39650L189960L703484J165709j487272j370822Q75064J938712
$$ -2607056 -4691928 -4552278 -1362318 2341166 3506875 2019603 648781 1523845 3462557
9257C462557J05357k529513k864012p70349J077234Q11716p29614j655490j146559
$$ 3462557 3567914 1038401 -1825611 -2595960 -1518726 -707010 -1436624 -3092114 -4238673
9248d238673L01174J596301J714582N48333p20325q34252J2917O06434L34771
$$ -4238673 -3937499 -2341198 -626616 -78283 -798608 -1632860 -1619943 -1013509 -678738
9239f78738n27035j628440k424049j827703M21622K438972K059078q5271j216077
$$ -678738 -1205773 -2834213 -5258262 -7085965 -6664343 -4225371 -2166293 -2251564 -3467641
9230c467641k20888J138583J192380N64596N72119J041976Q95465l4855q28799
$$ -3467641 -3688529 -2549946 -1357566 -792970 -220851 821125 1716590 1681735 852936
9221H52936q23871n65347j221995k791999l189782m38039L967847N896586L856946
$$ 852936 29065 -536282 -1758277 -4550276 -7740058 -8178097 -4210250 1686336 5543282
9212E543282J107481O53344Q00179j276194m018473l859865j513194q21057j876249
$$ 5543282 6650763 7304107 8104286 6828092 2809619 -1050246 -2563440 -3384497 -5260746
9203e260746q35689K734089M033434O79075k964138k362111M85971R14028j002007
$$ -5260746 -6096435 -3362346 671088 1350163 -1613975 -3976086 -3490115 -2576087 -3578094
9194c578094j402580P71213K539871J755321m01404j970697k420456j869761m41510
$$ -3578094 -4980674 -4209461 -1669590 85731 -315673 -2286370 -4706826 -6576587 -7018097
9185g018097R14738P91926n71181r11326J197936L910045L896761N37870l019834
$$ -7018097 -6103359 -5311433 -5882614 -6793940 -5596004 -1685959 2210802 2748672 -271162
9176b71162l677978k022321o66800l8570J521787L591821L096239o78223l733209
$$ -271162 -3949140 -5971461 -6638261 -6676831 -5155044 -1563223 1533016 854793 -2878416
9167b878416k482619J322720L487356K840822Q98125j499532l671070l453231
$$ -2878416 -5361035 -4038315 -550959 2289863 3187988 1688456 -1982614 -5435845
9159e435845j54315K609602J277537j986896k365536L87200K511032K620320K374762
$$ -5435845 -5590160 -2980558 -1703021 -3689917 -6055453 -5668253 -3157221 -536901 1837861
9150A837861J939762K23013j281488m47034P56769n83906j954752P18480M269108
$$ 1837861 3777623 4000636 2719148 2272114 3028883 2444977 490225 1208705 5477813
9141E477813K013121m212266n602049q06728J984225l05963o59910L855958N129899
$$ 5477813 7490934 3278668 -2323381 -3130109 -1145884 -1451847 -2111757 1744201 6874100
9132F874100j404975o597787j938839N556016M592784j907460k759847K289353
$$ 6874100 5469125 -1128662 -3067501 2488515 7081299 5173839 2413992 4703345
9124D703345L465722j271264l475147J63285K391481j411854n611140m262494
$$ 4703345 8169067 6897803 3422656 3585941 5977422 4565568 -1045572 -5308066
9116e308066J05846K357583K312635J909229O97202j460706k015919l0788J240218
$$ -5308066 -5202220 -2844637 -532002 1377227 2074429 613723 -1402196 -1432984 -192766
9107a92766m65299k435822j496289R59046J778995R95243P17710J335575J664885
$$ -192766 -658065 -3093887 -4590176 -3631130 -1852135 -856892 -139182 1196393 2861278
9098B861278J181727m2375j939543l316578k164470J138732L018711J149353k072996
$$ 2861278 4043005 4000630 2061087 -1255491 -3419961 -2281229 737482 1886835 -186161
9089a86161k715982o08241R49981J10849j314149r81111N42428R32724l0957Q1225
$$ -186161 -2902143 -3510384 -2560403 -2449554 -3763703 -4744814 -4202386 -3269662 -3300619 -3219394
9079c219394K200993L307686P02864k855140k368248J479336K794378j09863j776492
$$ -3219394 -1018401 2289285 2992149 137009 -2231239 -751903 2042475 1932612 156120
9070A56120R84791K987677q17081o079704n338554J82221L034606J618345J218474
$$ 156120 1140911 4128588 3311507 -2768197 -8106751 -7924530 -4889924 -3271579 -2053105
9061b053105L414133L216094j483791n347178l702348P58205K844413J762230
$$ -2053105 1361028 4577122 3093331 -2253847 -5956195 -5197990 -2353577 -591347
9053e91347k6782r86960p14083R03827K534481K149253K11108q36769p50240j360562
$$ -591347 -618129 -1605089 -2319172 -1415345 1119136 3268389 3479497 2642728 1892488 531926
9043E31926k054317l05405K533567J765856k524313l965796M95827N294802M486622
$$ 531926 -1522391 -1827796 705771 2471627 -52686 -4018482 -3522655 1772147 6258769
9034F258769P8301k434562k221015j725523j095632M86207R97076j306391l315992
$$ 6258769 6337070 3902508 1681493 -44030 -1139662 -653455 343621 -962770 -4278762
9025d278762j131722L077116L732432K48843k458794j338593J703038L811575
$$ -4278762 -5410484 -2333368 1399064 1647907 -810887 -2149480 -446442 3365133
9017C365133L919701J699273k036839m118238k335798L73565m99121l620215l242242
$$ 3365133 7284834 8984107 6947268 2829030 493232 866797 367676 -3252539 -6494781
9008f494781J457467M313116J474992k750802k812589k9627P59772o93561o41973
$$ -6494781 -5037314 -724198 750794 -2000008 -4812597 -4842224 -4082452 -4776013 -5417986
8999e417986J622762K772268J483468N52490J696133K459143O44156j521056q91663
$$ -5417986 -3795224 -1022956 460512 1013002 2709135 5168278 5812434 4291378 3399715
8990C399715J133179N44904k700828m114380j319749K390489K928243Q59066n85415
$$ 3399715 4532894 5077798 2376970 -1737410 -3057159 -666670 2261573 3120639 2535224
8981B535224o84669j182042k319711k404107j129593j91622k36291J5587J052204
$$ 2535224 1850555 668513 -1651198 -4055305 -5184898 -5376520 -5612811 -5597224 -4545020
8972d545020J636484J295306J086273J000908n29916l179761l736047o73761K833528
$$ -4545020 -2908536 -1613230 -526957 473951 -55965 -3235726 -6971773 -7645534 -4812006
8963d812006L027226O09251j051797q99984k61122N58810K106455K977577J067941
$$ -4812006 -1784780 -1175529 -2227326 -3127310 -3388432 -2829622 -723167 2254410 3322351
8954C322351k217352k735771M67738L337447K406234o69074k079491r19925R73351
$$ 3322351 1104999 -1630772 -1163034 2174413 4580647 3911573 1832082 912157 1885508
8945A885508K244935K554396J382003j023655k536993j698073n58096k013524
$$ 1885508 4130443 6684839 8066842 7043187 4506194 2808121 2250025 236501
8937B36501m797175m614094n68999L179385L291339J238478k72071j223624k029100
$$ 236501 -4560674 -9174768 -9743767 -6564382 -3273043 -2034565 -2306636 -3530260 -5559360
8928e559360q82716K828159N250666K770750j888628l133412p37251O78641m00317
$$ -5559360 -6442076 -3613917 1636749 4407499 2518871 -614541 -1351792 -673151 -1073468
8919a073468r26762Q9940m9011j553955r75296J628235J251871l000736m536285
$$ -1073468 -2000230 -1910290 -1959301 -3513256 -4488552 -2860317 -1608446 -4609182 -9145467
8910i145467K15240M837977K969062j035217L18574M582442L659726k110816m797027
$$ -9145467 -8930227 -4092250 -1123188 -2158405 -1839831 2742611 6402337 4291521 -505506
8901e05506k512329j335202l070993k057913L235395N859821K083916j852808
$$ -505506 -3017835 -4353037 -7424030 -9481943 -6246548 -386727 1697189 -155619
8893a55619l95017K145946o0806l839148k871007J092967J480371j793492k645063
$$ -155619 -550636 1595310 1534504 -2304644 -5175651 -4082684 -2602313 -4395805 -7040868
8884g040868Q50371L981468L327201Q89369n01083q79878j116069r45166j12282
$$ -7040868 -6190497 -2209029 1118172 2007541 1506458 626580 -489489 -1434655 -1546937
8875a546937R07134J566558J145144q44956k696411j515939J653922J435269l627910
$$ -1546937 -639803 926755 2071899 1226943 -1469468 -2985407 -1331485 103784 -3524126
8866c524126o723125k146530M899626N225917l03072k412489J721583M848764
$$ -3524126 -10247251 -12393781 -7494155 -2268238 -2571310 -4983799 -3262216 1586548
8858A586548K362165q98914l59180M03543k767612o141259m185810R16789L065295
$$ 1586548 3948713 3049799 2690619 3094162 326550 -5814709 -10000519 -9083730 -6018435
8849f018435J920801J555977K092579L18062k681189k269102J222281K185987
$$ -6018435 -4097634 -2541657 -449078 -131016 -2812205 -5081307 -3859026 -1673039
8841a673039p00386j813736J772185M695900J785020l278194l453255J004433
$$ -1673039 -2373425 -4187161 -2414976 2280924 4065944 787750 -2665505 -1661072
8833a661072L484033J017047k413519k544992o456K114377K237888O71358j336711
$$ -1661072 1822961 2840008 426489 -2118503 -2124959 -10582 2227306 2898664 1561953
8824A561953k121775j268622p80223k243737l420224j054076L231330M220809
$$ 1561953 -559822 -1828444 -2608667 -4852404 -8272628 -9326704 -6095374 -1874565
8816a874565Q88605j963575j391580l51606j297409j311670J814204L730043J04175
$$ -1874565 -985960 -2949535 -4341115 -4692721 -5990130 -7301800 -5487596 -1757553 -1653378
8807a653378m738509l336538K923312N614512K455223j51549J070085J206850
$$ -1653378 -6391887 -9728425 -6805113 -1190601 1264622 1113073 2183158 3390008
8799C390008k467436l920244J471791P218711M442590m131809p809285l495175
$$ 3390008 922572 -2997672 -1525881 5692830 10135420 6003611 -1805674 -5300849
8791e300849J264231R41927q46617N49775K851880J670808j512855j627071J986897
$$ -5300849 -4036618 -3094691 -3941308 -3391533 -539653 1131155 -381700 -2008771 -21874
8782b1874M753399L572058M12001j416455j557560j660062k033496j408448L55104
$$ -21874 4731525 8303583 8715584 7299129 5741569 4081507 2048011 639563 994667
8773I94667J326709J55756j617164j468380M02397J198496l72078k114081j520491
$$ 994667 2321376 2477132 859968 -608412 -206015 992481 620403 -1493678 -3014169
8764c014169P21051J950250J143932l66687j114540q37462Q5384J167773J794640
$$ -3014169 -2293118 -342868 801064 434377 -680163 -1517625 -1432241 -264468 1530172
8755A530172J516958L24024j580769l573158m127440k062980J217756K637502
$$ 1530172 3047130 3371154 1790385 -1782773 -5910213 -7973193 -6755437 -4117935
8747d117935J551533P69714K041878L087036J515800p45961l93315J627485J498354
$$ -4117935 -2566402 -1796688 245190 3332226 4848026 4102065 3708750 5336235 6834589
8738F834589j200751k855758j727521m70240j538754l422641l247403q15719J619239
$$ 6834589 5633838 2778080 1050559 580319 -958435 -4381076 -7628479 -8444198 -6824959
8729f824959K156587Q27666m82012M75217L509851N207485L010169p76526k058279
$$ -6824959 -4668372 -3840706 -4322718 -3847501 -337650 4869835 7880004 7103478 5045199
8720E045199j185046j908355m266605l837490N00039L619698J995476n62542O49857
$$ 5045199 3860153 1951798 -2314807 -6152297 -5652258 -2032560 -37084 -599626 50231
8711E0231L300393K066479k204566l552607j66112L134975K135295j621014l860066
$$ 50231 3350624 5417103 3212537 -340070 -506182 2628793 4764088 3143074 -716992
8702g16992k362963J866271N361592M177588j849282p167353o246662q07245K579274
$$ -716992 -3079955 -1213684 4147908 8325496 6476214 -691139 -6937801 -7745046 -5165772
8693e165772J618349J71919Q73004J599287Q71710R67134K710132K473574j570711
$$ -5165772 -3547423 -3375504 -2502500 -903213 -31503 935631 3645763 6119337 4548626
8684D548626m702563k045828L616560N540961K247016j845026l248874k126528
$$ 4548626 -153937 -2199765 1416795 6957756 9204772 7359746 4110872 1984344
8676A984344M47926L165808L343213k73982m171879l914662o46754P46894q25695
$$ 1984344 2432270 5598078 8941291 8667309 4495430 580768 -65986 680908 -144787
8667a44787k040095j533312j194230r55899J501956M811151M117602o79393l232825
$$ -144787 -2184882 -3718194 -4912424 -5868323 -4366367 444784 4562386 3882993 650168
8658F50168l65052K734508J022453k364216j805257J760881L404228K297172J165184
$$ 650168 285116 3019624 4042077 1677861 -127396 1633485 5037713 7334885 8500069
8649H500069K44893k037702m013413k455617J370776K785234N51843k156828l266452
$$ 8500069 8744962 6707260 2693847 238230 1609006 4394240 4946083 2789255 -477197
8640d77197l480369k771040j66916K787154L086152J143523J74082O11391l3966
$$ -477197 -3957566 -6728606 -6895522 -4108368 -1022216 121307 295389 906780 872814
8631H72814j548820p38986K244281L003294K43779j518517N58604K584160J77718
$$ 872814 -676006 -1414992 829289 3832583 4076362 2557845 3116449 5700609 5878327
8622E878327m375457n571959k432202J348746L037358K928692K037896Q51928
$$ 5878327 1502870 -4069089 -6501291 -5152545 -2115187 813505 2851401 3703329
8614C703329k55578j298094k421571k459504N0128L319464L043766j240297m054096
$$ 3703329 3447751 2149657 -271914 -2731418 -2681290 638174 3681940 2441643 -1612453
8605a612453j389236K999158K806820j743154m704455k932435Q68510L194031
$$ -1612453 -3001689 -2531 2804289 1061135 -3643320 -6575755 -5707245 -2513214
8597b513214L442912K226411j16029k311959k533677j081100l14787j108452j603468
$$ -2513214 929698 3156109 3040080 728121 -1805556 -2886656 -3201443 -4309895 -5913363
8588e913363l00865J737346K777750K690084K222442J457007J87812j084131j544204
$$ -5913363 -6214228 -4476882 -1699132 990952 3213394 4670401 4858213 3774082 2229878
8579B229878r86508J76412J345444J865184J292492m3950j092205j079588m18209
$$ 2229878 1243370 1419782 2765226 4630410 5922902 5878952 4786747 3707159 3288950
8570C288950l46699j439608k588009k070020J60397K180285K644865K271213J684030
$$ 3288950 2942251 1502643 -1085366 -3155386 -2994989 -814704 1830161 4101374 5785404
8561E785404k24529l408003m229336M317N216260M607969j168247l966087k59645
$$ 5785404 5560875 2152872 -2076464 -2072147 3144113 7752082 6583835 2617748 2358103
8552B358103L184710n0523n684123n510277k76950K204800o5180q66244L019473
$$ 2358103 5542813 5492290 -191833 -5702110 -5979060 -3774260 -3839440 -4705684 -1686211
8543a686211O192154L476491j853042l331465p35089P42244j316054l851163l515073
$$ -1686211 4505943 7982434 6129392 2797927 2062838 2805082 1489028 -2362135 -5877208
8534e877208q70170J451750K373963K700744K910805K236402K43723j743192k000285
$$ -5877208 -6747378 -5295628 -2921665 -220921 2689884 4926286 5170009 3426817 1426532
8525A426532q93438m58463j266975j615283n94634L18500K28657Q37459L024883
$$ 1426532 533094 74631 -1192344 -2807627 -3402261 -3083761 -2855104 -2017645 1007238
8516A007238L863891O58266l775872m237857p79877J492904L78364o73074R19085
$$ 1007238 4871129 5529395 1753523 -2484334 -3264211 -1771307 -1392943 -2066017 -1146932
8507a146932K496146J044938j496538j383723J145208K829290K373231J054213
$$ -1146932 1349214 2394152 897614 -486109 659099 3488389 5861620 6915833
8499F915833m19911k193295k998506j116229K090065K760323k19549l114177k203214
$$ 6915833 6495922 4302627 1304121 187892 2277957 5038280 4818731 1704554 -498660
8490d98660J110398K334667J14690k213811j632767M98099J004929k77907q30758
$$ -498660 611738 2946405 3061095 847284 -785483 -287384 717545 439638 -391120
8481c91120J47949P28730J4818k31562R17382J458738O6592j036453R0184R33594
$$ -391120 -243171 485559 500377 268815 1186197 2644935 2711527 1675074 1765258 2698852
8471B698852j636082n096705l972170J584094N331417M004999J487083J742985
$$ 2698852 1062770 -4033935 -8006105 -6422011 -1090594 2914405 4401488 6144473
8463F144473K653701N06916l380029m976853l718772j832870L58068L441566M641128
$$ 6144473 8798174 9305090 5925061 948208 -2770564 -4603434 -4245366 -803800 3837328
8454C837328M34362o222794p237163k77791O607129N026664k604841o562857k558327
$$ 3837328 4271690 -1951104 -9188267 -9466058 -2858929 2167735 -437106 -6999963 -9558290
8445i558290L992041O279908L902523P75564q82367j556684j657963r23743J43858
$$ -9558290 -5566249 713659 4616182 5391746 4509379 2952695 1294732 370989 514847
8436E14847P19124J196289K273005K919642J439991j621045l818820m017958l071988
$$ 514847 1233971 2430260 4703265 7622907 9062898 7441853 3623033 -394925 -3466913
8427c466913j516933O41427J837598J85023k423812j505363K912267M725958N42179
$$ -3466913 -4983846 -4342419 -2504821 -2319798 -4743610 -6248973 -3336706 1389252 1931431
8418A931431m111583k272876L807313N728309J389421k408517o73255K820186
$$ 1931431 -2180152 -4453028 -645715 5082594 6472015 4063498 3390243 6210429
8410F210429K114499k245146m977629l562474k90723J595694R36217j182712k227293
$$ 6210429 8324928 6079782 1102153 -2460321 -2751044 -1155350 -219133 -1401845 -3629138
8401c629138j61317L864535N997929M180975N80639j825635l010234m262331m918934
$$ -3629138 -3790455 74080 6072009 10252984 10833623 9007988 5997754 1735423 -3183511
8392c183511l549552r83531Q49588K131107M038986N107420K503316k659383n166017
$$ -3183511 -6733063 -7716594 -6867006 -4735899 -696913 4410507 6913823 4254440 -911577
8383i11577k551075J180092J278581r20517n54830K752850L927994K10441m205553
$$ -911577 -3462652 -2282560 -1003979 -1924496 -2479326 273524 4201518 4411959 206406
8374B06406l858909M16498L139901K035628K30874M59194J092856k46438k290570
$$ 206406 -3652503 -3236005 -96104 1939524 2170398 2629592 3722448 3476010 1185440
8365A185440k206678k15702R32516K85692l59689K51629J069169P31546n14047
$$ 1185440 -1021238 -1236940 -304424 -18732 -378421 -126792 942377 1673923 1159876
8356A159876j483631j417020l42198R70124J395206O25188l30688n58899l92260
$$ 1159876 -323755 -1740775 -2082973 -1112849 282357 907545 576857 17958 -374302
8347c74302k28941M91532J595073J008575k265150n188957l836736Q78128L832083
$$ -374302 -603243 -111711 1483362 2491937 226787 -4962170 -8798906 -7920778 -4088695
8338d088695K325211r27068k119257q73476O77831J049535M08965n9864Q03142
$$ -4088695 -1763484 -2690552 -4809809 -5683285 -5005454 -3955919 -3546954 -3606818 -2803676
8329b803676K435202K269207q33647l662818k278954J861725L298988M05232k445765
$$ -2803676 -368474 1900733 1067086 -2595732 -4874686 -3012961 286027 691259 -1754506
8320a754506j667871R12933K035616J404001j54281k693235m508602j888734M696253
$$ -1754506 -3422377 -2509444 -473828 930173 775892 -1917343 -6425945 -8314679 -3618426
8311c618426Q248148L910604l271213m679727J68840M042237K621847j336521
$$ -3618426 4629722 8540326 5269113 589386 758226 4800463 7422310 6085789
8303F085789l987016m500628k696013J614674N489652M420225q55365l938878
$$ 6085789 2098773 -2401855 -5097868 -3483194 2006458 6426683 5571318 1632440
8295A632440j719400R71195q99000m492536l625854J504356M712685L039213K36231
$$ 1632440 -86960 884235 -14765 -4507301 -8133155 -6628799 -1916114 1123099 1359330
8286A359330K65388J829468J531869o99171k205830j889184r80481j18211J490938
$$ 1359330 1624718 3454186 4986055 4286884 2081054 191870 -788611 -906822 584116
8277E84116L461365L340813P5623l288552k858425O46890K367145j81874l582960
$$ 584116 4045481 7386294 7461917 4173365 1314940 1961830 4328975 4147101 564141
8268E64141l115821J005278M235495L532332K52079k462289k989809j702619Q885
$$ 564141 -2551680 -1546402 2689093 6221425 6473504 4011215 1021406 -681213 -672328
8259f72328O10961l40596j407684q13106J087765K189009J598054N65673L3213
$$ -672328 -61367 -401963 -1809647 -2622753 -1534988 654021 2252075 2817748 2850961
8250B850961q22503k473386l226689j419418J548593K520186P88174j005406p21693
$$ 2850961 2028458 -444928 -3671617 -5091035 -3542442 -1022256 -234082 -1239488 -1961181
8241a961181K99587n21168k854806l500545p40495L010556M016086J804728m90801
$$ -1961181 -1661594 -2182762 -5037568 -8538113 -9278608 -6268052 -2251966 -447238 -938039
8232i38039l01088J267666J219837j195110l256126j987977J926869M370981K528487
$$ -938039 -1239127 28539 1248376 53266 -3202860 -5190837 -3263968 1107013 3635500
8223C635500j287242k170409Q41556L075616O35558l732859m253745k96734L063871
$$ 3635500 2348258 177849 1019405 4095021 4730579 997720 -3256025 -3552759 -488888
8214d88888K632692Q34141N79031P87298k92401j132546l3762Q31591j063557
$$ -488888 2143804 2977945 3556976 4344274 4051873 2919327 2885565 3717156 2653599
8205B653599l228221j420336K837663L611860l40715l448181j926991P48401J0005
$$ 2653599 -574622 -1994958 842705 4454565 4113850 665669 -1261322 -512921 -502916
8196e02916k521572k156716J247549L445787K428583N72602J03013J35856o99044
$$ -502916 -3024488 -5181204 -3933655 -487868 1940715 2513317 2616330 2752186 2053142
8187B053142j545601r49697N28814J125904N11243O3946O21132J203371N01884
$$ 2053142 507541 -442156 86658 1212562 1723805 1787751 2408883 3612254 4114138
8178D114138j090060j864730j184144m46320r96187j881545r89368J753762L743291
$$ 4114138 3024078 1159348 -24796 -471116 -1467303 -3348848 -4338216 -2584454 1158837
8169A158837K728463n48230l335102l721379j950106M12376J913487K126009J586131
$$ 1158837 3887300 3339070 3968 -3717411 -5667517 -5255141 -3341654 -1215645 370486
8160C70486Q54779o4458r92263j000147K60671J245960K94134j506822j417064
$$ 370486 1225265 1160807 168544 -831603 -570932 675028 969162 -537660 -1954724
8151a954724P42736K031047R55761j59313P73003J755618j95135l774355m607863
$$ -1954724 -1211988 819059 1774820 1615507 2388510 4144128 3948993 174638 -4433225
8142d433225j279967K893294M288620K630415j23916k175911k465307q76740J166870
$$ -4433225 -5713192 -2819898 1468722 4099137 3975221 1799310 -665997 -1542737 -375867
8133c75867J681696L42654j342417k179971k244420j722387n37276O89160J067820
$$ -375867 1305829 1648483 306066 -1873905 -4118325 -5840712 -6377988 -5688828 -4621008
8124d621008J059526J822812K796066K119407j72238j832155j924487j964296
$$ -4621008 -3561482 -1738670 1057396 3176803 3004565 1172410 -752077 -2716373
8116b716373k488001j475789J906090M681659L748039K59978k168887k078973
$$ -2716373 -5204374 -6680163 -4774073 -92414 3655625 3915603 1746716 -332257
8108c32257o25381J004201K077118J521106p73662k811621k815496j491993n8786
$$ -332257 -957638 46563 2123681 3644787 2871125 59504 -2755992 -4247985 -4306771
8099d306771J944671M255760L821976q94366n500720m486132M69669K307658j159794
$$ -4306771 -2362100 1893660 5715636 4821270 -679450 -5165582 -4695913 -2388255 -3548049
8090c548049m237165j981008L030002M985653K276961j864456l636534j721697
$$ -3548049 -7785214 -9766222 -6736220 -1750567 526394 -1338062 -4974596 -6696293
8082f696293J912583L308860P11676k497804j907820J405524K580992Q31513J63653
$$ -6696293 -4783710 -1474850 -763174 -3260978 -5168798 -3763274 -1182282 -350769 -187116
8073a87116J701237J645308j225561k665111o96923L44361k286787m259074j881671
$$ -187116 1514121 3159429 1933868 -731243 -1428166 -1083805 -3370592 -7629666 -9511337
8064i511337Q73406m76754k477645j20859L328139J878239j603873M52559O506663
$$ -9511337 -8637931 -9114685 -11592330 -11713189 -8385050 -6506811 -8110684 -7658125 -1151462
8055a151462P018103k51402o329302m669819M48761K545906J907014J631872J419965
$$ -1151462 5866641 5615239 -714063 -5383882 -4935121 -2389215 -482201 1149671 2569636
8046B569636J14846o08856M99516J278252n4978j736108j907761j556808j578931
$$ 2569636 2684482 2075626 2575142 3853394 3798416 2062308 154547 -1402261 -2981192
8037b981192p98181Q62506J358355O95752J517126L477879K473061j758755l251057
$$ -2981192 -3779373 -2916867 -1558512 -862760 654366 4132245 6605306 4846551 1595494
8028A595494Q99009M589748J412836n389085p622853l426121J932311M076032
$$ 1595494 2494503 7084251 8497087 3108002 -4514851 -7940972 -6008661 -1932629
8020a932629L027199N30575j458141j089662R37873J269356q01927j240049J972203
$$ -1932629 1094570 1625145 167004 -922658 15215 1284571 482644 -757405 1214798
8011A214798M190288J126738l568980l767372m37092R70363p1511K27333J786283
$$ 1214798 5405086 6531824 2962844 -804528 -1241620 -271257 -342768 -115435 1670848
8002A670848R00914j896190j868062J558689L533549J929285J52288M03744M32642
$$ 1670848 2571762 675572 -1192490 366199 3899748 5829033 5981321 6385065 6817707
7993F817707j105289j929255j036313r53586k613522k904219l9029K985188L029843
$$ 6817707 5712418 3783163 2746850 1793264 -820258 -3724477 -3763506 -778318 2251525
7984B251525J154638j34837n38243o88511m62732l95867j619579l026288j998429
$$ 2251525 3406163 3271326 2733083 2044572 1581840 1185973 -433606 -3459894 -5458323
7975e458323Q73618J816389j19729j557189q35329n57771j927891j875126J056348
$$ -5458323 -4584705 -2768316 -2888045 -4445234 -5280563 -5838334 -7766225 -9641351 -8585003
7966h585003L164430J854337N39463K598650M913786L001154j005651j676509
$$ -8585003 -5420573 -3566236 -3026773 -428123 4485663 7486817 6481166 4804657
7958D804657Q24255J468554j219128l465228k803864j044583k03413Q8285M03472
$$ 4804657 5628912 7097466 5878338 2413110 -390754 -1435337 -1638750 -1550465 -1146993
7949a146993M24021N86993J668071K540415J436144o44143j113598l30945j246037
$$ -1146993 -722972 -135979 1532092 4072507 5508651 4864508 3750910 3419965 2173928
7940B173928m080290n188504k498329J205887K187108M67183j100892o63531J230918
$$ 2173928 -1906362 -7094866 -9593195 -8387308 -6200200 -5733017 -6833909 -7497440 -6266522
7931f266522K805920K602754P89427o64475j07996J590949K236215J294642N6368
$$ -6266522 -3460602 -857848 -68421 -732896 -840892 750057 2986272 4280914 4337282
7922D337282o61147r52288n50367M40970R5066l026726o299187n301874j63001
$$ 4337282 3676135 2723847 2173480 2614450 2709516 -317210 -6616397 -11918271 -12081272
7913a2081272L992354L957768K075850J382932J110559k73672j130173M58544
$$ -12081272 -8088918 -4131150 -2055300 -672368 438191 164519 -965654 -507110
7905e07110K355283J140355k137261l121818o54063J726127J183667q00634j265206
$$ -507110 1848173 2988528 851267 -2270551 -2924614 -1198487 -14820 -815454 -2080660
7896b080660K40295J759306J526519l95389k159020j712282O86677K042968K00854
$$ -2080660 -1840365 -81059 1445460 1050071 -1108949 -2821231 -2134554 -91586 109268
7887A09268k855835l381152j005869J165491J490790J655657K848268L283930
$$ 109268 -2746567 -6127719 -7133588 -5968097 -4477307 -2821650 26618 3310548
7879C310548J325034j445950k434466j536773m48192O722l7061o09599j209972
$$ 3310548 4635582 3189632 755166 -781607 -1229799 -1223077 -1260138 -1869737 -3079709
7870c079709m33488J720091K750932J179576n57439K91325J899069N53903k571247
$$ -3079709 -3513197 -1793106 957826 2137402 1579963 1871288 3770357 4324260 1753013
7861A753013k241635K436587N363052J793532m562787o521055k961903Q31390
$$ 1753013 -488622 1947965 7311017 9104549 4541762 -1979293 -4941196 -4109806
7853d109806J209563R6128M08223J451598R31995q72849j567637l52567J073089
$$ -4109806 -2900243 -2804115 -2395892 -944294 -12299 -885148 -2452785 -2805352 -1732263
7844a732263J382048J366691J913416J826492m70984l626956m033034n30444L452371
$$ -1732263 -350215 1016476 2929892 4756384 4285400 658444 -3374590 -3905034 -452663
7835d52663L966625J378026p91964q58925l07158m03158l19288N74059J027163
$$ -452663 3513962 4891988 4100024 3241099 2933941 2530783 2211495 2785554 3812717
7826C812717P691j352523j553542j029402r20670p98450L17611J495419Q35388
$$ 3812717 3820408 2467885 914343 -115059 -1035729 -1834179 -1516568 -21149 814239
7817H14239j193209j719782M87167K906339K568085J15808j286934m95855L76171
$$ 814239 -378970 -2098752 -1611585 1294754 3862839 3978647 2691713 2195858 2572029
7808B572029l49933j249800m28053Q98155Q4085k379555l141260j192572M89209
$$ 2572029 2222096 972296 544243 1442398 1526483 -853072 -3994332 -5186904 -4697695
7799d697695j83211j158827j38432J325328P75351o53356m75838M99933J11165
$$ -4697695 -4880906 -6039733 -6178165 -4852837 -4077486 -4730842 -5206680 -4706747 -4595582
7790d595582l43714J621187L739812J426944l781182m859614P184L922352J611146
$$ -4595582 -4939296 -3318109 421703 1848647 -1932535 -6792149 -6784965 -2862613 -1251467
7781a251467k733705k471012J483443L201665J104900r05067k07084J512758J651757
$$ -1251467 -3985172 -6456184 -4972741 -1771076 -666176 -1571243 -1778327 -265569 1386188
7772A386188k94566k795042l263552j95919M033871M759240J205785j994347j677682
$$ 1386188 1091622 -1703420 -4966972 -5162891 -1129020 3630220 4836005 2841658 1163976
7763A163976m88008j082922p74976K879940N470432J672772m950375n858511k35883
$$ 1163976 675968 -406954 -1181930 1698010 7168442 8841214 3890839 -1967672 -2203555
7754b203555L937394J930313j994011k595474q01810m273m91469p91693p03888
$$ -2203555 1733839 3664152 1670141 -925333 -1727143 -1731416 -2222885 -3014578 -3718466
7745c718466k50115J307131L316853L466401J293959q04119j340477j597442k577721
$$ -3718466 -3968581 -2661450 655403 4121804 5415763 4611644 3271167 1673725 -903996
7736i03996l102968k172725m48347J515276L693381M703045K741469r29727k801176
$$ -903996 -4006964 -6179689 -6628036 -5112760 -1419379 3283666 6025135 5095408 2294232
7727B294232k063347j250267j436481p52106J485205L256694L542491L514197
$$ 2294232 230885 -1019382 -2455863 -3207969 -1722764 1533930 5076421 8590618
7719H590618L072653N53250l015363m058311k242718j213557k026024j310389
$$ 8590618 11663271 12216521 9201158 5142847 2900129 1686572 -339452 -1649841
7711a649841J888234L336116Q02894j680447o21486J235302L91569j287423q38431
$$ -1649841 238393 3574509 4377403 2696956 2075470 3310772 3702341 2414918 1576487
7702A576487Q0549r62967j878378k32946J200879q77919l552256k046655K021966
$$ 1576487 1657036 694069 -1184309 -1417255 -216376 -1094295 -4646551 -6693206 -4671240
7693d671240L330112J451554J53422J17913p38069j298285J051380L649226J168359
$$ -4671240 -1341128 110426 263848 381761 -356308 -1654593 -603213 3046013 4214372
7684D214372m836850o641683j896308K752397J864050j485106j791711Q30083
$$ 4214372 -622478 -7264161 -9160469 -6408072 -4544022 -6029128 -7820839 -6990756
7676f990756K423259J280467j017241k260794j308438R19448J600300l69400j532367
$$ -6990756 -4567497 -3287030 -4304271 -6565065 -7873503 -6954055 -5353755 -5723155 -7255522
7667g255522J535276N682103M649793j052770m272134k264600l58132j904293
$$ -7255522 -5720246 -38143 4611650 3558880 -713254 -2977854 -3335986 -5240279
7659e240279k173713K758355P609320N213565k102207n682783k679942J708648
$$ -5240279 -7413992 -4655637 2953683 8167248 6065041 382258 -2297684 -589036
7651e89036K948496J830134M64451q20434j617870q16346R05235J118125q82797
$$ -589036 2359460 4189594 4654045 3833611 2215741 1399395 2304630 3422755 2539958
7642B539958l092627l669421k560939l31460K233262L474310K280189R9352p62530
$$ 2539958 -552669 -4222090 -6783029 -7114489 -4881227 -1406917 873272 972624 210094
7633B10094m94631q96460j699020r65051R36452J332681j47716n49599J462087
$$ 210094 -284537 -1180997 -2880017 -3845068 -2908616 -1575935 -1723651 -2273250 -811163
7624h11163K942597J053903k532135m080031k733126n38995J033657K012400K168774
$$ -811163 2131434 3185337 653202 -3426829 -6159955 -6698950 -5665293 -3652893 -1484119
7615a484119R43522q56157j353800p5779J282738J075852l16726j261906r28404
$$ -1484119 -540597 -1396754 -2750554 -2826333 -1543595 -467743 -784469 -2046375 -2974779
7606b974779N7779P84852J263719J998685K465810J014956k740450o064985n381425
$$ -2974779 -2917000 -2132148 -868429 1130256 3596066 4611022 1870572 -4194413 -9575838
7597i575838p72566L394453L278194k01450k969537k525047K19058K867755L689315
$$ -9575838 -10348404 -6953951 -3675757 -3877207 -6846744 -9371791 -9152733 -6284978 -2595663
7588b595663K315499o5914j283427k99973J286257J153021m46218q99190R64712
$$ -2595663 -280164 -346078 -1629505 -1929478 -643221 509800 63582 -835608 129104
7579A29104K985299K526223J0043j653560o68959J665000K555375P26938k255902
$$ 129104 3114403 5640626 5650669 3997109 3328150 4993150 7548525 8275463 6019561
7570F019561l572024k140998J40349N93658j023565k314378j357720Q90793J879877
$$ 6019561 2447537 306539 446888 1040546 16981 -2297397 -3655117 -2764324 -884447
7561h84447O18890j142255r63706J319842L062711J704832j905400m051612k422334
$$ -884447 -265557 -1407812 -2371518 -1051676 2011035 3715867 1810467 -2241145 -4663479
7552d663479J255461L622286L446705J754526l59691k074047k132411k87927J211145
$$ -4663479 -3408018 214268 3660973 5415499 5055808 2981761 849350 561423 1772568
7543A772568K09794j787641j572836O43954J593201M74210K0733J197424J245481
$$ 1772568 1982362 194721 -1378115 -734161 859040 1333250 1353983 2551407 3796888
7534C796888j123654k849573j522310O01351P73521L48048J426132K162931r1974
$$ 3796888 2673234 -176339 -1698649 -1097298 -323777 24271 1450403 3613334 3521360
7525C521360l379590l532663m26973K404961K994696J830162p12314l571496l572558
$$ 3521360 141770 -3390893 -3817866 -1412905 1581791 3411953 2699639 -871857 -4444415
7516d444415L58415L427435R51226l627023l251211J366259K682613j031173k623551
$$ -4444415 -4086000 -658565 292661 -3334362 -6585573 -5219314 -2536701 -3567874 -6191425
7507f191425J748437N665810K626023l448687m166349J222169N934420N352137
$$ -6191425 -4442988 1222822 3848845 400158 -3766191 -2544022 3390398 8742535
7499H742535J129878k897223m326741k647998K59539R72315j297082k842372o08502
$$ 8742535 9872413 6975190 2648449 451 259990 1232305 -64777 -2907149 -3515651
7490c515651K744507K413677j459309m138791k963225K7692J961445K263772J542275
$$ -3515651 -771144 1642533 183224 -3955567 -6918792 -6891100 -4929655 -2665883 -1123608
7481a123608J93015r73666o71645J274266L208785L103855N48790k587957l611026
$$ -1123608 -930593 -1904259 -2575904 -1301638 1907147 5011002 5559792 2971835 -639191
7472f39191j868294J18752k83923k105637k224002j56402J545155J755524K019055
$$ -639191 -2507485 -2388733 -2672656 -4778293 -7002295 -7158697 -5613542 -3858018 -1838963
7463a838963K604522J422144j486939k591851n19178R42450j268955m213563l418203
$$ -1838963 765559 2187703 700764 -1891087 -2410265 -1467815 -2736770 -6950333 -10368536
7454a0368536L93027L168097L627204L197823J929111r38674l603384l316892
$$ -10368536 -9975509 -6807412 -3180208 17615 1946726 1008052 -2595332 -5912224
7446e912224q07561O69595K40445P540J156480K480163K472967O07910k574116
$$ -5912224 -6719785 -6050190 -5809745 -5802205 -4645725 -2165562 307405 915315 -1658801
7437a658801m690849k694369K733905O266114M394108L02167j161092m72529r78695
$$ -1658801 -6349650 -9044019 -6310114 -44000 4350108 4652275 3491183 3018654 2039959
7428B039959k246811j407785P42584R06008n33415l74413J068555N93245j245060
$$ 2039959 -206852 -1614637 -872053 33955 -499460 -873873 194682 787927 -457133
7419d57133n73827K347238K785312j76246j675573N86213K538570J105159q24310
$$ -457133 -1030960 1316278 4101590 3925344 2249771 2835984 5374554 6479713 5655403
7410E655403m23880j47922k376342l900170j150911K937718L063228j04108j460228
$$ 5655403 5231523 5083601 2707259 -1192911 -2343822 593896 3657124 3553016 2092788
7401B092788K46704J294419l14851k219743k339319j756972j694351j125005Q32767
$$ 2092788 2339492 3633911 3319060 1099317 -1240002 -2996974 -4691325 -5816330 -4983563
7392d983563K677761K591034J140974J91352R1695l68403j507856j822534r4194
$$ -4983563 -2305802 285232 1426206 1617558 1709253 1340850 -167006 -1989540 -2083734
7383b083734K488018L408253J898051j86160q97249m18696N8759M09120R88899
$$ -2083734 404284 3812537 5710588 5524428 4627179 4208483 4267242 4676362 5665261
7374E665261R15895r29646l342372l486733q26619J544260Q25021j498133j430564
$$ 5665261 6581156 5651510 2309138 -1177595 -2004214 -459954 365067 -1133066 -2563630
7365b563630J894585M283919J629227l945210n721731j087578M246760L546193
$$ -2563630 -669045 3614874 5244101 1298891 -4422840 -5510418 -1263658 2282535
7357B282535j687384m257831j976927J34580r11860j418202J323927L250595O29403
$$ 2282535 595151 -3662680 -5639607 -5505027 -6416887 -7835089 -6511162 -3260567 -2631164
7348b631164k565713j050680K344471J476711j953808r94246M081875N453126
$$ -2631164 -5196877 -6247557 -3903086 -2426375 -4380183 -5374429 -1292554 4160572
7340D160572P89227k806958q29542J374036j703312o027596m511771J722989N390940
$$ 4160572 4949799 2142841 1313299 2687335 984023 -5043573 -9555344 -7832355 -2441415
7331b441415L567187k8887j835914j929681r98263J202908L469498L040362m58222
$$ -2441415 1125772 1096885 -739029 -2668710 -3666973 -2464065 1005433 4045795 3587573
7322C587573l450612k703294K59584J195458p65341j685875J106983M029626K040379
$$ 3587573 136961 -2566333 -2306749 -1111291 -1876632 -3562507 -2455524 1574102 3614481
7313C614481k720360k742987L100020O133115M46600p107462o319814J328266
$$ 3614481 894121 -1848866 1251154 7384269 7830869 723407 -5596407 -4268141
7305d268141N433086K072249k640194l681933k484677m42678L543547O900226
$$ -4268141 1164945 3237194 597000 -3084933 -5569610 -6012288 -2468741 4431485
7297D431485L963070l847878p130216k046363L631721L053312L18542J425448
$$ 4431485 8394555 4546677 -2583539 -4629902 -998181 2055131 2373673 3799121
7289C799121L332197N73988l657783k618787K198235L832134J420119j17120J82039
$$ 3799121 7131318 7705306 4047523 1428736 3626971 7459105 8879224 8762104 8944143
7280H944143j029998l196366k263766Q62149R06046k139742k435012J218102K733482
$$ 8944143 7914145 4717779 2454013 3316162 4222208 2082466 -352546 865556 3599038
7271C599038o79019l248528j86237M226856L392825j751278n171047m562415k429564
$$ 3599038 2920019 -328509 -514746 3712110 7104935 5353657 182610 -4379805 -6809369
7262f809369o65376Q64329J533841L78813r48154M03798L725706M799559J693940
$$ -6809369 -7474745 -6610416 -5076575 -4697762 -5645916 -5242118 -1516412 3283147 4977087
7253D977087k280427k959207n63464J482891J580609J158091J091850j07784l154102
$$ 4977087 2696660 -262547 -826011 656880 2237489 3395580 4487430 4379646 1225544
7244A225544n360175l721582N00206L108457K587894J461422J682219J789061
$$ 1225544 -4134631 -7856213 -7356007 -4247550 -1659656 -198234 1483985 3273046
7236C273046O9863k019884j737927J081359L834076M029636J379979k062909l339027
$$ 3273046 3342909 1323025 -414902 666457 4500533 8530169 9910148 7847239 4508212
$$ [...]
##END NTUPLES=NMR SPECTRUM
##END=
