##TITLE=31Pdec_SR146(r2)rm
 , 24 sc
 22.2.2023
##JCAMPDX= 6.0         $$ Bruker NMR JCAMP-DX V2.0
##DATA TYPE= NMR SPECTRUM
##DATA CLASS= NTUPLES
##ORIGIN= UXNMR, Bruker Analytische Messtechnik GmbH
##OWNER= root
$$ XWIN-NMR		Version 3.5
$$ Wed Feb 22 16:09:06 2023 Russian Standard Time (UT+4h)  she@DPX200
##.OBSERVE FREQUENCY= 81.013821
##.OBSERVE NUCLEUS= ^31P
##.ACQUISITION MODE= SIMULTANEOUS
##.ACQUISITION SCHEME= undefined
##.AVERAGES= 24
##.DIGITISER RES= 16
##SPECTROMETER/DATA SYSTEM= spect
##.PULSE SEQUENCE= zgpg30
##.SOLVENT NAME= CD3CN
##.SHIFT REFERENCE= (INTERNAL, CD3CN, 0, 248.564)
##AUDIT TRAIL= $$ (NUMBER, WHEN, WHO, WHERE, WHAT)
$$ ##TITLE= Audit trail, XWIN-NMR		Version 3.5
$$ ##JCAMPDX= 5.01
$$ ##ORIGIN= Bruker BioSpin GmbH
$$ ##OWNER= she
$$ F:/spectra/data/she/nmr/P31/1/pdata/1/auditp.txt
$$ ##AUDIT TRAIL=  $$ (NUMBER, WHEN, WHO, WHERE, WHAT)
(   1,<2023-02-22 16:08:18.28 +0400>,<she>,<DPX200>,
      <created by zg, POWCHK disabled, PULCHK disabled
       configuration hash MD5:
       00 E9 B6 7A A2 85 ED C7 34 08 36 98 17 FE 4E 26
       data hash MD5: 32K
       93 47 1A 79 B7 D4 EC 02 C0 1D 27 ED C2 C5 E0 03>)
(   2,<2023-02-22 16:08:25.92 +0400>,<she>,<DPX200>,
      <Start of raw data processing
       efp BC_mod = 2 LB = 1 FT_mod = 6 PKNL = 1 PHC0 = -11022.66 PHC1 = 182.4102 SI = 64K 
       data hash MD5: 64K
       DD A1 89 BF D9 71 2C 72 6B 4C 5C 32 34 24 53 B4>)
(   3,<2023-02-22 16:08:37.67 +0400>,<she>,<DPX200>,
      <abs ABSG = 5 
       data hash MD5: 64K
       03 90 28 A2 34 9B B4 F0 72 35 5D 00 40 4D 5F 95>)
$$ ##END=
$$ 
$$ hash MD5
$$ 4B 34 0E 03 D4 F6 FC BE DE 98 29 91 E9 40 CE 46
##$RELAX= 
##$RELAX= 
##$RELAX= 
##$RELAX= 
##$RELAX= 
##$RELAX= 
##$RELAX= 
##$RELAX= 
##$RELAX= 
$$ Bruker specific parameters
$$ --------------------------
##$DU= <F:/spectra>
##$EXPNO= 1
##$NAME= <P31>
##$PROCNO= 1
##$TYPE= <nmr>
##$USER= <she>
##$AMP= (0..31)
100 100 100 100 100 100 100 100 100 100 100 100 100 100 100 100 100 100 
100 100 100 100 100 100 100 100 100 100 100 100 100 100 
##$AQSEQ= 0
##$AQ_mod= 1
##$AUNM= <au_zg>
##$AUTOPOS= <>
##$BF1= 81.014009
##$BF2= 200.13
##$BF3= 200.13
##$BF4= 200.13
##$BF5= 200.13
##$BF6= 200.13
##$BF7= 200.13
##$BF8= 200.13
##$BYTORDA= 1
##$CFDGTYP= 0
##$CFRGTYP= 5
##$CHEMSTR= <none>
##$CNST= (0..31)
1 1 145 1 1 1 1 1 1 1 1 1 1 1 1 1 1 1 1 1 1 1 1 1 1 1 1 1 1 1 1 1 
##$CPDPRG= <waltz16>
##$CPDPRG1= <>
##$CPDPRG2= <waltz16>
##$CPDPRG3= <>
##$CPDPRG4= <mlev>
##$CPDPRG5= <mlev>
##$CPDPRG6= <mlev>
##$CPDPRG7= <mlev>
##$CPDPRG8= <mlev>
##$CPDPRGB= <>
##$CPDPRGT= <>
##$D= (0..31)
0 1 0 0 0 0 0 0 0 0 0 0.03 2e-05 3e-06 0 0 0 0 0 0 0 0 0 0 0 0 0 0 0 0 
0 0 
##$DATE= 1677067697
##$DBL= (0..7)
120 120 120 11 120 120 24 19 
##$DBP= (0..7)
150 150 150 150 150 150 150 150 
##$DBP07= 0
##$DBPNAM0= <>
##$DBPNAM1= <>
##$DBPNAM2= <>
##$DBPNAM3= <>
##$DBPNAM4= <>
##$DBPNAM5= <>
##$DBPNAM6= <>
##$DBPNAM7= <>
##$DBPOAL= (0..7)
0.5 0.5 0.5 0.5 0.5 0.5 0.5 0.5 
##$DBPOFFS= (0..7)
0 0 0 0 0 0 0 0 
##$DE= 6
$$ [...]
##$SUBNAM3= <"">
##$SUBNAM4= <"">
##$SUBNAM5= <"">
##$SUBNAM6= <"">
##$SUBNAM7= <"">
##$SUBNAM8= <"">
##$SUBNAM9= <"">
##$SW= 501.771253377433
##$SWIBOX= (0..15)
0 1 3 0 0 0 0 0 0 0 0 0 0 0 0 0 
##$SW_h= 40650.406504065
##$TD= 32768
##$TD0= 1
##$TE= 0
##$TE2= 300
##$TE3= 300
##$TEG= 300
##$TL= (0..7)
0 120 53 12 22 120 120 120 
##$TP= (0..7)
150 150 150 150 150 150 150 150 
##$TP07= 0
##$TPNAME0= <>
##$TPNAME1= <>
##$TPNAME2= <>
##$TPNAME3= <>
##$TPNAME4= <>
##$TPNAME5= <>
##$TPNAME6= <>
##$TPNAME7= <>
##$TPOAL= (0..7)
0.5 0.5 0.5 0.5 0.5 0.5 0.5 0.5 
##$TPOFFS= (0..7)
0 0 0 0 0 0 0 0 
##$TUNHIN= 0
##$TUNHOUT= 0
##$TUNXOUT= 0
##$USERA1= <user>
##$USERA2= <user>
##$USERA3= <user>
##$USERA4= <user>
##$USERA5= <user>
##$V9= 5
##$VALIST= <valist>
##$VCLIST= <CCCCCCCCCCCCCCC>
##$VD= 0
##$VDLIST= <DDDDDDDDDDDDDDD>
##$VPLIST= <PPPPPPPPPPPPPPP>
##$VTLIST= <TTTTTTTTTTTTTTT>
##$WBST= 1024
##$WBSW= 4
##$XGAIN= (0..3)
0 0 0 0 
##$XL= 0
##$YL= 0
##$YMAX_a= 8954
##$YMIN_a= -13894
##$ZGOPTNS= <>
##$ZL1= 120
##$ZL2= 120
##$ZL3= 120
##$ZL4= 120
##$ABSF1= 248.5645
##$ABSF2= -253.2056
##$ABSG= 5
##$ABSL= 3
##$ALPHA= 0
##$AQORDER= 0
##$ASSFAC= 0
##$ASSFACI= 0
##$ASSFACX= 0
##$ASSWID= 0
##$AUNMP= <proc_1d>
##$AZFE= 0.1
##$AZFW= 0.5
##$BCFW= 0
##$BC_mod= 2
##$BYTORDP= 0
##$COROFFS= 0
##$CY= -3
##$DATMOD= 1
##$DC= 0
##$DFILT= <>
##$DTYPP= 0
##$F1P= 0
##$F2P= 0
##$FCOR= 1
##$FTSIZE= 65536
##$FT_mod= 6
##$GAMMA= 0
##$GB= 0
##$INTBC= 1
##$INTSCL= 6.047779e-11
##$ISEN= 30
##$LB= 1
##$LEV0= 0
##$LPBIN= 0
##$MAXI= 10000
##$MC2= 0
##$MEAN= 0
##$ME_mod= 0
##$MI= 50
##$NCOEF= 0
##$NC_proc= -7
##$NLEV= 6
##$NOISF1= 182.463
##$NOISF2= 159.3651
##$NSP= 0
##$NTH_PI= 0
##$NZP= 0
##$OFFSET= 248.5645
##$PC= 4
##$PHC0= -11022.66
##$PHC1= 182.4102
##$PH_mod= 1
##$PKNL= yes
##$PPARMOD= 0
##$PSCAL= 0
##$PSIGN= 0
##$REVERSE= no
##$SF= 81.0140089999694
##$SI= 65536
##$SIGF1= 159.3651
##$SIGF2= -187.1042
##$SINO= 113.3802
##$SIOLD= 16384
##$SREGLST= <1H.CDCl3>
##$SSB= 0
##$STSI= 65536
##$STSR= 0
##$SW_p= 40650.406504065
##$SYMM= 0
##$S_DEV= 0
##$TDeff= 32768
##$TDoff= 0
##$TI= <>
##$TILT= no
##$TM1= 0
##$TM2= 0
##$TOPLEV= 0
##$USERP1= <user>
##$USERP2= <user>
##$USERP3= <user>
##$USERP4= <user>
##$USERP5= <user>
##$WDW= 1
##$XDIM= 65536
##$YMAX_p= 426970238
##$YMIN_p= -78598624
$$ End of Bruker specific parameters
$$ ---------------------------------
##NTUPLES= NMR SPECTRUM
##VAR_NAME=  FREQUENCY,     SPECTRUM/REAL,   SPECTRUM/IMAG
##SYMBOL=    X,             R,               I
##VAR_TYPE=  INDEPENDENT,   DEPENDENT,       DEPENDENT
##VAR_FORM=  AFFN,          ASDF,            ASDF
##VAR_DIM=   65536,         65536,           65536
##UNITS=     HZ,            ARBITRARY UNITS, ARBITRARY UNITS
##FACTOR=    0.620285442955139, 1,           1
##FIRST=     20137.2065510682, 0,            0
##LAST=      -20513.1999529968, 0,           0
##MIN=       -20513.1999529968, -78598624,   0
##MAX=       20137.2065510682, 426970238,    0
$$ Real data points
##PAGE= N=1
##DATA TABLE= (X++(R..R)), XYDATA
$$ [...]
41344 614616 1825509 1304415 -45701 -1247237 -2254812 -2714751 -1549025 1109007 2907351
41335 2907351 1777127 -1126991 -2508773 -897177 1863708 3375645 3482498 3390191 3237625
41326 3237625 2223669 713520 329444 1573897 2970534 3285850 3111028 3188131 2637846
41317 2637846 501992 -1974059 -2592678 -1361168 -537277 -1528246 -3364944 -4349333 -3709884
41308 -3709884 -1539294 1328481 3160788 2642659 752019 -94818 947295 2492574
41300 2492574 3449514 4319291 5436065 5894430 5204248 4295960 3859786 3356241 2727074
41291 2727074 3251616 5316061 7091561 7080311 6359832 6490756 6818126 6049599 5088710
41282 5088710 5664418 7071006 7076648 5647273 4917359 5385457 4972465 2592422 212134
41273 212134 167114 2244839 4631203 6290220 7185449 7315473 6858076 6606400 7144657
41264 7144657 7900609 7771506 6475467 4785358 3612538 3184583 3019219 2619926 2231441
41255 2231441 2563100 3476102 3588940 1975909 -271154 -1255898 -724006 -93591 -245726
41246 -245726 -677962 -901087 -1156668 -1333637 -624974 989833 2152814 1978910 1528797
41237 1528797 2300668 3877076 4312664 2755305 641931 -26348 1010280 2156179 1946364
41228 1946364 618024 -542284 -941695 -1003452 -915021 -269718 630663 500771 -837645
41219 -837645 -1360205 506637 3050817 3188122 820525 -985489 -274840 1629347 2718806
41210 2718806 2751302 2206211 1069694 53238 915815 3696455 5407837 3759248 809273
41201 809273 293831 2171383 2762425 268336 -2733019 -3037552 -597779 2648405 5632557
41192 5632557 8092217 9099159 7761188 4992814 2940244 2584870 3002352 2965154 2268585
41183 2268585 1408104 879800 1016210 1770751 2460673 2378639 1788746 1579299 1789637 1440636
41173 1440636 242128 -568791 107428 1599743 2504430 2579315 2353235 1604660 14905
41164 14905 -1062085 203018 2796409 3246688 570918 -1520578 484221 4620668 5967956
41155 5967956 3532611 1306327 2256208 4501072 4790385 3159275 2029175 2364595 3057126
41146 3057126 3356567 3758284 4529194 5008289 4661767 3796879 3109734 3267277 4664002
41137 4664002 6620373 7201240 5241453 2514567 2248605 4986883 7490122 6725123 3574606
41128 3574606 1153710 529011 157280 -746685 -671778 1480892 3960110 4038612 1501284
41119 1501284 -1220903 -2064808 -1199964 -3354 629611 799366 1295897 2799993 4673017
41110 4673017 4969732 2866734 629199 1309963 4474616 6436497 5376167 3826141
41102 3826141 4654693 6817869 7264163 5380843 3051418 1517434 913476 2069440 5665108
41093 5665108 9709856 10926519 9122684 7421293 7497202 7473188 5710558 3789911 3734673
41084 3734673 4579588 4139292 2630064 2024998 2717058 3189367 2631900 1839902 1525568
41075 1525568 1360793 817645 -217970 -1605157 -2703928 -2254774 347833 3821266 6087814
41066 6087814 6466396 5857374 5071622 4143455 3206831 2858285 3354128 4179169 4618092
41057 4618092 4359262 3666457 3337091 4136407 5823350 7205174 7591926 7514899 7521656 7266711
41047 7266711 6571283 6176238 6261603 5499938 3284428 1768250 3418837 7138924 9303485
41038 9303485 8575956 7172468 7001751 7201164 6584135 6175757 7528002 10007093 11553339
41029 11553339 11327632 10200556 9247293 8979606 9596980 10919934 12295192 13203852 13610848
41020 13610848 13418974 12414242 11198211 11035715 11961783 12200684 10623609 8750233 8851156
41011 8851156 10832196 12632311 13191655 13182854 12923385 11580972 9059711 7032106 7009157
41002 7009157 8354164 9256315 9115779 9030706 10157554 12329462 14295041 14878322 13885808
40993 13885808 12139386 10664361 9826826 9383177 9255483 9798980 11144269 12688668 13549065
40984 13549065 13295777 12098057 10564633 9730164 10634203 13164942 15543560 15865082 14336200
40975 14336200 13151018 13694546 14688726 14005900 11762470 10283648 10942576 12441533 12954846
40966 12954846 12851565 14028114 17025789 20133111 21435591 20787618 19563976 19238034
40958 19238034 20386358 22372153 23786339 23795486 23119438 22998557 23306189 22774783 21194385
40949 21194385 19978490 19969359 20103711 19272173 18211108 18140432 18575167 18242095 17466200
40940 17466200 17622841 18477839 18288474 16883795 16444354 18212147 20269219 20080087 17938627
40931 17938627 16174958 15713506 15240840 13653591 11687661 10645355 10580778 10438348 9548647
40922 9548647 8455714 8233649 9128527 10145190 10331111 10213807 11088160 12810058 13526479
40913 13526479 12183429 10031017 8648058 7793931 6744239 6513436 8469208 11350096
40905 11350096 12302644 11001214 10067116 10715544 10739784 8304082 5268401 4504644 5689393
40896 5689393 6323082 5782487 5650873 6543561 7302926 7449902 8009215 9387462 10504197
40887 10504197 10714385 10787229 11267761 11627545 11889977 13332032 16410407 19567315 21425421
40878 21425421 22659684 24081359 24391774 22221681 19545542 20163477 24452173 28273238
40870 28273238 28378191 26815687 27921810 32165934 35615250 35562266 34072347 34519060 36477722
40861 36477722 36507733 33390180 29837097 28359602 27927491 26322793 23815726 22179154
40853 22179154 21349471 19814202 17734411 16740812 16580472 15053073 12017525 10342835
40845 10342835 11342341 12155696 9986379 6598390 5743445 7752709 9763228 10308648 10492560
40836 10492560 10954106 10776032 9682567 8622645 7702324 6041173 4261569 4581229 7482832
40827 7482832 10627077 12184399 12926620 13628558 12868760 9679107 6559076 7085138 11240234
40818 11240234 15436934 16837067 15693547 13774337 12579746 13149346 15554412 18032933
40810 18032933 18285681 16326988 14721800 15337077 17140746 18065961 17897780 18142680 19739989
40801 19739989 22076248 23959587 24610413 23877929 22368515 21304079 21419387 21924279 21323756
40792 21323756 19432798 17820733 17947571 19599948 21645433 23525751 25077377 25432810
40784 25432810 23536509 20055671 17605544 18187038 20876499 22823225 22331436 20285327
40776 20285327 18575664 17809797 16934869 14845221 11927594 9778791 9442369 10291742 10966065
40767 10966065 11066927 11275378 11957745 12601331 12821655 12925610 12995980 12427967 11158454
40758 11158454 10416947 11127017 12216817 11830211 9954288 8632187 9566800 12411801 15306252
40749 15306252 16273784 14441411 10927724 8243834 7736209 8028423 7263389 6267468 7522844
40740 7522844 11145779 14194791 14525942 13180677 12005556 10965253 9252460 7375638
40732 7375638 6424450 6411206 6866126 8013149 9851974 11167740 11176762 11250011 13156096
40723 13156096 16280791 18453859 18938720 18623244 17778101 15967632 14095813 14059851 15866942
40714 15866942 17312635 17290632 17349478 18920652 20940502 21659403 21282172 21256055 22111817
40705 22111817 23525409 25505081 27939133 29778758 30250152 30204328 30713124 31065011 29986896
40696 29986896 28227620 27664786 28011394 26927146 23865342 21267945 20793248 20683271 18673746
40687 18673746 15660276 14197011 14559395 14753847 13845380 12849399 12429818 12022353 11492833
40678 11492833 11489390 11651899 10601030 8470509 7327160 7944701 8208794 6298601 3651571
40669 3651571 2830659 3904435 5133478 6107224 7670135 9290590 9151687 7098283 5343542
40660 5343542 5677780 7487942 8851294 8262977 5301774 1154539 -1480141 -667053 2430061
40651 2430061 4969701 5964527 6493369 6750466 5647956 3726249 3401245 5064785 5737905
40642 5737905 3402945 211598 -800135 -40378 152003 -396815 -81003 985390 848210
40633 848210 -1019835 -2726316 -2462824 -327126 2336653 4025655 3793944 2199467 1070879
40624 1070879 1169223 1062679 -224181 -914305 851430 3323880 3227032 989159 491691
40615 491691 3307909 6491829 7092923 5917154 5297574 5618272 5955356 6359480 7503073
40606 7503073 9075510 10091008 10229284 10019608 10369857 12279410 15994015 20316814 24118701
40597 24118701 28268380 33719841 37666506 35152478 26110404 17385197 14874710 16267238
40589 16267238 15102959 10047624 5742280 5158031 5842725 4723844 2564822 1518610
40581 1518610 1256160 281286 -718141 280576 3107421 5235614 5248253 4451765 4428288
40572 4428288 4588163 3378430 1140584 277590 2240507 5292453 6233914 4227109 1849078
40563 1849078 1721515 2940885 2273293 -1124660 -3923713 -2755906 1015831 2681823
40555 2681823 293154 -2795108 -2546498 467037 2466905 2035081 1457000 2445696 3526647
40546 3526647 3005492 2015422 2442120 3644599 3839247 3489888 4342484 5685858 4827611
40537 4827611 1557268 -943209 -485617 1632174 3615966 5718402 7969186 8141707
40529 8141707 4823115 753276 24450 2743192 5213205 4998706 3138607 1377078
40521 1377078 -48969 -1140927 -1050848 303710 1057413 -546573 -3523360 -4889751 -3070654
40512 -3070654 224301 1844288 606487 -1620688 -2407964 -1683260 -1202874 -1479837 -1016839
40503 -1016839 780084 1796641 -31486 -3356957 -4826730 -3307169 -755108 915592
40495 915592 1807875 2594305 2974492 2426929 1281679 249069 -328378 -262320 672364
40486 672364 2255825 3745717 4590005 4785297 4567922 4313783 4468276 4757882 3897267
40477 3897267 1332761 -1004494 -352796 3226745 6449498 6627476 4462391 2342394
40469 2342394 1322438 878630 462212 -86506 -1003356 -2220732 -2884244 -2300835 -1147065
40460 -1147065 -819843 -1682420 -2705829 -2814105 -1975234 -964697 -525422 -749038 -927916
40451 -927916 -116025 1767087 3456855 3462856 1896425 848175 2395537 6054945 8725385
40442 8725385 7822324 4231797 1219561 478888 703092 519706 882810 2928447 5046673
40433 5046673 4642998 2181635 763353 1615564 2673519 2209398 1195876 903765 649952
40424 649952 -325103 -828662 310264 1830949 1918384 1350299 2304609 4622575 5732402
40415 5732402 4336597 2055686 999046 1412197 2290425 2911218 2988650 2244310 644619
40406 644619 -1211518 -2320833 -1964680 -425701 970974 1195328 1006667 1999842 3811801
40397 3811801 3958680 1501975 -994403 -1000268 228077 -4286 -1150078 -444562 2085546
40388 2085546 3551233 3397128 4450597 7338828 8029507 3845614 -1329415 -1694450 2601815
40379 2601815 6268224 6518958 5699289 6196531 6900107 6192002 5146795 5450843 6299120
40370 6299120 5842467 4475144 4249764 5449453 5907743 4071323 1257169 239197 2309047
40361 2309047 6076692 8773555 8736959 6998626 6192305 7429479 8800430 7897334 5293319
40352 5293319 3948666 5090153 6500934 5794213 3827106 3334181 5148875 7591444
40344 7591444 9237160 10460389 12047217 13893616 15680505 17731371 20759919 25682599
40336 25682599 33549839 43837492 52356713 53255894 44990673 32923765 24037193 20027568
40328 20027568 17537843 14037980 10546550 8605931 7593453 6199571 4517888 3377710
40320 3377710 3040625 3570263 5105555 6799046 6954341 5383113 4224171 5111917 6925599
40311 6925599 7887117 8447087 9998681 11827167 11903424 10315017 9301270 9655305 9536439
40302 9536439 7583030 5070628 3955406 4621906 6723144 10397000 14953497 17796930
40294 17796930 16747706 12769496 8639218 5593504 3239323 2097974 3413828 6030237
40286 6030237 6397918 3381844 786524 2585880 7057551 8756354 5979271 2885158
40278 2885158 3222901 5124358 4494535 1375157 -322501 1354637 4090342 5112210
40270 5112210 4460623 3495651 2633647 2072415 2739565 4643274 5779553 4660207 2801266
40261 2801266 2701551 4294422 5562031 5921092 6520657 7429835 7132244 5253801 3591397
40252 3591397 3715436 5264767 7094384 8377073 8220952 6243023 4126498 4446401 7049969
40243 7049969 8746537 7655615 5608529 4925320 5283333 5619016 6604176 8684543 9887151
40234 9887151 8689427 7281471 8448777 10587972 9882346 6743981 5610632 8036714
40226 8036714 10480147 10203129 9117416 9648250 10614998 10242432 10290638 13596015 19249015
40217 19249015 23559609 24846874 24492602 24119761 24370007 25677337 27527086 27522036 23968833
40208 23968833 19064002 16649870 16862726 16040695 12358268 8404059 6997659 7308381
40200 7308381 6971215 5795299 5088351 4771758 3573441 1501856 114562 386047 1762179
40191 1762179 3357452 4904617 6324488 7223495 7200036 6393196 5629256 5890816 7212327
40182 7212327 8219216 7571061 5877118 5058928 5590230 5824850 4735265 3726072 4463548
40173 4463548 6263132 7276749 7230552 7119826 6979922 6117118 5213672 5951699 8383709
40164 8383709 10736517 12198342 13889429 16451974 18664484 19438131 19498200 20007810 21017278
40155 21017278 22275250 23979091 25623236 25878532 24976875 25222946 27236456 27758403 23944262
40146 23944262 18215848 15453363 16306471 17069133 15912466 15003867 15659373 15725811 13874845
40137 13874845 12834445 15416787 20040343 23307432 24873916 26481081 27955343 27897825
40129 27897825 27268192 28397853 30779678 31635380 30891345 31810356 35692884 39355283 39455871
40120 39455871 36604113 33558038 31752028 31241660 31731717 31725519 28769895 22750031 17231777
40111 17231777 15329873 15791276 15460335 14033032 13467561 13732639 12541730 9411084 6933217
40102 6933217 7041405 8235431 7817567 5467384 3309633 3120409 4500869 5814174 6462362
40093 6462362 7693546 10554833 13455635 13447592 10454886 8192286 9354795 11778509 11693471
40084 11693471 9261995 7803910 8278760 8076260 5638297 2983914 2441433 3480696
40076 3480696 4236255 4109335 3464071 2560478 2159845 3494366 6204162 7854105 6962457
40067 6962457 5062664 4294793 4484713 4376902 4322059 5503928 7378900 8196613 7742483
40058 7742483 7471398 7925345 7941047 6759473 5312448 4833040 5347048 6087813 6548430
40049 6548430 6674077 6660628 6894404 7604592 8426454 8779085 8702580 8760945 9037530 8818265
40039 8818265 7547054 5722238 4499876 4444919 4852708 4489599 3060757 1614799 1158216
40030 1158216 1305147 1059004 611254 1187067 3010251 4686845 5064796 4547305 3948498
40021 3948498 3200685 2068960 1158796 1164118 1785494 2303683 2639810 3075353 3564133 4053324
40011 4053324 4788402 5616648 5829538 5418583 5467701 6410129 7050305 6493914 5896817 6776181
40001 6776181 8505078 9179399 8337708 7137125 6306739 5619970 5082929 4965723 4767971
39992 4767971 3683596 2069460 1141453 1354286 2296725 3797018 5700940 6970219 6668564
39983 6668564 5642399 5609769 6758128 7829571 8287803 8605691 8642068 7719847 6280847
39974 6280847 5496819 5257224 4580892 3935148 4774200 6661203 7466547 6829838 6636058
39965 6636058 7361463 7027047 5075065 4138342 5880155 7851777 7145005 4957575 4499621
39956 4499621 5927072 6603622 5631984 4974542 6031497 7749258 8669361 8882806 9232667
39947 9232667 9867052 10181133 9509277 7715701 5511835 3907568 3040455 2264679 1696201
39938 1696201 2385898 4298927 5710552 5700278 5550846 6239074 6413637 4864031 3194512
39929 3194512 3483233 4788797 4927339 4468599 5524952 7342739 6988035 4444723 3104203
39920 3104203 4449502 6013289 5899961 5709797 7032042 8289556 7605508 6219430 6284352
39911 6284352 7226064 7050737 5778933 4916448 4688199 4376688 4442453 5707455 7125970
39902 7125970 6971423 5858580 6055875 7895229 9304744 9091202 8371329 8239164 8096134
39893 8096134 7151699 6029451 5990748 7471822 9750135 11296606 10704976 8405497 6966772
39884 6966772 8120831 10020420 9507935 6694117 4668150 4695319 4868480 4235598 4778534
39875 4778534 7490899 9660701 8706741 6212107 5117058 4982665 3550508 1473395
39867 1473395 1465429 3388944 4370163 4028444 5422791 9651569 13398180 13855139 12767913
39858 12767913 12978266 13720581 12611235 10412028 10152863 12259464 13990744 13803557 13221939
39849 13221939 13696874 14301347 13838028 13186758 13924262 15935362 18028728 20119288 23163438
39840 23163438 27167262 30763581 33167874 35578795 39968160 46917114 55290073 63901812
39832 63901812 72769343 82397920 92386033 101301753 107503068 109336629 105137503 94703115
39824 94703115 81086322 69215111 61576497 56349857 50854997 45484556 42502551 42105187
39816 42105187 42255091 42289302 43994076 48228284 52823076 55570850 57806527 62946710
39808 62946710 72050151 82734822 92435050 100740157 107596503 110716029 106762111 95281220
39800 95281220 80111644 66161578 55578624 47736423 41739113 37134553 32727979 27226833
39792 27226833 21705637 19061185 19627396 19513497 15475566 9781787 7544503 10194429
39784 10194429 14411046 16958778 17533052 16819497 14932871 12621985 11370421 11258035
39776 11258035 10912878 10306539 11142499 13622408 15549160 15863591 16257109 17700058 18364457
39767 18364457 17189802 16563005 18543105 21044274 21331863 21212667 24590370 31116535
39759 31116535 36676180 39807256 43302674 49147716 56220382 64168357 75374386 90727236
39751 90727236 106565930 118551979 126445239 132424173 136317000 135398996 128333561 116868136
39743 116868136 103564641 89700590 75785235 62748244 51803723 43584846 37882493
39736 37882493 34181894 32199712 31603626 31265228 29600984 26311883 23102517 21661466
39728 21661466 21501920 21091035 20563381 21467557 23830769 25449392 24677976 22298595 19949934
39719 19949934 18232553 17174703 17060879 17627317 17542223 15923039 13755800 12895078 14059748
39710 14059748 16313149 18050401 18300427 17650834 17758589 19090730 19698086 17808060 15086371
39701 15086371 14875242 17143269 18132211 15861973 12892012 11954759 11806291 9902407 6815219
39692 6815219 5069738 5274104 6234432 7474484 8813485 8851119 6966023 5547095 6818194
39683 6818194 8580806 7129307 3744987 3622246 7936761 11760810 11366286 9168123
39675 9168123 9034213 10577855 11210903 10731758 10334373 9362468 6709500 3867893 3047411
39666 3047411 3410843 2666287 1475514 2463888 5193104 6228699 4823582 4539912 7593264
39657 7593264 11076860 11334591 9465885 9348929 11683646 13315990 12196663 10002539
39649 10002539 9107010 9329019 9164509 8675804 9146380 10362982 10370180 8583252 7407786
39640 7407786 9148160 12259064 12861611 9955669 6713449 5743474 5575784 3776278 1365064
39631 1365064 1147376 2963694 4140974 4211592 5270727 7212217 6878084 3643539 1726440
39622 1726440 3961166 6755020 5262609 1055252 -155671 2843935 5519661 4990235
39614 4990235 3693835 4421732 6146527 6972061 7560141 8934753 9849454 9306220 9248021
39605 9248021 11455818 13655283 12383590 8669366 7057809 9096904 11346333 10562418
39597 10562418 7798159 6012352 5979583 6338355 6257724 6336314 7374811 9320748 11254978
39588 11254978 12098267 11722601 11308643 11881223 12726235 12432246 11365156 11442582 13023887
39579 13023887 13770520 11708540 8138551 6101881 6712671 8418361 9538583 10099006
39571 10099006 10892843 11814719 11909698 10802041 9417741 8993636 9623054 10247540 10066259
39562 10066259 9336163 8603314 7956786 7509652 7663129 8069979 7365703 5197775 3574093
39553 3574093 4492454 6961862 8418881 8530450 9015771 9838225 8758467 5533535 3365132
39544 3365132 4292106 5805004 4550177 1403555 18319 1620805 4125442 5679786
39536 5679786 6288920 6204771 5352801 4494165 4703417 5540595 5773367 5791312 6938047 8504624
39526 8504624 8266078 6487114 6241005 8520853 10192150 8850580 6785922 7155073 8531231
39517 8531231 7091445 3068534 830476 2316688 4283843 3438263 1117106 701589
39509 701589 2598585 4312014 4305966 3435636 2992845 3286316 4109480 5104785 5614171 5329909
39499 5329909 4998302 5410998 5999995 5700756 4871424 4743272 5089547 4387175 2656825
39490 2656825 2071449 3750298 5799801 6018434 5067051 5118249 6346817 6803064 5450417
39481 5450417 3520593 2758215 3696717 5766332 7918225 9070535 9018862 8927663 9898282
39472 9898282 11161566 10875911 8688647 6221801 4876831 4419943 4009283 3402727 2739765
39463 2739765 2200184 2300511 3550328 5391767 6350915 5633330 3896570 2373459 2033814
39454 2033814 3430443 6172511 8605360 9374745 9313334 10245739 11942727 12261411 10697292
39445 10697292 9543293 10503726 12243248 12749641 12332895 12520372 13375429 13785492 13423484
39436 13423484 12673036 11392229 9421926 7732587 7547997 8774536 10511614 12467400
39428 12467400 14639333 16361434 17049385 17234885 17581508 17662747 17049833 16619948 17104776
39419 17104776 17261060 15509207 12786380 11588856 12394280 13194409 12742715 12275809 13472095
39410 13472095 16202538 18825904 19613447 17670273 13556813 9226502 6508972 5671986
39402 5671986 6061224 7406320 9356736 10640595 10445114 10084680 11379518 13655872 14308423
39393 14308423 12266447 9006354 6175717 4258374 3742689 5382635 8518675 10822373
39385 10822373 10602297 8422676 6264560 6102464 8929452 13609095 17002713 17014297 15169745
39376 15169745 14279247 14294073 13214784 11536421 12059728 14776653 15840844 13185483 9685527
39367 9685527 8562239 8708567 7333013 4867372 4153255 6126321 8975008 10739940
39359 10739940 10795963 9762711 9531557 11953085 15882255 17405297 15061565 12757926
39351 12757926 14729996 19460398 22013098 21078171 19720024 19557492 18465563 14986976
39343 14986976 11382365 10366100 11192069 11004779 8766658 6264048 5872528 8224047
39335 8224047 11584525 13196320 11877335 9333518 8123266 8603014 9075853 8684137 8500462
39326 8500462 9513638 11053387 11761375 11046495 9248110 7327476 6460516 6829253 6927003
39317 6927003 5483207 3973636 5313382 9658338 13515359 14000964 12222314 11058153
39309 11058153 11033915 10237289 7648404 4748114 3684319 4962460 7210874 8583560
39301 8583560 8233003 6839939 5896514 6365541 7963496 9548482 9951812 8697734 6493007
39292 6493007 4932915 5096090 6420478 7536961 8058386 8723253 9865685 10838867 11180180
39283 11180180 11255565 11281626 10726412 9374717 8156345 8062821 8746767 8943778 7959514
39274 7959514 6202221 4632915 4194795 5329470 7430957 9094597 9473539 9138116 9181748
39265 9181748 9923497 11023046 12289602 13497597 13839677 12752782 11239359 11080467 12342032
39256 12342032 12871800 11087304 8254095 6779014 6925687 6842455 5724891 5072619 6108885
39247 6108885 7647364 7940912 7443413 7828635 8857382 8497046 6512140 5818346 8949921
39238 8949921 14380310 17828419 16891239 13401436 11257118 12489421 15523436 17216081
39230 17216081 16613673 16111431 18157465 21567196 22825099 20884045 18457557 17907693
39222 17907693 18148724 17090631 15181149 14455764 15461576 17435635 20654707 26082288
39214 26082288 32774465 37821472 39269375 37561681 33862570 28514080 21777130 15053971
39206 15053971 10565614 9803620 12092659 14649358 14939791 13381011 12600094 13579810 14302040
39197 14302040 13218749 11895824 12332982 13708205 14289251 14759601 16673598 19277285
39189 19277285 21389147 24909413 32033825 39849118 42917306 41519403 41803529 46173747
39181 46173747 48980665 44765047 36147617 29554796 26633896 24372307 21352767 19231814
39173 19231814 18985797 19644674 20554027 21968407 23692270 25517165 28407606 32989530
39165 32989530 37687157 40749052 43299970 47884910 54703250 61780821 68094808 73727471
39157 73727471 77417091 76965130 72244724 65354087 57685919 49069438 39722679 30744120
39149 30744120 22695203 15839392 11433371 10332548 10741136 10191310 9428745 11017908
39141 11017908 14127620 14649979 11397478 8258027 8519205 10714325 12354957 14274383
39133 14274383 18070861 21949290 22847165 21084995 19318760 17890496 14841723 10275778
39125 10275778 7199688 7339427 8831323 9075251 7851639 6618905 6354136 7114180 8517991
39116 8517991 9743260 9931819 9267902 8871475 9216228 9657724 10001214 11267946 13940217
39107 13940217 16555370 17460946 17295428 18070389 20022095 21327935 21477247 22946441 28022903
39098 28022903 35411962 42193693 48373881 56564303 66592050 73391605 72381063 65197721
39090 65197721 57659381 52951038 49326998 44218284 37925874 32558135 29317756 27865582
39082 27865582 27108971 25912040 24094246 23128319 24634294 27865579 30151747 30277418
39074 30277418 29721084 29763700 29188114 26207033 21238795 16214941 12227839 9430052 8280962
39065 8280962 9034812 10477566 10961373 10613621 10979498 12364875 12959468 11076712 7288376
39056 7288376 3776377 2089734 1946710 1990335 1408665 697509 820469 1959609 3531360
39047 3531360 5061114 6218709 6342588 5226521 4268090 5147868 7075692 7297791 5176781
39038 5176781 3798207 6107317 11066010 15232007 16711634 15826127 13270139 9752975
39030 9752975 6581812 4601262 3195826 1935781 2075822 4427908 6955799 7012038 5165658
39021 5165658 4199963 4938440 5833362 6252997 7183230 8737267 9926310 10982334 12887952
39012 12887952 14437492 13089204 9298004 6601709 6513676 6806889 6063398 6190676 8504501
39003 8504501 10880915 11344330 11360931 12711958 13894794 12814739 10672607 9796396 9592101
38994 9592101 8161693 6340345 6492307 8405852 9866819 10452238 11389514 12404607 12164333
38985 12164333 11398304 12245710 14786687 17368341 19920124 23555165 27244987 28584717
38977 28584717 27911849 28167941 30806424 35573452 43738381 56261100 68207125 71200218
38969 71200218 64173911 56306383 55326072 57349262 53198224 41457269 29515442 23161798
38961 23161798 20751775 17902023 13337296 8726978 5827967 5306819 6679208 8552583
38953 8552583 9906493 11037688 12257153 12582263 11407131 10451394 11744908 14379728
38945 14379728 15951478 16958386 20671537 27871039 34388185 35409913 30590828 23607771
38937 23607771 17987669 14747947 13199096 12399113 11636572 10352706 8202714 5379210
38929 5379210 2742583 1173885 643636 410165 247869 687275 1806739 2862828 3596238
38920 3596238 4675485 6172441 7005161 6834070 7005712 8455462 10358125 12370142 16359607
38911 16359607 23753425 32657606 39977000 45198615 49867827 54852140 60688825 68707058
38903 68707058 78187053 83996894 81644727 74052725 68366218 65879786 60526236 48724046
38895 48724046 35264110 26508490 22299845 18461545 13905795 10901045 10290483 10539355
38887 10539355 10640452 10724871 10356000 8845495 6805747 5333602 4307691 3193058 2468808
38878 2468808 2512219 2377451 1577895 1577199 3311033 4797581 3863408 1912720 1984799 3962190
38868 3962190 4867373 3554679 2052612 2118466 3115980 3653801 3191226 1896412 788095
38859 788095 1677278 4851746 7377577 6258380 2843174 1229024 2600692 4461585
38851 4461585 5452796 6950148 8938314 8507106 4763336 1764624 3393735 7695274
38843 7695274 9699028 8339375 7019231 7897252 9191895 8811690 7724126 8056568 9601688
38834 9601688 10201603 9020793 7603412 7340574 7367275 6118258 4110354 3483796 4856013
38825 4856013 6497965 7179623 7833702 9204529 9953761 9187430 9038525 11772053 15392557
38816 15392557 15585315 11912736 8666811 8943515 11023501 11742236 10567669 8804694
38808 8804694 7243498 6380947 6975616 8666309 9707350 9446996 9203520 9361154 7937095
38799 7937095 3993366 225493 -414508 1070739 1665908 1106786 1619170 3669251 5150669
38790 5150669 4843954 3969566 3909350 4656074 5990080 8101080 10321082 10981811 9435451
38781 9435451 7049363 5552194 5302583 5508040 5170629 3559338 786003 -1709115 -2122262
38772 -2122262 -153615 2643341 4488635 4794301 4076938 3241758 2999745 3338953 3537078
38763 3537078 3154479 2761843 3085674 3757691 3678984 2482040 1011129 451987 1291241
38754 1291241 2751154 3097812 1339717 -1114716 -1704958 -94747 1300405 968631 405317
38745 405317 1028075 1316784 -332302 -1828082 -33817 3829134 5401091 3671254 2127713
38736 2127713 2737333 3026927 1012662 -839862 435463 3256892 3922059 2326877 1622818
38727 1622818 2921782 3862804 2707920 856736 260909 551725 137435 -1217802 -2305166
38718 -2305166 -2277454 -1433062 -495134 51834 24503 -352153 -341961 685611 2302914 3248676
38708 3248676 3058548 2942540 4227523 6275917 7124050 6169953 4797209 3996843 3092871
38699 3092871 1709676 1123084 2051152 2789753 1702592 147592 297258 1205108 285467
38690 285467 -1879206 -1941611 731305 2780963 2126004 916863 1567018 3158909 3943823
38681 3943823 4390126 5212633 5123745 3461971 2628755 4641157 7304770 7343954 5593902
38672 5593902 5170091 5842362 4741190 2191154 2067929 5623663 9297856 10178819 9836544
38663 9836544 10671268 11808404 11389735 10473201 11490964 14134808 15680641 14944815 13515938
38654 13515938 13016481 13102359 12696136 11854962 11555689 12072502 12237217 10630240 7512919
38645 7512919 5101118 5390538 8030528 11002334 12935946 13741331 13455107 12113502 10849951
38636 10849951 11382464 13774990 16098420 17038582 17580847 19267918 21914943 24028955
38628 24028955 24621363 23673047 21540945 18853653 16514324 15024692 14084267 13232184 12375121
38619 12375121 11373923 9797485 7543643 5207157 3600026 3382484 4944182 7615247
38611 7615247 9150415 7559011 3856277 1514341 2485707 5058383 6375704 5788012
38603 5788012 4798978 4796479 5804161 6724298 6246760 4315148 2784025 3291718 4516885
38594 4516885 3605372 629985 -1029420 225531 1620984 313223 -2462516 -3966045
38586 -3966045 -4123973 -4098768 -2964268 391517 3564585 3055876 -162998 -1580499 311701
38577 311701 2299881 1746776 -192707 -1608993 -2437590 -2526181 -434182 3798754 7319487
38568 7319487 7982428 7141261 7158770 8127100 8758951 8564987 7446162 5107766 2588392
38559 2588392 2203573 4014854 4696811 2383947 311662 2403497 7074706 9273124
38551 9273124 7719611 6087886 7065653 9177922 10302487 10833204 11865331 13012837
38543 13012837 13740048 14699579 16067629 16364328 14624764 12247327 11065630 10966046 11109523
38534 11109523 12176734 15320315 19789438 23839962 27574908 32531542 38257527 41539614
38526 41539614 39955338 34616449 28416427 22910813 18117935 14233488 11808075 10495881
38518 10495881 9060050 6837514 4366805 2551826 1922089 2503622 3513873 3494765 2029234
38509 2029234 1132789 3169013 7078556 8757663 6260132 2675184 2132102 4604963
38501 4604963 6919784 7616912 7960350 8650101 8637977 7617971 6946088 7218734 7315869
38492 7315869 6837432 7148609 8724098 9768086 9255210 9359287 12684639 18461450 23588124
38483 23588124 26399692 27468230 27692015 27660370 28135467 29124960 29076489 26903071 24131858
38474 24131858 23003286 23146028 22561894 21524019 22785162 27669507 34482457 41361760
38466 41361760 48183847 54463313 57562140 54997730 47750159 39869865 34904616 33116508
38458 33116508 31815762 28270405 22660270 17850379 15721676 14755592 12690226 10461040
38450 10461040 10926365 13912300 15542338 13392440 9700302 7960904 8467414 9085735
38442 9085735 8828923 8519217 8730071 8971409 8682322 7750369 6251811 4571149 3451313
38433 3451313 3220377 3373995 3451733 3790574 4987159 7216035 10222957 13012186 13537954
38424 13537954 10476274 6025743 5048614 9860451 17096362 21317404 20761947 17945654
38416 17945654 15502480 13564919 11267424 9000746 8241166 9668787 12036070 13192739
38408 13192739 12443592 11398332 11627794 12083760 10587048 7663788 6408784 7859798
38400 7859798 9167786 7866961 5484458 4780579 5574178 5926696 5679198 5776563 5383275
38391 5383275 3033546 18584 -718019 1033399 2625318 2992632 4028061 6825199
38383 6825199 9519292 10072951 8815429 7045691 5301310 4197969 4851429 7029543
38375 7029543 8683480 8712259 8544739 9628203 11065512 11371778 11014521 11252360 11581579
38366 11581579 10463336 8102474 6604145 7309988 9281078 10571410 10223462 9053209
38358 9053209 8937699 10968755 13918491 15190803 13809300 11656691 11071991 12089906
38350 12089906 12978191 12758953 12120194 12310115 14098045 17418697 21093911 23190447 22530285
38341 22530285 19752626 16385529 13269881 10458684 8090364 6481189 5617418 5270433
38333 5270433 5394934 5849826 6069504 5666284 5122174 5298217 6414039 7922104 9165727
38324 9165727 9841497 10091409 10354743 10783940 10785119 9762587 8333326 7896978 8847226
38315 8847226 10264313 11578463 13141536 14621318 14455687 12063828 9321587 8444246
38307 8444246 9255700 9772139 8715127 6394895 4053190 3436542 5881477 10453127 14092579
38298 14092579 15068184 15039799 16035769 16951299 15498206 12332574 10105389 9017711 6754553
38289 6754553 2977672 427548 674508 1925798 2413814 3129562 5442183 8417228 10428997
38280 10428997 11409154 11635416 10341004 7707862 6396066 8574299 12784635 16161314
38272 16161314 18421301 21006828 23561532 24552961 24799519 26838755 30532812 32630904
38264 32630904 31549986 29537586 28774910 28169633 25928269 22941569 21180320 20352634
38256 20352634 18777066 16692572 16099337 17447605 18773135 18541657 17503741 16931387
38248 16931387 16414299 14598898 11511953 8999675 8639280 9765727 10105991 8425951
38240 8425951 5994949 4855714 5080372 4872842 3410644 2110873 2343777 3238063 3083290
38231 3083290 2032110 1830132 3203518 5016065 6072963 6514530 7146406 8249428 9272294
38222 9272294 9241680 7754663 6081504 6466664 9242587 11546786 10607727 7593294 5947827
38213 5947827 6264961 5724960 3192258 1732291 4209403 8791026 11322774 10675286 9151852
38204 9151852 8451443 7923983 6864596 6231351 7255137 9559254 11319404 10842508 8021797
38195 8021797 4638389 2808690 2726271 2735644 2073777 2065229 3513210 4644097 3634507
38186 3634507 1815156 1815690 3342223 3609293 1698877 -375568 -1109094 -1134240 -870729
38177 -870729 529319 2772716 3643302 2170548 299822 -227845 -414429 -1404602 -1475630
38168 -1475630 1567425 6180206 8225249 6215369 3044270 2110502 3511548 4756071
38160 4756071 4073854 2199720 1209494 2012590 3263283 3095443 1597519 517507 535264
38151 535264 348934 -996093 -2461774 -2691664 -1932874 -1117640 -315883 599878 981565
38142 981565 554655 425061 1439775 2673819 3167208 3902160 5973695 7846816 6956898
38133 6956898 3596845 745770 92690 552269 837169 1083480 1357986 850260 -336737
38124 -336737 -369441 1982708 5294191 6937468 5939586 3572339 1646400 959491 1196698
38115 1196698 1823666 2830869 4379127 5875273 6295682 5742385 5495617 5820886 5217642
38106 5217642 3136692 1820478 3367700 6246198 7287688 6291293 5756624 6502799 6797475
38097 6797475 5997332 5686797 6400599 6531274 5915171 7336395 12270297 17678241 19646615
38088 19646615 18397466 17022263 16571494 15291469 12271734 9184140 7982135 8682202
38080 8682202 10027189 11169130 12020564 12481554 11969818 10080616 7773406 7122618 8896506
38071 8896506 10940367 10513354 7985865 6294864 6685273 7343101 6846572 6403156 7359590
38062 7359590 8888341 9976838 11631993 14852695 17974590 18441095 16265602 13660686
38054 13660686 12043298 11263523 10929088 10619030 9556280 7784467 6790322 7365944 8134343
38045 8134343 8067540 8813678 11869107 14899692 14301496 10728769 8445743 9218342 10523105
38036 10523105 10372589 10142980 11113337 11544628 9556080 6626463 5834028 8044898 11792513
38027 11792513 15649525 18775837 20125759 19164905 17053759 15621191 15344748 15339243 14834814
38018 14834814 13589103 11383742 8412033 5969163 5562939 7205772 9377297 10719019
38010 10719019 11077469 10887535 10369942 9724417 9522270 10173114 11001131 10541696 8297551
38001 8297551 5790926 4948337 5503851 5277394 3494935 2332619 3880876 6775769 7762654
37992 7762654 6073524 4171869 4081702 4979258 5033658 3964409 2824566 2403746 2765598
37983 2765598 3603116 4373622 4682144 4929549 5918166 7538613 8590595 8189129 6703058
37974 6703058 5213227 4721445 5699464 7405327 7845136 5730196 2481711 951245 2130562
37965 2130562 4540068 6714855 8367641 8983677 7667182 5258346 4423285 6374142
37957 6374142 9349548 11642055 14204094 18513566 23455363 26308692 25786985 22469758
37949 22469758 17410805 12127791 8859021 8685446 9887806 9883990 8311361 6740242 6116080
37940 6116080 6137194 6420888 6565977 5803681 4350680 4215750 6612464 9497911 10175773
37931 10175773 9595045 11041363 14804264 17610348 18010263 18830860 22499492 26715589
37923 26715589 27220073 23198641 17646962 13430588 11112252 10149825 10273635 11392865
37915 11392865 13107754 14519111 14415581 12297911 9443386 7923470 8158381 8716808
37907 8716808 9075782 10836731 14994557 19698388 22531608 23646100 24464379 24405732 21687348
37898 21687348 16999659 13377400 11926081 10494226 7705100 5602914 6284820 8029931
37890 8029931 7563912 5126069 4296826 6734091 9783131 10231281 8307828 6543522 6254083
37881 6254083 6969629 8368067 10632024 12997502 13966821 13592714 13951435 16260801 18666157
37872 18666157 18297218 14960149 11313457 9441254 8689312 7364269 5367273 4141177
37864 4141177 4553354 5815700 6451520 5670458 3778214 1824678 999451 1853518 3733901
37855 3733901 5175779 5147894 3891409 2425712 1361533 441664 -733201 -1815976 -1916052
37846 -1916052 -791680 513132 732001 73976 205647 2096447 4410725 4876162 3098447
37837 3098447 1067687 684162 1726834 2721433 2845472 2163968 875815 -427087 -339094
37828 -339094 1933430 4771647 5357561 3098501 485494 -17902 1356404 2807452 3352965
37819 3352965 2969018 1541784 -823713 -3114550 -4372937 -4854581 -5094022 -4567294 -2752719
37810 -2752719 -840346 -499319 -1165387 -515471 2137245 4728859 5216000 3881837 2297316
37801 2297316 1482967 1835361 3449327 5481883 6266059 5143493 3527486 3313604 4727744
37792 4727744 6305211 6506618 5014417 2985809 2149625 2944866 3627357 2245636 -585322
37783 -585322 -2200663 -1204694 1180931 3090708 3583086 2212450 -677966 -2774664 -1469907
37774 -1469907 2308859 4546318 3666689 2694831 4045068 5392279 3781825 1061449
37766 1061449 1158044 3704123 4793381 3258430 1728006 1509148 944675 -325077 172417
37757 172417 3240454 5675481 4766557 2162955 726309 136423 -1298001 -2380417 -270495
37748 -270495 4479168 7464222 5790190 1658084 -565234 521544 2474290 2666061
37740 2666061 1429176 1089531 2765994 5330976 7482063 9323354 11039917 11418201
37732 11418201 9415263 6484788 5406615 6959609 9507390 11767193 14032773 16496512
37724 16496512 18461029 19828794 21484878 23432788 24331938 23764926 23184457 23488819 23367304
37715 23367304 21559627 19446856 19683853 22876645 26901811 29121256 28421291 25563518
37707 25563518 22261412 19616148 17285705 14731534 12897385 13271224 15472471 17653608
37699 17653608 19433921 22270427 26585473 31216938 36653246 45736993 59067109 72140452
37691 72140452 79535522 80120064 75914274 68045336 56971963 45092514 35441405 28229199
37683 28229199 21670919 15782936 12299141 11063745 9740541 7455294 5839203 5950624
37675 5950624 6887838 8020297 9763903 11274098 10300001 6822099 4253114 5119245 7627125
37666 7627125 8535880 7638711 7111767 7780493 8549656 8846153 9235142 9785242 9936127
37657 9936127 10082317 11301718 13117961 13451529 11636233 9758004 9653407 9982413 8220457
37648 8220457 4796745 2849680 3686824 5006008 4797146 4561223 6253083 7890484 5882734
37639 5882734 1334113 -109741 4048880 9348981 10613826 8831336 8482351 10483905
37631 10483905 12098465 12663687 14725370 19302669 24454270 29688220 37678787 49449475
37623 49449475 61149075 68172271 69828739 67325732 59951635 47154698 32782410 22780171
37615 22780171 18524813 16028799 12330743 9211577 9171732 10821092 10742151 8124773 5044829
37606 5044829 3083778 1968367 1163527 691288 284526 -462146 -808304 582943 3277853
37597 3277853 4838836 3819924 1659500 559050 674750 681488 141451 -167216 341388
37588 341388 1671650 3649230 5383989 5178966 2723663 570452 1184006 3093757 2757775
37579 2757775 155002 -767679 2015600 5651118 6947022 6707366 7174652 7958155 7634551
37570 7634551 7351532 9338751 13029921 16056109 18373760 22047796 27169180 31183692
37562 31183692 32421784 31416783 28608647 23804028 18388785 14968304 13783966 12205160
37554 12205160 8923149 6040800 5604335 6532832 6750981 6255397 6078315 5910371 4879395
37545 4879395 3516596 2945310 2894349 2304681 1387806 1447975 2827854 4305703 4608270
37536 4608270 3786694 3066845 3584113 5039762 5766602 4829361 3716341 4598726 7018208
37527 7018208 8114397 6530149 4179934 3326255 3729431 3831692 3116091 1938720 429750
37518 429750 -997788 -1186985 360167 2532429 4037967 4652226 4295638 2623061 690880
37509 690880 931779 3606180 5289443 3369136 299076 268119 2867698 3800297 1618043
37500 1618043 -205417 1138232 3702010 4235029 3005222 2584779 3458856 3610019 1982468
37491 1982468 15186 -517389 479297 1958292 2952205 2760023 1126426 -962516 -1590473
37482 -1590473 -4840 2271790 3469742 3957240 5010374 5764813 3876998 -284412
37474 -284412 -2839634 -1458524 1163491 1415275 384680 1896591 6027864 8686067
37466 8686067 7816108 5970826 5605317 5671898 4818533 4422641 5658909 6433214 4603843
37457 4603843 2182218 2636829 5219011 5774088 2987738 305612 932707 3725848 5307380
37448 5307380 4338774 2259001 780970 -21766 -1093795 -2425805 -2411919 81007 3403947
37439 3403947 4501867 2906800 1450274 2173626 3710428 4199764 4460096 5860932 6945537
37430 6945537 5281242 1648230 -738177 -746542 -129225 15688 549046 1677985 1897502
37421 1897502 539792 -849746 -840496 -159649 -333840 -1517478 -2613412 -2769951 -2119899
37412 -2119899 -1427342 -1119893 -510000 1353671 3650542 3945874 1464763 -1304299 -1883527
37403 -1883527 -1085538 -899672 -788945 935099 3225295 3260713 878706 -1292013 -1969097
37394 -1969097 -2151473 -2021745 -656461 768526 -593417 -4562871 -7342800 -6939737 -5509720
37385 -5509720 -4722908 -2825015 1105917 3730192 1928184 -1910385 -2963162 -720064
37377 -720064 1028222 -26028 -2419943 -4052564 -4418635 -3497645 -1139195 1692413 2985523
37368 2985523 1845559 -495101 -2224653 -2668140 -2318585 -1896007 -1566625 -877046 316723
37359 316723 946883 -322000 -3053310 -5114766 -5207154 -4072023 -2798044 -1560960 -721462
37350 -721462 -1256993 -2894211 -3615124 -2529865 -1561726 -2542812 -4243445 -4344950 -2972555
37341 -2972555 -1936873 -1545315 -718284 361921 323897 -808669 -1474961 -1173820 -1103307
37332 -1103307 -1943680 -2966840 -3733876 -4739952 -5695175 -4959211 -1802088 1988990 3877471
37323 3877471 3213460 1252376 -773017 -2569041 -4003166 -4432755 -3331385 -1307522
37315 -1307522 99743 -14095 -833481 -797764 504290 2065094 2986178 3408848 3811584
37306 3811584 4309104 4913786 5576797 5657031 4306390 1761984 -673224 -2218871 -3107637
37297 -3107637 -3281413 -2078946 198583 1935728 2285276 2218716 2625570 2913275 2643029
37288 2643029 2925121 4523289 5843830 4755475 1726592 -612300 -706590 551359 1476089
37279 1476089 1433565 1063871 1330112 2204056 2258226 404889 -2014125 -2440596 -697418
37270 -697418 637820 223088 18591 1941424 4664435 5738401 5094201 4247951 3516577
37261 3516577 2287394 870627 -64868 -880626 -1914213 -2242007 -1335195 -518447 -823558
37252 -823558 -1032380 -6222 935580 480181 43194 938313 1035253 -1812657 -4863779
37243 -4863779 -3791130 119503 1250631 -1924781 -4905842 -4452544 -2761227 -2670045 -3270573
37234 -3270573 -2729910 -1734550 -1431002 -933595 492218 1283587 185237 -1087781 -271647
37225 -271647 1996093 3384299 3222544 2695495 2711903 3154232 3421805 2713195 764312
37216 764312 -1130915 -1252126 -15498 417952 -502499 -1030295 -403182 -129795 -892990
37207 -892990 -979624 519021 1551262 259770 -1891503 -2384544 -1244674 -175651 389818
37198 389818 1257240 2641775 4084277 5096187 4723552 2105612 -1373830 -2646575 -1172400
37189 -1172400 -138272 -1494795 -2530336 -257300 3204128 3363564 89297 -2282223
37181 -2282223 -1210678 1124175 1508372 -437912 -2740823 -3487297 -2198656 -50080
37173 -50080 1109286 727205 55164 31447 -89536 -889123 -1181793 5094 1304943
37164 1304943 923759 -485399 -908690 135013 1762211 3598077 5383996 5957906 4909487
37155 4909487 4058117 4909850 5893993 4699887 2080181 462923 -20341 -947841 -2077227
37146 -2077227 -1881700 -957097 -1299641 -2480807 -2100491 6619 1502020 1497908 1275042
37137 1275042 1024555 -346842 -1879988 -1055174 1647629 2693072 1061049 -139712
37129 -139712 985194 2248520 1769185 1279530 2613591 4463601 5346378 6498407 8811471
37120 8811471 9915763 7717376 4381736 3334850 4314645 4794161 4514470 5031258 6096865
37111 6096865 6050673 4999580 4422698 4260809 3310573 1854033 1115101 843520 229378
37102 229378 307451 2289724 4259756 3104385 -461263 -2389353 -1044112 1051355 1726762
37093 1726762 1843910 2430964 2611494 2014953 2162202 3469711 3642461 1392651 -676393
37084 -676393 292332 2759097 2977245 776380 -242805 1708385 3971959 3408397 620373
37075 620373 -1380048 -1196254 121491 1529347 3220210 5114012 5912685 4887269 3511487
37066 3511487 3589313 4182464 2534212 -1510424 -4269840 -2844996 905530 3102949 3068183
37057 3068183 3039391 3583894 2794819 380485 -954163 327465 1987283 1682431 863515
37048 863515 2352530 5660138 7645482 7049627 5589687 4788864 4322359 3711794 3309546
37039 3309546 3082030 2450215 1905270 2806366 4901522 6121206 5790107 5842744 7375894
37030 7375894 8256018 6543395 4552454 6290941 11502253 15679605 16438821 16597310 19519837
37021 19519837 24404961 28780388 33644696 42689489 56739373 71826589 83089306 88086049
37013 88086049 85797647 75525895 59075975 42104076 30238816 23959179 19345409
37006 19345409 13787821 8763678 6564873 6630138 6658924 5906643 5520514 6231081 7445708
36997 7445708 8557083 9653819 10661913 11039853 10848996 11132629 12548017 14310161 15162219
36988 15162219 14892005 14274716 13929782 13818609 13525280 12538691 10698432 8874334 8556488
36979 8556488 9962363 11214239 10547638 8774095 7999214 8216826 7257507 4491682 2287774
36970 2287774 2497096 3485281 2680208 619831 -103415 796231 929124 -510789 -991664
36961 -991664 1493469 4952405 5735202 3194320 123958 -955207 -304096 203534 -552830
36952 -552830 -2050028 -2822896 -1787055 747569 3304413 4623270 4609049 3885437 3060562
36943 3060562 2716103 3269247 4190259 4096984 2443311 517623 -37953 906469 2355340
36934 2355340 3607290 4249244 3655577 1962792 858591 1745191 3621529 4540804 4627301
36925 4627301 5470755 6862928 6831444 5184804 4142481 4596303 4722430 3737262 3892002
36916 3892002 6347960 7966620 5643361 1751445 1133860 3708380 4576068 1687298
36908 1687298 -1074635 14246 3126892 4076104 2238464 471116 662549 1946118
36900 1946118 2560478 1478090 -1194346 -3785176 -3806481 -891439 1733522 701561 -2944617
36891 -2944617 -4725807 -2326515 1722732 3453653 1883349 -775616 -2020439 -1107448
36883 -1107448 1037228 2848043 3154037 1866592 -77067 -1444616 -1457088 -188292 1417430
36874 1417430 2154328 1621203 621064 293323 1062877 2512606 3743110 3709902 2085141
36865 2085141 213357 158913 2074411 3661918 3261115 2160757 2317228 3069844 2318853
36856 2318853 111299 -1561027 -2224274 -3338459 -4995403 -5190236 -3400531 -2094203
36848 -2094203 -2978517 -4055357 -2507311 1200922 4264329 5270411 4844199 3605041
36840 3605041 1738101 33136 -717270 -1064545 -1940616 -2850278 -2867718 -2859256 -4386376
36831 -4386376 -6487225 -6080977 -2220494 2266798 4423017 4535721 4470344 4252478 2401233
36822 2401233 -892463 -3007759 -1947791 982281 2513621 1140695 -1361629 -2401702
36814 -2401702 -1708385 -1018002 -1075849 -620302 1156544 2822972 2678433 1284548 446975
36805 446975 597467 934781 1367550 2239619 2658847 1475021 -251808 -359601 630338
36796 630338 -288498 -3771739 -6408359 -5441647 -2589138 -1019615 -812035 -89786 1154508
36787 1154508 1564875 1704791 3464896 6382998 7692977 6440420 4767949 4407120 4467931
36778 4467931 3704877 2568299 1671570 386693 -1405675 -2061535 -578894 1265423 1247566
36769 1247566 -32309 -389060 393956 710255 347220 911352 2821519 4350225 4471666
36760 4471666 4574522 6104535 8063525 8293279 6330623 3761492 2286131 2319464 3050489
36751 3050489 3246577 2434253 1616574 2181509 3985415 5583346 6515608 7806947 9673943
36742 9673943 10651211 10122507 9742797 10618841 10983916 9078893 6734418 6965707 8923419
36733 8923419 8787497 5615889 2652466 2082643 2105660 871583 81259 2108770 5834259
36724 5834259 8147050 8164971 7366432 6599124 5596338 4877689 5497555 6838788 6894408
36715 6894408 5180001 3582326 3730604 4967962 5665462 5471733 5332774 5727832 5743520
36706 5743520 4271595 1956422 1153361 3115476 5783878 5955305 3596938 1938307
36698 1938307 2704603 3712344 2711964 1236282 2121110 4878142 6486724 5856003 4518823
36689 4518823 3373255 1842068 362120 645089 2756845 4624096 5367712 6549543
36681 6549543 8825931 9868670 7645275 4006282 2681084 4545744 6942455 7401376
36673 7401376 6229770 5197493 5113051 5452207 5647350 5880545 6667901 8277702 10746584
36664 10746584 13875737 16757114 18042999 17705405 17890134 20452722 24081492 26034819
36656 26034819 26660824 29405087 35784781 43563768 51104716 59952128 71254728 83731739
36648 83731739 98070699 119041842 149596336 187920507 235040028 297461855 370962623
36641 370962623 426208304 426970238 367866233 283080365 211820559 164569431 129245098
36634 129245098 98288847 75892509 64043170 56511615 48362615 41272209 36851496
36627 36851496 32462169 26476367 21494032 19475019 18560320 17060344 16081506 15907929
36619 15907929 14064148 9613657 5730985 5269097 6745633 7210175 6385807 5516938 4574868
36610 4574868 3228824 2691783 4073667 6160112 6821055 5594240 3462997 1363163
36602 1363163 204012 907624 2998298 4432192 4084124 3102035 2693129 2155571 521289
36593 521289 -1323739 -1806518 -860848 523866 1966496 3506347 4625369 4807162 4415738
36584 4415738 3976103 3320668 2301865 1364573 492569 -1246815 -3942485 -5761813 -5067398
36575 -5067398 -2758657 -1021865 -343217 757719 3269206 6213533 7670690 6558354
36567 6558354 3518209 461919 -1089208 -1397996 -1625503 -1659063 -262825 2235761 3318665
36558 3318665 1585164 -957559 -1661638 -996359 -1389911 -3146015 -4027940 -2919637 -1520346
36549 -1520346 -1620256 -2516538 -2303204 -536034 1617873 3202979 4305807 5384622 6803721
36540 6803721 9011891 12234135 15672465 17769224 17822438 16799109 15870966 14689554 12217789
36531 12217789 8986635 6954384 6762363 6749594 5576882 4252109 4156880 4498666 3664654
36522 3664654 2080936 1491674 2027523 2383546 2576358 3892956 5972962 6643735 5262735
36513 5262735 3677545 3040950 2250866 696254 -98814 724088 1296364 -117265 -2136544
36504 -2136544 -2412420 -1144676 -113634 368816 969012 956310 -770484 -2837268 -2552474
36495 -2552474 -51764 1425868 82242 -1938255 -1716991 522724 2102442 1529949
36487 1529949 87819 -55433 1539592 3198853 3254485 2132808 1687519 2502561 2970949
36478 2970949 1651459 -510853 -1354614 -207154 1605737 2459081 1778056 230119 -678641
36469 -678641 102534 1573430 1379251 -1030000 -3221279 -2997019 -1376756 -676276 -1039477
36460 -1039477 -1153923 -1245523 -2516815 -4170724 -4060027 -2338314 -1418996 -1864473 -1482657
36451 -1482657 487870 1543793 112221 -1317088 120127 3012510 3792321 2156122
36443 2156122 1056084 1710827 1908037 -136740 -2981162 -4258558 -3762420 -2766552 -1762466
36434 -1762466 -556845 284797 -150718 -1513076 -2430367 -2410962 -2305112 -2706141 -3057109
36425 -3057109 -2765455 -2160893 -1697426 -1068931 69282 1166293 1467888 1176088 1026382
36416 1026382 1079460 823590 159551 -583122 -1231193 -1481175 -646653 1081924 1827405
36407 1827405 232497 -1981170 -1833383 614108 2271869 1697093 895927 1354230 1278032
36398 1278032 -1045379 -3639945 -3499875 -1197672 276302 275910 856788 2677435 3782521
36389 3782521 3041918 2056986 2496018 3533550 3253637 1354877 -625291 -1093483 160596
36380 160596 1784596 2025891 642247 -638551 -293468 1045161 1933495 2462603 3469284
36371 3469284 4186546 3092254 880181 -60629 531665 165407 -2356981 -4852784 -5106837
36362 -5106837 -4007968 -3532900 -3503202 -2512720 -763581 257022 148639 -405767 -1454899
36353 -1454899 -3469841 -5367554 -5006377 -2207058 445898 769252 -298742 -354620 881145
36344 881145 1229024 -579510 -2728499 -2636140 -618688 408003 -1097715 -3375178 -4141043
36335 -4141043 -3625708 -3391564 -3454383 -2622587 -1034487 -172356 -452049 -832708 -963242
36326 -963242 -1697589 -3065236 -3706094 -3047799 -2284215 -2337705 -2446552 -1697566 -493778
36317 -493778 442671 1136969 1503141 843285 -731596 -1689001 -991687 512624 1523841
36308 1523841 1816799 1491590 340727 -891935 -445191 1675010 2644617 626426 -1973168
36299 -1973168 -1619035 1130957 2448785 787795 -1399490 -1674788 -495887 674609
36291 674609 1592342 2269629 1819872 -113347 -2126566 -2787109 -2588265 -2701393 -2647861
36282 -2647861 -1056309 1465826 2122286 -671274 -4899194 -7050619 -6023151 -3783503
36274 -3783503 -2379834 -1774723 -1187388 -1111643 -2419636 -4096616 -3804345 -1021082 1947535
36265 1947535 2768172 1612879 103327 -1019263 -1958484 -2465079 -1822926 -76191 1721969
36256 1721969 2536189 2157107 1182969 498016 419208 265940 -587993 -1328572 -590150 1129282
36246 1129282 1644926 340269 -656444 231494 1497093 1128990 -90877 -327520 -278738
36237 -278738 -1931057 -4477761 -4945520 -3073304 -2124793 -3772650 -5283780 -3650568 -74812
36228 -74812 1975337 1480136 183958 -740072 -1772434 -3046192 -3595166 -3079922 -2553637
36219 -2553637 -2760539 -2878399 -1819620 -18294 978967 415283 -862796 -1447126 -777677
36210 -777677 507540 1296146 981522 -64835 -893479 -963994 -747702 -1161317 -2382313
36201 -2382313 -3523621 -3612336 -2562031 -991507 455628 1217388 758767 -864843 -2631769
36192 -2631769 -3426441 -3121945 -2260312 -1136714 -6916 439832 61733 124132 1505925
36183 1505925 2520459 783636 -2767297 -4479397 -3353520 -2837634 -5511709 -8678208
36175 -8678208 -7960723 -3499586 443727 1092704 -506971 -2261390 -3299672 -3315250 -2073260
36166 -2073260 -216838 1017600 1190878 579141 -907528 -3094753 -4307017 -2876437
36158 -2876437 163342 2006230 1878900 1806044 3140378 4436016 3694090 1081322 -1626621
36149 -1626621 -3174655 -3534972 -3246228 -2655875 -1541602 344947 2040034 1723237 -634514
36140 -634514 -2320521 -1377284 273074 -332730 -2395665 -2594283 -521533 789053 -120730
36131 -120730 -1382503 -1749549 -2460948 -3911367 -4242894 -3053087 -2862543 -4604803 -5178901
36122 -5178901 -2409846 715477 262846 -2714993 -4201839 -3260319 -2196130 -2035516 -1726950
36113 -1726950 -1142022 -1259250 -1692290 -1268223 -688420 -1388192 -2188293 -715598 1906603
36104 1906603 1816361 -1399823 -3325881 -1223960 1716042 1215650 -1866003 -3383246 -2197528
36095 -2197528 -1079771 -1824062 -2794941 -2098696 -615653 -234502 -592989 345255 2817330
36086 2817330 4369283 3111814 368133 -1179853 -950579 -436108 -409071 -272198 -114470
36077 -114470 -1049450 -2872254 -3625822 -2596476 -1679843 -2403603 -3584618 -3601181 -3053413
36068 -3053413 -3132809 -3095272 -1710891 184717 1004369 1017035 1196973 802482 -1064162
36059 -1064162 -2611216 -1272651 2180076 4594714 4999089 4934427 4671222 2847632 59018
36050 59018 -1034655 6147 571472 -495829 -1081160 118024 1119470 148718 -1442386
36041 -1442386 -1810808 -1401921 -959383 510613 3298847 4986289 3686874 1313031 800667
36032 800667 1820074 2142230 1709169 2127901 3136616 2847575 1092513 -457047 -1342903
36023 -1342903 -2597802 -3791032 -2659273 1413614 5752810 7382350 6212947 4379231
36015 4379231 3641532 4339290 5973979 7760769 8784586 8244693 5918499 2657209 256375
36006 256375 17291 1135492 1375989 -195022 -2102545 -2615308 -1814798 -695730 463662
35997 463662 1532484 1458672 -558412 -3375351 -4818375 -3988199 -1671539 920880 2778099
35988 2778099 3196774 2467768 1860511 1940593 1733403 539663 -593792 -528079 66527
35979 66527 16921 -373551 -411323 -785062 -2136121 -3060807 -2018287 -262978 -140203 -1218950
35969 -1218950 -1180720 -113770 -447263 -2376282 -2966403 -932915 920637 -202473 -3098784
35960 -3098784 -4619971 -3785348 -1919948 -189808 1102444 1748140 1781706 1811963 2144341
35951 2144341 2252065 1874267 1684223 2021726 1933281 459012 -1812225 -3274637 -2904560
35942 -2904560 -950686 1313806 2339081 1604115 236466 -491170 -876298 -1680424 -1972428
35933 -1972428 -290587 2225744 2544235 45736 -2545561 -3287656 -3208860 -3211212 -1952025
35924 -1952025 1126183 3502042 3033756 1488481 1710798 3129249 3236152 2020482 1389991
35915 1389991 1109432 -851489 -3955079 -4822139 -2262593 511427 232960 -2134436 -3214235
35906 -3214235 -1824030 49576 298394 -749121 -1060955 416411 2363455 2735669 1512294
35897 1512294 766358 1773406 3407969 4144480 4160899 4234733 4014598 3054406 2280048
35888 2280048 2448856 2225090 18565 -3075349 -4561380 -4216222 -3991398 -4534725 -4364639
35879 -4364639 -2610382 -244619 1630461 2672484 2534689 1397310 996831 2523949
35871 2523949 3730054 1319952 -3564583 -5885787 -3674776 -728588 -670420 -2012240
35863 -2012240 -1747534 -595049 -1106608 -2761629 -2858917 -1266437 -597413 -1739846 -2366852
35854 -2366852 -553872 2402019 3694555 2206873 -646523 -2549628 -2488528 -1570323 -1356871
35845 -1356871 -1509185 -351406 2031799 3287195 2352658 1284291 1832102 2446148 1176878
35836 1176878 -434768 336837 2456311 2218753 -994947 -3673344 -3327640 -1405493 -183539
35827 -183539 200841 261631 -607487 -2583998 -4048739 -3601643 -2092898 -1133366 -775527
35818 -775527 -111940 801828 1027065 184877 -1145086 -2016167 -1672840 -298009 580693
35809 580693 -370638 -2076909 -1944441 493884 2598128 2180118 240034 -1050890 -1306843
35800 -1306843 -1329923 -1245455 -1103400 -1865700 -3655071 -4253525 -1768784 2051241 3710797
35791 3710797 2660011 1447943 1374537 920101 -901119 -2395832 -1829016 -223893 164829
35782 164829 -975942 -1850358 -1005921 1031161 2278656 1083653 -2126395 -4864937 -5183153
35773 -5183153 -4068834 -3957093 -5000200 -4758708 -2045910 1060370 2150165 1502949 722032
35764 722032 157712 -398439 -29112 1831469 3221892 1714206 -1590742 -2835750 -572556
35755 -572556 2341794 2958256 2105290 2408544 4006983 4408986 2266877 -584485 -1507917
35746 -1507917 -478525 -32113 -1777269 -4002234 -3854748 -1516901 -362228 -2212075
35738 -2212075 -4379457 -3372133 -165938 1006317 -1221473 -3458454 -2467541 742862
35730 742862 3097954 3497017 2900247 2070858 1224618 889745 1339335 1855921 1922444 2269411
35720 2269411 3353405 3813428 2166471 -680038 -2373254 -2155133 -1410956 -1538895 -2632564
35711 -2632564 -3853328 -3906864 -1844279 1370750 3112791 2373637 1433573 2342993 3427314
35702 3427314 2132127 -208393 -347350 939648 -407627 -4647969 -6825860 -4171129
35694 -4171129 -313426 613117 -88278 724059 2088403 1331312 -7125 1938190 6321198
35685 6321198 7739662 4106894 -221238 -805998 1198548 2045164 1093794 529655 1074694
35676 1074694 1070842 -454047 -2227428 -2752894 -2320191 -2169291 -2524439 -2444060 -1419889
35667 -1419889 -172413 536976 1113578 2244486 3270320 2770904 783824 -1067685 -2038334
35658 -2038334 -3153930 -4797207 -5236104 -3164171 -299749 550442 -781422 -1926152
35650 -1926152 -1280213 528280 2025049 2098893 302644 -2421745 -3851615 -2962248 -1580712
35641 -1580712 -1746657 -2447238 -1462456 432456 371964 -1636231 -2196090 286900 3203756
35632 3203756 3834057 2869706 2184735 1771669 938794 311031 416130 84048 -1538977
35623 -1538977 -2912194 -2241311 -400767 502188 416393 937189 2351071 3291983 2991058
35614 2991058 1986390 821767 -343128 -1015054 -636199 588159 2050726 3335196
35606 3335196 3646380 1891135 -1324266 -3109848 -1533841 1655633 3484780 3703463
35598 3703463 3893677 3850918 2106064 -370876 -639391 1394370 2043114 -784558 -4167606
35589 -4167606 -4254579 -1571971 258431 -258031 -1197456 -710729 593060 1176910 783871
35580 783871 287675 277861 614618 1003799 1341381 1508784 1350374 1130328 1646712 3329258
35570 3329258 5337510 6272818 5857245 5029683 4200555 2727712 836224 490617 2709532
35561 2709532 5076755 4087104 -319686 -4619393 -6158157 -5723513 -5249999 -4975752 -3911331
35552 -3911331 -1704329 1045025 3390848 4274562 3172008 1129660 68732 423216
35544 423216 613133 -496324 -1964562 -2504335 -2442338 -2666051 -2766684 -1745073 197055
35535 197055 1965513 3011802 3181270 1984018 -334650 -1707338 -291829 2550323
35527 2550323 3393016 1165678 -1487458 -1882976 -515858 391857 -36678 -1086193 -2095759
35518 -2095759 -2785378 -2637777 -1464127 -204058 197228 373334 1540579 3136646 3189531
35509 3189531 1287040 -571528 -784763 -206016 -331686 -846321 -419654 1052445 2538960
35500 2538960 3475902 3788213 3068441 1479636 810663 2494348 4897610 4962923 2565046
35491 2565046 613255 427595 25264 -1827191 -2964461 -1367463 1255284 2152661 1725471
35482 1725471 1966301 2387546 1111634 -915102 -688563 1893808 3522538 2507380 881926
35473 881926 479294 261750 -805746 -1285354 34199 1386957 648827 -953745 -498596
35464 -498596 2217495 4491605 4543012 3229555 1929178 754603 -613475 -1806709 -2234178
35455 -2234178 -1908237 -1328724 -928948 -773671 -526728 197311 1217624 1813828 1658956
35446 1658956 1312006 1358259 1466776 880214 -342966 -1130308 -604173 667825 920204
35437 920204 -885749 -3421488 -4170729 -2683092 -1443954 -2434774 -4145987 -3836619 -1642335
35428 -1642335 84905 794118 1896128 2968638 1568171 -2062855 -3774741 -1137558
35420 -1137558 2754687 3693970 1960354 545990 29712 -1230775 -3199054 -4078781 -3536641
35411 -3536641 -2829666 -2119637 -691375 439647 -714604 -3617460 -5442345 -5186108 -4720980
35402 -4720980 -5193354 -5249933 -3906223 -2627680 -3086063 -4687817 -5609858 -4861344 -2494089
35393 -2494089 671122 2799546 2241531 -147593 -1486261 -465196 1188878 1594407
35385 1594407 1106039 735248 214957 -728114 -851238 903594 3288166 4140017 3111648
35376 3111648 1445105 -154838 -1723792 -2734321 -2421529 -1283551 -713273 -1052357 -1270691
35367 -1270691 -698411 70963 271244 3013 -225783 -333522 -570612 -914013 -955712 -414979
35357 -414979 389538 762075 419874 -145316 -302866 11905 525906 1073118 1286336 518682
35347 518682 -1004887 -1667767 -489895 872100 12349 -2507273 -3523222 -1721101 591733
35338 591733 1095534 581411 952120 2084560 2715128 2984579 3785826 4429335 3295981
35329 3295981 590907 -1554736 -1823480 -972525 -312588 -392058 -1257385 -2546347 -3076996
35320 -3076996 -1752553 611825 1515963 -470465 -3877950 -5822695 -4890600 -2193798
35312 -2193798 78149 807745 701894 1003294 1747712 1927907 1374433 1297850 2233393
35303 2233393 2574520 535087 -3045693 -5429924 -5371445 -4288552 -3909377 -4220122 -4301651
35294 -4301651 -3953410 -3561550 -3092256 -2172449 -900506 178616 907782 1757410 2954901
35285 2954901 3676035 2701434 182401 -1784705 -1246770 1050728 2382338 1642347 794318
35276 794318 1729496 3084367 2069086 -1231492 -3670186 -3369474 -2089801 -2286524 -3550394
35267 -3550394 -3644265 -2151987 -1154437 -2162283 -3921269 -4101053 -2377683 -799660 -1159308
35258 -1159308 -2868629 -3867136 -3084382 -1290172 300369 1383575 2253103 2858817 2815197
35249 2815197 2088845 1190058 731332 970096 1570789 1703221 771868 -726686 -1517672
35240 -1517672 -1075632 -459240 -1173343 -3384767 -5609926 -6117039 -4547809 -2255339 -910787
35231 -910787 -610905 102585 1788941 2579180 588953 -2686949 -3622130 -1404078 658223
35222 658223 -165706 -2348306 -2939323 -2051314 -1912610 -2696556 -2331989 -314870 1077212
35213 1077212 80324 -2101690 -3130541 -2440357 -1331016 -993944 -1308199 -1387630 -972731
35204 -972731 -1102858 -2872120 -5405422 -6241840 -4543002 -2645706 -2975257 -4490626 -4186494
35195 -4186494 -1584207 471905 -346393 -3047982 -4852372 -4268155 -2263164 -1172338
35187 -1172338 -2418796 -4721476 -5172152 -2842178 -190971 252603 -921569 -1809946 -2290996
35178 -2290996 -2753925 -1654695 1990490 5004628 3423083 -975562 -2394000 338007
35170 338007 2043023 -525588 -4041608 -4731906 -3948753 -3942702 -2771307 1633494 5855612
35161 5855612 5101994 805771 -1440249 -303978 519762 -477951 -435655 1957663 3703213
35152 3703213 2737022 1542339 2713633 4243344 2502173 -2103205 -5566277 -5456032
35144 -5456032 -3144181 -1164627 -380271 -150259 -105688 -938350 -3287143 -6043357 -6646958
35135 -6646958 -3932412 -27916 1909205 1454040 838449 1358408 1847153 1099912 -107613
35126 -107613 -355537 451038 1375598 1685106 1098697 -207219 -1255342 -950228 321175
35117 321175 819221 -198519 -1308575 -848588 885811 2117817 1536434 -786336 -3587775
35108 -3587775 -4949451 -3583024 -421042 1745959 1033075 -1564446 -3514715 -3545117 -2483072
35099 -2483072 -1714274 -1495248 -893059 724486 2299916 1845020 -888423 -3329574 -2894608
35090 -2894608 -296852 1527575 1420977 906053 1057952 904668 -202360 -903939 -33572
35081 -33572 1261868 1339492 640552 632233 1220808 1119052 83070 -1074361 -2214389 -3736070
35071 -3736070 -4925126 -4360858 -2254107 -763520 -1386952 -3202682 -4331573 -4282013 -4118863
35062 -4118863 -4671244 -5143592 -3748074 55330 4063164 4912693 1673972 -2910546 -5509884
35053 -5509884 -5696420 -5297708 -5131090 -4152861 -1775721 705470 1638101 903293 -294822
35044 -294822 -821167 -425167 203776 -26658 -1366682 -2407651 -1363191 1544319 3835077
35035 3835077 3407745 771691 -1812467 -2759931 -2143568 -851588 365396 1121733 1349552
35026 1349552 1210856 841305 213097 -593489 -1176058 -1184643 -822260 -598027 -507957 129358
35016 129358 1605600 2768655 1782030 -1592727 -5010248 -5748235 -3805060 -1783602 -1524406
35007 -1524406 -2105735 -1852861 -970604 -719156 -879702 -33383 1792126 2858177 2637060
34998 2637060 2980594 5072630 6818991 5270105 963912 -2202119 -1560147 1528668
34990 1528668 3890939 4082229 2973166 2095332 2514285 4411699 6503440 6552466 3936367
34981 3936367 1265143 1683029 4621795 6280006 4784790 2534488 2090030 2151242 214981
34972 214981 -2455581 -2154803 1234112 3349834 1635527 -855026 -106438 3056404 4732472
34963 4732472 3755001 2374422 1876075 1032512 -658506 -1345801 183429 2184775 2381565
34954 2381565 1165376 544495 862595 477488 -1504597 -3777538 -4472955 -3293098 -1610823
34945 -1610823 -973588 -1765958 -2982151 -3109945 -1516224 791450 1909924 848579 -1303723
34936 -1303723 -2283251 -1044063 949825 1393764 14916 -1163160 -692719 424135 674801
34927 674801 601125 1675934 3342898 3497255 2074787 1754766 4010364 6465098 5920742
34918 5920742 2715803 113869 6180 1130368 1415096 340237 -1314971 -2592684
34910 -2592684 -2648147 -1064757 1363893 2891290 2559504 1259386 556929 881244 1400560
34901 1400560 1353278 847743 371530 69232 -219047 -452557 -305837 276150 670286 127427
34891 127427 -1164803 -1976140 -1371086 81884 943960 695161 300308 762269 1638475
34882 1638475 1567741 133359 -1404245 -1485813 4234 1777543 2730515 2893981 2655283
34873 2655283 1730250 -338185 -2838304 -3937728 -2546510 220127 1912098 1107862
34865 1107862 -1230627 -2757236 -2068352 -26586 1344023 1201588 589728 539045 321021
34856 321021 -1330631 -3709172 -4426396 -2562833 -124841 439420 -914854 -2402159 -2840242
34847 -2840242 -2322279 -1210742 137880 1000787 956888 756389 1314723 2018622 1382455
34838 1382455 -613109 -2266649 -2466341 -1846932 -1249410 -512969 453803 778437 -84842
34829 -84842 -1174481 -1309605 -830605 -920293 -1790152 -2712294 -3404843 -4169903 -4887711 -5016946
34819 -5016946 -4514687 -3772208 -2773685 -1333212 -10259 374057 99100 176586 558163
34810 558163 160537 -965572 -1110669 538013 2234021 1924539 157763 -847031 -432871
34801 -432871 -78951 -878947 -2169924 -2988672 -3296828 -3085607 -1778561 288926 1022073
34792 1022073 -1027680 -3872918 -3663361 482120 4764959 4879739 982219 -2717885
34784 -2717885 -2881070 -256371 2069722 2331402 1239941 282547 291 -1363 -131190
34775 -131190 -367517 -508234 -538650 -708757 -1305620 -2348568 -3522816 -4426229 -4791536
34766 -4791536 -4409359 -3043022 -758904 1617876 2755856 1947750 32451 -1160900
34758 -1160900 -618385 707405 931565 -548272 -2370390 -2965908 -2341799 -1498562 -762185
34749 -762185 87538 369390 -1062725 -3502740 -4325493 -2401836 14421 545447 426200
34740 426200 2409211 5642190 5946132 1900506 -2458817 -2863600 -347280 916310 -391532
34731 -391532 -1941494 -2213808 -2386391 -3207135 -2962171 -285356 2907925 3417037 905866
34722 905866 -1790052 -2350881 -1395924 -869875 -1258857 -1351891 -322457 928706 825254
34713 825254 -944770 -3032389 -3883487 -3132467 -1510123 42798 825087 474405 -730181
34704 -730181 -1835353 -2004739 -1278467 -240556 767374 1665930 2277758 2623216 3267761
34695 3267761 4544118 5583015 5070024 3089651 1330885 1081748 1648835 1231502 -928212
34686 -928212 -3578262 -4597855 -3152400 -739608 285120 -627411 -1690443 -1260670 138836
34677 138836 1077581 1401044 1793459 2062666 1628410 1127102 1527334 1974556 733992
34668 733992 -1754474 -3152161 -2803028 -2464357 -2859936 -2327937 -142377 1579038 1124830
34659 1124830 -74652 -103841 263876 -443381 -1198927 -248980 1309429 875806 -1477909
34650 -1477909 -3133042 -2830712 -1768672 -1114312 -1003357 -1719199 -3270873 -4061196 -2644264
34641 -2644264 -546357 -478254 -1985431 -2139574 -572572 -107172 -1778979 -3187183 -3109869
34632 -3109869 -3736327 -6135413 -7286593 -4685528 -826068 434648 -429812 -364747 676672
34623 676672 162134 -1876150 -2491700 -883557 102932 -1347238 -3055052 -2265462 305249
34614 305249 1768829 972540 -667236 -1472482 -1157018 -403315 127380 176020 -198539
34605 -198539 -740807 -985649 -379716 1066797 2255491 1957961 613949 162471 1406401
34596 1406401 2603514 1727324 -797014 -2890773 -3553775 -3300442 -2483666 -955301 736850
34587 736850 1474483 1102301 536942 195646 -450091 -1560399 -2351362 -2191319 -1397179
34578 -1397179 -695631 -562059 -1081751 -1796663 -1873115 -1078192 -158007 455009 1436020 2910694
34568 2910694 3102417 578438 -2838323 -3786122 -1926491 -381393 -1230337 -2956062 -3258798
34559 -3258798 -2248811 -1495246 -1547995 -1882231 -2212686 -2582060 -2827794 -2771954 -2317630 -1086495
34549 -1086495 986927 2568833 2002165 -92069 -993125 673741 3360659 5089901
34541 5089901 5516900 4720353 2447513 48438 536476 4389366 7528186 6339917 2874432
34532 2874432 1686633 2885922 2360666 -1406485 -4952551 -5167139 -3380992 -2465926 -2783435
34523 -2783435 -3128302 -3466506 -4330774 -4912510 -4079848 -2523009 -1874961 -2186682 -2173854
34514 -2173854 -1743304 -2276616 -3994403 -4810718 -2937294 416935 2358275 2027423 1555590
34505 1555590 2832047 4617474 4243944 1561284 -733003 -991733 -784971 -1923044 -3165771
34496 -3165771 -2165805 340700 1113371 -753945 -2318635 -1105097 1354814 1945124 338257
34487 338257 -1015179 -481713 1022093 1768255 1259758 313956 34001 968488 2765892
34478 2765892 4466032 5302150 5173875 4430328 3676135 3722915 4822652 5726760 4649017
34469 4649017 1785162 -301270 166213 1669085 1430735 -755705 -2380614 -1680770 319371
34460 319371 1388883 427099 -1997238 -4256036 -4530241 -2230039 1005667 2704545 2342825
34451 2342825 1742805 2347759 3384540 3509302 3013859 3067312 3542415 3139581 1510314
34442 1510314 -73947 -356078 594734 1903137 2827065 2916588 2112325 1155285 1198111
34433 1198111 2426331 3549619 3216405 1547872 -263546 -1472121 -2185910 -2495231 -2051889
34424 -2051889 -709277 952831 1956709 1531295 -438094 -2990829 -4265092 -3020356
34416 -3020356 -257373 1548855 1283765 365907 431616 918973 273026 -1162317 -1316028
34407 -1316028 448361 2153500 1990700 859712 888431 2326635 3401211 2992998 2010932
34398 2010932 1717908 1763273 822330 -1083027 -1957134 -255435 2495354 2862052 -101977
34389 -101977 -2977982 -2087143 1421756 2984675 1008745 -1140276 -583758 764255 -197488
34380 -197488 -2327705 -1982093 1063653 3303604 2962676 2009195 2079225 2022774 960006
34371 960006 517627 1876881 3225855 2603667 1168442 1031050 1596066 890401 -791191
34362 -791191 -1530044 -1162961 -1009223 -795891 969734 3601446 4375971 2622547 835751
34353 835751 889312 1764699 2058571 2159338 2493604 1941120 -173448 -2334837 -2968458
34344 -2968458 -2869498 -3662828 -5037086 -5357154 -4151707 -2348406 -813499 -97829 -687088
34335 -687088 -1950472 -1854998 462985 2744084 2250667 -374432 -2182282 -2357085 -2886711
34326 -2886711 -4615844 -5443271 -3622018 -657313 757416 264402 -439916 -543869 -922919
34317 -922919 -2023358 -2466512 -577155 3195978 6196378 6212087 3888898 1926927 1937046
34308 1937046 2957862 3374543 3152614 3228298 3677097 3921339 4161771 4963477 5629182
34299 5629182 4681122 2136453 -223685 -1159153 -1089810 -561826 752064 2681880 3633559
34290 3633559 2354258 -80869 -1187584 207348 2766219 4011394 2687177 17289
34282 17289 -1452197 -627305 942509 1295401 614641 141399 -595865 -3063183 -6328251
34273 -6328251 -7211264 -4734849 -1884013 -1500268 -2692766 -3122254 -2729449 -2829873 -3099440
34264 -3099440 -2163835 -361024 570263 166582 -486634 -753099 -734522 -27853 1673361
34255 1673361 3023404 2251194 -122689 -1865323 -2251450 -2505978 -2995057 -2429532 -373601
34246 -373601 1777465 3097738 4254305 5463788 5516936 4015114 2499979 1930196 1033568
34237 1033568 -1060318 -2431908 -973483 1873364 2550782 34486 -3298362 -5291821
34229 -5291821 -6187979 -6810456 -6704480 -5191540 -2995650 -1674673 -1957526 -3240748 -4232568
34220 -4232568 -3734251 -1459319 1388394 2892486 2367052 1136897 824931 1283643 1081891
34211 1081891 -66980 -472182 1308618 4117316 5151745 3279800 437097 -716309
34203 -716309 187768 1220609 704125 -1047995 -2444600 -2421756 -1424967 -888197 -1665923
34194 -1665923 -2873522 -2755912 -992107 625469 480961 -704258 -1073178 -331481 172121
34185 172121 -274917 -949834 -1191352 -1215383 -1215539 -954731 -435861 250342 1644791 3888320
34175 3888320 5151152 3378301 -89134 -1397682 218161 682079 -2929464 -7342905
34167 -7342905 -7349055 -3389754 -876808 -2289204 -4054640 -2444546 910956 1789723 -491627
34158 -491627 -2588656 -2111359 -488923 -301544 -1616916 -2366425 -1549819 -377547 814
34149 814 287702 1348981 1916579 51949 -3361206 -4953467 -3323478 -936633 -406225
34140 -406225 -1034075 -861589 -246062 -882587 -2479390 -3143905 -2557150 -2200769 -2592526
34131 -2592526 -2697458 -2138825 -1740652 -1716474 -1460381 -1243792 -1857029 -2420426 -1097256
34122 -1097256 1557199 2639082 1121433 -654041 -902310 -1080927 -2887634 -5054266
34114 -5054266 -5452382 -4517346 -4095471 -4241009 -3677680 -2621224 -2763291 -4697992 -7132039
34105 -7132039 -8412777 -7560416 -4439639 -295144 2578350 3071065 2454074 2214667 1938210
34096 1938210 852158 -29951 510340 1403268 920432 -123575 395372 2069073 2412490
34087 2412490 1027252 114077 448109 75615 -1962910 -3593234 -2928690 -1075022 -50836
34078 -50836 -1914 -155409 -599835 -1330166 -1320974 -472122 -790078 -3460613 -6222106 -6125006
34068 -6125006 -3816889 -2418220 -2796397 -2817931 -1283823 227199 194707 -526961 -452633
34059 -452633 220702 431447 155847 77335 151523 -97107 -254271 603548 2121186 2528502
34049 2528502 958281 -932369 -748141 1416536 2769147 1374253 -1187867 -1964596
34041 -1964596 -770052 -329458 -2107411 -4027001 -3588080 -1749605 -1759400 -4612712 -7537378
34032 -7537378 -7302564 -3780183 264655 2112709 1330029 -472805 -1635975 -2025470 -2451713
34023 -2451713 -2865526 -2234587 -579049 255010 -955894 -2680351 -2625085 -1178688 -851088
34014 -851088 -2407673 -3694682 -2826151 -648505 900157 1337630 1361113 1200668 619452
34005 619452 -39761 36667 1156461 2835458 4159530 4174630 2630718 646535 -312468
33996 -312468 -475211 -1466781 -3323869 -3571908 -811684 2333680 2197996 -842998 -2956511
33987 -2956511 -2396325 -1525361 -2466236 -3571067 -2227082 784918 2316791 1331733 -193189
33978 -193189 -672694 -746117 -1139707 -928624 720283 2613561 3010899 2179323 1819411
33969 1819411 2395107 2718399 2150700 1533714 1491475 1275533 62301 -1773340 -3512720
33960 -3512720 -5113671 -6383712 -6263173 -4341631 -2212971 -1595755 -1654424 -208743 2492291
33951 2492291 3498528 1329329 -1699251 -2660360 -1889168 -1892204 -3399410 -4472694 -3321960
33942 -3321960 -395370 2475546 3836270 3390881 2020857 1139915 1217517 1058791 -468448
33933 -468448 -2219272 -1772682 1072237 3398142 2691036 14187 -1581479 -894938 713040
33924 713040 1912142 2823340 3611857 3478319 2109183 897952 1291963 2547896 2630236
33915 2630236 1147019 -183539 -264859 -243357 -1547053 -3566304 -4534199 -3937579 -2798058
33906 -2798058 -2106748 -2195997 -3086263 -4036308 -3352711 -551024 1633497 -128265 -4714520
33897 -4714520 -6810023 -3517260 1718713 3786766 2394224 1139056 1614284 1911021
33889 1911021 680942 -840443 -1676893 -2896564 -4964817 -5809199 -3762514 -796388
33881 -796388 -324329 -2540865 -4328345 -3686511 -2027122 -1538977 -2199542 -2586994 -2361057
33872 -2361057 -2342882 -2579464 -1909036 171890 2303909 2710984 1345012 -173492 -541653
33863 -541653 27206 549061 441724 -270148 -1255315 -1972217 -1908572 -1102172 -137874 516720
33853 516720 757774 459509 -361142 -882255 -88582 1510543 2016851 762899 -541619
33844 -541619 -418269 60599 -725711 -1918802 -1535675 -85748 -19985 -1603120 -2271802
33835 -2271802 -803975 693995 311494 -709178 -510940 -56955 -1515016 -4410632 -5953424
33826 -5953424 -4813768 -2439029 -676845 68026 164731 -119747 -385343 -126061 640946
33817 640946 1541902 2629704 4103249 5337100 5297961 4067493 2916883 2619663 2677270
33808 2677270 2596515 2967646 4557054 6894618 8506577 8383866 6711178 4230017 1444473
33799 1444473 -1231741 -2896900 -2524920 -322902 1844403 2225515 1184441 551422 1107757
33790 1107757 1850510 1809830 1190390 317936 -981108 -2165074 -1773780 308333 1870479
33781 1870479 1252531 -122286 -7290 1065069 851171 -671216 -1197341 126478 1528739
33772 1528739 1685393 1410945 1410117 759832 -1011174 -2378314 -2011536 -910784 -648910
33763 -648910 -817871 -47863 1468153 2377526 2375337 2089614 1230193 -1079701 -4073376
33754 -4073376 -5406400 -4066158 -1745692 -567797 -638787 -793651 -818508 -1621536 -3432752
33745 -3432752 -5063104 -5415478 -5022380 -5308731 -6486128 -7030230 -5648571 -3123967 -1442891
33736 -1442891 -1420808 -2078918 -2240045 -1705819 -763040 306845 828172 9919 -1725355
33727 -1725355 -2804850 -2699488 -2829822 -4112714 -4889946 -3163899 -66336 1250307 101639
33718 101639 -800488 416111 1922965 1037422 -1797668 -3834371 -3845687 -3080965 -2711831
33709 -2711831 -2312372 -1294900 -355981 -672523 -2398238 -4489534 -5563460 -4793921 -2618621
33700 -2618621 -681800 -315938 -939969 -836468 336780 987164 -907 -1598039 -2289376
33691 -2289376 -2237750 -2526925 -3165537 -3346569 -3059787 -2827113 -2279313 -814435 497075
33682 497075 -289163 -2942861 -4776288 -4191541 -2790003 -2870808 -4240140 -4782058 -3273233
33673 -3273233 -554623 1456448 1327472 -478215 -1510876 -44065 1898025 368258
33665 368258 -4853772 -9063751 -8745246 -6151481 -5185848 -5328455 -3512587 -306620 551874
33656 551874 -1443744 -2414205 -409549 1394696 -116782 -3072755 -3581421 -1236603 1105119
33647 1105119 1574101 871719 468060 1136287 2717210 4042030 3796775 2365168 1722846
33638 1722846 2661413 3564824 2932139 1398213 -8689 -1658534 -3612538 -4085050 -2006069
33629 -2006069 368440 101078 -2099996 -2855825 -867571 1864209 3292181 3348428 2763777
33620 2763777 2132256 2248109 3343428 4018635 2961108 1481077 1871253 3315423 2441193
33611 2441193 -1356644 -4190297 -2822914 982600 3243282 2871705 1696278 843111
33603 843111 -174172 -1208398 -920236 913197 2268600 1145902 -1773311 -3726010
33595 -3726010 -3137900 -1633646 -2161114 -5173726 -7620654 -6430482 -2179745 1951595
33587 1951595 4245822 5557223 6386519 5291099 1493828 -2766842 -4485285 -3626998
33579 -3626998 -2718205 -3047811 -3194204 -1658407 696585 1839064 1272638 359082 170692
33570 170692 150201 -626798 -1609359 -1198642 992564 3299668 3957682 3142381 2254325
33561 2254325 1747823 828506 -822721 -2223527 -2339433 -1387266 -560330 -916189 -2499809
33552 -2499809 -3942658 -3163762 460587 4559473 5591551 2658630 -1424382 -3268327
33544 -3268327 -2195979 -20596 1304314 1025660 -488436 -2130309 -2762277 -2252304 -1490594
33535 -1490594 -1053880 -546362 297619 789587 361230 -352125 -496769 -434530 -1097438 -2377046
33525 -2377046 -3334568 -3746927 -4220893 -4827853 -4885370 -4315591 -3986758 -4134160 -3515689 -1103457
33515 -1103457 2029955 3656066 3083119 1848140 1508031 1742092 1303271 84831 -805338
33506 -805338 -709147 -24513 825778 1801750 2367397 1599282 -81338 -612878 1050901
33497 1050901 3025817 2740561 401614 -1398136 -1140986 148081 713501 -140542 -1895618
33488 -1895618 -3007635 -1634017 2043688 4596805 2725554 -2124352 -5051085 -4034257
33480 -4034257 -2236330 -2962140 -5137856 -5640723 -3804679 -1353951 415457 1082318 99152
33471 99152 -2278514 -3966742 -3147578 -780256 800853 1026803 987958 1048860 696865
33462 696865 240596 575731 1487799 1927208 1653084 1063521 4473 -1597709 -2675573
33453 -2675573 -2370259 -1550933 -1130902 -171015 1940662 2962150 800085 -2126269 -1656842
33444 -1656842 1411741 2055911 -1086611 -3528488 -2210000 -45333 -412868 -1513771
33436 -1513771 -123356 2406593 2423872 152200 -890686 448089 1970011 2262323 2050372
33427 2050372 1533288 -117680 -2295280 -3107941 -2505696 -2493944 -3688125 -4289691 -3191876
33418 -3191876 -1634678 -893831 -537562 80430 569169 631494 646665 406607 -865724
33409 -865724 -2580886 -2927475 -1756358 -1126524 -1932214 -2307818 -865903 705032 193820
33400 193820 -1829981 -3289905 -3547880 -2967856 -1135953 1962600 4180034 3362709 669713
33391 669713 -778960 -162303 533270 -104323 -1546234 -3165890 -4811297 -5427415 -3811135
33382 -3811135 -1182434 -329888 -1493335 -1796643 222032 2312788 2240363 1077900 666385
33373 666385 182441 -2044993 -4978472 -6031444 -4820436 -3117232 -1772133 -319009
33365 -319009 784706 248277 -1592609 -2761020 -2408574 -1613422 -1244781 -1046659 -1009645
33356 -1009645 -1518574 -1873547 -927551 432996 -27201 -2059205 -2578359 -347382 1919416
33347 1919416 2008251 1798380 3556388 5208874 3260461 -1010405 -2771848 -980338 -11686
33338 -11686 -2698170 -5830758 -5212939 -2128015 -1227256 -3597231 -5721209 -5135167 -3597875
33329 -3597875 -3624268 -4727663 -5037803 -4694607 -5096618 -5663125 -4154153 -563633 1827868
33320 1827868 676059 -1960407 -2372196 -379316 631698 -1274128 -3982517 -4610943
33312 -4610943 -3338970 -2358080 -2340192 -1968851 -547427 856306 1197264 950974 1133993
33303 1133993 1714364 1770859 859958 -347980 -713440 322151 2160434 3313676 2431391
33294 2431391 -559102 -4118503 -5994195 -4845065 -1369182 2195073 3987148 3997632
33286 3997632 3510845 3381126 3367779 2976508 2206879 1381669 864153 963424 1450133 1314525
33276 1314525 -9046 -1316136 -941387 490407 438851 -1786823 -3670416 -3229551 -2124888
33267 -2124888 -2901556 -4686210 -4490111 -2141907 -814256 -2247757 -4222418 -3937274 -1770546
33258 -1770546 -139053 -78017 -622764 -842764 -1013813 -1878575 -3592102 -5402420 -6104034
33249 -6104034 -5147094 -3464342 -2640102 -3056745 -3519371 -2929242 -1522951 -102254 1061284
33240 1061284 1921915 2049823 1224352 223811 132576 924265 1430504 861360 -125545
33231 -125545 -175373 1142032 2800347 3435204 2608755 740001 -1595033 -3496557 -3496579 -1106544
33221 -1106544 1391974 797068 -2566918 -4471844 -2432019 514981 214980 -2335489
33213 -2335489 -2750599 -346439 811220 -1574516 -4600682 -4904440 -3320401 -2403352 -2111589
33204 -2111589 -946229 439239 -92444 -2642298 -5022469 -5778261 -5458050 -4995670 -4465323
33195 -4465323 -3490605 -1863926 31393 904300 -339595 -2451836 -2370496 740558 3629812
33186 3629812 3092024 483044 -422602 948865 1464390 -832749 -4210304 -6035767 -5628346
33177 -5628346 -3683745 -1073312 842012 552976 -1789234 -4136761 -4914733 -4531994 -4023782
33168 -4023782 -3495576 -2623830 -1601353 -873782 -695471 -1202585 -2040968 -2054572 -750564
33159 -750564 50201 -1976416 -5856507 -7626030 -5454135 -2270845 -1742632 -3571198 -4782703
33150 -4782703 -4096856 -2618135 -1231250 88617 792257 135407 -841391 -54763 2374665
33141 2374665 3708013 2259595 -342805 -1642835 -1474988 -1197354 -1116030 -461427 716875
33132 716875 1423419 1447256 1730988 2698654 3377966 2731114 1093294 -278411 -685280
33123 -685280 -651483 -1331163 -3282675 -5481501 -5755037 -2971780 1206598 3727801 3528091
33114 3528091 2412612 2148574 2154470 1239582 254277 950793 2783768 3223457 1581625
33105 1581625 299035 1380294 3409688 3756750 2507437 2205074 4074813 6333067
33097 6333067 6505046 4117237 707489 -1801293 -2267636 -784109 1280202 2145933 1255848
33088 1255848 -40885 69694 1726982 3156519 2785762 1182376 286336 793824 1173296
33079 1173296 -189741 -2579418 -3660451 -2304590 364004 2668303 3901048 3966794
33071 3966794 2935622 1713151 1919577 3880867 5491658 4408015 1051341 -1819388
33063 -1819388 -2487212 -2014932 -2262165 -3213790 -3175125 -1276210 1183667 2289103 1833169
33054 1833169 1246837 1288891 964626 -637365 -2544556 -3183699 -2705538 -2466181 -2664668
33045 -2664668 -2322821 -1419942 -967976 -843461 124438 1397545 678932 -2189666 -3857293
33036 -3857293 -1905808 1465999 2486381 851749 -768401 -978137 -725487 -830956 -951852
33027 -951852 -756082 -150010 1253413 3126993 3670356 1870341 -378368 -742553 -104851
33018 -104851 -907379 -2536803 -1845021 1526493 3825725 2262900 -1477259 -4142459 -4887151
33009 -4887151 -4823456 -4626664 -4240997 -3589941 -2311366 50537 2727977 3902061 2948367
33000 2948367 1178778 -248752 -1583298 -2950423 -3329308 -2156184 -528431 259041
32992 259041 176029 -392097 -1625431 -3396192 -4543175 -4048174 -2238591 -295604 704595
32983 704595 212190 -1231787 -1961861 -1089018 -137716 -1024273 -2828934 -2931920 -1102783
32974 -1102783 419274 991123 2361121 4774053 5848826 4567461 2869320 1762570
32966 1762570 -378789 -3561515 -4221327 -615073 3357452 3411735 997549 171869 989969
32957 989969 573377 -1138378 -1570833 -468645 -33483 -476641 293498 2553286 4224523
32948 4224523 4506169 4357980 3420493 402988 -3203795 -3890022 -1380055 700562 355702
32939 355702 -381488 247773 985226 931869 1870179 4632493 6308205 4165507 160220
32930 160220 -1513353 41723 2029391 2153045 830351 -282928 -100296 1329846 2822307
32921 2822307 2966684 1801094 874404 1072559 1486876 1138954 535279 583155 1161294
32912 1161294 1691812 1991951 1791339 725624 -460571 -335611 687067 181343 -2546058
32903 -2546058 -4575689 -3284208 -430598 199238 -1937696 -4046156 -4555287 -4646352 -4914327
32894 -4914327 -3629264 99192 3655687 3712857 727395 -1576507 -1098143 386106 560056
32885 560056 159199 1345178 3643340 4203770 2279729 684802 1526413 2966818 2331321
32876 2331321 335334 -657394 -1033237 -2995873 -5886772 -6364176 -3669421 -1021209 -669602
32867 -669602 -981485 -57576 933143 260799 -1083965 -1074736 260361 1621794 2630209
32858 2630209 3225067 2604437 862542 6745 1150040 2324147 1407218 -398756 -601705
32849 -601705 546476 904829 171094 -233520 -189404 -798906 -1802867 -1941606 -1476618
32840 -1476618 -1521381 -1301914 823939 3823018 4769551 3362759 2315679 2693982 2335179
32831 2335179 43382 -2003264 -1848607 -918738 -1380643 -2531056 -2130775 182247 2837792
32822 2837792 4462763 4349347 2085136 -1436755 -3666441 -2891018 -413084 1203671
32814 1203671 1217012 575430 -251340 -1345189 -1823690 -399162 2388888 4211623 3708247
32805 3708247 2014886 1072267 1337042 1730552 1280332 207396 -576804 -760395 -1068913
32796 -1068913 -2123863 -3207243 -2990223 -1486872 -221046 -91823 -188636 570403 1657444
32787 1657444 1821264 1035442 453020 795612 1688227 2279827 1793874 -95882 -2658287
32778 -2658287 -4329901 -4351666 -3691246 -3477650 -3115517 -1133166 2415060 5601051 6618259
32769 6618259 5160998 2020016 -1553124 -4101627 -4745041 -3966993 -2877301 -1817269
32761 -1817269 -663467 -204472 -1611817 -4244042 -5608419 -4390350 -2288931 -1792633
32753 -1792633 -3114165 -4533735 -5021359 -5052529 -5075277 -4630593 -3327874 -1666358 -377126
32744 -377126 393602 781394 648838 -12043 -390018 613053 2811230 4179906 2637334
32735 2637334 -1394784 -4765292 -4557017 -1169484 2112439 2605215 655283 -1455003
32727 -1455003 -2097377 -1234294 427811 2141877 3136898 2897695 1705037 406651 -468804
32718 -468804 -991318 -1340239 -1671413 -2464939 -4169438 -6171574 -6890978 -5518468 -3146853
32709 -3146853 -1509392 -988543 -624424 222436 1222241 2079851 3012730 3695519 2811273
32700 2811273 -158513 -3218468 -3482149 -824301 1452356 488587 -2665611 -4801502
32692 -4801502 -4969471 -5086275 -6065065 -5809317 -2569244 1478037 2372713 -480366 -3554787
32683 -3554787 -3669196 -1210138 1472501 2863918 2604533 835229 -1421224 -2487909
32675 -2487909 -1922683 -1131154 -1042988 -591694 1039414 2230888 1207610 -630170 -410001
32666 -410001 1607623 2114919 -160577 -2354232 -1663961 738753 1743344 520702 -1249985
32657 -1249985 -2303241 -2952960 -3691834 -4276069 -4416715 -4408827 -4753361 -5471291 -5848509 -4964719
32647 -4964719 -2844250 -822240 -33036 100800 736911 1451486 1036039 259793 1333663
32638 1333663 4074101 5355976 3688040 1583513 1413705 1640352 26228 -1769304
32630 -1769304 -572186 2742531 4184771 2697665 1218961 1473945 1753372 898992 674468
32621 674468 2314547 3883088 3323985 1659005 880272 778467 180083 -534155 -580936
32612 -580936 -796363 -1891309 -2066885 701663 4808229 6385649 4274026 957489 -1322072
32603 -1322072 -2602595 -3134537 -2245011 -317870 592243 -373842 -1314545 -434401 1152474
32594 1152474 1254268 -25369 -693731 127369 1521978 2677080 3549091 3715675 2486548
32585 2486548 546558 -258682 478506 871035 -520903 -2495324 -3140517 -2770378 -3051607
32576 -3051607 -3918270 -3658724 -2123672 -1448672 -2717971 -4054731 -3531064 -2224955 -2380128
32567 -2380128 -3769890 -4238814 -3205109 -2150749 -1780502 -1226300 -382013 -423417 -1155602
32558 -1155602 -443737 2193860 3773554 1786741 -1845549 -3280736 -1978405 -683872
32550 -683872 -913590 -1416268 -1135539 -774510 -648031 456007 2941414 4899466 4477822
32541 4477822 2374849 608882 11857 269344 1234899 2589327 3074376 1745518 -538082
32532 -538082 -2291197 -3361985 -4092934 -3372936 81865 4637141 6570111 4744720 2173946
32523 2173946 1758603 2593449 2167469 334781 -1177535 -1848613 -2256812 -1647602 1321052
32514 1321052 5222585 6302770 3449774 243460 347942 2776961 3751295 1872871
32506 1872871 -769515 -1849408 -982824 983280 2826505 3104209 1283102 -1075523
32498 -1075523 -1814860 -1011452 -746808 -1939270 -3217330 -3390135 -3161081 -3500930 -3964681
32489 -3964681 -3769113 -3225818 -2948792 -2754729 -2400637 -2259333 -2185449 -1003136 1534472
32480 1534472 3533990 3318770 1872673 1124551 880923 -288815 -1882420 -1838135 38739
32471 38739 1660275 2029787 2473366 3719108 4237988 2843784 847605 -4900 -3611
32462 -3611 -158144 -34879 1019115 1769391 566068 -1838042 -3264966 -3385799 -3547971
32453 -3547971 -3592747 -1737280 1804431 3911619 2659448 37960 -1179822 -1317343 -2342233
32444 -2342233 -4062296 -4459485 -3105778 -1535739 -317846 1574874 4006266 4880794
32436 4880794 3280866 1294494 1160427 2186327 2170766 624826 -1192090 -2478673 -3289152
32427 -3289152 -3389380 -2537481 -1493653 -1084439 -727261 349732 978024 -645795 -3737630
32418 -3737630 -5432452 -4678917 -3162591 -2024727 -518915 1208527 1158088 -954643 -2120313
32409 -2120313 -500780 1095421 -707464 -4375832 -5736353 -4354178 -3586537 -4774460
32401 -4774460 -5579574 -4552382 -3393091 -3457109 -3515426 -2651575 -2266878 -3169687 -3409907
32392 -3409907 -1385798 1158943 1751845 884944 471056 314916 -908401 -2384753 -2091355
32383 -2091355 -463809 -44110 -1470372 -2630169 -2098199 -805326 193702 1065268 1577469
32374 1577469 690153 -1007353 -746363 2803667 7043956 8359440 6321389 3356575
32366 3356575 1321880 217008 -425582 -775477 -1183378 -1918425 -2416217 -1969004 -1067117
32357 -1067117 -880583 -1496989 -1941570 -1994161 -2565205 -3812503 -4231398 -2599361 9439
32348 9439 1299484 555897 -654794 -668918 296088 866536 627799 589826 1446314 2249231
32338 2249231 1564106 -436511 -1970541 -1791417 -455565 826184 1678089 2305832 2606361
32329 2606361 2480667 2487534 3117820 3719693 3252393 1965274 1116104 939706 230004 -1565240
32319 -1565240 -3056931 -2619505 -593470 1126877 1192912 -283397 -2381632 -4039384 -4426440
32310 -4426440 -3589681 -2602975 -2354095 -2415785 -1878016 -934522 -560125 -766473 -456695 768929
32300 768929 1883930 1994469 1555689 1391306 1425754 1126988 423441 -540480 -1754775
32291 -1754775 -2664777 -2056031 310081 2742912 3544549 3156286 2953029 2662193 981137
32282 981137 -1554756 -2687219 -1817985 -1010127 -1716849 -2658259 -2343861 -1758319 -2576614
32273 -2576614 -4128250 -4393032 -3214792 -2298419 -2366032 -2413963 -1762166 -924788 -288242
32264 -288242 342503 689057 160569 -749613 -957848 -864921 -1950513 -3868093 -4194251
32255 -4194251 -2078795 -27653 -581845 -2973125 -4687093 -4774249 -3842360 -2243119 -368107
32246 -368107 412393 -617503 -1773077 -1149244 152204 -472945 -2793425 -3768481 -2125076
32237 -2125076 -19727 702766 1128650 2612674 3865484 2936489 660922 -244070 972544
32228 972544 2125583 1073846 -1698323 -3845935 -3811781 -2419080 -1889129 -3122131 -4311439
32219 -4311439 -3262556 -954983 -1017088 -4867107 -9160185 -9698869 -6627228 -3719087 -3232367
32210 -3232367 -3760423 -3153684 -1272695 893460 2929756 4521533 4584493 2464843 -529395
32201 -529395 -2257409 -2369817 -2530338 -3667980 -4196345 -2014943 2256733 5391029 5182085
32192 5182085 2857242 1096205 526223 -490363 -2869286 -5172950 -5511633 -3982904
32184 -3982904 -2358261 -1885225 -2164473 -2044079 -1151240 -432806 -1005103 -2257737 -1766830
32175 -1766830 1821191 6174637 7168065 3695169 -987702 -3337470 -3277934 -2836377 -2706955
32166 -2706955 -1976523 -364111 1116644 1545710 941517 -16637 -261583 1017829 3054387
32157 3054387 3668973 1917492 -333509 -824318 73466 397538 -246166 -591536 -240472
32148 -240472 -145971 -681991 -1105698 -897917 -31485 1699529 3795225 4138658 1377223
32139 1377223 -2176305 -2815883 -589419 883160 72912 -451453 1170193 2766054 1742723
32130 1742723 -810835 -2170452 -1958304 -1495782 -978654 -17027 369614 -923752 -2617879
32121 -2617879 -2472167 -636748 736953 811282 779007 1531993 2681622 3786410 4701044
32112 4701044 4803673 3574529 1828508 872500 768632 901107 1562310 3079879 4064514
32103 4064514 2877301 504828 -502708 152993 413707 -288567 -54630 1814438 3097189
32094 3097189 2087566 277365 -203220 305617 555468 1242169 3646178 6378664 6237421
32085 6237421 2456458 -1913435 -3435901 -1862567 238833 672170 -86672 262854 2696571
32076 2696571 5020840 4252579 804444 -1505407 -470380 1453786 935621 -1120031
32068 -1120031 -1127594 1296668 2537995 703899 -1266460 -204785 2238432 2163697 -469248
32059 -469248 -1904604 -662688 122504 -2120876 -4940840 -4330637 -871568 997064 -517974
32050 -517974 -2247515 -1184852 1184428 1795395 879391 865230 1669547 735577 -2050490
32041 -2050490 -3094563 -363698 2947442 2617537 -560429 -2038262 -56441 2367217
32033 2367217 2371604 1046118 785388 1351993 973145 -86790 230943 2332039 4202868
32024 4202868 4353590 3445913 2437527 1075384 -808666 -2232972 -2548315 -2554002 -2827319
32015 -2827319 -2387982 -652606 689509 -92804 -1697755 -1444355 575803 1712254 988316
32006 988316 208615 422820 311678 -785189 -1114259 435449 1972388 1513727 298723
31997 298723 722348 2421087 3031198 1927896 676038 260298 209142 234186 586150
31988 586150 831953 224574 -659284 -388842 1139948 2501373 2680064 1889150 792866
31979 792866 300649 1475575 3931502 5129466 3424490 995639 1018600 2522119 1497549
31970 1497549 -2711934 -5924673 -5203676 -2862798 -2374440 -3329659 -3157625 -1608243 -544321
31961 -544321 -600593 -775356 -605131 -466375 -263676 222852 225423 -953955 -2310457 -2330646
31951 -2330646 -1305614 -684997 -642607 -226908 388130 -95971 -1741467 -2935879 -2690660
31942 -2690660 -1716429 -784953 310832 1437772 1300514 -860596 -3647805 -4773176 -3597370
31933 -3597370 -1539455 -169642 274384 364931 230593 -493694 -1575360 -1864976 -683604
31924 -683604 943573 1425118 900855 1246148 3444305 6094827 7204620 6444506 4767084
31915 4767084 2765196 604534 -1118945 -1854628 -2172088 -3128068 -4621356 -5457870 -5091513
31906 -5091513 -4305068 -3954577 -3825975 -3055787 -1262401 892956 2116782 1687775 435824
31897 435824 -38385 502910 374076 -1725647 -4624416 -5940836 -4845681 -2469888 -204765
31888 -204765 1003290 226187 -2658280 -5645939 -5904296 -2992644 607939 2647810 3238003
31879 3238003 3195573 2180538 -11345 -1822933 -1743253 -986126 -2078174 -4911114 -6576216
31870 -6576216 -5645931 -4215424 -4348207 -4677447 -2800469 472698 2194476 1947982 2100711
31861 2100711 3082656 2052983 -2078977 -5649587 -5127608 -2506725 -2235410 -4424983 -5266104
31852 -5266104 -3531600 -2147614 -2756343 -3088527 -1358015 561429 633513 79323 593778
31843 593778 922044 -606815 -2234963 -934897 2789936 5420267 5006369 2540348 -434167
31834 -434167 -2805787 -3151819 -914196 1885443 2629252 1539620 790279 810354 270249
$$ [...]
##END NTUPLES=NMR SPECTRUM
##END=
