##TITLE=31Pdec_SR146(r)rm
 , 24 sc
 21.2.2023
##JCAMPDX= 6.0         $$ Bruker NMR JCAMP-DX V2.0
##DATA TYPE= NMR SPECTRUM
##DATA CLASS= NTUPLES
##ORIGIN= UXNMR, Bruker Analytische Messtechnik GmbH
##OWNER= root
$$ XWIN-NMR		Version 3.5
$$ Tue Feb 21 17:20:02 2023 Russian Standard Time (UT+4h)  she@DPX200
##.OBSERVE FREQUENCY= 81.013821
##.OBSERVE NUCLEUS= ^31P
##.ACQUISITION MODE= SIMULTANEOUS
##.ACQUISITION SCHEME= undefined
##.AVERAGES= 24
##.DIGITISER RES= 16
##SPECTROMETER/DATA SYSTEM= spect
##.PULSE SEQUENCE= zgpg30
##.SOLVENT NAME= CDCl3
##.SHIFT REFERENCE= (INTERNAL, CDCl3, 0, 248.564)
##AUDIT TRAIL= $$ (NUMBER, WHEN, WHO, WHERE, WHAT)
$$ ##TITLE= Audit trail, XWIN-NMR		Version 3.5
$$ ##JCAMPDX= 5.01
$$ ##ORIGIN= Bruker BioSpin GmbH
$$ ##OWNER= she
$$ F:/spectra/data/she/nmr/P31/1/pdata/1/auditp.txt
$$ ##AUDIT TRAIL=  $$ (NUMBER, WHEN, WHO, WHERE, WHAT)
(   1,<2023-02-21 17:17:52.90 +0400>,<she>,<DPX200>,
      <created by zg, POWCHK disabled, PULCHK disabled
       configuration hash MD5:
       00 E9 B6 7A A2 85 ED C7 34 08 36 98 17 FE 4E 26
       data hash MD5: 32K
       B3 E8 A7 65 2D EC 1D C2 C4 84 66 67 5E E9 55 BA>)
(   2,<2023-02-21 17:19:01.42 +0400>,<she>,<DPX200>,
      <Start of raw data processing
       efp BC_mod = 2 LB = 1 FT_mod = 6 PKNL = 1 PHC0 = -11050.58 PHC1 = 265.2102 SI = 64K 
       data hash MD5: 64K
       A8 40 99 79 46 18 1D E0 60 99 58 F7 BA 2C 5E CE>)
(   3,<2023-02-21 17:19:21.34 +0400>,<she>,<DPX200>,
      <pk PHC0 = 32.44357 PHC1 = -88.2 
       data hash MD5: 64K
       4C 50 AA 53 63 71 47 C7 56 DE DA CC 2D 37 8A D9>)
(   4,<2023-02-21 17:19:24.40 +0400>,<she>,<DPX200>,
      <abs ABSG = 5 
       data hash MD5: 64K
       DA A4 FA A8 96 54 33 1D B2 01 E0 30 F1 C6 0C 52>)
$$ ##END=
$$ 
$$ hash MD5
$$ 6F 87 2F 2B 62 D3 C5 A0 B7 42 5B 59 C1 12 BE 06
##$RELAX= 
##$RELAX= 
##$RELAX= 
##$RELAX= 
##$RELAX= 
##$RELAX= 
##$RELAX= 
##$RELAX= 
##$RELAX= 
$$ Bruker specific parameters
$$ --------------------------
##$DU= <F:/spectra>
##$EXPNO= 1
##$NAME= <P31>
##$PROCNO= 1
##$TYPE= <nmr>
##$USER= <she>
##$AMP= (0..31)
100 100 100 100 100 100 100 100 100 100 100 100 100 100 100 100 100 100 
100 100 100 100 100 100 100 100 100 100 100 100 100 100 
##$AQSEQ= 0
##$AQ_mod= 1
##$AUNM= <au_zg>
##$AUTOPOS= <>
##$BF1= 81.014009
##$BF2= 200.13
##$BF3= 200.13
##$BF4= 200.13
##$BF5= 200.13
##$BF6= 200.13
##$BF7= 200.13
##$BF8= 200.13
##$BYTORDA= 1
##$CFDGTYP= 0
##$CFRGTYP= 5
##$CHEMSTR= <none>
##$CNST= (0..31)
1 1 145 1 1 1 1 1 1 1 1 1 1 1 1 1 1 1 1 1 1 1 1 1 1 1 1 1 1 1 1 1 
##$CPDPRG= <waltz16>
##$CPDPRG1= <>
##$CPDPRG2= <waltz16>
##$CPDPRG3= <>
##$CPDPRG4= <mlev>
##$CPDPRG5= <mlev>
##$CPDPRG6= <mlev>
##$CPDPRG7= <mlev>
##$CPDPRG8= <mlev>
##$CPDPRGB= <>
##$CPDPRGT= <>
##$D= (0..31)
0 1 0 0 0 0 0 0 0 0 0 0.03 2e-05 3e-06 0 0 0 0 0 0 0 0 0 0 0 0 0 0 0 0 
0 0 
##$DATE= 1676985472
##$DBL= (0..7)
120 120 120 11 120 120 24 19 
##$DBP= (0..7)
150 150 150 150 150 150 150 150 
##$DBP07= 0
##$DBPNAM0= <>
##$DBPNAM1= <>
$$ [...]
##$SUBNAM3= <"">
##$SUBNAM4= <"">
##$SUBNAM5= <"">
##$SUBNAM6= <"">
##$SUBNAM7= <"">
##$SUBNAM8= <"">
##$SUBNAM9= <"">
##$SW= 501.771253377433
##$SWIBOX= (0..15)
0 1 3 0 0 0 0 0 0 0 0 0 0 0 0 0 
##$SW_h= 40650.406504065
##$TD= 32768
##$TD0= 1
##$TE= 0
##$TE2= 300
##$TE3= 300
##$TEG= 300
##$TL= (0..7)
0 120 53 12 22 120 120 120 
##$TP= (0..7)
150 150 150 150 150 150 150 150 
##$TP07= 0
##$TPNAME0= <>
##$TPNAME1= <>
##$TPNAME2= <>
##$TPNAME3= <>
##$TPNAME4= <>
##$TPNAME5= <>
##$TPNAME6= <>
##$TPNAME7= <>
##$TPOAL= (0..7)
0.5 0.5 0.5 0.5 0.5 0.5 0.5 0.5 
##$TPOFFS= (0..7)
0 0 0 0 0 0 0 0 
##$TUNHIN= 0
##$TUNHOUT= 0
##$TUNXOUT= 0
##$USERA1= <user>
##$USERA2= <user>
##$USERA3= <user>
##$USERA4= <user>
##$USERA5= <user>
##$V9= 5
##$VALIST= <valist>
##$VCLIST= <CCCCCCCCCCCCCCC>
##$VD= 0
##$VDLIST= <DDDDDDDDDDDDDDD>
##$VPLIST= <PPPPPPPPPPPPPPP>
##$VTLIST= <TTTTTTTTTTTTTTT>
##$WBST= 1024
##$WBSW= 4
##$XGAIN= (0..3)
0 0 0 0 
##$XL= 0
##$YL= 0
##$YMAX_a= 9921
##$YMIN_a= -14948
##$ZGOPTNS= <>
##$ZL1= 120
##$ZL2= 120
##$ZL3= 120
##$ZL4= 120
##$ABSF1= 248.5645
##$ABSF2= -253.2056
##$ABSG= 5
##$ABSL= 3
##$ALPHA= 0
##$AQORDER= 0
##$ASSFAC= 0
##$ASSFACI= 0
##$ASSFACX= 0
##$ASSWID= 0
##$AUNMP= <proc_1d>
##$AZFE= 0.1
##$AZFW= 0.5
##$BCFW= 0
##$BC_mod= 2
##$BYTORDP= 0
##$COROFFS= 0
##$CY= -3
##$DATMOD= 1
##$DC= 0
##$DFILT= <>
##$DTYPP= 0
##$F1P= 0
##$F2P= 0
##$FCOR= 1
##$FTSIZE= 65536
##$FT_mod= 6
##$GAMMA= 0
##$GB= 0
##$INTBC= 1
##$INTSCL= 6.047779e-11
##$ISEN= 30
##$LB= 1
##$LEV0= 0
##$LPBIN= 0
##$MAXI= 10000
##$MC2= 0
##$MEAN= 0
##$ME_mod= 0
##$MI= 50
##$NCOEF= 0
##$NC_proc= -7
##$NLEV= 6
##$NOISF1= 182.463
##$NOISF2= 159.3651
##$NSP= 0
##$NTH_PI= 0
##$NZP= 0
##$OFFSET= 248.5645
##$PC= 4
##$PHC0= -11018.14
##$PHC1= 177.0102
##$PH_mod= 1
##$PKNL= yes
##$PPARMOD= 0
##$PSCAL= 0
##$PSIGN= 0
##$REVERSE= no
##$SF= 81.0140089999694
##$SI= 65536
##$SIGF1= 159.3651
##$SIGF2= -187.1042
##$SINO= 113.3802
##$SIOLD= 16384
##$SREGLST= <1H.CDCl3>
##$SSB= 0
##$STSI= 65536
##$STSR= 0
##$SW_p= 40650.406504065
##$SYMM= 0
##$S_DEV= 0
##$TDeff= 32768
##$TDoff= 0
##$TI= <>
##$TILT= no
##$TM1= 0
##$TM2= 0
##$TOPLEV= 0
##$USERP1= <user>
##$USERP2= <user>
##$USERP3= <user>
##$USERP4= <user>
##$USERP5= <user>
##$WDW= 1
##$XDIM= 65536
##$YMAX_p= 386247546
##$YMIN_p= -84863520
$$ End of Bruker specific parameters
$$ ---------------------------------
##NTUPLES= NMR SPECTRUM
##VAR_NAME=  FREQUENCY,     SPECTRUM/REAL,   SPECTRUM/IMAG
##SYMBOL=    X,             R,               I
##VAR_TYPE=  INDEPENDENT,   DEPENDENT,       DEPENDENT
##VAR_FORM=  AFFN,          ASDF,            ASDF
##VAR_DIM=   65536,         65536,           65536
##UNITS=     HZ,            ARBITRARY UNITS, ARBITRARY UNITS
##FACTOR=    0.620285442955139, 1,           1
##FIRST=     20137.2065510682, 0,            0
##LAST=      -20513.1999529968, 0,           0
##MIN=       -20513.1999529968, -84863520,   0
##MAX=       20137.2065510682, 386247546,    0
$$ Real data points
##PAGE= N=1
##DATA TABLE= (X++(R..R)), XYDATA
$$ [...]
42435h88017R55493r4537r53179L58908K417290K122811n64826k144653n80999
42426F28291J592472J054526j250006j688549L15794J577232M38182q50339l78318
42417A439285K54113o92644j630178n94637Q96144N39477l08046R36991K776075
42408C616580J589656j755574k489959M24912K476472R18314j104713l66873R36401
42399D245216p53846l978172m227887p07516K772707L198113J495849J08319j76621
42390A976162k46839p93761j166514j30994K051615K942023P38147k558570l020082
42381b08813j56020K151751J028738j704546k761850j787864m32844P46812J879517
42372a245119J947684J97151j630676j187276Q95012J790231O32814m54396L00306
$$ y = [-888017, 67476, -27061, -980240, -621332, 1795958, 3918769, 3353943, 1209290, 628291, 2220763, 3275289, 2025283, 336734, 652528, 2229760, 2667942, 1817603, 1439285, 1693398, 1000754, -629424, -1224061, -327917, 211560, -96486, 840505, 3616580, 5206236, 3450662, 960703, 1385615, 3862087, 4780401, 3675688, 3308815, 4245216, 3491370, -486802, -4714689, -5422205, -2649498, 548615, 2044464, 2152783, 1976162, 1729323, 935562, -230952, -361946, 1689669, 4631692, 5369839, 2811269, -208813, -364833, 1786918, 2815656, 1111110, -1650740, -3438604, -3871448, -3124636, -1245119, 702565, 899716, -730960, -1918236, -1023224, 767007, 1399821, 945425, 1245731]
42363A245731J921272K234635N61865j655107k294969n82523J885098K512775
42355E828777O00543j762939k285768j111988m1951K4689k94114k93200l5087
42346F28962K03048N27512J182394J848783J479148m83801k541708k178640M80883
42337A146581J799236m47049l008927j441680K697292L453426o06546m027717
42329d35384k480452J532986L363119K390590N69822j395060k986291k282649
42321a723319Q87063K978854J461203j193223j684526r50592j115159p66686J729814
42312c76571L246037J99062m286176m041280M49269K746920O67432j077419N64454
42303a908272K385474J124835j317368j776897o02224K45159M45841M04473N828
$$ y = [1245731, 3167003, 5401638, 5963503, 4308396, 2013427, 1430904, 3316002, 5828777, 6429320, 4666381, 2380613, 1268625, 1226674, 1251363, 957249, 664049, 628962, 832010, 1359522, 2541916, 4390699, 5869847, 5386046, 2844338, 665698, 1146581, 2945817, 2498768, -510159, -1951839, 745453, 4198879, 3592333, -435384, -2915836, -1382850, 1980269, 4370859, 4940681, 3545621, 559330, -1723319, -836256, 2142598, 3603801, 2410578, 726052, -224540, -1339699, -2106385, -376571, 2869466, 3068528, -1217648, -5258928, -4809659, -2062739, -1395307, -2472726, -1908272, 477202, 1602037, 284669, -1492228, -2094452, -1849293, -1403452, -998979, -993151]
42294i93151j12460J054932K258118J111248j449546j790259M93621J755545N56569
42285B884617k44576O37658L82503k003259k712431L09028K926305J244757k054667
42276A369935k546574j141319j154551j872315o59540J328682J234906N6834N42367
42267b841575J557179L13132j563763m04557K264133J439509k696932m444671
42259f377545j528320J912876K549816K077590K287047J582213q53560k237151
42251e87034o37391J577091J576877P5330r04672j031495k72645K013200M279146
42242F088407K822553k490882o106146l832450J097906K793421Q07856p16172
42234D64493L1243R64651N16907m60880j027146j156408n82046O90988J153162
$$ y = [-993151, -1105611, -50679, 2207439, 3318687, 1869141, 78882, 572503, 2328048, 2884617, 2640041, 3277699, 3660202, 1656943, -1055488, -746460, 2179845, 3424602, 1369935, -1176639, -2317958, -3472509, -5344824, -6004364, -4675682, -3440776, -3383942, -2841575, -1284396, -971264, -2535027, -2939584, -675451, 764058, -1932874, -6377545, -7905865, -5992989, -3443173, -1365583, 921464, 2503677, 1650117, -587034, -1224425, 352666, 1929543, 2004873, 1100201, 68706, -203939, 1809261, 6088407, 8910960, 6420078, 313932, -3518518, -2420612, 372809, 1180665, 464493, 495736, 1460387, 1977294, 1516414, 489268, -667140, -1249186, -558198, 594964]
42225E94964l65433k217952j938810q8594O66754k18007p91482j60410N60265
42216c958705Q36109J332709J760579R70102m37006m66013P11828M90182j866351
42207f26566l464582j889870J249182K693950J707303R1986o53460m99387l6384
42198a427828J68192j24107l43594M02897J822013K318913R76955j235841k675889
42189a18289k464697n18694K429498M390100L351860j37294l006306l155740j573863
42180h03425k10799N27250R74243O79485n54155j435327q54915K14244K94321
42171a169078r0665N00124J609207J445841k1460q32055q1878Q76092P82722J68096
42161C186946p9545k53154q91752j466717j144211j86051M02350K85640R8882
$$ y = [594964, 229531, -1988421, -3927231, -4015825, -3349071, -3567078, -4358560, -4518970, -3958705, -3122596, -1789887, -29308, 940794, 503788, 37775, 749603, 1239785, -626566, -4091148, -5981018, -4731836, -2037886, -330583, -238597, -892057, -1391444, -1427828, -1259636, -1383743, -1727337, -1324440, 497573, 2816486, 3793441, 2557600, -118289, -2582986, -3101680, -672182, 3717918, 7069778, 6932484, 3926178, 770438, -803425, -1014224, -486974, 487269, 1166754, 612599, -822728, -1677643, -1463399, -1169078, -1259743, -759619, 849588, 2295429, 2273969, 1441914, 1360036, 2236128, 3018850, 3186946, 3107401, 2854247, 1962495, 495778, -648433, -834484, -432134, -146494, -47612]
42152d7612M57553J169178J433179O35206r61198k227961k048635l58425J619199
42143c29516K191158O02987j886195k639584l53718K828723L267840L99843k208065
42134A873473j510504R05706J318985o65415j807252k30645J976874K005144L6668
42125C903034j602292j589346n29542M36554P56006N34942J84314j76961r72711
42116I43998k201229k526546p35787J846796K271661m450j908315q76645J552067
42107a638450K147567O16121n79562l09016J4681n43375q17812O4218Q18575J41794
42097h5259q03001n1740J785643K052125M9311j640846q48740R17898P31837j241705
42087H65523j953861k79617J049721l02436k353012j631140J374737K754610J016213
$$ y = [-47612, 409941, 1579119, 3012298, 3647504, 2686306, 458345, -1590290, -1948715, -329516, 1861642, 2464629, 578434, -2061150, -2414868, 413855, 3681695, 4081538, 1873473, 362969, 1268675, 2587660, 1922245, 114993, -115652, 1861222, 3866366, 3903034, 2300742, 711396, 181854, 618408, 1374414, 1909356, 2093670, 1916709, 943998, -1257231, -3783777, -4519564, -2672768, -401107, -405557, -2313872, -3190517, -1638450, 509117, 1125238, 545676, 236660, 251341, -292034, -1109846, -1045628, -227053, -85259, -888260, -940000, 845643, 2897768, 2947079, 1306233, 457493, 1375391, 2107228, 865523, -1088338, -1367955, -318234, -620670, -2973682, -4604822, -3230085, -475475, 540738]
42078E40738q92384l54098J153538R76151n05234j184961j014864j443587k031426
42069d756127q77526J651702K729806J223173o93212j015731m52537k25370J29678
42060b286144R24212O08227j566003k941908o32742L581680M833651J729104j732295
42051B517782j639158J055317K648494J558661o54785j867372j370049Q466O04299
42042B861655o06779k471880k584893n05548J339166J087102R5757L75899J027246
42033F17725o4480j995858j665113J122500K757013J094669j362808j331390O76783
42024a50959J929683J756934J525416J420197K02444j899877k725611j337555
42016G20672L66864L17244q73456j068529J68079J008666O9751j537472j634218
$$ y = [540738, -351646, -705744, 447794, 1423945, 918711, -266250, -1281114, -2724701, -4756127, -5633653, -3981951, -1252145, -28972, -722184, -1737915, -2190452, -2415822, -2286144, -1361932, -753705, -2319708, -5261616, -5894358, -2312678, 2520973, 4250077, 2517782, 878624, 1933941, 4582435, 6141096, 5486311, 3618939, 2248890, 2257356, 2861655, 2254876, -217004, -2801897, -3307445, -1968279, -881177, -785420, -409521, 617725, 553245, -1442613, -3107726, -1985226, 771787, 1866456, 503648, -827742, -150959, 1778724, 3535658, 5061074, 6481271, 6683715, 4783838, 2058227, 720672, 1087536, 1404780, 531324, -537205, -369126, 639540, 709291, -828181, -2462399]
42007b462399J03915J724472J595430K90241p72525j394819j964759j754857L6163
41998d599138J940615J525401o06396r68338J486369L152207J100412k001041
41990A030091j596361J787809L213953O28862k409935k210830J15867J015718
41982A575174m33807j963929j576189K94031J873781K099067J313269M02785l42384
41973C241798j149629j693792j119313L95853J315201R34302N46094R96300O42797
41964D109611j918748m322713k836077J884046M743932K734003j321050k828902
41956B44102r54462J474554J884452K24724j624423j644031L25179J976841J044485
41947B951421j544988k688199j376030J89208J82955n32725n94031k57889n1823
$$ y = [-2462399, -2358484, -634012, 961418, 1251659, 479134, -915685, -2880444, -4635301, -4599138, -2658523, -1133122, -1739518, -2707856, -1221487, 1930720, 3031132, 1030091, -566270, 1221539, 4435492, 5064354, 2654419, 443589, 559456, 1575174, 1141367, -822562, -2398751, -2104720, -230939, 1868128, 3181397, 3584182, 3241798, 2092169, 398377, -720936, -325083, 990118, 1924420, 2470514, 3466814, 4109611, 2190863, -2131850, -4967927, -3083881, 1660051, 4394054, 3073004, 244102, -710360, 764194, 2648646, 2873370, 1248947, -395084, -69905, 1906936, 2951421, 1406433, -1281766, -2657796, -2468588, -2285633, -2818358, -3412389, -3670278, -3722101]
41938c722101N33343J526607J613977L13824q26128o96595l91505r22042j174573
41929c745193m7682J253954J188624M82527N64575R17972L03264p24663q94482
41920g01104o19034r18801j053938K14531J853743J667431k92425j764680j374149
41911b988426L19845K249497L273883K039810j229729l578164k547162N2261M32069
41902a976116j527629k152701K64574K849776K435148j31605j551302l09281K035125
41893f4011K913961J340392j042006j530833L59709J930434Q34131j483419j896251
41884A362107k76228O12867l69527j257376n05612O72535N66264m84450j002966
41875f82386m58313M72004Q03729P8265r12703n65165J321171K612411J674390
$$ y = [-3722101, -3188758, -1662151, -48174, 265650, -560478, -1257073, -1648578, -2570620, -3745193, -3792875, -2538921, -1350297, -867770, -303195, 614777, 918041, 193378, -701104, -1320138, -2238939, -3292877, -3078346, -1224603, 442828, 150403, -1614277, -2988426, -2668581, -419084, 2854799, 4894609, 3664880, 86716, -2460446, -2408185, -1976116, -3503745, -5656446, -5391872, -2542096, -106948, -238553, -1789855, -2099136, -64011, 2849950, 4190342, 3148336, 1617503, 1977212, 3907646, 4741777, 3258358, 1362107, 1085879, 1698746, 1329219, 71843, -433769, 238766, 805030, 320580, -682386, -1140699, -668695, 135034, 213299, -699404, -1264569, 56602, 2669013, 4343403]
41866D343403l4167l82683k41840j677424l530197k681765N35878K346990J347298
41857B5493J50538M15820N61453k20841j28729J112205P39325j804332k556971
41848a706039N82860L325628J210084l120022l915968j014807R73165N68730P23450
41839b372919K547884L303591J557085l77478o44875n85898j504058k007122o80015
41830g63805J073588J015313o72093j831162j071569R95703K537704K103357J90667
41821C577703j032822n83775k77563j667363k687424m79764L177495L379363n53594
41812B852256l613636k510452j91928l50508j475393k74398K087258J954776l46184
41803a868209r80557R41911K147150R55742j26136R89025K506168J958288j4040
$$ y = [4343403, 4309236, 3926553, 3684713, 2007289, -1522908, -4204673, -3668795, -1321805, 25493, 176031, 591851, 1153304, 932463, 803734, 1915939, 2655264, 850932, -1706039, -1123179, 2202449, 3412533, 292511, -3623457, -4638264, -3665099, -3096369, -2372919, 174965, 3478556, 5035641, 4658163, 4013288, 3427390, 1923332, -83790, -763805, 309783, 1325096, 653003, -1178159, -2249728, -1254025, 1283679, 3387036, 3577703, 2544881, 1961106, 1683543, 16180, -2671244, -3151008, 26487, 3405850, 2852256, -761380, -3271832, -3463760, -3814268, -5289661, -5564059, -3476801, -1522025, -1868209, -2848766, -1906855, 240295, 1196037, 1069901, 2058926, 4565094, 6523382, 6509342]
41794F509342j332674j656377j671805j153093o749M32339m53922o35967J653068
41785A684162M278278L583204j39075k795864k254722p70443q29947j547714q48654
41776C59225R69382J844406Q82649q83982j880530j181045P59204J969302Q26812
41767C665423j477534k077977o00446J75585j043243j590382P91849L696579L282872
41758D822726n7085k656875k916442k130855r38930J095465K647057J498412j288233
41749G5240j983507J20217J453265o3608j807938j015245R39007J376471M83436
41740d22662j59433o61713j445989j053097J355303L142332J488909j699258k010291
41731a465899Q78604K679533Q56468k067814k629194q74232Q72962J465099J345541
$$ y = [6509342, 5176668, 3520291, 1848486, 695393, 688644, 1120983, 667061, 31094, 1684162, 5962440, 9545644, 9406569, 6610705, 4355983, 3585540, 2755593, 1207879, 359225, 1328607, 3173013, 4055662, 3171680, 1291150, 110105, 869309, 2838611, 3665423, 2187889, 109912, -490534, -314949, -1358192, -2948574, -2156725, 1539854, 4822726, 4765641, 2108766, -807676, -2938531, -3877461, -2781996, -134939, 1363473, 75240, -1908267, -1788050, -334785, -398393, -2206331, -3221576, -2282569, -906098, -422662, -582095, -1243808, -2689797, -3742894, -2387591, 754741, 2243650, 544392, -1465899, -587295, 2092238, 2948706, 880892, -1748302, -2622534, -1749572, -284473, 1061068]
41722A061068R34951L36874m8174M6012M7254p17312j721064j551168K18009K005743
41712F12193J725666o33568k656998k349658o47654R4739m05975k53193J213706
41703c300742K185656J421340K88733K85598N00637m87898j789706j562057p3931
41694b532370Q82973Q58345Q01818Q67510L58040n19649q70638p58965q00490
41685a713426o19850L78225J320616J008387P2637j88329k47334j067588j410297
41676b466959K94797K127696P48677k696144l169485P62228M401132L731052O92878
41667D425872q51029p04821p41410q77523k58770r861j105445j554334M52207
41658a225114K415707Q55785k561648k995625k8655J743957K11001j224726K63366
$$ y = [1061068, 1996019, 2332893, 2284719, 2330731, 2377985, 1660673, -60391, -1611559, -1393550, 612193, 2337859, 1704291, -952707, -3302365, -3950019, -3855280, -4261255, -4514448, -3300742, -1115086, 306254, 594987, 880585, 1381222, 893324, -896382, -2458439, -2532370, -1649397, -791052, 10766, 878276, 1236316, 716667, -153971, -912936, -1713426, -2333276, -1955051, -634435, 373952, 446589, 258260, 10926, -1056662, -2466959, -2172162, -44466, 704211, -1991933, -5161418, -4399190, 1942, 3732994, 4425872, 3574843, 2870022, 2128612, 1251089, 992319, 982458, -122987, -1677321, -1225114, 1190593, 2046378, -515270, -3510895, -3539550, -1795593, -1584592, -2809318, -2545952]
41649b545952K449979K296184P83361K70007J58944j092695k087247p95770Q69543
41640C06354n87577l866226l695638J155335N263010M003197k33043k252212j380986
41631a287786o64361p56340O22293L331353L629923m4592l769989l209496M31514
41622a717481K412202R27797j448915k137928j329294j84345R78899J763157J184783
41613D48875n58291j485840m61112R56469Q87871J34448P36493K285154K182824
41604E126891k60691k459666k279251j011274r34321j553399o84230J511196K403570
41595a41175J098119l516Q89205J911733N79176j925710k400847o98869J28700
41586e63184j077831j709344J27348K234910J675550o68574j579000k09422J443422
$$ y = [-2545952, -95973, 2200211, 2983572, 3253579, 3412523, 2319828, 232581, -563189, 306354, -281223, -4147449, -7843087, -6687752, -1424742, 2578455, 2345412, 93200, -1287786, -1952147, -2708487, -2086194, 1245159, 4875082, 4830490, 1060501, -2148995, -1717481, 694721, 1622518, 173603, -1964325, -3293619, -3477964, -2499065, -735908, 448875, -109416, -1595256, -2056368, -1099899, -212028, -77580, 658913, 2944067, 5126891, 4866200, 2406534, 127283, -883991, -1818312, -3371711, -4055941, -2544745, -141175, 956944, 953428, 1842633, 3754366, 4333542, 2407832, 6985, -691884, -563184, -1641015, -3350359, -3223011, -988101, 687449, 18875, -1560125, -1769547, -326125]
41577c26125K007766J888463J238392l67907j936100j486616O61235J568310o0926
41568C186492j616737m52346J907380J927943o23257k299173r60540J284310J112877
41559C466949j596521l740343k791011N10186L271009L488240J617883m52253
41551C774139j317178q28468L33356J154233O94452j040047k554507k142142p8272
41542b004434J329318M94231j383431j842745k52531J606977J897847P12486m56908
41533A00810m79603N46487J654548J744048K67983k156528l720478k656580Q27096
41524c872217M027763M039151R05580k249751k792353j452878o91126j039345
41516c125176q04206P74365K134073J858088P57562K94048L39011k0827n59987
$$ y = [-326125, 1681641, 3570104, 4808496, 4440589, 2504489, 1017873, 1679108, 3247418, 3186492, 1569755, 1117409, 3024789, 4952732, 4329475, 2030302, 1069762, 2354072, 3466949, 1870428, -1869915, -4660926, -4150740, -879731, 2608509, 4226392, 3774139, 2456961, 1628493, 1961849, 3116082, 3810534, 2770487, 215980, -1926162, -2004434, -675116, -180885, -1564316, -3407061, -3659592, -2052615, -154768, 557718, 100810, -378793, 167694, 1822242, 3566290, 3834273, 1677745, -2042733, -4699313, -3872217, 155546, 4194697, 5100277, 2850526, 58173, -1394705, -2085831, -3125176, -3929382, -3155017, -1020944, 837144, 1594706, 1888754, 2227765, 2206938, 1646951]
41507A646951m82300r7160j32737j5315J137954K227312J263537j177760k190500
41498B179982q50480M17869P393k22657J331687K328162o4283l720805l765389
41489b358521J24056K883648J382214j441269j632853J28370P66896j2048k22928
41480c82435L88338L61364k73963j28522N67541L14134l88667N56804K706396
41471C720990K733852n08758l609865l125062q1970K072331K048849J039852K1497
41462D311716q83655j244309o75919N9432n9031p54179j096088j035433r42578
41453b320044l84554J093365K552646K570909J186937l49579j271034j525067
41445A553579j032497j00676J59283o42073r74697N58677K650766K748092O79358
$$ y = [1646951, 1164651, 1067491, 934754, 919439, 2057393, 4284705, 5548242, 4370482, 2179982, 1329502, 1747371, 1754764, 1532107, 2863794, 5191956, 5127673, 1406868, -2358521, -2234465, 649183, 2031397, 590128, -1042725, -914355, -147459, -159507, -382435, 5903, 367267, 93304, -35218, 532323, 846457, 457790, 1014594, 3720990, 6454842, 5946084, 2336219, -788843, -870813, 1201518, 3250367, 4290219, 4311716, 3428061, 2183752, 1507833, 1567265, 1508234, 754055, -342033, -1377466, -2320044, -2704598, -1611233, 941413, 3512322, 4699259, 4349680, 3078646, 1553579, 521082, 420406, 579689, -62384, -1037081, -478404, 2172362, 4920454, 5599812]
41436E599812j207868j371611n17614K96349R48927J304020Q12743l50947j149261
41427D364550j073739n27628J77848Q72133P76055o00358j920049j343331N00721
41418A226202J026596m10322j441007m02506J135107J044602l2365Q441J267863
41409C422611J765076M80719j293800j938125j588273j499238j887265j467756
41401d006051M29105K184408J732968j73926n89440J167878K094604J18545k311060
41392F47031j866272M59085J199481L7755l91522M32975M01646o90189o27340
41383c97350N17501j79873k904020l606539m27033K743572K184477n0705j18969
41374b238939J358677J294176j10742j77960J156046J441213K04292n83095k49453
$$ y = [5599812, 4391944, 3020333, 2502719, 2799068, 3747995, 5052015, 5864758, 5513811, 4364550, 3290811, 2763183, 2941031, 3813164, 4589219, 3988861, 2068812, 725481, 1226202, 2252798, 1842476, 401469, -1037, 1134070, 2178672, 2146307, 2154748, 3422611, 5187687, 5668406, 4374606, 2436481, 848208, -651030, -2538295, -4006051, -3576946, -1392538, 340430, 166504, -422936, 744942, 2839546, 2958091, 647031, -1219241, -760156, 439325, 477080, 85558, 518533, 920179, 229990, -397350, 120151, -59722, -2963742, -6570281, -6997314, -4253742, -2069265, -2119970, -2238939, -880262, 413914, 303172, 125212, 1281258, 2722471, 2926763, 2343668, 2094215]
41365B094215j49506o90710p48573j59587q4053p85469j374369j585194j628271
41356e111517q57527J000582K108170Q63831q07955J02187K469204K204319j160979
41347H10315l304140j691743P40710N79006r64313q48102N95536P50210m95658
41338c828179o33549J018542J934081L81725j491158m23355L038168M511769J320049
41329E828093l540134m791189j608322J568438J409909r7791K87922J615378P61135
41320A433439j788520k376375j30968J625472P09123q81940p43665L10491M06729
41311a436214j67515j33726L14939L91865N38276J315631J758433Q43229m58609
41302B966309n90136j7031l90153j648819k019355q31371M93474N92923r7669
$$ y = [2094215, 1944709, 1253999, 505426, 345839, 261786, -523683, -1898052, -3483246, -5111517, -5969044, -4968462, -2860292, -1996461, -2804416, -2702229, -233025, 1971294, 810315, -2493825, -4185568, -3444858, -2865852, -3830165, -4678267, -4082731, -3332521, -3828179, -4461728, -3443186, -1509105, -1127380, -2618538, -3041893, -3725, 4508044, 5828093, 2287959, -2503230, -4111552, -2543114, -1133205, -1230996, -943074, 672304, 1433439, -355081, -2731456, -2862424, -1236952, -527829, -1409769, -2153434, -1842943, -1436214, -1603729, -1737455, -1422516, -1030651, -492375, 823256, 2581689, 3424918, 2966309, 2376173, 2359142, 1968989, 320170, -1699185, -2530556, -2037082, -1444159, -1541828]
41293a541828k79987M74148J464781J813517J233550N9812j159022j966228k011400
41284a912657j201844j00229L55513N8038N1422Q96487J530180R68762K64871
41275I10543R15887J956459J090310j344884k349133q42412N93606q5291j179806
41266c34721l45678J376924J332670m60869j673444j501850j304230j587663j092724
41257e591585N87855J742144R54644p06733j066159M00508K103458K297547Q98188
41248A619867o32556r74293l42038M5986k64313m59871N9266N93949J92527q86567
41238a048043j511284j024075L41242J872713K622708J831892j71940j934806
41230I78407k307921j461067j18302J365425K566080K633607J394962J12620P3615
$$ y = [-1541828, -1821815, -1347667, 117114, 1930631, 3164181, 3223993, 2064971, 98743, -1912657, -3114501, -3214730, -2859217, -2801179, -2749757, -1853270, -323090, 645672, 910543, 1826430, 3782889, 4873199, 3528315, 1179182, 336770, 930376, 845085, -334721, -680399, 696525, 2029195, 1568326, -105118, -1606968, -2911198, -4498861, -5591585, -5003730, -3261586, -2306942, -3013675, -4079834, -3679326, -1575868, 721679, 1619867, 987311, 13018, -329020, -283034, -547347, -1007218, -947952, -354003, -161476, -1048043, -2559327, -3583402, -3242160, -1369447, 1253261, 3085153, 2913213, 978407, -1329514, -2790581, -2908883, -1543458, 1022622, 3656229, 5051191, 5163811, 5237426]
41221E237426Q76904J049923j2793j504388k206869j442320M24552J911827J599122
41212E933384r0618j239263j075864q93129j501322j538078J13274J849143J479948
41203C037475l08407j066516l83918Q0005j7812P43965K275781K217183l43959
41194F233797k808395k434491q5812J197994K68227j291537j806760j257703l35256
41185b319936Q16415K205608L021688K058950n50207k635435k038094N26221J840250
41176B925460J45315k411690k552741j52061J998165K166507J328537P70944K40857
41167D459293p07728j319195q48328j8980n7020r68643j738157j674996p76329
41158c650083O85460K116907K557004J487911m07797j771449j767484o18820O92333
$$ y = [5237426, 6114330, 7164253, 7151460, 5647072, 3440203, 1997883, 2422435, 4334262, 5933384, 5842766, 4603503, 3527639, 2634510, 1133188, -404890, -291616, 1557527, 3037475, 2729068, 1662552, 1278634, 1358639, 1340827, 2084792, 4360573, 6577756, 6233797, 3425402, 990911, 905099, 2103093, 2371320, 1079783, -726977, -1984680, -2319936, -1503521, 702087, 3723775, 5782725, 5232518, 2597083, 558989, 1085210, 2925460, 3070775, 659085, -1893656, -2045717, -47552, 2118955, 3447492, 4218436, 4459293, 3751565, 2432370, 1584042, 1565062, 1508042, 539399, -1198758, -2873754, -3650083, -2964623, -847716, 1709288, 3197199, 2789402, 1017953, -749531, -1368351, -676018]
41149f76018J084161K10840j068872j433272n29951P00877J261669J151735R40386
41140A641555P90816L80316l75740r16592n36349P07832J816296J899472J203617
41131F611223M80001l79019j853944k965293j830615J116157K535798N48832k125754
41122B137386j847610N13436R43623j510580l372558k031360P49865J839402P87916
41113a790480n65058p42245L40977J637451J563461k64754j719528n18088K104544
41104D6280K744259J112822N48047K204946K641675n26230m187481m214309j488662
41095a118653K88619N21129J259324K372477J714830l86183j133521l2666K65177
41086C750533j284769k095545j48585K612438K909196L13498k716261l765744
$$ y = [-676018, 408143, 618983, -449889, -1883161, -2413112, -1712235, -450566, 701169, 1641555, 2432371, 2812687, 2436947, 1520355, 984006, 1691838, 3508134, 5407606, 6611223, 7091224, 6712205, 4858261, 1892968, 62353, 1178510, 3714308, 4263140, 2137386, 289776, 803212, 1746835, 236255, -3136303, -5167663, -4417798, -2578396, -1790480, -2355538, -3097783, -2756806, -1119355, 444106, 179352, -1540176, -2058264, 46280, 2790539, 3903361, 4451408, 6656354, 9298029, 8771799, 4584318, 370009, -1118653, -830034, -308905, 950419, 3322896, 5037726, 4651543, 3518022, 3485356, 3750533, 2465764, 370219, 221634, 2834072, 5743268, 6056766, 3340505, -425239]
41078d25239k391473n7377J189957O34059m36897n56676O9818N54724J041074
41069c78030J759452J592374j39221j549432n97046J319954J388338J99745O62330
41060D258464K427974J998701r69346k345232k57575J539101k09077k956665k792140
41051F94205p18172k48993j210266n59046J875512K924892J219902q86531r87685
41042B103818N73165K076696K473884J664991L26676m18762k94241l68772j205184
41033F932271j585901n51013O11531L37698n13680j83675Q67483Q41224k68438
41024F487500r72967j011193j205985j233285j68021J276794J666512J373160
41016F212515J483269J084700j078130l071103j887331J193144J807866n56848
$$ y = [-425239, -2816712, -2874089, -1684132, -1050073, -1486970, -2043646, -1973828, -1419104, -378030, 1381422, 2973796, 2834575, 1285143, 688097, 2008051, 3396389, 3596134, 4258464, 6686438, 8685139, 7715793, 5370561, 5112986, 6652087, 6443010, 3486345, 694205, -23967, -272960, -1483226, -2042272, -166760, 2758132, 3978034, 3091503, 2103818, 2676983, 4753679, 7227563, 8892554, 9219230, 8800468, 8506227, 8137455, 6932271, 5346370, 4795357, 5406888, 5744586, 5230906, 5047231, 5914714, 6755938, 6487500, 5514533, 4503340, 3297355, 2064070, 1896049, 3172843, 4839355, 6212515, 7695784, 8780484, 7702354, 4631251, 2743920, 3937064, 5744930, 5188082]
41008E188082j639057L82463J774857k13267k393233q57015K540760L254343J112414
40999I150347j76157P64366J516753L09641j655539k592421k134449o50916J286325
40990E817950K540973K241328R77955j77494j304846k741224l410994k130172
40982A813476r844P11595j597r7373J093686J822481Q63797n26864m83276J030596
40972F216677K413836K157929N8169k472878l327873j878121M3957M48100q2377
40963C577419L91043J662059J374452j161130l367082k642307L72789K833295
40955C040538K848758P88283j514041k157815p81694P20546K31002j506642j515573
40946A53362R65005K768078J254531j344639p47789L006497N118093K510391j968342
$$ y = [5188082, 3549025, 3931488, 5706345, 5493078, 3099845, 2242830, 4783590, 8037933, 9150347, 8974190, 9738556, 11255309, 11564950, 9909411, 7316990, 5182541, 4531625, 5817950, 8358923, 10600251, 11578206, 11400712, 10095866, 7354642, 3943648, 1813476, 1803632, 2515227, 2513630, 2416257, 3509943, 5332424, 6196221, 5669357, 5186081, 6216677, 8630513, 10788442, 10846611, 8373733, 5045860, 3167739, 3211696, 3659796, 3577419, 3968462, 5630521, 7004973, 5843843, 2476761, -165546, 207243, 3040538, 5889296, 6677579, 5163538, 3005723, 2224029, 2944575, 3175577, 1668935, 153362, 1118367, 3886445, 5140976, 3796337, 3048548, 6055045, 11173138, 13683529, 11715187]
40937A1715187l458861j327514Q13088N20297o41783k29792J285846J543766O4130
40928A0284364j026012j48994J486473J604121j71011k021154k191249p84275
40920G032263N54468L28773j255302k252639r33569K015450L873637K843320l7662
40911A2168739k384091l029871k366340r86731P27570J992849J950360R13025
40903H985510L88809J355676K948613L338634J847818k19786j201497j251766
40895A6192011j902870l161391k670014O50696L566444K017146k778886n191356
40887F721780k818101M31008O02553o93985K2968J971554J806603m92492j880711
40878E671177j477288j199174j424691l26408K005192K844185J339676J42355
$$ y = [11715187, 8256326, 6928812, 7741900, 8262197, 7620414, 7390622, 8676468, 10220234, 10284364, 9258352, 9109358, 10595831, 12199952, 12028941, 10007787, 7816538, 7032263, 7586731, 7915504, 6660202, 4407563, 3473994, 5489444, 9363081, 12206401, 12168739, 9784648, 6754777, 4388437, 3401706, 4129276, 6122125, 8072485, 8985510, 9374319, 10729995, 13678608, 17017242, 18865060, 18645274, 17443777, 16192011, 14289141, 11127750, 8457736, 9108432, 12674876, 14692022, 11913136, 6721780, 3903679, 4334687, 4937240, 4243255, 4266223, 6237777, 8044380, 7551888, 5671177, 4193889, 2994715, 1570024, 1243616, 3248808, 6092993, 7432669, 7575024]
40870G575024J045378K141475J081237j398859k955966k646518j072969P02941
40862D471743J444225P21167O8848J007917J868402l14334m369601n373729j767000
40853b242362J972960J895490j50232o43710k874l64577r20131K53333J977156
40844A775053J883713Q35016J227945K345480J780653L79757J047950L084399
40836A4359966K597329j003030l602925k706180r49467j375402k738852k099414
40828B482025L44162J743498P86282p69911o06596J198756K025324k12753l788826
40819C201961m365827n67879L443852L133248l27833k166596r18084N86530N95445
40810B614817M80555R12239K64649j694294k265620k8216K414331K076792l66965
$$ y = [7575024, 8620402, 10761877, 11843114, 10444255, 7488289, 4841771, 3768802, 4471743, 5915968, 6637135, 6705983, 7713900, 9582302, 9267968, 4898367, -475362, -2242362, -269402, 1626088, 1475856, 832146, 829272, 464695, -455436, -202103, 1775053, 3658766, 4493782, 5721727, 8067207, 9847860, 10227617, 11275567, 14359966, 16957295, 15954265, 12351340, 9645160, 8695693, 7320291, 4581439, 2482025, 2826187, 4569685, 5355967, 4586056, 3979460, 5178216, 7203540, 6990787, 3201961, -1163866, -1731745, 1712107, 4845355, 4517522, 2350926, 1432842, 2019372, 2614817, 3095372, 4007611, 4272260, 2577966, 312346, 284130, 2698461, 4775253, 4408288]
40801D408288k149646k018367n82865J109958J895015J070680l13994n55679j38626
40792B724764r58400k345453j374309J834049L195016R91727j071730L3952J673425
40783D703041M80502j492368m47411K143748J726368j664294l417528j599812
40775D32246Q38509J329815O51663M0199n97371q01847M37766J997576J386008
40766E714564j018268j939505l11889J091718L38475q18118l91598P07875R05040
40757D278294N55354L58475l09441j492625j443331N68100K331650J752901l7536
40748F561841p76436m94676n52204q05950k42241O50711N62605k67434m97465
40739D138751j966J67263k50299n22855m05823l05673k26217J11154L76271Q7280
$$ y = [4408288, 2258642, 240275, -342590, 767368, 2662383, 3733063, 3419069, 2863390, 2724764, 1766364, -579089, -1953398, -119349, 3075667, 4067394, 2995664, 3029616, 4703041, 5183543, 3691175, 3243764, 5387512, 7113880, 5449586, 2032058, 432246, 1270755, 2600570, 3252233, 3292432, 2695061, 1893214, 2330980, 4328556, 5714564, 4696296, 2756791, 2444902, 3536620, 3875095, 3056977, 2665379, 3373254, 4278294, 4833648, 5192123, 4882682, 3390057, 1946726, 2514826, 4846476, 6599377, 6561841, 5785405, 5290729, 4738525, 3932575, 3690334, 4341045, 4903650, 4636216, 4138751, 4136785, 4304048, 4053749, 3530894, 3125071, 2819398, 2593181, 2704335, 3080606, 3167886]
40729C167886l11373M1770J036108J659910J319749M12632k58842l04924k34923
40720F527993r44283k060845j561835J308794L559230J750068k387221l405100
40712B786801r8190K300508O2042l314271k958969k81196K16418j122379k67032
40703b676268K835917L894685J519418q67851j103146r49152j491457j028700
40695A33446O58837Q74505q72151j058918J728768L514785J326794j450126n20771
40686D335169K198228K054323n09131j282258J98486L87714j449838j973318q7114
40677C872261Q46725j044821k644698j016152J621181J454121q93554j557955
40669F37108N08898K172204R55328j521287k107308m98168O27481m56419k031451
$$ y = [3167886, 2856513, 2898283, 3934391, 5594301, 6914050, 7326682, 7067840, 6762916, 6527993, 5583710, 3522865, 1961030, 3269824, 6829054, 8579122, 6191901, 2786801, 2688611, 4989119, 5051161, 1736890, -1222079, -1503275, -1286857, -2409236, -2676268, 159649, 4054334, 5573752, 4705901, 3602755, 2653603, 1162146, 133446, 792283, 1666788, 794637, -264281, 1464487, 4979272, 6306066, 4855940, 4335169, 6533397, 8587720, 8078589, 6796331, 6994817, 7382531, 5932693, 3959375, 3872261, 4718986, 3674165, 1029467, 13315, 1634496, 3088617, 2195063, 637108, 1146006, 3318210, 4273538, 2752251, 644943, 146775, 774256, 317837, -1713614]
40660a713614j351518J291749K702246J213086r65239j041984M22898Q81682p9255
40651A360051m98365M43611J212740O18437l91962l96697N48789J307056J007833
40642E211493k15908j031349P8789K493707L275896J239033k72004K122911N634971
40633A8537539M132771k580934p428330n771257j470656j57785j150703o37486
40625C473159Q67171Q6226k163786j903442Q48070J836971q4728j186933K23955
40616A996663Q14900j327718k553688K17648L512940K263787k126848l822603
40608a024919j139073J906908K164523P63929m32315j456848k101009q93838J956234
40599b56408L550991K210888J756n70950j44565n61160j341651p99132O17012
$$ y = [-1713614, -3065132, -1773383, 928863, 2141949, 1176710, 134726, 557624, 1439306, 1360051, 861686, 1305297, 2518037, 3136474, 2744512, 2347815, 2896604, 4203660, 5211493, 4995585, 3964236, 4043025, 6536732, 9812628, 11051661, 10779657, 12902568, 18537539, 22670310, 20089376, 12661046, 6889789, 5419133, 5261348, 4110645, 3473159, 4340330, 4426556, 2262770, 359328, 1207398, 3044369, 2959641, 1772708, 1996663, 2811563, 1483845, -1069843, -852195, 2660745, 4924532, 2797684, -1024919, -2163992, -257084, 1907439, 2671368, 2239053, 782205, -1318804, -2212642, -256408, 3294583, 5505471, 5507227, 4936277, 4791712, 4230552, 2888901, 2089769, 2706781]
40590B706781R00653j63250p94880k27089L67528J06363m37906n98435m34651
40581A425114N6156R42183J405314M84010j017068j199952k8638L91903q10552
40572A648470j692416m73082J700224K449553J249420o13482j948570k151243
40564A68874r74283P40972J197986p2855j207929p07543K73887J19592l11368
40555g72667O40726K077518J804733K50566r4219R57179Q34788j306787k928628
40546A463209k177107o64108m04901n36917N94993K001833J413654q48590j922907
40537a080841l26946K045694K315336k9732k638485k866433o85880J248110Q36454
40528a182723p92251j045045K69681Q83199q3731p16189L56732J678462J622432
$$ y = [2706781, 3607434, 3444184, 2649304, 2422215, 2789743, 2896106, 2458200, 1859765, 1425114, 1481270, 2423453, 3828767, 4312777, 3295709, 2095757, 2067119, 2459022, 1648470, -43946, -517028, 1183196, 3632749, 4882169, 4268687, 2320117, 168874, -805409, -64437, 1133549, 1060694, -147235, -854778, -580891, -461299, -772667, -131941, 1945577, 3750310, 4000876, 3906657, 4863836, 5698624, 4391837, 1463209, -713898, -1378006, -1782907, -2319824, -1724831, 277002, 1690656, 842066, -1080841, -1407787, 637907, 2953243, 2923511, 285026, -2581407, -3267287, -2019177, -1182723, -1974974, -3020019, -2750338, -1867139, -1950870, -2667059, -2310327, -631865, 990567]
40519I90567J181228J935310K867692J754073j114422l026182k449750o05738
40511A532778N23034K27435q20509j290024k48999J531849J944528K73250j406021
40502B267321j043373J85646m22460k765694l711215j465950J901790L136833
40494a917102J620319l98477p02802M92235J073522j17828j476426p18607J469904
40485f75262J932883j74258j669928j70174J911417J058614j627065k105166K30482
40476a288457J894031J002315k94906O0596R05472L08218j432005k654051k292584
40467c791371j60155K792455M166298K465807r883L85098K887348K742580j432349
40458A0045828m860637l567215k48705K58253j748417k236256n0945K153116K518607
$$ y = [990567, 2171795, 4107105, 6974797, 8728870, 7614448, 4588266, 2138516, 1532778, 2055812, 2283247, 1462738, 172714, -76285, 1455564, 3400092, 3673342, 2267321, 1223948, 1409594, 987134, -1778560, -5489775, -6955725, -5053935, -1917102, -296783, -695260, -1398062, -905827, 167695, 49867, -1426559, -2145166, -675262, 1257621, 1083363, -586565, -756739, 1154678, 2213292, 586227, -1518939, -1288457, 605574, 1607889, 1312983, 1373579, 2279051, 2587269, 1155264, -1498787, -3791371, -3951526, -1159071, 3007227, 5473034, 5463151, 5848249, 8735597, 11478177, 10045828, 5185191, 1617976, 1369271, 1627524, -120893, -2357149, -2408094, -254978, 2263629]
40449B263629J588233j20685k464690l792761k177056J265841L267940K786719
40441B617170J705289J220816O36800p0375J89149Q80773k6156k256166k882022
40432B015278j068215K70793o01245j119064J084900L623878K803124n68394k597212
40423C843843k100968j145657p00156K00907J165765M36223j270446q80090J852124
40414A401545L057623N78334k377651j992057O80714K041748J348096L52594n31396
40405D559550j857621k256406j08426K476443J709634j730673l057215o82946
40397i47660J428155M46360q79729N77823K687792J715102j142239j439036J615794
40388D062362M163204L287734J77676k341524k707051j067994R68523J360557
$$ y = [2263629, 3851862, 3731177, 1266487, -2526274, -4703330, -3437489, -169549, 2617170, 4322459, 5543275, 6180075, 6109700, 6298849, 7179622, 7153466, 4897300, 2015278, 947063, 1217856, 616611, -502453, 582447, 4206325, 7009449, 6441055, 3843843, 1742875, 597218, -102938, 97969, 1263734, 1699957, 429511, -450579, 1401545, 4459168, 5037502, 2659851, 667794, 1348508, 3390256, 4738352, 5090946, 4559550, 2701929, 445523, 337097, 2813540, 4523174, 2792501, -264714, -947660, 480495, 926855, 47126, 624949, 3312741, 5027843, 3885604, 2446568, 4062362, 8225566, 11513300, 11690976, 9349452, 6642401, 5574407, 6542930, 7903487]
40380G903487J68265m1338J763759K736004Q47458n53113K473820O868229N695353
40371B7861924j354751o824311o011763k594441j480353j845984q45024O43586
40363G548883L49799q81454j115996r94693j584372j426193M34563J411389m12352
40354C329574j952165J34917L027944J783061k097256k600089R50874K759552
40346E336412Q9215k593084j281792J446880J398979n88050j019101K45732N28971
40337C564162p12578j258465n6593J162938O28009r63127j397802K74544K429891
40328C670979K562103L59780j667253j360808L00986R61346L41978j11005j53097
40319D905009o67258j102580J1347J892169J946292p1078j406740o84066J60802
$$ y = [7903487, 8071752, 8030414, 9794173, 12530177, 13377635, 12824522, 15298342, 22166571, 27861924, 26507173, 19682862, 13671099, 11076658, 9596305, 7750321, 6905297, 7548883, 7898682, 7017228, 5901232, 4906539, 3322167, 1895974, 2330537, 3741926, 3329574, 1377409, 1512326, 4540270, 6323331, 4226075, 1625986, 2576860, 5336412, 5425627, 2832543, 1550751, 2997631, 4396610, 3808560, 2789459, 3035191, 3564162, 2851584, 1593119, 1536526, 2699464, 3327473, 2364346, 966544, 1241088, 3670979, 6233082, 6592862, 4925609, 3564801, 3865787, 4827133, 5169111, 5058106, 4905009, 4237751, 3135171, 3146518, 5038687, 6984979, 6913901, 5507161, 4823095, 4983897]
40310D983897m53341j198367o00107M64123R11532J433683K259893J585226j265599
40301H120940l492210k518394n9209O18287j34940N83937K935209L807235J716689
40292A1577544r20504j254104N53611K331236K779681K398533K373599L170933
40284B3010529M053374M082034L534864L389136L223988J302268k414991n245081
40276C4936121n293795m175305m219246m679267l366184q04325L33559n55541
40268A2176017j380415r83635n58430j008790j476210j243803q92966p46683j58476
40259C726609P75197O65807r46531k380391j922376K4616J767485K245199J465488
40250E421103J12376o60848j01118R42511P62192p87345j795341q06730J309642
$$ y = [4983897, 4530556, 3332189, 2732082, 3196205, 4107737, 5541420, 7801313, 9386539, 8120940, 4628730, 2110336, 2051127, 2669414, 2534474, 3118411, 6053620, 9860855, 11577544, 10657040, 9402936, 9956547, 12287783, 15067464, 17465997, 19839596, 23010529, 27063903, 31145937, 34680801, 38069937, 41293925, 42596193, 40181202, 34936121, 29642326, 25467021, 21247775, 16568508, 13202324, 12397999, 12731558, 12176017, 10795602, 9811967, 9253537, 8244747, 6768537, 5524734, 4631768, 3885085, 3726609, 4501806, 5167613, 4221082, 1840691, -81685, -57069, 1710416, 3955615, 5421103, 5533479, 4872631, 4771513, 5714024, 6476216, 5688871, 3893530, 3086800, 4396442]
40241D396442K626713K234259N03776j557597k553736j460517R98121K633267
40233G820728K209586P88200P1876L45913P54267P32431M01242K45688R92060
40224A4361991L032227N429718O357713N134483L030495J545083P79575L8219
40216C9709504r70613k173946l387042l884077k752375l70825J520779J931691
40208B9623096J664661J562127J136442j0421q52783m41990M62694P71561R88426
40199C4903813K154675L861253N018133N690425O329857O026103L615280P66k675528
40190F4924777l767551m083354l752804k522512j713186l061952n560117o326364
40182C4136937m987732m119599m583450l869986p42423J800340Q67341j622313
$$ y = [4396442, 7023155, 9257414, 9761190, 8203593, 5649857, 4189340, 5187461, 7820728, 10030314, 10818514, 10890390, 11236303, 11990570, 12723001, 13124243, 13369931, 14361991, 17394218, 22823936, 29181649, 34316132, 37346627, 38891710, 39671285, 39709504, 38738891, 36564945, 33177903, 29293826, 26541451, 26170626, 27691405, 29623096, 31287757, 32849884, 33986326, 33975905, 33123122, 32681132, 33143826, 33915387, 34903813, 37058488, 40919741, 45937874, 51628299, 57958156, 63984259, 67599539, 67600305, 64924777, 61157226, 57073872, 53321068, 50798556, 49085370, 46023418, 40463301, 34136937, 29149205, 25029606, 20446156, 16576170, 15833747, 17634087, 18501428, 16879115]
40174A6879115j818214K21344J053911o15021k340602j928268p5514J549565K466010
40165A5392326K724254J923973l8877k269031l582198l356957j752805J39734
40157I180419P86675q7934q82762m70798j95347j561286k932335j452881K011044
40148D394795L280744R11215j584667j087973P39274P42860p39840j182471l03197
40139E170740N1137n21028n87521K64038Q49928O50409L86990L13514n6299n40060
40129E981848n04788l60049r03285j415204n62442R81642J229410K04294n2145
40120D599281R27254J289050L77241k5768Q11424Q97525p83327j747138K42304
40111F587846L168104L475904J221077n33472m26418J07198j02828o62523j192422
$$ y = [16879115, 15060901, 15282245, 16336156, 15721135, 13380533, 11452265, 11376751, 12926316, 15392326, 18116580, 20040553, 20001676, 17732645, 14150447, 10793490, 9040685, 9180419, 9967094, 9879160, 8996398, 8525600, 8330253, 6768967, 3836632, 2383751, 4394795, 7675539, 8586754, 7002087, 5914114, 6653388, 7396248, 6656408, 5473937, 5170740, 5221877, 4700849, 4113328, 4377366, 5227294, 5877703, 6264693, 6578207, 6521908, 5981848, 5477060, 5117011, 4213726, 2798522, 2236080, 3217722, 4447132, 4651426, 4599281, 5526535, 6815585, 7192826, 7167058, 7978482, 8876007, 8092680, 6345542, 6587846, 9755950, 13231854, 14452931, 13919459, 13493041, 13600239, 13497411, 12834888, 11642466]
40102A1642466j638218j156197P62117K204035P24322k497327l478748j140858
40094E421592J013239L48709r52351J80190K428260K081942j048029l226553k145433
40085D101566M27506J951078K352980K623795K262760J97213k643234l705938
40077G567726j948484P56059J895464J142785J50712J1031m617r33109k306343
40068F331224k727544j829746o02647J76931O84743R71966M63528p15246j144390
40059A608819n0500J157460Q22935l02510k78811O64141M26983j218046j951035
40050H79436q06686J32379m12365k70363K325761M831791M015387J571534J534796
40041A3801670L101716J541015l298104n402845j844296K054515P97519k820924
$$ y = [11642466, 10004248, 8848051, 9610168, 11814203, 12538525, 10041198, 6562450, 5421592, 6434831, 6783540, 5831189, 6011379, 8439639, 10521581, 9473552, 6246999, 4101566, 4529072, 6480150, 8833130, 11456925, 13719685, 13916898, 11273664, 7567726, 5619242, 6375301, 8270765, 9413550, 9564262, 9575293, 9570676, 8637567, 6331224, 3603680, 1773934, 1171287, 1348218, 2032961, 3004927, 3468455, 2753209, 1608819, 1558319, 2715779, 3538714, 3236204, 2957393, 3621534, 4048517, 2830471, 879436, 72750, 205129, -207236, -477599, 1848162, 6679953, 10695340, 12266874, 13801670, 16903386, 18444401, 15146297, 9743452, 7899156, 9953671, 10751190, 7930266]
40033G930266k677467Q11645K155542J95780p09048J330697K990858K006308M62191
40024A4496772J39857k04825q62783M53873L606162M226702K65755l981367m137819
40015A4002327k069489j763149k575467j527243O01841Q63319j55408M30018K140633
40006I947382J903441l08326j590803j345310j486640j783990j29416K449485
39998G655823K287068p15024k399869r11915R07707R40114P38296J412385J334931
39989A1249516o37l52782Q36885Q40265j193583k086315l45989P59415q41067
39980H865708j857504L95565K518504O68661k306842j367610K084163K597117
39972A1597762n9953p40693K280506M622556K893566o69405k240303j229922L69887
$$ y = [7930266, 5252799, 6064444, 8219986, 8415766, 7706718, 9037415, 12028273, 14034581, 14496772, 14636629, 14431804, 13569021, 14022894, 17629056, 21855758, 22121513, 18140146, 14002327, 11932838, 10169689, 7594222, 6066979, 6668820, 7532139, 7376731, 7806749, 9947382, 11850823, 11542497, 9951694, 8606384, 7119744, 5335754, 5206338, 7655823, 9942891, 9227867, 6827998, 5916083, 6823790, 7763904, 8502200, 9914585, 11249516, 11248879, 10896097, 11732982, 12573247, 11379664, 9293349, 8947360, 9706775, 8865708, 7008204, 7403769, 9922273, 10590934, 8284092, 6916482, 9000645, 11597762, 11537809, 10797116, 13077622, 17700178, 20593744, 19924339, 17684036, 16454114, 16824001]
39963A6824001N94754j365654m233058m778316j465637K460364K537435p71523
39955I802366k900605j731360M87707J694786K371504K780494J812825l04203
39947A4013514j557392j464900j733390k767652k701544p91799J306220K413107
39939F716164K893328K399285Q3655k409230k137821J51656N63980j322323j284389
39930E654305K161297M402303J921162j873340k060419M74474J695247J257202
39922A3632231J734358L062429K674175L07906j457617j168417J43171J127069
39914B0055305J172224J19079j007684l71784J595436J613988j547614m207845
39906A7421105k946684M8069O94619m53473m6878J745421K057841J149270J750513
$$ y = [16824001, 17418755, 16053101, 11820043, 7041727, 5576090, 8036454, 10573889, 9802366, 6901761, 5170401, 5658108, 7352894, 9724398, 12504892, 14317717, 14013514, 12456122, 10991222, 9257832, 6490180, 3788636, 2996837, 4303057, 6716164, 9609492, 12008777, 12092432, 9683202, 7545381, 7697037, 8261017, 6938694, 5654305, 7815602, 12217905, 14139067, 12265727, 10205308, 10679782, 12375029, 13632231, 15366589, 18429018, 21103193, 21411099, 19953482, 18785065, 18928236, 20055305, 21227529, 21346608, 20338924, 19967140, 21562576, 23176564, 21628950, 17421105, 14474421, 14522490, 15217109, 14763636, 14716758, 16462179, 18520020, 19669290, 21419803]
39897B1419803L151038J854437j507619j906840J997322N123881L718234Q95340
39889C4745596J309928M355889O359737O661410P776430J1201334J6253555K2040694
39881A10704573K7726450L0959298K8074997J6779703j063033j8918920k9018814
39874A65244254k8506646k2060407j6540328j3735201j0930216p313188n209099
39867F0949169m789487k849993J270722L515696J894877R81142N430983J2533574
39859G8936683J6308736J6799175J9524157K5880052K9334123K2919519P327045
39852B17029490j0140045k2483299k7384294k6492781k2662293j8103699j4093772
39845G5669307j1258977r432080p615505n103868k638531j513596j734774k239808
$$ y = [21419803, 24570841, 26425278, 24917659, 23010819, 25008141, 30132022, 33850256, 34745596, 36055524, 40411413, 46771150, 53432560, 61208990, 72410324, 88663879, 110704573, 138431023, 169390321, 197465318, 214245021, 213181988, 194263068, 165244254, 136737608, 114677201, 98136873, 84401672, 73471456, 66158268, 60949169, 56159682, 53309689, 54580411, 58096107, 59990984, 60972126, 66403109, 78936683, 95245419, 112044594, 131568751, 157448803, 186782926, 209702445, 217029490, 206889445, 184406146, 157021852, 130529071, 107866778, 89763079, 75669307, 64410330, 54978250, 47362745, 42258877, 39620346, 38106750, 36371976, 34132168]
39837C4132168k526777k485074j301228J120890K322291J38724k885786k097459
39829B6417749J797658K862688q36166l680378j428709J833846P18985k256029
39821B5429644j175558K779401L088206j039922l212336k04700L481841L607877
39813C2754453K399770L430642N431705N320397L817351L949580O249392Q979782
39805G2333072J1559891J4828467J9114322K4318031L0404075L5447252L4729167
39798B42734277K4732256P654869j0055308k3152482l0092975l1490225k8762580
39791A51567832k4079965j9304801j4571148r367110m840215l018067l355714
39784G3030812k232559K534022P823646P889500J107216p475120j1260528q825914
$$ y = [34132168, 31605391, 29120317, 27819089, 28939979, 31262270, 31400994, 28515208, 26417749, 28215407, 31078095, 30241929, 26561551, 25132842, 26966688, 27685673, 25429644, 24254086, 27033487, 30121693, 29081771, 25869435, 25664735, 29146576, 32754453, 35154223, 38584865, 44016570, 49336967, 53154318, 57103898, 63353290, 72333072, 83892963, 98721430, 117835752, 142153783, 172557858, 208005110, 242734277, 267466533, 275121402, 265066094, 241913612, 211820637, 180330412, 151567832, 127487867, 108183066, 93611918, 84244808, 79404593, 76386526, 73030812, 70798253, 73332275, 81155921, 89045421, 90152637, 82677517, 71416989, 62591075]
39776F2591075m276853j662642j149716q75354L0076J778316N007372Q969441
39768G0411715J0036404N137793l478107r530173q981788l115215M106096Q928811
39760G3515536Q314265J406187p978010j3262456j1651518o970248m465884m742913
39752C4164959m656367k399329O76839K521945K768089K821693M388012P294930
39744D7580771Q535737M983583k329749q445538r901480q014472n758363l864697
39736B2785792j907959q53738j668790k852720k232415l68225M39994j51119m41006
39727A2749814J89386P19736Q59380J319214J625338L58527j877491k321581m85
39718A3621838K352335J828702p57639k175673j089445N77388M74431j215297
$$ y = [62591075, 58314222, 56651580, 55501864, 54626510, 54656586, 56434902, 61442274, 70411715, 80448119, 85585912, 82107805, 72577632, 63595844, 60480629, 64586725, 73515536, 81829801, 83235988, 75257978, 61995522, 50344004, 43373756, 38907872, 34164959, 29508592, 27109263, 27786102, 30308047, 33076136, 35897829, 40285841, 47580771, 56116508, 61100091, 58770342, 50324804, 40423324, 32408852, 26650489, 22785792, 20877833, 20024095, 18355305, 15502585, 13270170, 12901945, 13341939, 13190820, 12749814, 12939200, 13658936, 14518316, 15837530, 17462868, 17821395, 15943904, 13622323, 13621838, 15974173, 17802875, 17045236, 14869563, 13780118, 14357506, 14831937, 13616640]
39710A3616640k213259j162358N81242Q26982j88053O2387K455509M243512K729101
39701B0951703m35787j154392J377375L637557K914730P55362l4630M50452J32877
39692B8595247j348423k172410j207992N31114J411241P72087j100818l259293
39684B2220753m097737k470190N23629K049382Q08077j145582j071037P45791
39676A7563086J617616M87282p21351k97550P22564N64341k61740J57144J980109
39667B1811501L327819L181279K972512M708595Q183516J0375554P777527K02479
39659F2540782p553660r489776m773147J433629M717955O531396J0374706J5627994
39651G9409879J8754385J8483084J5604587R753470J758259k738543O98491O057683
$$ y = [13616640, 11403381, 10241023, 10822265, 11649247, 11461194, 11523581, 13979090, 18222602, 20951703, 20515916, 19361524, 20738899, 24376456, 27291186, 28046548, 28011918, 28462370, 28595247, 27246824, 25074414, 23866422, 24397536, 25808777, 26580864, 25480046, 22220753, 18123016, 15652826, 16176455, 18225837, 19033914, 17888332, 16817295, 17563086, 19180702, 19667984, 18946633, 18649083, 19371647, 19935988, 19674248, 19831392, 21811501, 25139320, 28320599, 31293111, 36001706, 44185222, 54560776, 62338303, 62540782, 54987122, 45497346, 40724199, 42157828, 46875783, 53407179, 63781885, 79409879, 98164264, 116647348, 132251935, 142005405, 143763664, 141025121, 141723612, 147781295]
39643A47781295K328060r946802j6837927j0323405n17585j279440j0971528j7138017
39635H3094651j5315552j2119208j1608195r916167m741414m09334k04331j189585
39627B7590865k40823R38524L82751O0008J801138L496940K852494J119349M5262
39618C8046508j157873k897853l055044q35508Q55486K7305j008063j22729N20229
39609C0372458j314114l185069j939046N60570M88469j540540k135480j327791
39601A9979457j805186l091782k012759J126259K116177m91091k926630k012273
39593A0882172M10144R17906n46154j466564o69984O21634Q37827j85709j247868
39584I553404j112706L3708P15332J01900r20781j169110n81968M41612J637185
$$ y = [147781295, 150109355, 140162553, 123324626, 113001221, 112483636, 111204196, 100232668, 83094651, 67779099, 55659891, 44051696, 34135529, 29394115, 28984781, 28780450, 27590865, 27350042, 28288566, 28671317, 28731325, 30532463, 34029403, 36881897, 38001246, 38046508, 36888635, 33990782, 30935738, 30100230, 30955716, 30983021, 29974958, 29852229, 30372458, 29058344, 25873275, 23934229, 24494799, 24983268, 23442728, 21307248, 19979457, 18174271, 15082489, 13069730, 14195989, 16312166, 15821075, 12894445, 10882172, 11292316, 12210222, 11664068, 10197504, 9527520, 10149154, 10986981, 10801272, 9553404, 8440698, 8474406, 9189738, 9291638, 8370857, 7201747, 6619779, 7061391, 8698576]
39575H698576K001970M13740j655490p24510L463494O414122N416589M090610
39567B8119101O323508R469939R718582J0972963J9488623L0185776K8641220
39560A42919712J0291796j1230749k0787809j9388126j7557648j7240149j1164122
39553E5842905J430806R742874N507890n733441j2518188j1508299q237956p075847
39545B7450744o590098m543326k249408k004051l159228l167382j333350M69660
39537D873561O08802k99223o24118j8441L73240k22890r79671n46795J003930
39528D168395K000333J165563p02819j652664j003819N719K45532K79079R72636
39519E477955J494451M67405j257676j274260M99197J130580q15318k593593j394621
$$ y = [8698576, 10700546, 11114286, 9458796, 8734286, 12197780, 18611902, 24028491, 28119101, 34442609, 43912548, 53631130, 64604093, 84092716, 114278492, 142919712, 153211508, 141980759, 121192950, 101804824, 84247176, 67007027, 55842905, 57273711, 67016585, 72524475, 66791034, 54272846, 42764547, 34526591, 27450744, 20860646, 16317320, 14067912, 12063861, 8904633, 5737251, 4403901, 4873561, 5482363, 5183140, 4559022, 4540581, 4913821, 4690931, 3711260, 3164465, 4168395, 6168728, 7334291, 6631472, 4978808, 3974989, 3980708, 4226240, 4505319, 5477955, 6972406, 7439811, 6182135, 4907875, 5407072, 6537652, 5722334, 3128741, 1734120]
39510A734120J059778J292504j00491M49634K981344L297952j39780l111686j877640
39501E585735J219250J708927l30002j463123p81281k60553k32918R73388K750487
39492I169910J979603j664008l997169k000277J781080K963597J179334m98286
39484H913784l84648M26240P29905O06214K55634l93362p98680l20583K77121
39475I311625m41561k160510k827874j518660K90429Q93767M06536j3696K62367
39466D202423J187146K247474K257251L55206k066463k100457P98881L299834
39458A0181295K267469r81288k583845j336472M15690O95455J60858J34836N96574
39449I550572R53102J178492J350254J210548P11644J6957j086100k514603k884197
$$ y = [1734120, 2793898, 4086402, 3985911, 4435545, 7416889, 10714841, 10575061, 7463375, 5585735, 6804985, 8513912, 8183910, 6720787, 5939506, 5678953, 5446035, 6419423, 9169910, 11149513, 9485505, 5488336, 3488059, 5269139, 8232736, 9412070, 8913784, 8529136, 8955376, 9685281, 10291495, 10547129, 10153767, 9355087, 9034504, 9311625, 8870064, 6709554, 3881680, 2363020, 2653449, 3547216, 3953752, 3940056, 4202423, 5389569, 7637043, 9894294, 10249500, 8183037, 6082580, 6881461, 10181295, 12448764, 11467476, 8883631, 7547159, 7962849, 8658304, 8819162, 8953998, 9550572, 10503674, 11682166, 13032420, 14242968, 14954612, 14971569, 13885469, 11370866, 8486669]
39440H486669j048042J422626J655154k79107j213006J94704J376695K82224j157882
39431I720035n01272R27378N04391r56900p76743M95189j97024k758182l326864
39422C130008l76416K387524J311605j876966k673968k8516K766598K861357J120931
39413H622157R5171L14585l9065j972237l581269k350992R81739K861623J710532
39404F642244M7413M13429J524332R45261m56719k08160R68612K44672j826802
39395H294282j533646J583520L215737R91964j634796r25434J528255K166283
39387A3686165J246302J160281J349113m47610l119934l144981n28496O59534
39379A0860374j443614l569587k295349J136613L046498K189329K76472r31307
$$ y = [8486669, 7438627, 8861253, 10516407, 10237300, 9024294, 9218998, 10595693, 10877917, 9720035, 9218763, 10146141, 10650532, 9693632, 8916889, 9412078, 9215054, 6456872, 3130008, 2753592, 5141116, 6452721, 4575755, 1901787, 1873271, 4639869, 7501226, 8622157, 8717328, 9031913, 8992848, 7020611, 3439342, 1088350, 2070089, 4931712, 6642244, 6689657, 7103086, 8627418, 9572679, 9115960, 8907800, 9876412, 10121084, 8294282, 6760636, 8344156, 11559893, 12551857, 10917061, 9991627, 11519882, 13686165, 14932467, 16092748, 17441861, 16994251, 13874317, 10729336, 10200840, 10860374, 9416760, 5847173, 3551824, 4688437, 7734935, 9924264, 10200736, 9269429]
39371I269429j024039k26876R32557J451206O38746q58037j615010j053469K9723
39362G544230N28780J45198o43305j305104j583542j247571j04543J387566K054858
39353F776567J319233K53213L24324J271929J502448N76887k72880l44637l15388
39344A1091696l41235M79752J670492R05511k121501l828454j572466J680071
39336G963866J170453k382357l575521l39497L129587K626023n73205k434706
39328E584643j566609L39617J475214J247694L9064p80249J25174J895016K010132
39319A0369696R9421r78001N23898K231580J395251n84008n77091R49691Q63925
39310A4294362j101835j893980n77245j46581k383816m443841l063462L83973
$$ y = [9269429, 8245390, 8018514, 8951071, 10402277, 11041023, 10182986, 8567976, 7514507, 7544230, 8073010, 8218208, 7574903, 6269799, 4686257, 3438686, 3334143, 4721709, 6776567, 8095800, 8349013, 8673337, 9945266, 11447714, 12024601, 11751721, 11407084, 11091696, 10750461, 11230213, 12900705, 13806216, 11684715, 7856261, 6283795, 7963866, 9134319, 6751962, 3176441, 2836944, 5966531, 8592554, 8019349, 5584643, 4018034, 4357651, 5832865, 7080559, 7119623, 6339374, 6464548, 8359564, 10369696, 10469117, 9491116, 10015014, 12246594, 13641845, 13057837, 12480746, 13430437, 14294362, 13192527, 11298547, 10721302, 10574721, 8190905, 3747064, 683602, 1067575]
39302A067575J986432Q89663k36433L25885J316297J187950L96118J35886M89536
39293G558909Q15658Q49483N95094K0858m97196l53751P4906m54833j878023k084318
39283D646787J85386K809351K686892J16877j569120p81943M77940K78281l90451
39274H460000n1661L26386o65576j627208j97986K630007L389323J454575J52328
39265A3870188J518529L053109J744814j077071j725150K84482J650917J90561
39257A9510379k287834k854341j343171L3791M2401j68443Q25326K345954K332914
39248A8436976K29390j993188k288849j095544l49031o32082q90352o95581q05021
39239I916718j154928m22789J456618K337794R01881j068417j263275k20620N045
$$ y = [1067575, 3054007, 3943670, 3707237, 4033122, 5349419, 6537369, 6933487, 7069373, 7558909, 8374567, 9224050, 9819144, 9840002, 9342806, 8989055, 9063961, 8609128, 6731105, 4646787, 4832173, 7641524, 10328416, 10445293, 8876173, 8094230, 8572170, 8850451, 8460000, 8408339, 8734725, 8069149, 6441941, 6243955, 8873962, 12263285, 13717860, 13870188, 15388717, 18441826, 20186640, 19109569, 17384419, 17668901, 19319818, 19510379, 17222545, 14368204, 13025033, 13058824, 13101225, 12932782, 13758108, 16104062, 18436976, 18666366, 16673178, 14384329, 13288785, 12939754, 12307672, 11417320, 10721739, 9916718, 8761790, 8339001, 9795619, 12133413, 13035294, 11966877, 10703602, 10482982, 10488027]
39230A0488027o77868p53257q4512K73200Q28994L003456N411285M323257o13233
39221B2199349m198133j856303L943115O387536K602288l488854o458090n046745
39213A4084163j962401l0958J52735l08103k51428M74781J215830J637586K242180
39204A7254385L378143M381195M706144N422289P920248J0907794J0593240N144069
39196F9707507k267762o517981o031130l625525k297316k259144k521512l172865
39188D1014272m591200n834444n677024m539371l652975k834529j069667Q68090
39180A3683152P28561j657027l327064k023377O60105J664918P11025J40075J235613
39171A1815981K831130L561619L617923L735204L747174K838809O15439k357117
$$ y = [10488027, 9810159, 9056902, 8972390, 9245590, 10074584, 13078040, 18489325, 22812582, 22199349, 18001216, 16144913, 20088028, 26475564, 29077852, 25588998, 19130908, 14084163, 12121762, 12090804, 12243539, 11935436, 11684008, 12158789, 13374619, 15012205, 17254385, 20632528, 25013723, 29719867, 35142156, 43062404, 53970198, 64563438, 69707507, 67439745, 60921764, 54890634, 51265109, 48967793, 46708649, 44187137, 41014272, 36423072, 30588628, 24911604, 20372233, 16719258, 13884729, 12815062, 13683152, 14411713, 12754686, 9427622, 7404245, 8064350, 9729268, 10440293, 10580368, 11815981, 14647111, 18208730, 21826653, 25561857, 29309031, 32147840, 32763279, 30406162]
39163C0406162m693378n108514l791891k417135k036345j684588k09598J379478
39155A1844191J160739o25276j850784j734623j538103j806584j403213p3485
39147C972862N14717l49838p65963P38731K457060K021861J84760m44093N00546
39138H830643R56175O0991o17835J46786J476579K291893L278987N585289Q286125
39129C0295633Q455859M168313k796650p786689p563522l755953j034137j645623
39121A8337231l231512k744496o49139M48000j49448q24802n11267L11204J120536
39112A2106307J760364J579471J68551j302369j532382j454860k692789m011551
39104D620742k475556J517239L827341K426068L09881N65435J610758K74157k705868
$$ y = [30406162, 25712784, 20604270, 16812379, 14395244, 12358899, 10674311, 10464713, 11844191, 13004930, 12379654, 10528870, 8794247, 7256144, 5449560, 4046347, 3972862, 4487579, 4137741, 3371778, 4110509, 6567569, 8589430, 8774190, 8330097, 8830643, 9786818, 9847809, 9229974, 9376760, 10853339, 13145232, 16424219, 22009508, 30295633, 38751492, 42919805, 40123155, 32336466, 24772944, 21016991, 19982854, 18337231, 15105719, 12361223, 11712084, 12160084, 12010636, 11185834, 10674567, 10985771, 12106307, 13866671, 15446142, 15614693, 14312324, 12779942, 11325082, 8632293, 4620742, 2145186, 3662425, 7489766, 9915834, 10225715, 10791150, 12401908, 12676065, 9970197]
39095I970197l811163k216297o09812p01841j048479R717J727445K372171J579038
39086G270976J91256j115965k042262k220411j496142l84970L62799N92187P69946
39077A927414J156062J281503O24645k63270l8841J526732K676216J750914l96123
39068A0245252j501938j104424q53155j543821j922723j060444J48447Q56066
39060C263260J611670K502560J961916o67747l022119k424610L24695K030365
39052E579990J308942k35974n84519O53378K391582K944117J364966r92762j391241
39043A1038479N64187J748202j47839k976885l320856j527728m06952l73530K95892
39034D892970J248726L80393j682774j764690N21802J792288M29427r60520l30763
$$ y = [9970197, 6159034, 3942737, 3332925, 2631084, 1582605, 1592322, 3319767, 5691938, 7270976, 7462232, 6346267, 4304005, 2083594, 587452, 202482, 565281, 1157468, 1927414, 3083476, 4364979, 4989624, 4726354, 4687513, 6214245, 8890461, 10641375, 10245252, 8743314, 7638890, 6785735, 5241914, 3319191, 2258747, 2407194, 3263260, 4874930, 7377490, 9339406, 8671659, 5649540, 3224930, 3549625, 5579990, 6888932, 6652958, 6068439, 6721817, 9113399, 12057516, 13422482, 12429720, 11038479, 11602666, 13350868, 13203029, 10226144, 6905288, 5377560, 4970608, 4597078, 4892970, 6141696, 6522089, 4839315, 3074625, 3596427, 5388715, 5818142, 4857622, 4526859]
39025D526859N14312k44595r32149L11564J713886P65880j274563j247382J003236
39016E137048K796363K700337J590652L88463o60228j033435m72628K57185J037193
39007A1740950L362810P118453Q183753L198085m032374n558268L23719N942575
38999C0279703L802224m002129r073897p378495k907807j123951k355148l107100
38991D133400j578627N14633R87626q0222j130162j181577k66768J138926K136792
38982D674021J755188M74944N72582L349886O531335O279474J838142l419426
38974B2056146n687317m137109q56882J070726k17917l307330m172365r65999
38966C781953K722400K231718j415136k971305q52248J153755O80967P5493J103685
$$ y = [4526859, 5041171, 4796576, 3864427, 4175991, 5889877, 6655757, 5381194, 4133812, 5137048, 7933411, 10633748, 12224400, 12612863, 11952635, 10919200, 10446572, 10703757, 11740950, 15103760, 22222213, 30405966, 33604051, 29571677, 24013409, 24337128, 30279703, 34081927, 30079798, 21005901, 13627406, 10719599, 9595648, 7240500, 4133400, 2554773, 3069406, 4057032, 3976810, 2846648, 1665071, 1398303, 2537229, 4674021, 6429209, 6904153, 7476735, 10826621, 17357956, 23637430, 25475572, 22056146, 16368829, 12231720, 11374838, 12445564, 12227647, 8920317, 4747952, 3781953, 6504353, 8736071, 7320935, 4349630, 3497382, 4651137, 5332104, 5407597, 6511282]
38957F511282J567048p099j106245J5969R11171j17153l90346J637391K328424
38948A1350442m77528j952324J989391O297260M164115j196315j453909L020937
38940B1742069M678316K622991L311359O902860N349361k570003o416308l80103
38932C5240542O208874K777300o634451j0676127p406853l891257l419670k981285
38924I217073j339123o82367q68341M61265K247113J078779k254495l339225j259938
38915C260741M51894K3635o79658n22559l16290L05463K323178L809937J992026
38906A0648367j363935j892589J43758K50751k381036l424473r73578J449837
38898B457102J261883N43799J129951J258281k23116j143575k73390K12505p87237
$$ y = [6511282, 8078330, 8071231, 6964986, 6980955, 7892126, 7774973, 7384627, 9022018, 11350442, 10872914, 8920590, 10909981, 17207241, 21371356, 20175041, 18721132, 21742069, 26420385, 29043376, 32354735, 39257595, 44606956, 42036953, 35620645, 35240542, 41449416, 44226716, 37592265, 26916138, 19509285, 15618028, 12198358, 9217073, 7877950, 7195583, 6327242, 6788507, 9035620, 10114399, 7859904, 4520679, 3260741, 3712635, 3736270, 3056612, 2534053, 2217763, 2523226, 4846404, 8656341, 10648367, 9284432, 7391843, 7535601, 7786352, 5405316, 1980843, 1007265, 2457102, 3718985, 4262784, 5392735, 6651016, 6427900, 5284325, 5010935, 5223440, 4436203]
38889D436203r49027N37279N60362j982209k826897P77630M457020L128119q80335
38880G258145j859806K42022J025422l02680o15944M21072j30519k119340j659932
38871B258440J920692M037052J831829j427886j486258J158572L412475M348616
38863A6053532M710575L936563J016070k730848m559507l746057k135285j399065
38855A1145978j408969j363400j067231o79745j91897K81020K69509l84273r15532
38846E685460l95510Q56009J452141R95889R85691K556351M174938L417040O35009
38837B0363018j469233k016806k850428m424578m077787n04824L009309K916387
38829A0945058P03270K22953J392079Q07722k048938l748703k495458o34915m45202
$$ y = [4436203, 3487176, 4024455, 4584817, 2602608, -224289, 553341, 5010361, 8138480, 7258145, 5398339, 5640361, 6665783, 6363103, 5747159, 6168231, 6037712, 3918372, 2258440, 4179132, 8216184, 10048013, 8620127, 7133869, 8292441, 11704916, 16053532, 20764107, 24700670, 25716740, 22985892, 18426385, 14680328, 12545043, 11145978, 9737009, 8373609, 7306378, 6626633, 6434736, 6715756, 6985265, 6600992, 5685460, 5289950, 6145959, 7598100, 8593989, 9579680, 12136031, 16310969, 19728009, 20363018, 18893785, 16876979, 14026551, 9601973, 5524186, 5019362, 8028671, 10945058, 11648328, 11871281, 13263360, 14071082, 12022144, 8273441, 5777983, 5143068, 4697866]
38820D697866j074275j166164j186745j339477l13520J769498K168464j58143
38812C397504j890337k08690K151550P60059l137396l799691M85358M588454L678208
38803F025019m90475k786572j619613K63170N66202P971M7655M77532L13808k82374
38793B522323k55702O13358J264172P49154n60620j451022j228597l43464K00915
38784A510517j05426p30688o22667M65610J323069O17935j078579j656079l47125
38775f23433J000765O38027l40734J64105J498107R24542j824976l425523j535093
38766c524213J799546L044706J740882J43748m11692n07603o42465m62668J7949
38757A198190J87213k8415j23689o2677j47251j02102L87813O44483P0710k45546
$$ y = [4697866, 3623591, 2457427, 1270682, -68795, -382315, 1387183, 3555647, 3397504, 1507167, 1298477, 3450027, 4210086, 1072690, -2727001, -2241643, 2346811, 6025019, 5534544, 2747972, 1128359, 1391529, 1957731, 1965702, 2013357, 2490889, 2804697, 2522323, 2266621, 2879979, 4144151, 4893305, 4332685, 2881663, 1653066, 1309602, 1510517, 1405091, 674403, 51736, 517346, 1840415, 2458350, 1379771, -276308, -623433, 377332, 1015359, 674625, 838730, 2336837, 3261379, 1436403, -1989120, -3524213, -1724667, 1320039, 3060921, 3204669, 2792977, 2285374, 1642909, 1180241, 1198190, 1385403, 1356988, 1233299, 1170622, 1023371, 921269, 1309082, 1953565, 2024275, 1778729]
38747A778729R76249K424309J422143j791425l691979k275921L00454J191391
38739C33950N41005j3000k12044l97344J05684J339539J271165j172755l266385
38730a470185k004914Q55928J170949r89566j594405M73363J739195M76450l08053
38721a651238J416174K725789R22370j429087r24658O90050k5514j598471l54244
38712b28829K198681J392868j857942j658617K597694M143452j42791l889267
38704B555249j227088L595675L164126j114592j830253J994825L670622J38578
38696A0947142l379143k262682O15666O07869j184969p76821J568562J996471
38688H132095n34868k852353k526458q90325m11247j341525j997773j145896P14561
$$ y = [1778729, 2754978, 5179287, 6601430, 4810005, 1118026, -1157895, -857441, 333950, 874955, 861955, 649911, 252567, 358251, 1697790, 2968955, 1796200, -1470185, -3475099, -2619171, -1448222, -2437788, -4032193, -3558830, -1819635, -1343185, -1651238, -235064, 2490725, 3413095, 1984008, 1059350, 1749400, 1723886, 125415, -228829, 1969852, 3362720, 1504778, -153839, 2443855, 6587307, 6444516, 2555249, 1328161, 4923836, 8087962, 6973370, 5143117, 7137942, 10808564, 10947142, 7567999, 5305317, 5920983, 6528852, 5343883, 4567062, 6135624, 8132095, 7597227, 4744874, 2218416, 1328091, 916844, -424681, -2422454, -3568350, -2853789]
38679b853789K015798J758837N28912l21566l86448l84645o36308m86470L89558
38670c76121J236948J297313N88144p63581k614755l741415k413850R26174L217712
38661b643431K437090K87810l46166P04341J435267R96675K83940j60130o27717
38652B367679q66701k60436O28887N67451k47740m34702R4819j26533j433145
38643B89579k026729o52525J252916J374793l93218j845818j143664J142988K667205
38634F65527J824562l65840j354847l57005M42143r36939k938656k339872R50009
38625d410918L387714K554434J41711q77913j37158N62739J91263o53047j068879
38616c10054o76340M47368J682589K128041J621728R66231O61890K18636p51028
$$ y = [-2853789, -837991, 920846, 1449758, 1128192, 741744, 357099, -279209, -765679, -376121, 860827, 2158140, 2746284, 1982703, -632052, -4373467, -6787317, -5861143, -2643431, -206341, 81469, -264697, 439644, 1874911, 2871586, 3155526, 2995396, 2367679, 1500978, 1240542, 1869429, 2436880, 2189140, 1754438, 1849257, 1722724, 289579, -1737150, -2389675, -1136759, 238034, -155184, -2001002, -3144666, -2001678, 665527, 2490089, 2124249, 769402, 412397, 854540, -82399, -3021055, -5360927, -4410918, -1023204, 1531230, 1672941, 795028, 657870, 1220609, 1411872, 758825, -310054, -986394, -539026, 1143563, 3271604, 4893332, 5859563, 6521453, 6740089, 5989061]
38607E989061j699416k002870j697032q80433M08537J277603N96267p81644m85448
38598G24625J510884J953622p50241l180631j596977K012668K589463l12828k021938
38589I28647j03600K283744J738130o46643j998922j881880j341845l80007J046540
38580c55836J612128O83430q2590N04913Q96832j83130p73949J054890L169842
38571F526530K612116J075676K269461M774870L241120k773241o965306n311932
38563E449294j622166q92720j818995l93750K502122K491229q94849l317711k057051
38554e54597Q00141K122766J423847Q3988n59778K11803J787720J995952l40161
38545F971681k869875k243809R53428K636822Q43816j981960k929501j963008
$$ y = [5989061, 4289645, 2286775, 589743, -290690, 117847, 1395450, 1991717, 1210073, 724625, 2235509, 4189131, 3438890, 258259, -1338718, 673950, 3263413, 2950585, 928647, 825047, 3108791, 4846921, 4200278, 2201356, 319476, -1022369, -1402376, -355836, 1256292, 1939722, 1857132, 2362045, 3258877, 3075747, 2301798, 3356688, 6526530, 9138646, 10214322, 12483783, 17258653, 20499773, 17726532, 10761226, 5449294, 3827128, 2934408, 1115413, 721663, 3223785, 5715014, 4820165, 1502454, -554597, 245544, 2368310, 3792157, 3876145, 3316367, 3528170, 5315890, 7311842, 6971681, 4101806, 1857997, 2811425, 5448247, 6292063, 4310103, 1380602, -582406]
38537e82406m19687J027752J689515P39480q57760p11034J376598K614754J431026
38528F308238k03925k96013J99380K6998L13913J897359K743974J297972j00449
38519A2187447J045048K415355K08090l958107m591956o08889K952178K371494
38511A2020660j26241q23240L38657J262139J245827O49919o45162k226657k460237
38502I235665q08125P32885K81799j269632j871258j201644l26868K64366O46572
38493E683760N07122k35337o30751J68149J563886K236018J562754k14970k267576
38484H373055l195755k089069m3491Q53407M14778L38708Q98190K18740k065628
38475C702935l222974j365652J440469K207266J039224j64061q89626j310048
$$ y = [-582406, -1002093, 25659, 1715174, 2454654, 1596894, 885860, 2262458, 4877212, 6308238, 6104313, 5808300, 6007680, 6034678, 6348591, 8245950, 10989924, 12287896, 12187447, 13232495, 15647850, 15855940, 11897833, 7305877, 6696988, 9649166, 12020660, 11894419, 11071179, 11409836, 12671975, 13917802, 14567721, 13922559, 11695902, 9235665, 8427540, 9160425, 9442224, 8172592, 6301334, 5099690, 4772822, 5037188, 5683760, 6190882, 5955545, 5324794, 5492943, 7056829, 9292847, 10855601, 10640631, 8373055, 5177300, 3088231, 3044740, 3898147, 4312925, 4651633, 5549823, 5768563, 3702935, 479961, -885691, 554778, 2762044, 3801268, 3637207, 2747581, 1437533]
38467A437533m75263J773632K887063R65092j427241m23920L239294N280042M099739
38458A7355971J976030L86239j566694l693766l946152k207968j086745j585356
38450E631559j541878J07879J114430p058j041109K26022K196191K160711N20253
38441I367000n42180p13700j040720j343999r45312o32224j144091j006620J125804
38432C123958L120341J849067j508373k428887K90860K516425Q19995k591459
38424E191927l271485p39641J413440P22335j412080k326826j421199J9307J037859
38415g86363J697156J978848J413752J90877m87781K6386P54965N93467M1528
38406E422835M0801n5304j262019k222261m94716L084136M435629J921571j008051
$$ y = [1437533, 962270, 2735902, 5622965, 6588057, 5160816, 4736896, 7976190, 13256232, 17355971, 19332001, 19718240, 18151546, 14457780, 10511628, 8303660, 7216915, 5631559, 4089681, 4197560, 5311990, 5304932, 4263823, 4489845, 6686036, 8846747, 9367000, 8824820, 8111120, 7070400, 5726401, 4781089, 4148865, 3004774, 1998154, 3123958, 6244299, 8093366, 6584993, 4156106, 4446966, 6963391, 7783386, 5191927, 1920442, 1180801, 2594241, 3316576, 1904496, -422330, -1843529, -1824222, -786363, 910793, 2889641, 4303393, 4494270, 4006489, 4032875, 4787840, 5381307, 5422835, 5463636, 5408332, 4146313, 1924052, 1429336, 4513472, 8949101, 10870672, 9862621]
38397I862621r17380O46825J89379j974004k597636q36089J043042J703383J877318
38388H997459J622283J19600j449118n38278K300765L128716K51149l118122l657256
38379G657198k307739j536707j101451M21927K004844J461411p27554j940003
38371C931926j202271J00826P80780P31390j92107j764517k338001o83530J525042
38362H89538J709602N02952P82899K582881K560631m85818l101271k096543R29087
38353D273958K392849J695780O54213j73941j463188k473455j598532O51206J935058
38344E893948J474516P69115O87470K26592j175674k221115j660553l4235J405507
38335E365571K149242K043220Q59022q35722j633619j071904l79497o22520j283408
$$ y = [9862621, 8945241, 9592066, 9781445, 7807441, 5209805, 4373716, 5416758, 7120141, 8997459, 10619742, 10739342, 9290224, 8751946, 11052711, 14181427, 14432576, 11314454, 7657198, 5349459, 3812752, 2711301, 3133228, 5138072, 6599483, 5871929, 3931926, 2729655, 2830481, 3611261, 4342651, 4150544, 2386027, 48026, -635504, 889538, 2599140, 3102092, 3884991, 6467872, 9028503, 8542685, 5441414, 3344871, 4273958, 6666807, 8362587, 9016800, 8842859, 7379671, 4906216, 3307684, 3958890, 5893948, 7368464, 8137579, 8825049, 9051641, 7875967, 5654852, 3994299, 3960064, 5365571, 7514813, 9558033, 10417055, 9581333, 7947714, 6875810, 6496313, 5873793, 4590385]
38326D590385j552536j695917j972245j475490M29241K452253K722585J173822
38318D672098p11874j819113j765210l09247J934620L041896J977475N51417R86495
38309H558557K175842J184111j594440k125135J330752N045051M655316Q87394
38301B0117448k034034k147437j231211j282911k176060k899249l008102k396426
38293B942018j166735j29317j61157p65891m76825J010060K316349K352754J543056
38284G464312N48024q48265k573421l208780j681355N49792P80190j260491k604984
38275b834978p86730K743588M250446K295621p46235j929159j155908n28168j160703
38266A47774j921879j320637L64539J365537N31514j222202j741409k2168K432681
$$ y = [4590385, 3037849, 1341932, -630313, -2105803, -1676562, 775691, 3498276, 4672098, 3960224, 2141111, 375901, 66654, 2001274, 5043170, 7020645, 7572062, 8558557, 10734399, 11918510, 10324070, 8198935, 9529687, 14574738, 19230054, 20117448, 18083414, 15935977, 14704766, 13421855, 11245795, 8346546, 5338444, 2942018, 1775283, 1645966, 1484809, 718918, 242093, 1252153, 3568502, 5921256, 7464312, 8012336, 7164071, 4590650, 1381870, -299485, 250307, 1030497, -229994, -2834978, -3621708, -878120, 3372326, 5667947, 4921712, 2992553, 1836645, 1308477, 147774, -1774105, -3094742, -2730203, -1364666, -833152, -2055354, -3796763, -3818931, -1386250]
38257a386250L180799J715005j16159p81158q83973j480475j931833j033776O14233
38248b103587J319528R37737P64429R87449N16281n12035n61418L78853L50619
38239B077856r90648j163559Q85804K042721n63609m414653m465654k43966L580900
38230c254808L705918J730231M15310k27099j346008k363118k060701j001090
38222d401365n37946l64166O62415J767560Q86366j617748k381049L62540L540076
38213b083317K983016n21690j963441O94293L307112J612230k219657k719543
38205i10997N61764K423970J18080k565594j476906J574959K161868J09316j158364
38196H38096o07781m93275j539835j455805Q49750L003680K619310N02245j086822
$$ y = [-1386250, 1794549, 3509554, 3393395, 2612237, 1728264, 247789, -1684044, -2717820, -2103587, -784059, 153678, 918107, 1905556, 2421837, 1909802, 1348384, 1727237, 2077856, 1087208, -76351, 809453, 2852174, 2288565, -2126088, -6591742, -6835708, -3254808, 451110, 2181341, 2596651, 2369552, 1023544, -1339574, -3400275, -4401365, -4939311, -5303477, -4641062, -2873502, -1987136, -3604884, -5985933, -5623393, -2083317, 899699, 378009, -1585432, -891139, 2415973, 4028203, 1808546, -910997, -349233, 2074737, 2192817, -372777, -1849683, -274724, 1887144, 1996460, 838096, 230315, -262960, -1802795, -3258600, -2408850, 594830, 3214140, 3716385, 2629563]
38187B629563j426038j152745o00305K71063J136543J426590P45513q64865k356388
38178a91069j990731L34996J867323K84719k407695k127387J293142L706202K727759
38169C497259O07425j52919k96398r26108p61322Q51587J367195r74645l177696
38160C4378j580344J966130K517856l87203k336376j191459J86558m70784r67606
38151b228850J187965M081998M061423J280236m68631J185910M704102P077718
38143B0881871O795357M073835k01957m711166p556006p152636l821355o1798
38135H246145J559885R26477R0268L70018Q76135N50553K56603J321480K965185
38126A7162749L154929J642501J11365o77531j698575l177067l539470j953613
$$ y = [2629563, 1203525, 50780, -549525, -278462, 858081, 2284671, 3030184, 2165319, -191069, -2181800, -1846804, 20519, 305238, -2102457, -4229844, -2936702, 769500, 3497259, 4104684, 3951765, 3655367, 2729259, 1967937, 2819524, 4186719, 3212074, 34378, -1545966, 420164, 2938020, 2550817, 214441, -977018, -790460, -1261244, -2228850, -1040885, 3041113, 7102536, 8382772, 7914141, 9100051, 13804153, 20881871, 27677228, 31751063, 31549106, 26837940, 19281934, 12129298, 8307943, 8246145, 9806030, 10732507, 10822775, 11192793, 12068928, 12619481, 12876084, 14197564, 17162749, 20317678, 21960179, 22071544, 21394013, 19695438, 16518371, 12978901, 11025288]
38118A1025288l0613M66934O3853N0371p5362j451713l020076k465829M11J387610
38108E950874K49709j090185j87584J640979J505897j00018M41066M399388Q231045
38099B1041171P878472L569685j233024m049980m652161l468004j241485J67984
38091A8012658q97788l487655m800071l603033j290316M40152J079671N05233
38083E958851j078153k118417r97068J220210J809749O43921M20538J817749K037109
38074I714489j38716j725840o60109L30427j277965k582926q4064L128338J301941
38065H005575m228326o093570k017237J926793J048208j361274n28807K166212
38057a082426K666660J320004J263251K214016J175426j664437k606657k46937
$$ y = [11025288, 10994675, 11461609, 11525462, 11575833, 11500471, 10048758, 7028682, 4562853, 4563264, 5950874, 6200583, 5110398, 4922814, 6563793, 8069690, 7969672, 8410738, 12810126, 21041171, 28919643, 32489328, 31256304, 27206324, 22554163, 19086159, 17844674, 18012658, 17114870, 13627215, 8827144, 5224111, 3933795, 4373947, 5453618, 5958851, 4880698, 2762281, 1765213, 2985423, 4795172, 5439093, 5859631, 7677380, 9714489, 9575773, 7849933, 7189824, 7520251, 6242286, 3659360, 3575296, 6703634, 8005575, 3777249, -2316321, -4333558, -2406765, -1358557, -2719831, -3248638, -1082426, 1584234, 2904238, 4167489, 6381505, 7556931, 5892494, 3285837, 3038900]
38049C038900K338127K102009k57951k171046k479167j635447k19095J479365
38041B195695L057356L870046L145081N07733l020322n104198m268173j734122
38033a350904l7607m594k29421M78541J377552J042721m29284j274130k14006
38024f41132J692589K068548L23608j244707n02395J310873J336387m28907j052266
38015B862598N92100J979681J172424J831P23463J912622P87497j907577k735809
38006E388830p13825J519459J701895L43261j170165k289710k520246j243478
37998A016021P82321J670357J097929J057277K840400M697956L823470p9563m249221
37989A2656947n600335l550014l83505J062907K48064q98981q34500k80615l49858
$$ y = [3038900, 5377027, 7479036, 7221085, 5050039, 2570872, 935425, 716330, 2195695, 5253051, 9123097, 12268178, 12775911, 9755589, 4651391, 383218, -1350904, -1388511, -1393105, -1622526, -1143985, 233567, 1276288, 847004, -427126, -641132, 1051457, 3120005, 3443613, 2198906, 1696511, 3007384, 4343771, 3914864, 2862598, 3454698, 5434379, 6606803, 6608634, 7332097, 9244719, 10032216, 8124639, 5388830, 4675005, 6194464, 7896359, 8239620, 7069455, 4779745, 2259499, 1016021, 1798342, 3468699, 4566628, 5623905, 8464305, 13162261, 16985731, 16906168, 12656947, 7056612, 3506598, 3123093, 4186000, 4434064, 3535083, 2700583, 2419968, 2070110]
37980B070110k90459R71649K173158J201111j224715k174731q84183L78073K76883
37971B496896J85726R48063R84793n05467j209917Q95896L833027M102033J585390
37962A3316440p48210j231000r46721j122399j539962j741235j827784j689991
37954B469138r64741l2406K22041k30701o03167o29155o13435k71147R91128K505116
37944B842671K589356Q83511p98278o01640J233292K861279K742787P32942j996297
37935A0489623l732978l499298j868236j83820Q93635J469495J382202K11421
37927E162044j593812k698544k377006j218665r0756P57271J280431J231020O23813
37918A075796n6721m58264o13839n07438j06815J94172J05803L37001J670779
$$ y = [2070110, 1779651, 2751300, 4924458, 6125569, 4900854, 2726123, 1841940, 2220013, 2496896, 2682622, 3630685, 4615478, 4110011, 2900094, 3795990, 7629017, 11731050, 13316440, 12568230, 11337230, 10390509, 9268110, 7728148, 5986913, 4159129, 2469138, 1504397, 1471991, 1694032, 1463331, 860164, 231009, -382426, -653573, 337555, 2842671, 5432027, 6315538, 5517260, 4915620, 6148912, 9010191, 11752978, 12485920, 10489623, 6756645, 3257347, 1389111, 1205291, 2098926, 3568421, 4950623, 5162044, 3568232, 869688, -1507318, -2725983, -2816739, -2059468, -779037, 451983, 1075796, 1019075, 560811, -53028, -560466, -667281, -473109, -367306, -30305, 1640474]
37909A640474L079459K433473l80060k774039k798014j475918o61081l76922J5467
37900a297161k33937j731179k608293o20603K937606M381939K753364Q11955M25369
37891D819060J47159j271232k013959k05934K440759K780137P09978j184096j566728
37882D655144j232301o11275O55594J581183K73745k635602l712145j334594J652179
37873g08072J799189k29023j127042P0664J202844Q50893K17730M68633N73472
37864C119288p00967k261713k078121l48878O70825k7382q75157k71058J072151
37855a701012J448027P91349N21240J160774J631036J087731J70396j02095K78708
37846E286154O34863N88130J56257n01776r41579p09618k34113o00412j817512
$$ y = [1640474, 4719933, 7153406, 6773346, 3999307, 1201293, -274625, -935706, -1312628, -1297161, -1531098, -3262277, -5870570, -6491173, -3553567, 828372, 3581736, 4393691, 4819060, 4966219, 3694987, 1681028, 1475094, 3915853, 6695990, 7405968, 6221872, 4655144, 3422843, 2811568, 3467162, 5048345, 5322090, 2686488, -1025657, -2360251, -708072, 1091117, 862094, -264948, -194284, 1008560, 1859453, 2077183, 2545816, 3119288, 2418321, 156608, -1921513, -2270391, -1599566, -1626948, -2502105, -2773163, -1701012, -252985, 538364, 1059604, 2220378, 3851414, 4939145, 5109541, 5007446, 5286154, 5921017, 6509147, 6665404, 6163628, 5222049, 4512431, 4278318, 3677906, 1860394]
37837A860394k286425r44212R45017J328331L1830j306272j372051o7968J978733
37828A67377L402100K462757p46677l225927k416946n598L61327j208065r89959
37819b199611J907023L320950M42222l166584k470925J531957L388571J214301
37811C967904j159246m13475J717743J725879n80636k435682k151710p69327n0789
37802a49339k83812l72759N09222J791176K165227J251061P7257l27639j67979
37793D492415k10419n70298q73872j007596r33260l75809N21456R50431O82988
37784B676036O59264J313926J408491n8761j840719k099251j163088o08520l88450
37775a01072O95012K112422J975596M43569J295J598983K975520J930049p70449
$$ y = [1860394, -426031, -1370243, -425226, 903105, 934935, -371337, -1743388, -1811356, 167377, 3569477, 6032234, 5285557, 2059630, -357316, -362914, -1587, -1209652, -2199611, -292588, 3028362, 3470584, 304000, -2166925, -634968, 2753603, 3967904, 2808658, 2395183, 4112926, 5838805, 5258169, 2822487, 670777, -98550, -149339, -433151, -805910, -296688, 1494488, 3659715, 4910776, 4988033, 4660394, 4492415, 4281996, 3711698, 2837826, 1830230, 896970, 521161, 1042617, 1993048, 2676036, 3335300, 4649226, 6057717, 5998956, 4158237, 2058986, 895898, 287378, -101072, 593940, 2706362, 4681958, 5125527, 5126822, 6725805, 9701325, 11631374, 10860925]
37766A0860925k878184l286050k140761j05462J376906P84224j288266k162936
37758A160396m93560J901125K832842K682408K975710L586044L350523K484509
37750B0479997K414505L644787N250660O036597N057736J786003k863473o370173
37742C5436639o953242n612127m513927l938407k444715J55822J778030O74760
37734A4582833j889822k558045K65828L878198L803716l00612k805244J313345
37726A6290197Q836400J1078299N093658k144757l270230k15503j17549m399713
37718C1150802p602581o334595l594741k941846l256559j877554N59318J495439
37710G597683N55565n15754p74772o07055k03681M40253N90675l14039j186579
$$ y = [10860925, 7982741, 4696691, 2555930, 2450468, 3827374, 4611598, 3323332, 1160396, 666836, 2567961, 5400803, 8083211, 11058921, 14644965, 17995488, 20479997, 22894502, 26539289, 31789949, 37826546, 42884282, 44670285, 41806812, 35436639, 28483397, 22871270, 18357343, 14418936, 11974221, 12130043, 13908073, 14582833, 12693011, 10134966, 10400794, 14278992, 18082708, 17782096, 14976852, 16290197, 25126597, 36204896, 41298554, 39153797, 35883567, 35668064, 35550515, 31150802, 23548221, 17213626, 13618885, 10677039, 7420480, 5542926, 6102244, 7597683, 8153248, 7637494, 6862722, 6255667, 6051986, 6492239, 7082914, 6768875, 5582296]
37701E582296m66526J336311J942911M19737j481876j758732p53871k73561q25581
37692C721108j145114m78618J48668k23630n74804O36669K684690L172087J536467
37683I477523j4236K26474J116918P55380p16187j859801k119608j671616l70111
37674D824736J382954J865719J36303j971874j975548j32573J278378J297586
37666F705681P64696J94414m84511o30377L02421J239201J239674J938573N125082
37657A6394854Q537241P940443L538843J58196N9397k00213l736643q026481q646517
37648A6019120n587644k543730j557111j438024p20397L66615Q04298J33614j050902
37639D425839j399931k32274J226725J260647K27642j24543K48688j72952j195763
$$ y = [5582296, 5115770, 6452081, 8394992, 8814729, 7332853, 5574121, 4820250, 4546689, 3721108, 2575994, 2097376, 2246044, 2022414, 1447610, 2084279, 4768969, 7941056, 9477523, 9463287, 9689761, 10806679, 11562059, 10845872, 8986071, 6866463, 5194847, 4824736, 6207690, 8073409, 8209712, 6237838, 4262290, 4129717, 5408095, 6705681, 7470377, 7664791, 7180280, 6549903, 6852324, 8091525, 9331199, 11269772, 16394854, 24932095, 32872538, 36411381, 36569577, 36628974, 36428761, 32692118, 24665637, 16019120, 10431476, 7887746, 6330635, 4892611, 4172214, 4538829, 5343127, 5476741, 4425839, 3025908, 2793634, 4020359, 5281006, 5508648, 5384105, 5632793, 5459841, 4264078]
37630D264078r78262J57440k45195j900798j251652K255957L930849Q86233k997078
37621D121572l016787o14609J38402n60070j47293N02906q52137k143999J97296
37612b374719M038971L813860l50522k437326J3096K796667K656749J629309J714606
37603A1500691J296293j91394N03272M984308R548839J0524904R057245P054094
37595E4278252K837971m600569j0792284j0650498n904306k682481l186398m389932
37587A4909755l906746k546525j381837l64428J6011r26006j989468j283399O12711
37578C140068J432954Q01000J89640j55402j060167j605787q4631K163345J725436
37569F546456j349314k841512o16934K062988J653686m92900r92834L9200p7341
$$ y = [4264078, 3285816, 3443256, 3198061, 1297263, 45611, 2301568, 6232417, 7118650, 4121572, 1104785, 490176, 628578, 68508, -78785, 424121, -428016, -2572015, -2374719, 1664252, 5478112, 5127590, 2690264, 2703360, 5500027, 8156776, 9786085, 11500691, 12796984, 12605590, 13108862, 18093170, 27642009, 38166913, 47224158, 54278252, 57116223, 52515654, 41723370, 31072872, 25168566, 22486085, 19299687, 14909755, 11003009, 8456484, 7074647, 6710219, 6726230, 5800224, 3810756, 2527357, 3140068, 4573022, 5374022, 5563662, 5408260, 4348093, 2742306, 2657675, 4821020, 6546456, 5197142, 2355630, 1738696, 3801684, 5455370, 4962470, 3969636, 4008836, 3931495]
37560C931495j492187j509921O28321K122084R15112j072028r19330Q84521J433097
37551D921164m01j052623k92954M34189q25615k618566k044799Q19583L024430
37542B364408K953124J876416J142961M43850l99533m41842L73735M29406r15172
37533G827353j918313j251230j97021k67968n52343M44895J968114K293005J491598
37524I838090P01866j02600j381550k270529j819148q61820m96884m5635J171360
37515D733150J652549J01841j616203j183991l5888j061749l238990k913470K38
37506c562513J704351P42423q027J347818K635595J584395o32190j751614j499023
37497E61215o69592L47691Q11450j48242j509862j125992P01812J311252R5619
$$ y = [3931495, 2439308, 929387, 1557708, 3679792, 4594904, 3522876, 2603546, 3488067, 4921164, 4920763, 3868140, 3575186, 4009375, 3183760, 565194, -1479605, -660022, 2364408, 5317532, 7193948, 8336909, 8780759, 8381226, 7939384, 8313119, 8742525, 7827353, 5909040, 4657810, 4460789, 4192821, 3640478, 4085373, 6053487, 8346492, 9838090, 10539956, 10437356, 9055806, 6785277, 4966129, 4104309, 3607425, 3561790, 4733150, 6385699, 6487540, 4871337, 3687346, 3651458, 2589709, -649281, -3562751, -3562513, -1858162, -1115739, -1123766, 224052, 2859647, 4444042, 3811852, 2060238, 561215, -108377, 239314, 1050764, 902522, -607340, -1733332, -1031520, 279732, 375351]
37488C75351n07314N31366J042080j75228j067396j36629R58959P19097L29172
37479B069458O75748K58245j509521k291728o81912J245483J722020K031180K846250
37470F365223J917402j324825l119722j271795N50063j032031k962282j245533
37462b123500J517383O63914j871134r21749K303167K161716j061069j344757
37454f76029K216176L353863o44495m085307k110699J858075K117633r49166k804361
37445a724310j509187J132259K728135K035304m04548k019826r02392R99451N69816
37436I04702j012147j16974K279370J453561k362017l092738J106515M018547
37428C178819J280197k614019k037634J108986K061363J156708R87696K99697
$$ y = [375351, -131963, 399403, 1441483, 1266255, 198859, 62230, 1021189, 1740286, 2069458, 2745206, 3003451, 1493930, -797798, -1479710, -234227, 1487793, 3518973, 6365223, 8282625, 6957800, 3838078, 2566283, 3116346, 2084315, -877967, -2123500, -606117, 57797, -1813337, -2735086, -431919, 1729797, 668728, -676029, 1540147, 4894010, 4249515, 164208, -1946491, -88416, 2029217, 1080051, -1724310, -3233497, -2101238, 626897, 2662201, 2257653, 237827, -664565, 334886, 904702, -107445, -224419, 2054951, 3508512, 1146495, -1946243, -839728, 3178819, 4459016, 1844997, -192637, 916349, 2977712, 4134420, 5122116, 5421813]
37420E421813k596874m306476j339358K592710J653359k260946k498777J155045
37412b179504K428792o08867k740868p62689J842612J586354J65136K40309R88840
37403I60115O51698k94497p98006r76939p47221L08049R54237m34576k222748
37394b599888j096049K193232L193704Q11909r11431L06471J394178k96416k431127
37385E64583k180163j044398j433807j976943l33535K105917K463925J191536
37377f42885O88966Q73914R5126q74625J27443K245587K199260n51270k707169
37368A454347j905689K86882J203169N69549k00390n50344r85276j477825j214356
37359b819933r5816O00547j09555j107241l77000J807378K624638O65643j629345
$$ y = [5421813, 2824939, -1481537, -2820895, -228185, 1425174, -835772, -3334549, -2179504, 249288, -359579, -3100447, -3863136, -2020524, -434170, -269034, -28725, 960115, 1611813, 1317316, 519310, -457629, -1204850, -896801, 57436, -377140, -2599888, -3695937, -1502705, 1690999, 2502908, 1591477, 1897948, 3292126, 2995710, 564583, -1615580, -2659978, -4093785, -6070728, -6404263, -4298346, -1834421, -642885, 46081, 919995, 1015121, 140496, 267939, 2513526, 4712786, 4161516, 1454347, -451342, -164460, 1038709, 1608258, 1407868, 857524, -127752, -1605577, -2819933, -2915749, -2315202, -2424757, -3531998, -3908998, -2101620, 523018, 1188661, -440684]
37350d40684j360487N97252J343215O69852P52071J796414J728798K68173n00725
37341D853879j54635o54294k124507j965080L38912J572629j923j671086r23236
37332g29341O76049J021913J145537K101492J831677r54689l037927j269311J821781
37323B607181J767411p09515j396990J87806O67304q45302j554146k50459R82404
37314A455694Q41070L63633q6616j368306k548681j375069J467143K508902Q70306
37305B128076m36226K36308O47984p86744j770821j0867K682806L036106J000467
37296F727089p88726q73970j34900P6948n76855j329472j100418q233K34686j199456
37286A026693k239028p75744J344009P06312j680085j295689K332851M070447
$$ y = [-440684, -1801171, -1203919, 139296, 809148, 1561219, 3357633, 5086431, 5354604, 4853879, 4699244, 4044950, 1920443, -44637, 294275, 1866904, 1864981, 193895, -729341, -53292, 968621, 2114158, 4215650, 6047327, 5092638, 2054711, 785400, 2607181, 4374592, 3665077, 2268087, 2455893, 3123197, 2277895, 723749, 473290, 1455694, 2296764, 2660397, 2573781, 1205475, -1343206, -2718275, -1251132, 1257770, 2128076, 1691850, 1928158, 2576142, 1789398, 18577, 7710, 2690516, 5726622, 6727089, 5938363, 5064393, 4929493, 5006441, 4429586, 3100114, 1999696, 1991463, 2226149, 1026693, -1212335, -1988079, -644070, 62242, -1617843, -2913532, -580681, 3489766]
37278C489766J191345k077733j379777R31595L07540k199325k081818Q15702K271232
37269A268527P17723r29741p01278j70006p14394j144849l67925P49289J361762
37260F9108J744263J541555j94822k305999j987296P43767K241543O75596r90233
37251A537482J9412J490097j214k919353k905763L5666J376351n87800j994802
37242c949924J95619L194013K800214j17382j318962K37230J460194M15866j134105
37233A782763j179439l46491J3674J65081P04490Q16159k68237j357052p79015
37224d48067R96289J933926J130573n26732j914854k465968j842751k93258R19039
37215b511803P79195k1606j43846K89487J42088m93130l07836Q63968J514601
$$ y = [3489766, 4681111, 2603378, 1223601, 2155196, 2462736, 263411, -1818407, -1002705, 1268527, 1986250, 1056509, 355231, 185225, -529169, -1674018, -2041943, -1292654, 69108, 1813371, 3354926, 3160104, 854105, -1133191, -389424, 1852119, 2527715, 1537482, 1556894, 3046991, 3045777, 126424, -2779339, -2743673, -1367322, -1955122, -3949924, -3754305, -560292, 2239922, 2122540, 803578, 1040808, 2501002, 2916868, 1782763, 603324, 256833, 270507, 435588, 1140078, 1956237, 1688000, 330948, -448067, 548222, 2482148, 3612721, 3085989, 1171135, -1294833, -3137584, -3430842, -2511803, -1732608, -1754214, -1898060, -1608573, -1466485, -1959615, -2267451, -1403483, 111118]
37206A11118Q14045j03737l2826M32602K8565r98665j100805K68134J517952O89844
37196A626227j832916l222370j524184J548230K593722J111730j085R24473J809231
37187C033058N60723j192612p84599R83851J290972k2974p85171p26211j474201
$$ y = [111118, 925163, 821426, 788600, 1221202, 1249767, 251102, -849703, -581569, 936383, 1626227, -206689, -3429059, -4953243, -3405013, -811291, 300439, 299354, 1223827, 3033058, 3593781, 2401169, 1616570, 2600421, 3891393, 3868419, 3083248, 2357037, 882836]
$$ [...]
##END NTUPLES=NMR SPECTRUM
##END=
