##TITLE=31Pdec_SR145rm1h
 , 124 sc
 27.9.2022
##JCAMPDX= 6.0         $$ Bruker NMR JCAMP-DX V2.0
##DATA TYPE= NMR SPECTRUM
##DATA CLASS= NTUPLES
##ORIGIN= UXNMR, Bruker Analytische Messtechnik GmbH
##OWNER= root
$$ XWIN-NMR		Version 3.5
$$ Tue Sep 27 15:58:02 2022 Russian Standard Time (UT+4h)  she@DPX200
##.OBSERVE FREQUENCY= 81.013821
##.OBSERVE NUCLEUS= ^31P
##.ACQUISITION MODE= SIMULTANEOUS
##.ACQUISITION SCHEME= undefined
##.AVERAGES= 124
##.DIGITISER RES= 16
##SPECTROMETER/DATA SYSTEM= spect
##.PULSE SEQUENCE= zgpg30
##.SOLVENT NAME= CD2Cl2
##.SHIFT REFERENCE= (INTERNAL, CD2Cl2, 0, 248.564)
##AUDIT TRAIL= $$ (NUMBER, WHEN, WHO, WHERE, WHAT)
$$ ##TITLE= Audit trail, XWIN-NMR		Version 3.5
$$ ##JCAMPDX= 5.01
$$ ##ORIGIN= Bruker BioSpin GmbH
$$ ##OWNER= she
$$ F:/spectra/data/she/nmr/P31/1/pdata/1/auditp.txt
$$ ##AUDIT TRAIL=  $$ (NUMBER, WHEN, WHO, WHERE, WHAT)
(   1,<2022-09-27 15:57:07.56 +0400>,<she>,<DPX200>,
      <continue with go, POWCHK disabled, PULCHK disabled
       configuration hash MD5:
       00 E9 B6 7A A2 85 ED C7 34 08 36 98 17 FE 4E 26
       data hash MD5: 32K
       40 E5 31 A3 08 EB CC 18 F4 33 53 89 84 98 58 8D>)
(   2,<2022-09-27 15:57:09.67 +0400>,<she>,<DPX200>,
      <Start of raw data processing
       efp BC_mod = 2 LB = 1 FT_mod = 6 PKNL = 1 PHC0 = -10264.1 PHC1 = 39.25659 SI = 64K 
       data hash MD5: 64K
       F9 D4 FE 82 AB 9E 02 6B 26 39 D2 4C A3 A5 71 7D>)
(   3,<2022-09-27 15:57:32.68 +0400>,<she>,<DPX200>,
      <pk PHC0 = 21.11611 PHC1 = -26 
       data hash MD5: 64K
       94 F4 7C FE 40 61 A8 83 D5 C3 A8 23 E0 19 F7 9C>)
(   4,<2022-09-27 15:57:36.60 +0400>,<she>,<DPX200>,
      <abs ABSG = 5 
       data hash MD5: 64K
       27 8F 0E 8E A4 C7 23 E7 A9 5B 3C 98 C2 94 6B BE>)
$$ ##END=
$$ 
$$ hash MD5
$$ BE B6 EC 68 A6 F7 79 FF 7C 44 09 48 CB CF 2A 60
##$RELAX= 
##$RELAX= 
##$RELAX= 
##$RELAX= 
##$RELAX= 
##$RELAX= 
##$RELAX= 
##$RELAX= 
##$RELAX= 
$$ Bruker specific parameters
$$ --------------------------
##$DU= <F:/spectra>
##$EXPNO= 1
##$NAME= <P31>
##$PROCNO= 1
##$TYPE= <nmr>
##$USER= <she>
##$AMP= (0..31)
100 100 100 100 100 100 100 100 100 100 100 100 100 100 100 100 100 100 
100 100 100 100 100 100 100 100 100 100 100 100 100 100 
##$AQSEQ= 0
##$AQ_mod= 1
##$AUNM= <au_zg>
##$AUTOPOS= <>
##$BF1= 81.014009
##$BF2= 200.13
##$BF3= 200.13
##$BF4= 200.13
##$BF5= 200.13
##$BF6= 200.13
##$BF7= 200.13
##$BF8= 200.13
##$BYTORDA= 1
##$CFDGTYP= 0
##$CFRGTYP= 5
##$CHEMSTR= <none>
##$CNST= (0..31)
1 1 145 1 1 1 1 1 1 1 1 1 1 1 1 1 1 1 1 1 1 1 1 1 1 1 1 1 1 1 1 1 
##$CPDPRG= <waltz16>
##$CPDPRG1= <>
##$CPDPRG2= <waltz16>
##$CPDPRG3= <>
##$CPDPRG4= <mlev>
##$CPDPRG5= <mlev>
##$CPDPRG6= <mlev>
##$CPDPRG7= <mlev>
##$CPDPRG8= <mlev>
##$CPDPRGB= <>
##$CPDPRGT= <>
##$D= (0..31)
0 1 0 0 0 0 0 0 0 0 0 0.03 2e-05 3e-06 0 0 0 0 0 0 0 0 0 0 0 0 0 0 0 0 
0 0 
##$DATE= 1664279659
##$DBL= (0..7)
120 120 120 11 120 120 24 19 
##$DBP= (0..7)
150 150 150 150 150 150 150 150 
##$DBP07= 0
##$DBPNAM0= <>
##$DBPNAM1= <>
$$ [...]
##$SUBNAM3= <"">
##$SUBNAM4= <"">
##$SUBNAM5= <"">
##$SUBNAM6= <"">
##$SUBNAM7= <"">
##$SUBNAM8= <"">
##$SUBNAM9= <"">
##$SW= 501.771253377433
##$SWIBOX= (0..15)
0 1 3 0 0 0 0 0 0 0 0 0 0 0 0 0 
##$SW_h= 40650.406504065
##$TD= 32768
##$TD0= 1
##$TE= 0
##$TE2= 300
##$TE3= 300
##$TEG= 300
##$TL= (0..7)
0 120 53 12 22 120 120 120 
##$TP= (0..7)
150 150 150 150 150 150 150 150 
##$TP07= 0
##$TPNAME0= <>
##$TPNAME1= <>
##$TPNAME2= <>
##$TPNAME3= <>
##$TPNAME4= <>
##$TPNAME5= <>
##$TPNAME6= <>
##$TPNAME7= <>
##$TPOAL= (0..7)
0.5 0.5 0.5 0.5 0.5 0.5 0.5 0.5 
##$TPOFFS= (0..7)
0 0 0 0 0 0 0 0 
##$TUNHIN= 0
##$TUNHOUT= 0
##$TUNXOUT= 0
##$USERA1= <user>
##$USERA2= <user>
##$USERA3= <user>
##$USERA4= <user>
##$USERA5= <user>
##$V9= 5
##$VALIST= <valist>
##$VCLIST= <CCCCCCCCCCCCCCC>
##$VD= 0
##$VDLIST= <DDDDDDDDDDDDDDD>
##$VPLIST= <PPPPPPPPPPPPPPP>
##$VTLIST= <TTTTTTTTTTTTTTT>
##$WBST= 1024
##$WBSW= 4
##$XGAIN= (0..3)
0 0 0 0 
##$XL= 0
##$YL= 0
##$YMAX_a= 3130
##$YMIN_a= -6587
##$ZGOPTNS= <>
##$ZL1= 120
##$ZL2= 120
##$ZL3= 120
##$ZL4= 120
##$ABSF1= 248.5645
##$ABSF2= -253.2056
##$ABSG= 5
##$ABSL= 3
##$ALPHA= 0
##$AQORDER= 0
##$ASSFAC= 0
##$ASSFACI= 0
##$ASSFACX= 0
##$ASSWID= 0
##$AUNMP= <proc_1d>
##$AZFE= 0.1
##$AZFW= 0.5
##$BCFW= 0
##$BC_mod= 2
##$BYTORDP= 0
##$COROFFS= 0
##$CY= -3
##$DATMOD= 1
##$DC= 0
##$DFILT= <>
##$DTYPP= 0
##$F1P= 0
##$F2P= 0
##$FCOR= 1
##$FTSIZE= 65536
##$FT_mod= 6
##$GAMMA= 0
##$GB= 0
##$INTBC= 1
##$INTSCL= 6.834604e-11
##$ISEN= 30
##$LB= 1
##$LEV0= 0
##$LPBIN= 0
##$MAXI= 10000
##$MC2= 0
##$MEAN= 0
##$ME_mod= 0
##$MI= 50
##$NCOEF= 0
##$NC_proc= -10
##$NLEV= 6
##$NOISF1= 182.463
##$NOISF2= 159.3651
##$NSP= 0
##$NTH_PI= 0
##$NZP= 0
##$OFFSET= 248.5645
##$PC= 4
##$PHC0= -10242.98
##$PHC1= 13.25659
##$PH_mod= 1
##$PKNL= yes
##$PPARMOD= 0
##$PSCAL= 0
##$PSIGN= 0
##$REVERSE= no
##$SF= 81.0140089999694
##$SI= 65536
##$SIGF1= 159.3651
##$SIGF2= -187.1042
##$SINO= 113.3802
##$SIOLD= 16384
##$SREGLST= <1H.CDCl3>
##$SSB= 0
##$STSI= 65536
##$STSR= 0
##$SW_p= 40650.406504065
##$SYMM= 0
##$S_DEV= 0
##$TDeff= 32768
##$TDoff= 0
##$TI= <>
##$TILT= no
##$TM1= 0
##$TM2= 0
##$TOPLEV= 0
##$USERP1= <user>
##$USERP2= <user>
##$USERP3= <user>
##$USERP4= <user>
##$USERP5= <user>
##$WDW= 1
##$XDIM= 65536
##$YMAX_p= 386983554
##$YMIN_p= -213012616
$$ End of Bruker specific parameters
$$ ---------------------------------
##NTUPLES= NMR SPECTRUM
##VAR_NAME=  FREQUENCY,     SPECTRUM/REAL,   SPECTRUM/IMAG
##SYMBOL=    X,             R,               I
##VAR_TYPE=  INDEPENDENT,   DEPENDENT,       DEPENDENT
##VAR_FORM=  AFFN,          ASDF,            ASDF
##VAR_DIM=   65536,         65536,           65536
##UNITS=     HZ,            ARBITRARY UNITS, ARBITRARY UNITS
##FACTOR=    0.620285442955139, 1,           1
##FIRST=     20137.2065510682, 0,            0
##LAST=      -20513.1999529968, 0,           0
##MIN=       -20513.1999529968, -213012616,  0
##MAX=       20137.2065510682, 386983554,    0
$$ Real data points
##PAGE= N=1
##DATA TABLE= (X++(R..R)), XYDATA
$$ [...]
60163d891174J7229602m592621r277023j2114627j7200425j0228897O530743R900614
60155b4643808m029825r270980P054339K3473112K2861318J9342273K3958124
60148E8744553J7007076j3908095l8144506k4145788N513498O679880j3955516
60141b208898j0189916K3726021L8564875P480260l0541152k9203010K16616J3760192
60133A1604988j92333j4589338j0964123j817595m172542j2488569p454465J5967353
60125b4106624L7521618L2377597K468716k1387491j6663010O64534j002790k1818081
60117a1945531k9446130p239162K1378528K7635852J5332457P607095J1561520
60110C4884629J5044390Q890863n652500k5139300m2738453m3942145k0564972
$$ plain form
60163 -4891174 12338428 7745807 -1531216 -13645843 -30846268 -41075165 -34544422 -24643808
60155 -24643808 -28673633 -37944613 -30890274 -7417162 15444156 34786429 58744553
60148 58744553 75751629 61843534 23699028 -446760 5066738 11746618 -2208898
60141 -2208898 -12398814 11327207 49892082 57372342 26831190 -2371820 -2155204 11604988
60133 11604988 11412655 -3176683 -14140806 -15958401 -20130943 -32619512 -40073977 -24106624
60125 -24106624 13414994 45792591 48261307 26873816 10210806 10875340 9872550 -11945531
60117 -11945531 -41391661 -48630823 -27252295 383557 15716014 23323109 34884629
60110 34884629 49929019 58819882 53167382 28028082 -14710371 -58652516 -79217488
60103g9217488J3329488L4576239L6770125K7630396P438945k5575436n0192767
60096c5240498l4903607J3043207M2127735K1409897j5760840k1197846n60262
60089c1082214O333882m478197j604761J6475917J4676939r826745j2584522J7697457
60081d392244K4567736k4172054o4731710k5228923N2463531O1520062j2154097
60074G872301o7028065l2434018M0640473O5869890L3756383m655613j7840609
60067B6180742j2235475k677424k693568k0171811l5648872j4306075L5654595
60060b5897888N4461172J3093214l5814845l1852658N882456J8497103L807113
60053B175667Q715148L9498645M7386324R467960l3591805l7931445j1387298
$$ plain form
60103 -79217488 -65888000 -31311761 5458364 33088760 40527705 14952269 -35240498
60096 -35240498 -70144105 -57100898 -14973163 6436734 -9324106 -30521952 -31082214
60089 -31082214 -24748332 -29226529 -30831290 -14355373 321566 -9505179 -22089701 -4392244
60081 -4392244 20175492 -3996562 -68728272 -93957195 -41493664 20026398 7872301
60074 7872301 -59155764 -91589782 -50949309 14920581 48676964 44021351 26180742
60067 26180742 13945267 11267843 8574275 -11597536 -47246408 -61552483 -25897888
60060 -25897888 28563284 41656498 5841653 -26011005 -20128549 -1631446 2175667
60053 2175667 10890815 50389460 97775784 107243744 73651939 35720494 24333196
60046B4333196J0719032J1721945j896117j6998306k0221336o508448R954278
60039A1104244R183495p334449j9483062j7521511r172299p43897O703163N088138
60031b2176178j2042015k8755732j9384436J5293172M5551501M8001430K5424856
60024E1912598n325237k5449606k0334090L695828J5697541k713991k6726691
60017i243648k3213214k585811J687357o988860L039129K8126496L0105639O215025
60009B7142113j406859J6956542J4278635k8516869n4792159j8926621L0641978
60002a4623240K0294964l1970970m3518833M521036M4059034L0438215J73058
59995I373264o316676r907063l5990499n0049979j3358891L4357939K2857950
$$ plain form
60046 24333196 35052228 46774173 44878056 27879750 7658414 1149966 11104244
60039 11104244 20287739 12953290 -6529772 -24051283 -33223582 -33967479 -27264316 -22176178
60031 -22176178 -34218193 -62973925 -82358361 -67065189 -21513688 26487742 51912598
60024 51912598 46587361 21137755 803665 4499493 20197034 17483043 -9243648
60017 -9243648 -32456862 -35042673 -33355316 -40344176 -37305047 -9178551 20927088 27142113
60009 27142113 25735254 42691796 56970431 28453562 -26338597 -45265218 -14623240
60002 -14623240 5671724 -26299246 -69818079 -65297043 -21238009 9200206 9373264
59995 9373264 3056588 -6850475 -42840974 -92890953 -106249844 -71891905 -49033955
59988d9033955l2631310m3543082J4982491O0434355L1557093j4273345M867250
59981b7640503O1279064O2501356M27621l9226514j5549755J2759841m913497
59974D9637613l3017738k2708668P373817J7497865J7459112L0998903L5503157
59967A02744061J557331m1922214m6667250k2294684j1353020j1828877P272481
59960b2492172L1857393J8980818j9790820k6606747O650880K3470982j809290
59953A0261044k3214197l765295K4295428J5770662j7672857l2260630j5517289
59946d2103134P744590J2965239k733747k1750683j8437623J2986461M1955022
59939i373875L5645664N783844q522609k04240Q00142j7631490k9673568j3780567
$$ plain form
59988 -49033955 -81665265 -125208347 -110225856 -49791501 -18234408 -32507753 -27640503
59981 -27640503 33638561 96139917 96567538 57341024 41791269 54551110 49637613
59974 49637613 16619875 -6088793 1285024 18782889 36242001 67240904 102744061
59967 102744061 104301392 62379178 15711928 -6582756 -17935776 -29764653 -22492172
59960 -22492172 9365221 28346039 8555219 -18051528 -11400648 12070334 10261044
59953 10261044 -12953153 -16718448 7576980 23347642 5674785 -26585845 -42103134
59946 -42103134 -34358544 -21393305 -24127052 -45877735 -64315358 -51328897 -9373875
59939 -9373875 26271789 32055633 23533024 23328784 24128926 6497436 -23176132 -36956699
59931c6956699J8056965M0226350L7021316Q155716k4587701k8244869m081921
59924I589157J397692l2420991n3460107j6314175L1056970J7858829k5472469
59917f7765094j2532893M8140676O1786393R158991k2027139R478137L5512783
59910F1751854J0188424j4596968k141509l958465m7214566n8492442J0871695
59903d3591977Q0248815O0297984n686013k6049953j1018716k4621500m9687548
59896b0108908k3935088L2121079M3481259Q808301j0424672m655741j2524828
59889A2761402k4375427Q10005L7059509K0029740l3605543m3931228l361398
59882c4612940J3869898j6011037l1342078J338842L7620987M0403439K5563950
$$ plain form
59931 -36956699 -18899734 21326616 58347932 66503648 41915947 13671078 9589157
59924 9589157 10986849 -21434142 -74894249 -91208424 -60151454 -42292625 -67765094
59917 -67765094 -80297987 -32157311 29629082 38788073 16760934 26239071 61751854
59910 61751854 71940278 57343310 55201801 51243336 4028770 -54463672 -43591977
59903 -43591977 36656838 96954822 91268809 65218856 54200140 29578640 -20108908
59896 -20108908 -44043996 -11922917 31558342 40366643 29941971 25286230 12761402
59889 12761402 -11614025 -10804020 26255489 46285229 12679686 -31251542 -34612940
59882 -34612940 -20743042 -36754079 -68096157 -66757315 -29136328 11267111 36831061
59875C6831061M867031k9686299n0249392j2914927N0626874N5224439m529581
59868E0169206m1019738j7238990J508438k4267955l6684576P778566N3710118
59861f044931M1753753M450397l247571M205157q286366k1789871r466121J085335
59853B659782j7401636k8570500M575766M2964179L1349840q089976j6028552
59846A1458903O645679J4878917K590135j521127K779474m833129j4497248m887238
59838A2614366Q185489L22752q658661Q858663K5535298L95401l9896942l5370746
59830b8014380O127019J9891285p777215k1259856O398920L1579603J7267811
59823B4213187j1445702j7690571q312637q199008j5970905j3763049K054376
$$ plain form
59875 36831061 41698092 12011793 -38237599 -51152526 -525652 54698787 50169206
59868 50169206 9149468 -8089522 -6581084 -30849039 -67533615 -59755049 -6044931
59861 -6044931 35708822 40159219 36911648 41116805 32830439 11040568 1574447 2659782
59853 2659782 -14741854 -43312354 -38736588 4227591 35577431 27487455 11458903
59846 11458903 18104582 32983499 35573634 34052507 36831981 31998852 17501604 12614366
59838 12614366 20799855 21122607 12463946 21322609 46857907 47253308 7356366 -28014380
59830 -28014380 -21887361 -1996076 -9773291 -31033147 -24634227 6945376 24213187
59823 24213187 12767485 -4923086 -13235723 -21434731 -37405636 -51168685 -49114309
59816d9114309J8720708K0756514J655319k2399411j9339098J4940264L6819475
59809B039462J3838861j7914291n256826L1306562K4595506k6298059m7136995
59802b4825780p480208K9657953J1486738k3257484j8044144P524116L483692
59795b1455117j5744279J051074M2746313M3301539j1137171n2707627k8112741
59788d2058009K9644709N2539827K2263801k3331852m2130334k3102736J1045434
59781a5129160K0441675j3575033n5270335m5280720K0686078P4531153O0638180
59774D7041838O660360k4363112k2640879k3603199l1202768j1978973L2478698
59767b7608035N0155323J7266731k0591767j7079984R369560J5542791J055469
$$ plain form
59816 -49114309 -30393601 -9637087 -7981768 -30381179 -49720277 -34780013 2039462
59809 2039462 15878323 -2035968 -7292794 24013768 48609274 22311215 -24825780
59802 -24825780 -32305988 -2648035 8838703 -14418781 -32462925 -24938809 -21455117
59795 -21455117 -37199396 -36148322 6597991 49899530 38762359 -13945268 -42058009
59788 -42058009 -12413300 40126527 62390328 39058476 -3071858 -26174594 -15129160
59781 -15129160 5312515 -8262518 -63532853 -108813573 -88127495 -13596342 47041838
59774 47041838 53702198 29339086 6698207 -16904992 -48107760 -60086733 -27608035
59767 -27608035 22547288 39814019 19222252 2142268 11511828 27054619 28110088
59760B8110088o951811o942864j4280230k0205650n544722J8404689K4650990
59753A7240490J4041463N817100R16786n260839M838573L7269867M8559679K077991
59745A25501110n6567381n2929006j722063J2194028k7290647m1533144P797441
59738c4549662N3749584L9069258P665035J7628206L8164289J1280432m0059716
59731I2947426m8874697j2243046J5967211J4134783J993510j6751339m8105315
59724i31467o0696514j8866908M4318770N7196018J2021654k7428855k2652936
59717a7040238j656883L063453k724363o423481r336332l733098K2027906M6112177
59709C0289141L0276391j6313004m0710656k4160158m482723q022631j4342221
$$ plain form
59760 28110088 21158277 14215413 -64817 -20270467 -25815189 -7410500 17240490
59753 17240490 31281953 37099053 38015839 32755000 37593573 74863440 123423119 125501110
59745 125501110 68933729 16004723 14282660 26476688 -813959 -42347103 -34549662
59738 -34549662 19199922 58269180 65934215 83562421 121726710 133007142 92947426
59731 92947426 44072729 31829683 47796894 61931677 63925187 47173848 -931467
59724 -931467 -61627981 -80494889 -36176119 21019899 33041553 5612698 -17040238
59717 -17040238 -18697121 -15633668 -18358031 -24781512 -34117844 -37850942 -15823036 30289141
59709 30289141 60565532 44252528 3541872 -20618286 -25101009 -33123640 -47465861
59702d7465861o937174k667499n418127J3216719N3206581O0527298P695843m6475279
59694B5682501l3360827K1428176L1792185k4665160p5459720n3063091J9665342
59687h7980594O4334357M2608012o389354k1547593L346177J6057427j5847780
59680e419348m9974008k6194864L6260898N2651723p284033o9800963n8602877
59673a28363472K932735L7574755K5726087J2723342K3295341L1287604J7005814
59666B2182206o31794n374995j2028018k9127619k9126822J0717786N9358308
59659A5969052O1299985J0428208l8066179l7158309l711442J2325105l316824
59652A7769596j8316124q518322O716168j567085k5177580l1282778j1286476
$$ plain form
59702 -47465861 -54403035 -57070534 -62488661 -49271942 3934639 64461937 72157780 25682501
59694 25682501 -7678326 13749850 45542035 20876875 -54582845 -107645936 -87980594
59687 -87980594 -23646237 18961775 12572421 -8975172 -5628995 10428432 -5419348
59680 -5419348 -55393356 -81588220 -45327322 7324401 40368 -69760595 -128363472
59673 -128363472 -125430737 -87855982 -62129895 -49406553 -26111212 5176392 22182206
59666 22182206 21550412 16175417 4147399 -24980220 -54107042 -43389256 15969052
59659 15969052 77269037 87697245 49631066 12472757 8761315 21086420 17769596
59652 17769596 -546528 -9064850 -2348682 -3915767 -29093347 -60376125 -71662601
59645g1662601J0153420J3788205P345758L074325k337534j3702169k1489097
59638g4829693j4576287K169488J4765682J6929036J2149527O598061O095449
59631c0698737J2835546K0646483K0168942J0363075k116067j2657816j8106859
59624D34567j1983839N456781J8908625J7437866J3282636J8154633J3670025
59617G5361294j8729506m8339166k6732406K7986774L8746067j6833112o1765169
59610c0305224k9824979L5079567M8321073R951511j2320534K43365J27642k9700709
59602h428288m2936275j3104471K0512698K2173462J5695459L0323691M0398389
59595F4634665J0138942l6235055m4613231j2293162J3652516J1155391N431285
$$ plain form
59645 -71662601 -61509181 -47720976 -40375218 -37300893 -39638427 -53340596 -74829693
59638 -74829693 -89405980 -87236492 -72470810 -55541774 -43392247 -36794186 -30698737
59631 -30698737 -17863191 2783292 22952234 33315309 31199242 18541426 434567
59624 434567 -11549272 -6092491 12816134 30254000 43536636 61691269 75361294
59617 75361294 56631788 8292622 -18439784 9546990 48293057 31459945 -30305224
59610 -30305224 -60130203 -25050636 23270437 33221948 20901414 21144779 21272421 -8428288
59602 -8428288 -51364563 -64469034 -43956336 -21782874 -6087415 24236276 64634665
59595 64634665 74773607 38538552 -6074679 -18367841 -4715325 6440066 11871351
59588A1871351J3837329J6624091j028722j6356266m077258K0827124K3710448
59581F5408097J129362j5903518p857052P301797K542522j9005314k9252500j6250240
59573a1886846k260452j1068936l0361151k6897877M094292L0139892K9887969
59566a8353109K3445779L4143687M3483210J7902048l0889341n2220884k6589468
59559i078078P741863J1732041l831031o280213P320360J4570823O024721r491428
59551A8709058k6230364m0533155l7164205o002137L1051037L8887953J6222024
59544e059789l353258q62362N545116l370194j5922986r846897J3430416L1205433
59536A1765479K5864536m74152k7036416k6627020O276808L6416899K1230608
$$ plain form
59588 11871351 25708680 42332771 41304049 24947783 20870525 41697649 65408097
59581 65408097 66537459 50633941 42776889 50078686 52621208 33615894 4363394 -11886846
59573 -11886846 -14147298 -25216234 -55577385 -82475262 -78380970 -48241078 -18353109
59566 -18353109 5092670 39236357 82719567 100621615 69732274 17511390 -9078078
59559 -9078078 -1336215 10395826 6564795 284582 7604942 22175765 28200486 18709058
59551 18709058 -7521306 -48054461 -85218666 -91220803 -60169766 -21281813 -5059789
59544 -5059789 -8413047 -9275409 -3730293 -7100487 -23023473 -32870370 -19439954 11765479
59536 11765479 37630015 37155863 10119447 -16507573 -10230765 26186134 47416742
59529D7416742k8017274m9179059j2295533L2911740K6347804j2813555j5684430
59522a1313565K7402280M6941705m60388n9606950m9776034K1251476O7100308
59515D1538832L9427029j5457888l1103816j0192234m899612l1406250m9272353
59508f1366292k7400110J0175796K3254619J1182024K873141R382512J6041458
59501a5856852J2917785M690014o219345j9965065k4730844q744420J3399050
59494d4509677J4857464j111743l999304J3299243K1275571M285196j0249194
59487f152444M933617L2915488L8331974J6812508o513313j2689195j682994J6202274
59479H2157915K2889420J767177l7835342o1259092m9459024k0794812K074499
$$ plain form
59529 47416742 19399468 -29779591 -42075124 -9163384 17184420 4370865 -11313565
59522 -11313565 16088715 63030420 62570032 2963082 -46812952 -25561476 41538832
59515 41538832 80965861 65507973 34404157 24211923 19312311 -12093939 -61366292
59508 -61366292 -88766402 -78590606 -55335987 -44153963 -41280822 -31898310 -15856852
59501 -15856852 -2939067 1750947 -4468398 -24433463 -49164307 -57908727 -44509677
59494 -44509677 -29652213 -30763956 -34763260 -21464017 -188446 4096750 -6152444
59487 -6152444 -1218827 31696661 70028635 86841143 80327830 67638635 65955641 82157915
59479 82157915 105047335 106814512 68979170 7720078 -41738946 -62533758 -60459259
59472f0459259K0791376L7413362L3408166K880284k0977131r265309J5150348
59465A8941837J2267143j2463145k1833888p359653P507465J2175355J2397727
59458B1632841L47177l0150369m6881436j2581958M5255648N5628200M878668
59451C8128771m0291569k9460353O252738J4761921J51532j486259J1763698J1470025
59443A1290504q658874k4027566j6957987N866932L0262714M5893618M2888142
59436H6557483J6987161j8821832l9550478k9934372K00642K1585663J0859433
59429D7883700k2075629l7416680r529276L6194654M8221687J1215835l4455416
59422D0038875m0647189n043545K9512387K1907409k3529659n8329862m1371288
$$ plain form
59472 -60459259 -39667883 -2254521 31153645 34033929 13056798 3791489 18941837
59465 18941837 31208980 18745835 -3088053 -10447706 -2940241 9235114 21632841
59458 21632841 21980018 -8170351 -55051787 -67633745 -22378097 33250103 38128771
59451 38128771 -2162798 -31623151 -25370413 -10608492 -10456960 -11943219 -179521 11290504
59443 11290504 2631630 -21395936 -38353923 -32486991 -2224277 43669341 86557483
59436 86557483 103544644 84722812 45172334 15237962 15438604 37024267 47883700
59429 47883700 25808071 -11608609 -21137885 15056769 63278456 74494291 40038875
59422 40038875 -608314 -5651859 23860528 45767937 22238278 -36091584 -77462872
59415g7462872R928482L7767429J9663143k887885R000043L0292131J5710107
59408D2010578k1721378k8287882M384925K5977927N577863k5682981k5661656
59401b3402604K898227K6207523K3670511M007974p068811P902565L2505933K7132630
59393I3853948j5395273m6353813k5559697J4632378J5205802j9650262l4044181
59386a7311098r812580J5475627J6046458M865165n421781j1345884N964877N1161536
59378D9622320O9548622Q740915p7712406p9003363R473861O8343535K6942355
59371G5955839m4284153n6807856k4661754l711940N141392K3237898L3769695
59364H639121K1564741J3886992K2765293R839843l4379367m9130959o752358
$$ plain form
59415 -77462872 -67534390 -29766961 -10103818 -12991703 -3991660 26300471 42010578
59408 42010578 20289200 -7998682 -3613757 22364170 27942033 2259052 -23402604
59401 -23402604 -20504377 5703146 29373657 33381631 26312820 34215385 66721318 93853948
59393 93853948 78458675 32104862 6545165 21177543 36383345 16733083 -17311098
59386 -17311098 -27123678 -11648051 4398407 9263572 3841791 -7504093 -1539216 49622320
59378 49622320 119170942 127911857 50199451 -28803912 -19330051 49013484 75955839
59371 75955839 31671686 -25136170 -49797924 -53509864 -48368472 -25130574 8639121
59364 8639121 30203862 44090854 66856147 76695990 42316623 -6814336 -13566694
59357a3566694K1660765j6614077n4082802j6076469M0872989K2629648l2862959
59350d8039599j7083312N6406912O8863706l325152n2169938k0251057J8345826
59343B747386J727737j8256253J6423269N9136561L5649015l2851916o2435668
59336B140131k6880541J9594829K4651217n145868k7815002j8522936O585037
59329b5393133J3971182k425432j4662577o628689K380966O51555J2421642M6171196
59321B6486710N5682500P090277n1137608n1338402j0974499K59257k4213481
59314d8145246k7462227O554981L2549716K8500872K0560472J8086653Q73815
59307C1519036k1724626j5174128R229263N398411j7971879k871708M9425115
$$ plain form
59357 -13566694 8094071 -8520006 -62602808 -78679277 -37806288 -15176640 -48039599
59350 -48039599 -65122911 -8715999 60147707 56822555 4652617 -15598440 2747386
59343 2747386 4475123 -13781130 2642139 61778700 97427715 64575799 2140131
59336 2140131 -24740410 -5145581 19505636 14359768 -13455234 -31978170 -25393133
59329 -25393133 -11421951 -13847383 -28509960 -35138649 -32757683 -32106128 -19684486 26486710
59321 26486710 82169210 89259487 38121879 -13216523 -24191022 -23931765 -48145246
59314 -48145246 -75607473 -69052492 -36502776 -8001904 12558568 30645221 31519036
59307 31519036 9794410 -5379718 3849545 9247956 -8723923 -11595631 37829484
59300C7829484O4048244J1549569m4749818n2028119l5710770k7442640p510253
59293e4014303L4222447N3899315K2933441j8690649k5659609r727655K97225
59286C260212N130228O231003j0846738l1766138j5965331K5192900K6794720
59279H030856j7383521k6410447L3644523P7095383L0534811m5970068n6116767
59272C424770j5159563k521005k1470243j2366102K6843353L8096565R947280
59265B6795055n765561J3167146K6537042K527250l7201492n4256126l5330332
59258f3527018M828539L4626837L0326105R709224J4564625M0908428L2863496
59251A04300236k4346222o4357531l8929569M758006O737769q066648R273902
$$ plain form
59300 37829484 101877728 113427297 68677479 16649360 -19061410 -46504050 -54014303
59293 -54014303 -19791856 34107459 57040900 38350251 12690642 2962987 3260212
59286 3260212 8390440 14621443 3774705 -27991433 -43956764 -18763864 8030856
59279 8030856 -9352665 -35763112 -2118589 74976794 105511605 59541537 3424770
59272 3424770 -11734793 -14255798 -35726041 -48092143 -21248790 16847775 26795055
59265 26795055 21029494 34196640 60733682 63260932 26059440 -28196686 -63527018
59258 -63527018 -58698479 -24071642 6254463 15963687 30528312 71436740 104300236
59251 104300236 79954014 15596483 -23333086 -18575080 -11837311 -19903959 -10630057
59244a0630057L1467713P995768k8030999r136661M1395866M1028681j1908890
59237F2181421l7207604q365437J5915375L527385q364853N94294j08747j6447385
59229A1724449r782494J9774750J6386619l0590906n1886182q079147M1762226
59222a0690685L2676777j0095403k3592017k513895J5004107J6155651J3677847
59215C0622382P127353q490246j7999579r178464m33067j2703827l3689952l8290530
59207h3035930k4144210k024244K5557786M9685071M2992943n459341n8172282
59200e4600207o2829370j3854425L9763559M7178762O611582l4434186k9229760
59193a01394045J4347828M1403864K2647437l834478P777883L4990675K0391599
$$ plain form
59244 -10630057 20837656 28833424 802425 -8334236 33061630 74090311 62181421
59237 62181421 24973817 16608380 32523755 36051140 27686287 28280581 28171834 11724449
59229 11724449 1941955 21716705 38103324 7512418 -44373764 -52452911 -10690685
59222 -10690685 21986092 11890689 -11701328 -14215223 788884 16944535 30622382
59215 30622382 37749735 29259489 11259910 2081446 1648379 -11055448 -44745400 -83035930
59207 -83035930 -107180140 -109204384 -83646598 -33961527 9031416 3572075 -54600207
59200 -54600207 -117429577 -131284002 -91520443 -44341681 -37730099 -72164285 -101394045
59193 -101394045 -87046217 -45642353 -22994916 -26829394 -19051511 15939164 36330763
59186C6330763l2163631n6659800k4882414J4928890J7820066K359544J918783
59179d0347799P221840l795670j8000117r753915J4812611L0314370K7801862
59172H253182J1997884j3596160l5290538k9445208R54471J7215154j255387k2513934
59164f3680536j1252169J6397500K3480374J2678082J3247709K3624014J3607108
59157B8102082j9055978l7356302j9703255O954011N240049k1399058l3674369
59150i0892820o035344M1988269O6728194M7114210L617155k9361098l8191296
59143e032730k9388871r260944J6270174L0781392K1511334K520345o45201J0132679
59135C6888178P136407j9051618m1991252l4411690j699103K7254757K9664182
$$ plain form
59186 36330763 4167132 -52492668 -77375082 -62446192 -44626126 -42266582 -40347799
59179 -40347799 -33125959 -36921629 -54921746 -64675661 -49863050 -19548680 8253182
59172 8253182 20251066 6654906 -28635632 -58080840 -57126369 -39911215 -41166602 -63680536
59164 -63680536 -74932705 -58535205 -35054831 -22376749 -9129040 14494974 28102082
59157 28102082 9046104 -28310198 -48013453 -41059442 -35819393 -57218451 -90892820
59150 -90892820 -96928164 -54939895 11788299 58902509 62519664 33158566 -5032730
59143 -5032730 -34421601 -43682545 -27412371 3369021 24880355 27400700 26755499 36888178
59135 36888178 44024585 24972967 -17018285 -51429975 -53129078 -25874321 3789861
59128C789861Q127762q927467O044784L9743653M3648152J643976l5154430j8735982
59120D0180309J9050239J4782337k3890913l4253496p036022K881400j9557081
59113g843227k2825692R824056K1165792j5328550l6384726N635888N3604596
59106G848137L5779962j7605448l1114345p417416k958876j6492543N29575L9952521
59098H521567M0676122l567306l0263569j2792145M937058k375331J096407L3513985
59090C9746788M7339617N418849n1819464o4005415l3441214m522098N120081
59083e6162856Q658785J1890795J2643019J8640607L0352350K4980060r482713
59076D1520047m4701251n0324563l9044888l4255705j7765143L6386687R1299045
$$ plain form
59128 3789861 11917623 2990156 9034940 48778593 92426745 94070721 58916291 40180309
59120 40180309 59230548 74012885 50121972 15868476 8832454 11713854 -7843227
59113 -7843227 -30668919 -20844863 320929 -15007621 -51392347 -45756459 7848137
59106 7848137 43628099 26022651 -5091694 -12509110 -15467986 -31960529 -31430954 8521567
59098 8521567 49197689 45630383 15366814 2574669 7511727 5136396 6232803 39746788
59090 39746788 87086405 92505254 40685790 -23319625 -56760839 -61282937 -56162856
59083 -56162856 -47504071 -35613276 -22970257 -4329650 26022700 51002760 41520047
59076 41520047 -3181204 -53505767 -92550655 -126806360 -144571503 -108184816 -16885771
59069a6885771P7481620J15419n0948636k4405069K0491451Q902461l4689353
59062a9937878l0871722K5750509N7575634K2362061k9835641l7846257r545185
59055b2348479J1129993J2243916J0214469R817600O322542N509517Q856983P59528
59047D2506069j8923773j7595629J6672469L4858563p753768o9087963o6835584
59040h6159616J025871N0119612L0423801j3506992k3083342m774064M343133
59033d1611597o0970l03589N008085R322498J6375395K1281892M361336k7560480
59025a3187430k9128076J7706808N9445073L8756904j8493809l6191686M245243
59018B3153027M2170133K6197331k2661488n0965009m0617619j5194820M80238
$$ plain form
59069 -16885771 60595849 60711268 9762632 -14642437 5849014 14751475 -19937878
59062 -19937878 -50809600 -25059091 32516543 54878604 25042963 -12803294 -22348479
59055 -22348479 -11218486 1025430 11239899 21057499 27380041 32889558 41746541 42506069
59047 42506069 23582296 5986667 22659136 57517699 49763931 -19324032 -86159616
59040 -86159616 -85133745 -35014133 -4590332 -18097324 -41180666 -45954730 -41611597
59033 -41611597 -41672567 -41976156 -36968071 -27645573 -11270178 10011714 14373050 -13187430
59025 -13187430 -42315506 -24608698 34836375 73593279 55099470 18907784 23153027
59018 23153027 65323160 91520491 68859003 17893994 -22723625 -37918445 -37438207
59011c7438207M718610Q938437J8296901K5435199J9487651j443827k6980360
59004A1014404m0938456l1007924k5431K8484297K8872817O920074k030038J5803594
58996A7093337K5838763k519596l9499331l3676080P454267K7582821Q370575
58989A0644756j0264599l171341M530828p696821j9538577j2535467q58658N174484
58981c3715395J9153951L7208721K6646675j4285675l5986142j1836872J7086783
58974D272046J1244766l793122R836509L3037535K7861744N232083k628380m199926
58966H0863255k4570289m6328957l3391206M911025K7033305K1387933Q695266
58959C8600332j030382j0449855j1822783j418061L806429k294447K455064K0606860
$$ plain form
59011 -37438207 -32719597 -23781160 -5484259 19950940 39438591 37994764 11014404
59004 11014404 -29924052 -60931976 -60957407 -32473110 -3600293 3319781 1289743 17093337
58996 17093337 42932100 40412504 913173 -32762907 -25308640 2274181 10644756
58989 10644756 380157 -2791184 1739644 -5957177 -25495754 -38031221 -38889879 -33715395
58981 -33715395 -14561444 22647277 49293952 35008277 -977865 -12814737 4272046
58974 4272046 15516812 11723690 21560199 54597734 82459478 87691561 85063181 80863255
58966 80863255 56292966 9964009 -23427197 -18516172 8517133 29905066 38600332
58959 38600332 37569950 27120095 15297312 13879251 17685680 15391233 17846297 38453157
58951C8453157J3080165l1511294n6439259k1772901K3482918K1889631M895901
58944g921682K6038662M9969987J2130218n0346227m5784428J4501778L0298274
58937B8886582j8435530m4049456r043946J5874253j0656791k4847922K2215571
58930d0057239P1981016N6715199P372402r893864K421727M518769j819895L588976
58922I4827091K715211k5868227n1070315l2437859P650518J4409716j5536635
58915e310500l4240914j5472866J7253811L1641817K2729708Q665764P965496
58908C3232316J7615597J2531561j7780180m1069733k3811843R032703N173809
58901e075770k8106226l1243728O547515K6159343O37521j7466367J0457496L9954783
$$ plain form
58951 38453157 51533322 20022028 -36417231 -58190132 -34707214 -12817583 -7921682
58944 -7921682 18116980 68086967 80217185 29870958 -15913470 -1411692 28886582
58937 28886582 10451052 -33598404 -42642350 -26768097 -37424888 -62272810 -40057239
58930 -40057239 31923777 88638976 96011378 86117514 88539241 93058010 91238115 94827091
58922 94827091 97542302 71674075 20603760 -11834099 -4183581 10226135 -5310500
58915 -5310500 -39551414 -55024280 -37770469 -6128652 16601056 25266820 33232316
58908 33232316 50847913 63379474 45599294 4529561 -19282282 -10249579 -5075770
58901 -5075770 -33181996 -64425724 -57878209 -31718866 -31081345 -48547712 -38090216 1864567
58893A864567K1047914j6247600j5655307J4288340K6143716J2778980r58139
58886D3262471j5232779m3363949o5267152m9214552n659613K7306278L7378055
58879g0791241L7000605K8621128J1273132J799333R653437J0618550j5141714
58872A3033230l9979544k5179611J7585577M2189557L1260041O373331j1699559
58865C3583022j8648282j3673059J25101J1823556J7030071J9791517J1450489
58858F1482415k0488083n2462871m0417457N828000J9471005k1625007n1131970
58851i9343968j6296580L6904990L8675581J821718j3152836N107816K5222432
58844b1060847L7661941M5407980K8098197j5687260l0992421J3504790N0731238
$$ plain form
58893 1864567 22912481 6664881 -8990426 5297914 31441630 44220610 43262471
58886 43262471 28029692 -15334257 -80601409 -129815961 -135475574 -108169296 -70791241
58879 -70791241 -33790636 -5169508 6103624 7902957 17556394 28174944 13033230
58872 13033230 -26946314 -52125925 -34540348 7649209 38909250 45282581 33583022
58865 33583022 14934740 1261681 1386782 13210338 30240409 50031926 61482415
58858 61482415 40994332 -11468539 -51885996 -46057996 -26586991 -48211998 -99343968
58851 -99343968 -115640548 -78735558 -40059977 -38238259 -51391095 -46283279 -21060847
58844 -21060847 16601094 62009074 90107271 74420011 43427590 56932380 107663618
58837A07663618P611220o6799904o6651839M664992M4558519J5477699j5717718
58830C0806587p129376L862454l741497O070466L6814928L0138064k9302267o9890050
58822b370691m4103120j552394K264289p525059R680303K9381255J5462975n003345
58814c765787O971621K4252254J211073l7756045l2910545J2057670L8486836
58807H547077K6169857J0370411J0735509P279526p971946j2332993J679743Q763205
58799E3240389m731480j7655466j2872125n392096j1213513j6856446m892654
58792b0373391J2196405J2367035L341742Q720776K1233680Q440696k8158589
58785A7768354m1900276j3295387P049732k6648472o8485811l5781661N8478726
$$ plain form
58837 107663618 115274838 48474934 -18176905 -13511913 31046606 46524305 30806587
58830 30806587 23677211 27539665 23798168 29868634 66683562 96821626 67519359 -2370691
58822 -2370691 -46473811 -48026205 -45761916 -53286975 -43606672 -14225417 1237558 -3765787
58814 -3765787 3205834 27458088 28669161 -9086884 -41997429 -29939759 8547077
58807 8547077 34716934 45087345 55822854 63102380 55130434 42797441 44477184 53240389
58799 53240389 48508909 30853443 17981318 12589222 1375709 -15480737 -20373391
58792 -20373391 -8176986 4190049 7531791 16252567 37486247 45926943 17768354
58785 17768354 -24131922 -37427309 -30377577 -57026049 -125511860 -161293521 -102814795
58778a02814795J06642148N6764582j6355040k9603288o991163j5320223m6189767
58771e3867546m2664459n011380J4569598L932068j3085J5040968K4359817K0540461
58763b3113558J5536214o12444l5957825m7270320O950910P5236789O4084534
58756E4854300j9573284o9956490l6951804J6510811L1911694L1245297M0530526
58749D8571050L2358293n881950k9553196j4911469m345217k3524270l0584247
58742b7871006j842028J2345704j8877434l7415066M097668M8187657K5552871
58735D178366k3938525k0697726J8495823J9267688j4880151j5538450K3541048
58728i571927L8526351Q611283j9326106k0421258j8541617k0063634m084686
$$ plain form
58778 -102814795 3827353 60591935 44236895 14633607 7642444 -7677779 -53867546
58771 -53867546 -96532005 -101543385 -86973787 -83041719 -83054804 -68013836 -43654019 -23113558
58763 -23113558 -7577344 -8189788 -44147613 -91417933 -84467023 -9230234 54854300
58756 54854300 35281016 -34675474 -71627278 -55116467 -23204773 8040524 48571050
58749 48571050 80929343 75047393 45494197 30582728 26237511 2713241 -27871006
58742 -27871006 -29713034 -17367330 -36244764 -73659830 -69562162 -21374505 4178366
58735 4178366 -19760159 -40457885 -21962062 -2694374 -17574525 -33112975 -9571927
58728 -9571927 28954424 37565707 18239601 -2181657 -20723274 -40786908 -44871594
58721d4871594J7011767R059830p595458K0045950O9956125N4306127l6663179
58714H1249568r4139237m2505911M8364833O4827913K341155n2244343n0053793
58707d2159815k1291486n399902k668495K300686J1947524K0255536K2705147
58700a4310805J6748640N270133r39394O862816K4598241L8244703L4373236J0188561
58692A21036131j9792050l2793712k3683787j2865235j5396819j6230309L714263
58685C988482L1236125L6756177J5002903j6883342m7815178o8273193n4724498
58678a00712524q03642M7166444L4863243k1139180m7576368j2266921L9198672
58671f1270276N3249753K9073869l543696k4418429k4721991n358797J2525490
$$ plain form
58721 -44871594 -27859827 -18799997 -26395455 -6349505 63606620 117912747 81249568
58714 81249568 -12889669 -55395580 -7030747 57797166 60138321 7893978 -42159815
58707 -42159815 -63451301 -68851203 -71519698 -69219012 -57271488 -37015952 -14310805
58700 -14310805 2437835 7707968 6768574 13631390 38229631 76474334 110847570 121036131
58692 121036131 101244081 68450369 44766582 31901347 16504528 274219 3988482
58685 3988482 35224607 71980784 86983687 70100345 22285167 -45988026 -100712524
58678 -100712524 -101516166 -54349722 -19486479 -40625659 -88202027 -100468948 -61270276
58671 -61270276 -8020523 21053346 17509650 -6908779 -31630770 -36989567 -24464077
58664b4464077Q053405l473821O489603K2802011O046340k8771907k1453076K8598190
58656f173332M3895531q168123n1518324j8564704L8693284L2621071j8930743
58649A1854660k8291162J6457013M0213759Q648439k6905208k5837249j4962834
58642a8822582k0195920j4723846K2423644N2351105K9688451k6692231o0739454
58635c6710833n2185875k4574843L17328K0547679L7066586M6110361M2803711
58628C3374114J9154479k5534334o1717913m6663385J3506940N1608767K4396528
58621H125196j9983332q342601M4650217N3683541o556161n6314631k4565906
58614i303677M7898812O7187075J4314676m1042290m3816103j6643636q691780
$$ plain form
58664 -24464077 -16410672 -19884493 -13394890 9407121 15453461 -13318446 -34771522 -6173332
58656 -6173332 37722199 29554076 -21964248 -40528952 -1835668 30785403 11854660
58649 11854660 -16436502 20511 40234270 48882709 21977501 -3859748 -18822582
58642 -18822582 -39018502 -53742348 -31318704 21032401 50720852 24028621 -36710833
58635 -36710833 -88896708 -113471551 -113154223 -92606544 -55539958 -9429597 33374114
58628 33374114 52528593 26994259 -34723654 -81387039 -67880099 -16271332 8125196
58621 8125196 -11858136 -20200737 24449480 78133021 71576860 15262229 -9303677
58614 -9303677 38595135 105782210 120096886 79054596 35238493 18594857 9903077
58607I903077k3594399k6314579j679835K4096086K0993231n371747k2997396
58600b4965562j5113547J924157O484132K772625Q040788J8121172J1797347r601099
58592e39987j7565920k875116M936889j3398434k8922291r468992K1898032J8061715
58584b7874104j5793181k6888060M470904L8299158L9446444K3118995J7042805
58577E1822961J7394300O681320j4819381l7339125n4202963m9297254n216966
58570h4977108N5087309P2154328K5887824k7018871k8127984K945185R088193
58563B5038876j1845362j2645166J7242412L2400090N961229k8278836k8604329
58556g31086k869965J1071200j462127k1453597k6597820j4296228K884618J5109757
$$ plain form
58607 9903077 -13691322 -40005901 -41685736 -17589650 3403581 -1968166 -24965562
58600 -24965562 -40079109 -38154952 -31670820 -28898195 -20857407 -2736235 9061112 -539987
58592 -539987 -18105907 -20981023 -16044134 -29442568 -58364859 -67833851 -45935819 -27874104
58584 -27874104 -43667285 -70555345 -66084441 -27785283 11661161 34780156 51822961
58577 51822961 69217261 75898581 61079200 23740075 -30462888 -79760142 -84977108
58570 -84977108 -29889799 42264529 68152353 41133482 13005498 15950683 25038876
58563 25038876 13193514 548348 17790760 50190850 56152079 27873243 -731086
58556 -731086 -3601051 7470149 6008022 -15445575 -42043395 -56339623 -53455005 -38345248
58548c8345248K4568931L3980870L0813435J86295m2749957n7265939k7940949
58541g6752562J2114601K7109490K2035567J6491973M391879k4256192m5426152
58534f4291396k8792855J1203780L4637892L3900860K8537752J6247453j8079630
58527A3363856n0806192l5802777K0925564N6969627L7353351n144687k7025518
58520I833224k4237457r601249J2630883K9210795J8433631j0414847j8984206
58513F870774n538Q838475q637724j6883115O852705K8520439J5286884r173586
58505C1669314j0844397m099634j5197862k5084207m069419K6063476K2671940
58498B1109211o310575j8522929q416522n456496j3485837j0304574o90466j0105529
$$ plain form
58548 -38345248 -13776317 20204553 51017988 51204283 8454326 -48811613 -76752562
58541 -76752562 -64637961 -37528471 -15492904 999069 5390948 -18865244 -64291396
58534 -64291396 -93084251 -81880471 -47242579 -13341719 15196033 31443486 13363856
58527 13363856 -37442336 -73245113 -52319549 4650078 42003429 36858742 9833224
58520 9833224 -14404233 -24005482 -11374599 17836196 36269827 25854980 6870774
58513 6870774 6865236 15703711 7065987 -9817128 -2964423 25556016 40842900 31669314
58505 31669314 20824917 16725283 1527421 -23556786 -27626205 -1562729 21109211
58498 21109211 14798636 -3724293 -12140815 -17597311 -31083148 -41387722 -42078188 -52183717
58490e2183717k6796689j1567425K8443848L8142972K855193k1938683L594183
58483c9450318M2264786M1198619J0212145m465049P459864J9033908J5579745
58476I1833700K913926j9444603n2031125p0760705m9046128l231516K2104838
58469g7661613J7272371J7217649L8379243M7126066J6177601k2530885k0910754
58462A5069678R882981J4746329j8093496l5829281l549961L7848850L1189075
58455E1264175j2001109l2079206j0038579J5089269J5461642R207678J3524637
58448E0428507J1699914p315735j7744695n10917J4809626o515011m2475257m3138386
58440d0761954q496226J2804238J728287n175891J7972245L9809797K0403092
$$ plain form
58490 -52183717 -78980406 -90547831 -62103983 -23961011 -21105818 -43044501 -39450318
58483 -39450318 2814468 44013087 54225232 49760183 57220047 76253955 91833700
58476 91833700 94747626 75303023 23271898 -47488807 -96534935 -99766451 -77661613
58469 -77661613 -60389242 -43171593 -4792350 42333716 58511317 35980432 15069678
58462 15069678 24952659 39698988 21605492 -14223789 -17773750 20075100 51264175
58455 51264175 39263066 7183860 -2854719 12234550 27696192 36903870 50428507
58448 50428507 62128421 54812686 37067991 36557074 51366700 44851689 2376432 -40761954
58440 -40761954 -49258180 -36453942 -34725655 -39901546 -21929301 17880496 38283588
58433C8283588k3952621l9551378o420528L8723190M9212703J8078746k1643888
58426E2729812l4431672j6804371K171703l678636k3421080k1851937J0573522
58419c4712659L9205246L1169898L350479j736623J8943821K2184882j3583064
58412F4821980m7201247k9562178K1743769M1513994O418588l5646714l6802344
58405a4714152j1201969k74559p244243m637413J0105954J0117825j1043256k4071412
58397e2963225p504232K3301084M1293096L7491040J7307765r018466k4231029
58390B5676033j5941900J939086L847271p104899m155185J2189564Q393814k1731881
58382C111903l5242612o769360K4576445J3804056j9532499k5504535q80709J8296751
$$ plain form
58433 38283588 14330967 -25220411 -31640939 7082251 56294954 74373700 52729812
58426 52729812 18298140 1493769 3665472 -13164 -23434244 -45286181 -34712659
58419 -34712659 4492587 35662485 39012964 37276341 56220162 78405044 64821980
58412 64821980 17620733 -11941445 9802324 51316318 57734906 22088192 -14714152
58405 -14714152 -25916121 -26190680 -33434923 -38072336 -27966382 -17848557 -28891813 -52963225
58397 -52963225 -60467457 -37166373 4126723 41617763 58925528 49907062 25676033
58390 25676033 9734133 11673219 15520490 8415591 4260406 16449970 24843784 3111903
58382 3111903 -32130709 -38900069 -14323624 -519568 -20052067 -45556602 -46437311 -28140560
58374b8140560K0486645K1145659J5558011j3022402m3094720l1779032J3563232
58367d5283167L6984490J7225973o443604o717785p772441k5790308k7555850
58360f5352692R864313M4804451K7313549k1850694l9803808q935167L1555171
58353b2404877M6817705L4188434J882407l4269899m0675686k78690M5025649
58346C0285043L4929968k2148511n2150450j7462874L3926315M2841028J5175477
58339F5395996p797539j3904185j4671991q401247N990231L282956l0763772n5420723
58331e6290274k3522738L6242830M7388696j146868l5353914r073589K8121971
58324a3633886J4703184k6237576k9514994R907885L8978441L2265227J5675791
$$ plain form
58374 -28140560 -7653915 13491744 29049755 16027353 -27067367 -58846399 -45283167
58367 -45283167 -8298677 8927296 2483692 -4234093 -12006534 -37796842 -65352692
58360 -65352692 -55488379 -10683928 16629621 -5221073 -45024881 -53960048 -22404877
58353 -22404877 24412828 58601262 60483669 26213770 -14461916 -14740606 30285043
58346 30285043 65215011 43066500 -9083950 -26546824 7379491 50220519 65395996
58339 65395996 57598457 43694272 29022281 20621034 26611265 29894221 -869551 -56290274
58331 -56290274 -79813012 -43570182 3818514 2671646 -32682268 -41755857 -13633886
58324 -13633886 1069298 -25168278 -54683272 -44775387 -5796946 26468281 42144072
58317D2144072R740403M578370l870449j673147Q646953M459241j3838072j6510831
58309C3676540L774533J3795011o263606k7848007j9383272N128505J3322908
58302A6202612M927241J430170K730190j0721327l8543223n3276984l5867435
58295a13118756K14887K4566949K0832678J099490q422279J818377J4099740J3121911
58287d5787003J3028351L0298490M1917120J1563499m2847078n7814114j5690550
58280f5331285K3521517J1315155j6337549N09570M9586348O5387873K4564915
58273I3216544l0401788n5591723m7933259k4346386J660796J8485642K1166440
58266b3743734J9949922K3242277J9527334m43104j6208728k636291K7032460
$$ plain form
58317 42144072 51884475 56462845 52592396 50919249 59566202 64025443 50187371 33676540
58309 33676540 37451073 51246084 44982478 17134471 -2248801 2879704 16202612
58302 16202612 21129853 22560023 25290213 14568886 -23974337 -77251321 -113118756
58295 -113118756 -112903869 -88336920 -67504242 -66404752 -74827031 -73008654 -58908914 -45787003
58287 -45787003 -32758652 -2460162 39456958 51020457 8173379 -49640735 -65331285
58280 -65331285 -41809768 -30494613 -46832162 -46322592 3263756 68651629 93216544
58273 93216544 62814756 7223033 -40710226 -65056612 -63395816 -44910174 -23743734
58266 -23743734 -3793812 19448465 38975799 38532695 22323967 19687676 46720136
58259D6720136L4884161R610691k4055940m0587967l2555019n044133K1684317
58252A0656246J8433531j3487476k7085968Q451366M9327088K8424005m6007944
58245B8710848r5550015p4220809j5358152K7660510L7968414K3601962l255393
58238g0442635k0033221n487261K8442049M7912895M4367982L5021147J8935464
58231G8716420j9060060n7490694m8177876O724337M2161743J9388820k1217663
58224A045027k4885398N185270L1690120L8414018K7839418k7886l2341288l8901534
58216H017747j4404879N951820J255516j460218J9386170L3923800J1600026j8791047
58208D5478935j2342228J5927183J5084067j8315880l8508637k6257890j0805358
$$ plain form
58259 46720136 81604297 91214988 67159048 26571081 -5983938 -11028071 10656246
58252 10656246 29089777 15602301 -11483667 -3032301 46294787 74718792 28710848
58245 28710848 -66839167 -141059976 -156418128 -128757618 -90789204 -67187242 -70442635
58238 -70442635 -90475856 -95963117 -67521068 -19608173 24759809 59780956 78716420
58231 78716420 59656360 2165666 -46012210 -39287873 2873870 22262690 1045027
58224 1045027 -23840371 -18655101 13035019 51449037 79288455 79260569 46919281 8017747
58216 8017747 -6387132 -435312 820204 -640014 18746156 52669956 64269982 45478935
58208 45478935 33136707 49063890 64147957 45832077 7323440 -18934450 -29739808
58201b9739808j1820325j0283807P916699K1013935O710244j9016245k2009435
58194e7228742M695234L3213849L4233400Q678400j4922836j3764195K363445
58187b731445O446966o237109j2873615j217458J1685593J1293354R771195J7308001
58179C3445482J4485434j5377729m4284247k8865512K3049235N3313652K8717960
58172F4484275j5910480k6438876N37853J9804434J988755k8726096l0595661
58165a4855796j613653K0566584J2799677o121395j1849063r933029j2314232
58158b3320907n009200K4810655M8303883K6247111k6952977n5962707l9374666
58151e1258808p103774J5637180L1975843L8442638K0664767o974353j1142637
$$ plain form
58201 -29739808 -41560133 -51843940 -43927241 -22913306 -16203062 -35219307 -57228742
58194 -57228742 -52533508 -19319659 14913741 23592141 8669305 -5094890 -2731445
58187 -2731445 3715521 -2521588 -15395203 -16612661 -4927068 6366286 16137481 33445482
58179 33445482 47930916 32553187 -11731060 -40596572 -17547337 35766315 64484275
58172 64484275 48573795 22134919 22672772 42477206 44465961 15739865 -14855796
58165 -14855796 -16469449 4097135 16896812 10775417 -1073646 -11006675 -23320907
58158 -23320907 -28330107 -3519452 44784431 71031542 44078565 -11884142 -51258808
58151 -51258808 -58362582 -42725402 -10749559 27693079 48357846 41383493 30240856
58144C0240856J675698o195797k8637723j9411356J5458094J3132081k9637495
58137b3375642l0428755L7788131P7825067J8075007n9421670m2767202L1950282
58130I645218M7214640m105185k7014142K378400J0709711k4258762l3071575
58123a8501695J1302594L9483309R380509k1206075l36750K9584326J1759101
58116F1465319k9432392l7909694j4333217O119772J8129437L1147151K8911207
58109F4097583j287663k9890172k5101251n281290o567087k2772180k1860548
58102d8662608k939316N949196m237450j3146416k924582K2705487M3624006L5171764
58094C5540081q333683n2783815n2960216j3215416J2983636o69834j6021421
$$ plain form
58144 30240856 31916554 25720757 -2916966 -22328322 -6870228 6261853 -23375642
58137 -23375642 -53804397 -16016266 61808801 79883808 20462138 -22305064 9645218
58130 9645218 56859858 52754673 25740531 28118931 38828642 14569880 -18501695
58123 -18501695 -7199101 32284208 41664717 20458642 20121892 49706218 61465319
58116 61465319 32032927 -5876767 -20209984 -14090212 4039225 35186376 64097583
58109 64097583 62809920 32919748 7818497 2537207 -4029880 -26802060 -48662608
58102 -48662608 -51601924 -45652728 -49890178 -63036594 -65961176 -43255689 368317 35540081
58094 35540081 27206398 -25577417 -78537633 -91753049 -78769413 -79439247 -95460668
58087i5460668O131917M3652490M8927667J8140714j1877690j6167014M46606
58080f205978K1520412K9431361J4220768q160482p517357J4252992J8302337
58073G5844053r844877l1835131j9377909n540528k9091926o0636501m0214022
58066a20696841K7717945P2842468N1874078l093973l5037822k4112180R245354
58059b1260971L4352330L1995108L639947l1742378n4167134n3149204k4048719
58052a14381021K5251587N9270252L9266002j8591251m3782952o26369N5104208
58045A510456M9612557n366848l4027484p562922K3108682R514081l0519490m9013238
58037d2744206l0736967K148656K4374202K5905968R719307j2003334k3525932
$$ plain form
58087 -95460668 -89328751 -45676261 3251406 21392120 9514430 -6652584 -6205978
58080 -6205978 15314434 44745795 58966563 50806081 43288724 57541716 75844053
58073 75844053 65999176 34164045 14786136 9245608 -19846318 -80482819 -120696841
58066 -120696841 -92978896 -20136428 31737650 28643677 -6394145 -30506325 -21260971
58059 -21260971 13091359 45086467 48726414 16984036 -37183098 -90332302 -114381021
58052 -114381021 -89129434 -29859182 9406820 -9184431 -52967383 -53593752 1510456
58045 1510456 51123013 45756165 11728681 4165759 27274441 36788522 6269032 -42744206
58037 -42744206 -73481173 -71332517 -46958315 -21052347 -11333040 -23336374 -46862306
58030d6862306j5636067Q641981L4998846M2889170J9910816k0887233m7065117
58023b4009910l8494804n653646K6254697L8155172K2226392j1321584k9616024
58016b2459707p987438K8339464K8371288r510595l1285817j4075281m023525
58009c2631611l1661170m7235931N33988O7558489P1170257J5729270j9173606
58002B4289686m408813P686970j5896547l6538269j7388110J6064621K3092065
57995c098397P496378k899323j070612K648785J666895p999745k4582777k6462699
57987e4301495P408542N4615147O3817347K4303909j7101870k3549297j3228861
57980D1963422j6986271k8523226k3503186k31757K3134415L1586875J8516612
$$ plain form
58030 -46862306 -62498373 -53856392 -18857546 24031624 43942440 23055207 -24009910
58023 -24009910 -62504714 -68158360 -41903663 -3748491 18477901 7156317 -22459707
58016 -22459707 -30447145 -2107681 26263607 16753012 -14532805 -28608086 -32631611
58009 -32631611 -64292781 -111528712 -110994724 -43436235 27734022 43463292 24289686
58002 24289686 19880873 27567843 11671296 -24866973 -42255083 -26190462 -3098397
57995 -3098397 4397981 1498658 428046 3076831 4743726 -3256019 -27838796 -54301495
57987 -54301495 -46892953 7722194 71539541 95843450 78741580 55192283 41963422
57980 41963422 24977151 -3546075 -27049261 -27281018 -4146603 27440272 45956884
57973D5956884j0234559k9412892j8339305L975008J836925j6712197q089207
57966c1019343K9760023M2860925M980741l7947975l7683908q244853J3719583
57959b3574807K4214604K8556391J1906788k0808978k3074793K1906286N3370860
57952G2496351J7977626l9030348l9108046P944852K9520060J3763108J6304533
57945G9868136N0086033O3479513M1074812L4105915O0086727N8282418o291407
57938C80692147o8279761n5028848J052521J5020246k1594016m0525309j2034772
57931A99302208J3418857r974683n5302193o7041240l6610308k765266N672637
57924D6700012j013759K58691J0306012R447151j1609564l5340955l7926669j7641702
$$ plain form
57973 45956884 35722325 6309433 -12029872 -8054864 -6217939 -22930136 -31019343
57966 -31019343 -1259320 41601605 46582346 8634371 -29049537 -37294390 -23574807
57959 -23574807 639797 29196188 41102976 20293998 -2780795 19125491 72496351
57952 72496351 90473977 51443629 12335583 20280435 49800495 63563603 79868136
57945 79868136 129954169 193433682 234508494 268614409 328701136 386983554 380692147
57938 380692147 312412386 257383538 258436059 273456305 251862289 211336980 199302208
57931 199302208 212721065 202746382 147444189 80402949 43792641 41027375 46700012
57924 46700012 45686253 45944944 56250956 65698107 54088543 18747588 -19179081 -36820783
57916c6820783Q797875L1664502N1470896N8197327L2506797k1195449o4340924
57909F0280241o5448798l7426394j3798233n81202K0638752M6213699M1866229
57902E1744294m460473m8280386l7227264J5696006M1885659P114750m1298195
57895a4825609m0584724R21953K3000338O820287k651332K3184423M7050209K8410199
57887G1325744p451896j0722811J0551757N640274l2665794n5057793l3512243
57880e1892762P39945J2160607P976724Q609819R808217O56461j0008638r816348
57872c1765975k135440R031213K7093052L9319839J8514971k8289087m8091891
57865a6323318j2012985L4437619L2227574n207236j5078152J9702664M9449112
$$ plain form
57916 -36820783 -28022908 3641594 55112490 113309817 145816614 124621165 60280241
57909 60280241 -5168557 -42594951 -56393184 -56974386 -36335634 9878065 51744294
57902 51744294 47283821 -996565 -38223829 -22527823 19357836 26472586 -14825609
57895 -14825609 -55410333 -54488380 -31488042 -24667755 -27319087 -4134664 42915545 71325744
57887 71325744 63873848 53151037 63702794 69343068 36677274 -18380519 -51892762
57880 -51892762 -51152817 -38992210 -31015486 -22405667 -12597450 -11940989 -21949627 -31765975
57872 -31765975 -33901415 -24870202 2222850 41542689 60057660 31768573 -16323318
57865 -16323318 -28336303 6101316 38328890 33121654 18043502 37746166 87195278
57858H7195278L1820741j7135378n4249867n6745315k9042273R075998L0935918
57851A855102K2066090j496441j1331796l467811L268960K823239Q178808J9532621
57843D1428772J6134634q892498l0232697k2949253K588086J4227924q05359k0247229
57835h747620j3599776J8210271L7234317J4613901k3359173k3348213J6668771
57828A7672478L8146491J1620223j3219204J0229367M0676413J2757662m9089044
57821F8794386o3822735k3614300K407135o991797J161510L6783602L2413143
57814D7130944k8959043n8807586o077137M3895971Q178950m3520634o68756Q8792203
57806D9964912P8841718l7232863j04400197m1334270M5637939M0149055j6681633
$$ plain form
57858 87195278 119016019 101880641 47630774 -9114541 -38156814 -29080816 1855102
57851 1855102 23921192 22424751 11092955 7625144 10894104 13717343 21896151 41428772
57843 41428772 57563406 48670908 18438211 -4511042 -1922956 12304968 11499609 -8747620
57835 -8747620 -22347396 -4137125 33097192 47711093 24351920 1003707 17672478
57828 17672478 55818969 67439192 54219988 64449355 105125768 117883430 68794386
57821 68794386 4971651 -18642649 -16235514 -23227311 -22065801 14717801 47130944
57814 47130944 18171901 -40635685 -46712822 -2816851 5362099 -38158535 -38827291 49964912
57806 49964912 128806630 91573767 -12826430 -54160700 -8522761 31626294 14944661
57799A4944661k2163012J8889735K6722268q421940k2850676J480848J4544611
57792B3146495k400297m126523K7847099L8351404j1363621o2723043l4124345
57785b5392831M9663322P5724403K21612p9761587n4718651M4304773Q9720591
57778I9761632L6070937k8617661k6896801j524210k5019577o8939625n1839693
57771f7004998J7844695M7074146M911840l1959840n492688L6797811K7988026
57764C0158992j1492129j4683655K5001036N0167453K6405435j7944453l8000209
57757D9612470k4670074n855689j0434514l3038839l7184167m547038L1103560
57750c5014291K8006384J667218K6686K0001649J0957285l0646348m2090353K739228
$$ plain form
57799 14944661 -7218351 11671384 38393652 29971712 7121036 8601884 23146495
57792 23146495 20746198 16619675 44466774 82818178 71454557 8731514 -25392831
57785 -25392831 24270491 99994894 100216506 20454919 -34263732 10041041 99761632
57778 99761632 135832569 107214908 80318107 78793897 53774320 -15165305 -67004998
57771 -67004998 -49160303 -2086157 2825683 -29134157 -34626845 2170966 30158992
57764 30158992 18666863 3983208 28984244 79151697 105557132 87612679 49612470
57757 49612470 24942396 19086707 8652193 -24386646 -61570813 -66117851 -35014291
57750 -35014291 -7007907 -5340689 -5314003 14687646 25644931 -5001417 -47091770 -44352542
57742d4352542M2612809K4747466j3592407j3812445J1375393J5938624O33267
57735B3550165j0227439k4526863m5367451k7892999M4974534R0848186L1712137
57728H3070270o5418163o6247023K8621415Q3859336L8237772j6935659l274199
57721H1913749K6754409L219589l7092406k7982282M604471m463427l8696961
57714H257142l0055529K0277183M3244374J3585714k0775109k3578346j4700183
57707c744754j6914507j5696855N874212L1706259L4300697R534077k2176896
57700B2882233l4945185j6701706J5669500K5855729k75783l1825699l1300557
57693e0641468l793664J6862929J9065696J9802441K6781375K7542594J7201454
$$ plain form
57742 -44352542 -1739733 23007733 9415326 -4397119 6978274 22916898 23550165
57735 23550165 13322726 -11204137 -56571588 -84464587 -39490053 51358133 83070270
57728 83070270 17652107 -48594916 -19973501 63885835 102123607 85187948 81913749
57721 81913749 108668158 111887747 74795341 46813059 51417530 46954103 8257142
57714 8257142 -21798387 -1521204 41723170 55308884 34533775 10955429 -3744754
57707 -3744754 -20659261 -36356116 -30481904 1224355 35525052 45059129 22882233
57700 22882233 -12062952 -28764658 -13095158 12760571 12484788 -19340911 -50641468
57693 -50641468 -54435132 -37572203 -18506507 1295934 28077309 55619903 72821357
57686G2821357O626096j663267j7699884l6491725l3067980N34100L3405203K9241993
57678E3705893p935882l7235202k7993965P294419L0099922K0443341l404944
57671C4973582j2623823n170383q48324m172787L313915K6278473L6933186J3354167
57663I2038006k1814130k7822607k830240J3331949m591282l2195943k8249445
57656a2133692J0185588M0011909K0992928l4330455o8815924m3685216J5580278
57649g2194584M9669604L5331378L932566q287946m42645J1292625K3304686L6019417
57641G8625101L7301925J8183339q023404k2506065k5163296k4528123j7939873
57634C5949604k363788Q482032J227271j2990534j4471975o073844m562263q784979
$$ plain form
57686 72821357 79447453 77784186 60084302 23592577 -9475403 -8941303 24463900 53705893
57678 53705893 45770011 8534809 -19459156 -12164737 17935185 38378526 34973582
57671 34973582 22349759 17179376 16331052 12158265 15472180 41750653 78683839 92038006
57663 92038006 70223876 42401269 39571029 52902978 48311696 16115753 -12133692
57656 -12133692 -1948104 38063805 59056733 24726278 -44089646 -87774862 -72194584
57649 -72194584 -22524980 12806398 16738964 8451018 8008373 19300998 42605684 78625101
57641 78625101 115927026 134110365 126086961 103580896 78417600 53889477 35949604
57634 35949604 33585816 42067848 43295119 30304585 15832610 9758766 5196503 -3588476
57626c588476l160618J0093005R244898j2422913l1906211k3966423R477105M1814078
57618d415555M5724224J5871296k4431225m2395629k8165258k747569R955010
57611c0604706P646958J784571J579384J2453288L0772534L3321236j006050m8138729
57603G808486n2333935k861655M1649503L5364556R162913Q914819J3703347j9684173
57595D1723861o2490329m5685278K3089536N8221365K2710316k2799273k2275921
57588g505723j744098n694216k0737085j3799020L337634L119036j032291J7217158
57580b6838605L9294514K8088199m629267j2133893J1907198K3297388k597886
57573E6387648l4196697l1573543p17213J7945661R53623l0555712l3418376N472121
$$ plain form
57626 -3588476 -6749094 3343911 12588809 165896 -31740315 -55706738 -46229633 -4415555
57618 -4415555 41308669 57179965 32748740 -9646889 -37812147 -40559716 -30604706
57611 -30604706 -22957748 -21173177 -19593793 -7140505 23632029 56953265 55947215 7808486
57603 7808486 -44525449 -47387104 -5737601 29626955 38789868 47704687 61408034 41723861
57595 41723861 -20766468 -66451746 -43362210 14859155 37569471 14770198 -7505723
57588 -7505723 -9249821 -14944037 -35681122 -49480142 -46142508 -43023472 -44055763 -26838605
57580 -26838605 12455909 40544108 35914841 23780948 35688146 58985534 56387648
57573 56387648 22190951 -9382592 -10099805 7845856 8799479 -21756233 -55174609 -49702488
57565d9702488M2462955K2019147m5358587q0302643l2819137M5312757O4211788
57558c4176208J3122565l2772412j8078796K9221639N1086363L3356619K542707
57551D4302477k0161772l0789238k4866479J344625L3160255M3000573K0302440
57544F6292881j3939571k7855365j0899926J6208703K2785178k59348l0580972
57537B1751580l8234028j7905652P794876J7085720J2138840P216025K330422
57530A2177783j4477223l6497561l1698653J3569195N8093316M5968403j5137025
57523C1998235n3062437k5318266K2624697K5317202q500742j8261240J0362155
57516a4840396K8705215P587262k1022693k1403579l611683Q525452J6304625
$$ plain form
57565 -49702488 -7239533 14779614 -30578973 -110881616 -143700753 -98387996 -34176208
57558 -34176208 -21053643 -53826055 -71904851 -42683212 8403151 41759770 44302477
57551 44302477 24140705 -6648533 -31515012 -30170387 2989868 45990441 66292881
57544 66292881 52353310 24497945 13598019 29806722 52591900 52332552 21751580
57537 21751580 -16482448 -34388100 -26593224 -9507504 2631336 9847361 12177783
57530 12177783 -2299440 -38797001 -70495654 -56926459 1166857 47135260 31998235
57523 31998235 -21064202 -46382468 -23757771 1559431 -6941311 -25202551 -14840396
57516 -14840396 13864819 21452081 429388 -20974191 -24585874 -16060422 244203
57509B44203K4320070J6294032j4988562m1803404l5593880m473628K5390259
57502c0610910L9296698K7192077j5236254n5191135l7909059L1972039P1961183
57495C1474639L1306163k9018446k7001322J4503291J2608845l5082552m9379604
57488e0588986l282538L8505614L0723532J1162098J9811566K9665242M640170
57481H0636698l1181748l2890659l887377J8507700J7519398J965574j7233452
57474C3436134k7751749j8803364m093054j1206300l1537330k1549517K4576665
57467e6928515N1390141K3152062j9106675k2034623K921455J3959893R411803
57460B765541R822616N582227j7425296k9427301Q62488L8251782K5576515j8672949
$$ plain form
57509 244203 24564273 40858305 25869743 -15933661 -51527541 -56001169 -30610910
57502 -30610910 8685788 35877865 20641611 -34549524 -72458583 -40486544 31474639
57495 31474639 62780802 33762356 6761034 21264325 33873170 -1209382 -50588986
57488 -50588986 -53871524 -15365910 15357622 26519720 46331286 75996528 80636698
57481 80636698 49454950 16564291 12676914 31184614 48704012 50669586 33436134
57474 33436134 5684385 -13118979 -17212033 -28418333 -59955663 -81505180 -56928515
57467 -56928515 -5538374 17613688 -1492987 -23527610 -20606155 -6646262 2765541
57460 2765541 12588157 18170384 745088 -28682213 -27819725 10432057 36008572 17335623
57452A7335623k3389749J7411772L0751703j6289618o1335551m4185580O115052
57445g3586348K8035958K0574408K4027786M0004185L0426358j1793078m2485155
57438A5204114k7682397Q312386J5821307j4943954m2666764l0254893O148325
57431g0061876K1027880N344583j396168K5074756N1671050L8439339L709884
57424G3809448m038135J5930167J6948828j7652608m7162603l5629804N87236
57417B792529K5345346K8946223K2832425J4869040O953617k229779j9571812
57410G9937589m2309947m4247672r870121K3568405N672068m3623520m9133040
57403h0006238N866679M6129811J7351555l0995977k6189005J8159867L6639699
$$ plain form
57452 17335623 -6054126 11357646 42109349 25819731 -35515820 -79701400 -73586348
57445 -73586348 -45550390 -24975982 -948196 39055989 69482347 57689269 15204114
57438 15204114 -12478283 -4165897 11655410 -3288544 -45955308 -76210201 -70061876
57431 -70061876 -49033996 -43689413 -45085581 -20010825 31660225 70099564 73809448
57424 73809448 69771313 85701480 102650308 84997700 37835097 2205293 2792529
57417 2792529 28137875 57084098 79916523 94785563 101739180 99509401 79937589
57410 79937589 37627642 -6620030 -16490151 7078254 12750322 -30873198 -80006238
57403 -80006238 -74139559 -28009748 -10658193 -41654170 -67843175 -49683308 -13043609
57396a3043609J7781386O008672J9059061K9048310J7739674l954632k5098274
57389D7540588l6976978j9755697K4604335M4548089J340481n7750308n5228853
57382e1678343m18675K5703531M38888j2337457K0645169M5820859K0790509j2375439
57374C6589042m956241J4844808j415745l5735952m0180233j8877517o786087
57367e6517925K08188K5059969M4887580J9667396k7062416k8861175K1373950
57360a244433N6166821L1007687k0378703m4148105l1146682n745781J0558316
57353d930880Q471194n112942n818750J5189079K2531122j5985496o1200642m2432099
57345h9289414L0750662O7454756K7075857k1247052r442608K9050147K6325709
$$ plain form
57396 -13043609 4737777 10746449 29805510 58853820 76593494 72638862 47540588
57389 47540588 10563610 -9192087 15412248 59960337 61300818 3550510 -51678343
57382 -51678343 -52097018 -26393487 -25954599 -38292056 -17646887 28173972 48964481 36589042
57374 36589042 31632801 46477609 45061864 9325912 -30854321 -49731838 -56517925
57367 -56517925 -56309737 -31249768 13637812 33305208 6242792 -22618383 -1244433
57360 -1244433 54922388 85930075 65551372 21403267 -9743415 -15489196 -4930880
57353 -4930880 3540314 -1572628 -7391378 7797701 30328823 14343327 -46857315 -89289414
57345 -89289414 -58538752 8916004 35991861 14744809 5302201 34352348 60678057
57338F0678057j1010602k9278442k1087441j7441135j7643007l142666J733957
57331c7191279l5305584p1817480l2355684O2636242J01379471L9247996l3065328
57324f471646k3272033L5098016M8589484J356093m1389193l5120806J966633
57317a9243452L3039553L7703705J2316091k4864681l8430329j6971896O607355
57310i843654M811171l55991J9404645L9911037J9395226k7517019m5902175k0554547
57302b0651307J3080034L0541405L6422302K5795879j2660191n1773644m4832385
57295b4077907p21929J8231344j0767649l8380570k4373982P158794K1497260
57288e1434639K4453024K5145853M470981l5391726m3256738N519989N1531532
$$ plain form
57338 60678057 49667455 20389013 -698428 -18139563 -35782570 -38925236 -37191279
57331 -37191279 -72496863 -144314343 -176670027 -114033785 -12654314 26593682 -6471646
57324 -6471646 -29743679 5354337 53943821 55299914 13910721 -21210085 -19243452
57317 -19243452 13796101 51499806 63815897 38951216 520887 -16451009 -9843654
57310 -9843654 -5032483 -5388474 14016171 53927208 73322434 45805415 -96760 -20651307
57302 -20651307 -7571273 22970132 59392434 85188313 72528122 20754478 -24077907
57295 -24077907 -24799836 -6568492 -17336141 -55716711 -80090693 -72931899 -51434639
57288 -51434639 -26981615 -1835762 2635219 -32756507 -76013245 -70493256 -18961724
57281a8961724L0720177k5288845l5656745Q333400L9941257K3610162n565437
57274A7132245j1878960m911547j841513L117475J2574985J0907405n347636j4173657
57266E578797j491935J7244739K0321771M020652k1326039l9739713l4689821
57259e0081549o759336J8660959K3102786K2365028L4229402L6716413l42620
57252G7891083n5047491p3681797m6101542j0804204J2153758L6739251N6274152
57245b576790L6651506j8003644n1681867l4507600k810580N576718M870197J8582310
57237d3899750L2278128K6319096J2988948M248107j5377692m5660493m5096881
57230g4200537N526458N4871529M8228391P610263j0643424o479645k1414195
$$ plain form
57281 -18961724 11758453 -13530392 -49187137 -40853737 -912480 22697682 17132245
57274 17132245 5253285 341738 -1499775 1617700 14192685 25100090 19752454 5578797
57266 5578797 4086862 21331601 41653372 45674024 24347985 -15391728 -50081549
57259 -50081549 -56840885 -38179926 -15077140 7287888 41517290 78233703 77891083
57252 77891083 22843592 -50838205 -96939747 -107743951 -95590193 -58850942 -2576790
57245 -2576790 34074716 16071072 -35610795 -70118395 -72928975 -67352257 -62482060 -43899750
57237 -43899750 -11621622 14697474 27686422 31934529 16556837 -29103656 -74200537
57230 -74200537 -68674079 -13802550 34425841 42036104 31392680 24913035 3498840
57223C498840n4678007o0377988k2265728K5953199N3818041N8917087M2313525
57216D7178969P042167k1504972j9122322l055664n218257j4950687J68458K5934008
57208A6471700J6650699k0694737k5687678J7390289M7834820K3252654j4992795
57201F0224952j1727075J6341915J4649712k2022988m6661118k9775704P965295
57194a1005011K8296050J4801446j6123187l0020582r947902J7093930J0713589
57187C808333k0487586k2198266K2552340N4321289J7375367n2535396o9464538
57180f6628457j3354958M4619918L7513790j7237813n0263689k6678376K2309796
57173f9719789M4914390K6946232r88676o623824P279983J6427411J2117195N120390
$$ plain form
57223 3498840 -51179167 -111557155 -133822883 -107869684 -54051643 4865444 47178969
57216 47178969 54221136 32716164 13593842 10538178 5319921 -9630766 -9462308 16471700
57208 16471700 33122399 12427662 -13260016 4130273 51965093 75217747 60224952
57201 60224952 48497877 64839792 79489504 57466516 10805398 -18970306 -11005011
57194 -11005011 17291039 32092485 15969298 -14051284 -23999186 -6905256 3808333
57187 3808333 -16679253 -38877519 -16325179 37996110 55371477 2836081 -66628457
57180 -66628457 -79983415 -35363497 2150293 -15087520 -65351209 -92029585 -69719789
57173 -69719789 -24805399 2140833 1152157 -5471667 1808316 18235727 30352922 35473312
57165C5473312r11829j1950426j7711555L390603M0388330M4662261n926472o4877721
57157B2536503p1644998k9716910N661694O099891l437750L859098J8196319J9505192
57149b8940961J2250941J3016986K0240526J7174904r37360j8502015j8974418
57142d671397l494718J2374642J6011618Q611559L2316l027755j340783N39882
57134B5035364k673406j4218582k8499768l0625712j2779759J1266711K0187494
57127c2307658J2578702O300355J0073885J2339295K445278j2880628k0377208
57120b1827979j4726874J248177J7523576J8184289m23795j4554309k15565K5600681
57112A0808201K3465941n018816j4043235J1443296K4795973p524619m4875438
$$ plain form
57165 35473312 34561483 22611057 4899502 8290105 48678435 93340696 87414224 22536503
57157 22536503 -49108495 -78825405 -73163711 -67063820 -70501570 -66642472 -48446153 -28940961
57149 -28940961 -16690020 -3673034 16567492 33742396 32805036 14303021 -4671397
57142 -4671397 -8166115 4208527 20220145 28831704 28864020 25836265 24495482 25035364
57134 25035364 22361958 8143376 -20356392 -50982104 -63761863 -52495152 -32307658
57127 -32307658 -19728956 -13428601 -3354716 8984579 11429857 -1450771 -21827979
57120 -21827979 -36554853 -35306676 -17783100 401189 -22606 -14576915 -14792480 10808201
57112 10808201 34274142 29255326 15212091 26655387 51451360 43926741 -948697
57105i48697l2737461J0025544K1005431q780239k8379388j1132621J3756877
57098c7190554J9102645J4785972J1717225o03270k1849239k8232437j2422703
57091e4692361P87250k836461n866997Q24079j532789j5372961p614356L1372246
57083e4932350N3220973K1447728k2266364j7939000J6261974J4856556k3533409
57076a2883892l2160179J1033718M2761820J3943666l5645170m4281438j7348310
57069g4579785J484320P242484K2390769L5410153J5960850j8155334j3992386
57062b4238929L0870791N5794456K7557723j1716308j4979591R23809l786049
57055F0425902k1994389j9710347q0562M413702q954693j1683292J982053O824595
$$ plain form
57105 -948697 -33686158 -23660614 -2655183 -11435422 -39814810 -50947431 -37190554
57098 -37190554 -18087909 -3301937 8415288 7812018 -14037221 -42269658 -54692361
57091 -54692361 -53905111 -56741572 -62608569 -61784490 -63317279 -78690240 -86304596 -54932350
57083 -54932350 -1711377 19736351 -2530013 -20469013 -4207039 10649517 -12883892
57076 -12883892 -45044071 -34010353 8751467 22695133 -12950037 -57231475 -74579785
57069 -74579785 -73095465 -65852981 -43462212 -8052059 7908791 -10246543 -24238929
57062 -24238929 6631862 62426318 89984041 78267733 63288142 64211951 60425902
57055 60425902 38431513 18721166 18640604 23054306 14099613 2416321 4398374 11222969
57047A1222969m320710q403450J426261M51623j9894086k8857253n303152K3129688
57039c0548110J9322905q250555j9066512N659241M6382967P0117108N4101080
57032A37718124P05982n3182107o0115322j6077801K7779274K8241390K382812
57025F7452352r684619q663428k2652257m6944800m5638503j1851351J8728997
57018e9253609K2747395J8568577K6677034L4059796J8284932j5432040m0236235
57011E415850l7790445j2057977J4894471J6956433j0164834l5175530k3127201
57004h1049233J6757993L9058399K2586300m469884r756411J180819N176471l43826
56996a0859372j229891P694567K0308493K9803939K6420084K8462l8098905n2118203
$$ plain form
57047 11222969 6902259 -1501191 -74930 376693 -19517393 -48374646 -53677798 -30548110
57039 -30548110 -11225205 -19475760 -38542272 -32883031 13499936 83617044 137718124
57032 137718124 138424106 85241999 25126677 9048876 36828150 65069540 67452352
57025 67452352 57767733 49104305 26452048 -20492752 -66131255 -77982606 -59253609
57018 -59253609 -36506214 -17937637 8739397 42799193 61084125 45652085 5415850
57011 5415850 -32374595 -44432572 -29538101 -12581668 -22746502 -57922032 -81049233
57004 -81049233 -64291240 -25232841 -2646541 -7116425 -16872836 -15692017 -10515546 -10859372
56996 -10859372 -12089263 -4394696 15913797 45717736 72137820 72166282 34067377 -18050826
56988a8050826k1354949K8046031N1510055L6878144P597736j4956648k8735072
56981D0934471l4890388k8905663j2570214J648934M326663j656385p032444l979575
56973d2124601J0209701K8720741L6447533K4743092L994740p038559m530012
56966E0422635m262856j9825606m0555453l8365047k831171L3682868K3594932
56959A860302l2019564o7110625k6409750N4509126Q5271324L7855343j9335765
56952C4620391k1137603R851591J4449102r027602j5740480K986914P713028j9278419
56944D436922m4256270l4265896J35873K8431159L5418451K0780448q088898k9785555
56936b7193766k0606922J4276333M2282713M4723154L3589252K0061283m060181
$$ plain form
56988 -18050826 -39405775 -11359744 40150311 77028455 84626191 69669543 40934471
56981 40934471 6044083 -22861580 -35431794 -33782860 -29456197 -31112582 -38145026 -42124601
56973 -42124601 -31914900 -3194159 33253374 57996466 61991206 54952647 50422635
56966 50422635 46159779 26334173 -14221280 -52586327 -55417498 -21734630 1860302
56959 1860302 -30159262 -97269887 -123679637 -69170511 16100813 53956156 34620391
56952 34620391 13482788 23334379 37783481 28755879 13015399 16002313 23715341 4436922
56944 4436922 -39819348 -74085244 -73949371 -45518212 -10099761 10680687 2591789 -27193766
56936 -27193766 -47800688 -33524355 8758358 53481512 87070764 107132047 103071866
56929A03071866l8324173n5268315l3368648R839194L8326169L7802742J9534655
56922H1613490j163934j4011818j4603269j0780324j5971363k6165084k0980796
56915b2063098J775825J6006312P810320K8305J2805918K5429960J0184669j6317477
56907C5660734j6192103N922352O181834k8808710n6050401l4412564J9523113
56900f8175745N1448422K9678478k5268566o0826369l9075047K4821187P2033112
56893a5364528O1419315J5313545j4586372j6128638j9570695l5893857l5189932
56886f0001162k46949L7218853M0252678J8528009O429143R417447N188188j3045612
56878D3740595k7809249k9547879k7286809k3203639m710442K5957025L7789231
$$ plain form
56929 103071866 64747693 9479378 -23889270 -14050076 24276093 62078835 81613490
56922 81613490 80449556 66437738 51834469 41054145 25082782 -1082302 -22063098
56915 -22063098 -20287273 -4280961 3529359 3557664 16363582 41793542 51978211 35660734
56907 35660734 19468631 25390983 31572817 2764107 -53286294 -87698858 -68175745
56900 -68175745 -16727323 12951155 -12317411 -73143780 -112218827 -87397640 -15364528
56893 -15364528 46054787 61368332 46781960 30653322 11082627 -24811230 -60001162
56886 -60001162 -60248111 -23029258 17223420 35751429 42180572 51598019 56786207 43740595
56878 43740595 15931346 -13616533 -40903342 -64106981 -68817423 -42860398 -5071167
56871e071167Q808707l3468944l5691721J3290548O0409648N0271288n516445
56864E3031914m5131400l6960329j1512789n760887j1207316k075286J4462361
56857d5153732J4088935L251353Q249956K4774754K3291392L850519j280037J4024103
56849D5097243J6770518n886051k2118697j1534561j68511j1875195k7452871
56842a7168125k4081661j4968224j4655477n523578K1126888L1804825N753690
56835a7711662j7082310K042597K9480903J4716461j7988198j0382336K4102479
56828G177934K3635447p689603o500506K7798209K2577538l4761394n9251580
56821b7013955q262035M0819544J6952492k9408978j9335555K0655367J5472085
$$ plain form
56871 -5071167 3737540 -29731404 -65423125 -52132577 8277071 58548359 53031914
56864 53031914 7900514 -29059815 -40572604 -46333491 -57540807 -59616093 -45153732
56857 -45153732 -31064797 -27813444 -19563488 5211266 28502658 32353177 31073140 45097243
56849 45097243 61867761 55981710 33863013 22328452 22159941 10284746 -17168125
56842 -17168125 -41249786 -56218010 -70873487 -76397065 -55270177 -23465352 -17711662
56835 -17711662 -34793972 -32751375 -3270472 11445989 -6542209 -16924545 7177934
56828 7177934 30813381 23123778 16623272 44421481 66999019 32237625 -27013955
56821 -27013955 -35275990 5543554 22496046 -6912932 -26248487 -5593120 9878965
56814I878965k1303519j5331481L1523858M1945721k249229k9069829K490110
56807A7884596M0455968L1357731j586427j2951374p024655r315274j3444469
56800D5376096m306804P23547j9017445m1608690l1212961K746518J7889536L495488
56792b5914715o908038J0033997L4295897L4664056J0802740j0937728j0969489
56785C5066720O133689K1296334J8833027l271063l3898640n6533188n8131332
56778g0504453l5389381J890918L3279142M0791515K5921352J0619507J3289712
56771A9898312K3873308J4254824j9475255l8787928q287567M4955769N0851219
56764H7282682j0478777o8699778n0521639J7976397M5986520N360829l6800345
$$ plain form
56814 9878965 -11424554 -26756035 4767823 46713544 44464315 15394486 17884596
56807 17884596 58340564 89698295 88111868 75160494 68135839 58820565 45376096
56800 45376096 41069292 41792839 22775394 -18833296 -50046257 -47299739 -29410203 -25914715
56792 -25914715 -32822753 -22788756 11507141 46171197 56973937 46036209 35066720
56785 35066720 41200409 62496743 81329770 78058707 44160067 -12373121 -70504453
56778 -70504453 -105893834 -104002916 -70723774 -29932259 -4010907 6608600 19898312
56771 19898312 43771620 58026444 38551189 -236739 -8524306 36431463 87282682
56764 87282682 76803905 8104127 -42417512 -24441115 21545405 26906234 -9894111
56757i894111k4572889R510653R262485j3314890n058507L6977409N8623947K8149676
56749H9683773k3590132m8544867l4365406m257541J3544116R158189m346773
56742b718641q640312m617729o947193j3232013m949316J3864364J5545462J673751
56734a0021627J0588647M3707123L8536276l5035787j02065249p5930915J2064229
56727a18157303N6632150K9281610k049118M116064J2640907l875171j7199062
56720c8609923o681500K762669m011509k477872J8416182L2469305K8926489K8061030
56712E8854871K4990428j1377789o0230790n1326708J8458550N6862689J4439390
56705E0670641l5668254k0973816J3298098m881030m2720426k5183037K7677716
$$ plain form
56757 -9894111 -34467000 -24956347 -15693862 -29008752 -34067259 2910150 61534097 89683773
56749 89683773 66093641 17548774 -16816632 -21074173 -7530057 1628132 -2718641
56742 -2718641 -11358953 -15976682 -22923875 -36155888 -41105204 -27240840 -11695378 -10021627
56734 -10021627 567020 44274143 82810419 47774632 -54290617 -130221532 -118157303
56727 -118157303 -61525153 -32243543 -34292661 -30176597 -17535690 -21410861 -38609923
56720 -38609923 -45291423 -42528754 -46540263 -49018135 -30601953 1867352 30793841 58854871
56712 58854871 83845299 72467510 12236720 -39089988 -20631438 36231251 50670641
56705 50670641 15002387 -5971429 7326669 2445639 -40274787 -65457824 -37780108
56698c7780108L7577261N011535k962996K0160532J7563634j4615019j8542352
56691F412487J2071976J5922788k1141473l5868820q37176K5706511K683961k4921000
56683a9970746p958833K6905642L0483600O786637j3144454k4105858k9264521
56676c0268533j4988546J5332230K4838087l57650k0471926n691061J4270413
56669a7336986O135498o839371R428803L3958666K6039493m696866k0020861j9999474
56661F668902k9619901l6420086m485084N2114671O9609715K2252457l5561378
56654D4559296l7946913Q888016L6618775J152525n9461580o6343929P01424O8457761
56646c374625O0036325k497062l3759958j2475013l102839l7210264n3893754
$$ plain form
56698 -37780108 -202847 4808688 1845692 22006224 39569858 24954839 6412487
56691 6412487 18484463 34407251 13265778 -22603042 -23440218 2266293 4950254 -19970746
56683 -19970746 -27929579 -1023937 29459663 36246300 23101846 -1004012 -30268533
56676 -30268533 -45257079 -29924849 -5086762 -5444412 -25916338 -31607399 -17336986
56669 -17336986 -11201488 -18040859 -8612056 25346610 51386103 46689237 26668376 6668902
56661 6668902 -22950999 -59371085 -63856169 -11741498 57868217 80120674 44559296
56654 44559296 6612383 15500399 52119174 53271699 -6189881 -72533810 -71832386 -3374625
56646 -3374625 56661700 54164638 20404680 7929667 4826828 -32383436 -86277190
56639h6277190l181843O1921626O1882079O320750l6536446m2755609l2070159
56632g0696792m297116M1410760N6316088K422403n9287099l8931600L7053677
56625c6009679N7686557L099733l0434267l92057J4531047l3491000o5097454
56618i0107120j0916362N9248511M7876652r674257j2609034L2773895L3464759
56611E0057044k4239601n4226788j7705115K2472729J5772151o057946n422832
56604a9350358K32875n714998L108642L5290098M2408543o291301o0994618n8004874
56596f9315991r915630K3758783K3181297J2398883M006903n487112l952372J8056008
56588g269231K9464318n730793n9602132o3040180l956899M9831614M3253090
$$ plain form
56639 -86277190 -89459033 -27537407 34344672 40665422 4128976 -38626633 -70696792
56632 -70696792 -74993908 -33583148 22732940 25155343 -34131756 -73063356 -36009679
56625 -36009679 21676878 24776611 -5657656 -6049713 8481334 -25009666 -90107120
56618 -90107120 -101023482 -41774971 6101681 -3572576 -16181610 16592285 50057044
56611 50057044 25817443 -28409345 -46114460 -23641731 -7869580 -13927526 -19350358
56604 -19350358 -19117483 -24832481 -21723839 13566259 55974802 49683501 -11311117 -69315991
56596 -69315991 -79231621 -55472838 -32291541 -19892658 -15885755 -21372867 -25325239 -7269231
56588 -7269231 22195087 16464294 -43137838 -106178018 -110134917 -60303303 -17050213
56581a7050213L702491q940563J3321378K7456085O857295k5430546l0474912
56574c0558985o79981L2568100L3853666M120343j9491753r966411J4544050J8504846
56566D2893875R17553q477312j161587k250463k2450212l3965111j5144321J0997704
56558b8639874J0956605q596787j4908260J230550K0313876K7752617K2877307
56551C0986034L555130k5943106l8050976r426485L4173337L9038314j769842
56544C2562406l2893727j3326184K6992633L4651392Q133609j0686244m080617
56537D1353268K535819j1622614l0405769k7021691n24074K6437671L3872364
56530C4624974J9678201k941935j7033595j5611926n914702K566096R172360J4820785
$$ plain form
56581 -17050213 -13347722 -22288285 -8966907 18489178 25346473 -84073 -30558985
56574 -30558985 -31238966 1329134 35182800 39303143 19811390 9844979 24389029 42893875
56566 42893875 43811428 35334116 34172529 31922066 9471854 -24493257 -39637578 -28639874
56558 -28639874 -17683269 -26280056 -41188316 -39957766 -19643890 8108727 30986034
56551 30986034 34541164 8598058 -29452918 -38879403 -4706066 34332248 32562406
56544 32562406 -331321 -13657505 13335128 47986520 56120129 45433885 41353268
56537 41353268 43889087 32266473 1860704 -25160987 -25685061 752610 34624974
56530 34624974 54303175 51361240 34327645 18715719 12801017 15367113 24539473 39360258
56522C9360258J3104973K093794l970914N640241J3355824n856446l9901661m6898254
56514b3072185j5197006J5742845J1439356j0482999j4232744n77878N823791
56507c0556820M612142J5355728L3708725L2906470R936948p330387m570474K526030
56499E6588362L153515O315855J0613975j764315k4766275k3249388Q512758K5299315
56491F0703802K77346k6782991j4642153P167878q882733l6424970j3409086M2704046
56483A0711139M6938053j5667275n4834192j3738668L9908859K2533019l1876125
56476C974810k8761405L5694483P0280914K7174499l8138532n8694663l7919229
56469b6389123j2379400R978182L4301037M0573304O996591m4377734o3205579
$$ plain form
56522 39360258 52465231 54559025 50588111 56228352 69584176 63727730 23826069 -23072185
56514 -23072185 -38269191 -22526346 -11086990 -21569989 -35802733 -36380611 -30556820
56507 -30556820 -25944678 -10588950 23119775 56026245 65963193 58632806 54062332 56588362
56499 56588362 59741877 66057732 76671707 74907392 50141117 26891729 35404487 60703802
56491 60703802 60981148 34198157 19556004 26723882 17841149 -18583821 -31992907 10711139
56483 10711139 57649192 41981917 -12852275 -26590943 13317916 35850935 3974810
56476 3974810 -24786595 10907888 81188802 108363301 70224769 11530106 -26389123
56469 -26389123 -38768523 -28790341 5510696 46084000 53080591 8702857 -54502722
56462e4502722l0660403J9533958M1094973K2651728n930939q808906J4514854
56455b107457K7250702L009482l3615506l5816263m2122K8414806K1728046N713315
56447A4535003R910856J6345934n840194l8193481l2434568J2766182M1136404
56440A8226136J6489290k7951777m0196821j9158652k542897m132925j503343
56433f0770989J5847449K3928439N362701j4481491L58664M0127893N4812830
56426F5185496J8462278l6507984o0025618m0246368l361942K6072563M0937477
56419A0515902L5777482N264330l4474940m8258287k3091779Q721326Q699344
56412c6846622j4411690j5653570K0137456N0512916L1183715j8631880l6393958
$$ plain form
56462 -54502722 -85163125 -65629167 -24534194 -1882466 -7813405 -16622311 -2107457
56455 -2107457 25143245 28152727 -5462779 -41279042 -41321164 -12906358 8821688 14535003
56447 14535003 24445859 40791793 34951599 -3241882 -35676450 -22910268 18226136
56440 18226136 34715426 6763649 -33433172 -52591824 -55134721 -59267646 -60770989
56433 -60770989 -44923540 -20995101 -15632400 -30113891 -29755227 10372666 65185496
56426 65185496 83647774 47139790 -12885828 -53132196 -56494138 -30421575 10515902
56419 10515902 46293384 51557714 17082774 -31175513 -54267292 -45545966 -36846622
56412 -36846622 -51258312 -66911882 -46774426 3738490 34922205 16290325 -20103633
56405b0103633p15946L6784113K2238281k2990082l0387604J7694080N9744761
56398F2263970L9024773j9609057m7495456k5245702J376974n435816k5985317
56391b1105631k0813207R617617K7206321Q833113k3533659k8640600O927551
56384d1508495N3155677O8231568M1374414k044564l4282755m8759588m7230010
56377a1063753k6094804Q706716L2354282K9279374J5898926J1423693L339748
56370F3844182k5908482n4208795m5063518r521453O471693l348818J488846L0638894
56362c5607451L8178874Q71602l5443477k5480917Q649820K3608646K1476386
56355c746517J9309148k868298n8347198r3099842m6246938M6148695Q6843512
$$ plain form
56405 -20103633 -20819579 15964534 38202815 15212733 -15174871 2519209 62263970
56398 62263970 101288743 81679686 34184230 8938528 10315502 4879686 -21105631
56391 -21105631 -41918838 -32301221 -5094900 3738213 -19795446 -48436046 -41508495
56384 -41508495 11647182 79878750 121253164 119208600 84925845 36166257 -11063753
56377 -11063753 -37158557 -28451841 3902441 33181815 49080741 60504434 63844182
56370 63844182 37935700 -16273095 -61336613 -70858066 -64386373 -67735191 -66246345 -35607451
56362 -35607451 2571423 3443025 -32000452 -57481369 -48831549 -25222903 -3746517
56355 -3746517 15562631 12694333 -45652865 -138752707 -184999645 -138850950 -52007438
56348e2007438N3504854K0386921L5481985N5550417L0334062j8682937m3481272
56341H1086592l9372666k8507977j6498748m204210o051430k0661253j7178248
56334e1387940J5172449L8129993K0199453j2242286j7401442Q6467R683183P770875
56326A0010752Q062245O145587l924453l811984J4788089J8003815j9090881n6461559
56318b6278389m0302578J2310769M0199277L0033636J5511128J103320l6249934
56311c672771p3863915n5513646J0828658M8024608K5366761R94730J6786853
56304c1048722L0018618j111699l5354511j7270036K5859634K8381476p692277
56297h217517k2286338N863763L6127726L3509977P416061j6043236k2177143
$$ plain form
56348 -52007438 1497416 21884337 57366322 112916739 143250801 124567864 81086592
56341 81086592 41713926 13205949 -3292799 -7497009 -13548439 -34209692 -51387940
56334 -51387940 -36215491 1914502 22113955 9871669 -7529773 -7443306 2239877 10010752
56326 10010752 18072997 24218584 20294131 16482147 31270236 49274051 30183170 -26278389
56318 -26278389 -66580967 -54270198 -14070921 15962715 31473843 32577163 -3672771
56311 -3672771 -77536686 -133050332 -122221674 -74197066 -48830305 -47835575 -31048722
56304 -31048722 -1030104 -2141803 -37496314 -54766350 -28906716 -525240 -8217517
56297 -8217517 -30503855 -24640092 11487634 44997611 52413672 36370436 14193293
56290A4193293j1388330j167966j1549791k8964284j4470345K6730899K9801396
56283C184872l1677649q1749627m2119452M4847936P5232930L7842520J4495008
56276B0056538L5698171L9741080p568679n0743301m0314291p706737K698045
56269h139174N099994K3148327L1443815M987162k3616979j6642804J374571j0359264
56261G295648l2305193j9170535J6515298K3370399j727850j1355371J2107682
56254e269922L4013839K8881830J1648674k79161j0453665j9248968j6395558
56247B2897069p641266j3312785l1480451l6152620j9728259k630820P579514
56240h0469618K7930368N5538808N1816286O79070m8404199l5856435K2934720
$$ plain form
56290 14193293 2804963 1636997 -9912794 -38877078 -53347423 -26616524 3184872
56283 3184872 -28492777 -110242404 -152361856 -107513920 -32280990 5561530 20056538
56276 20056538 55754709 95495789 87927110 37183809 -3130482 -10837219 -8139174
56269 -8139174 -3039180 20109147 51552962 56540124 32923145 16280341 17654912 7295648
56261 7295648 -25009545 -44180080 -27664782 -4294383 -6022233 -17377604 -5269922
56254 -5269922 28743917 57625747 69274421 68995260 58541595 39292627 22897069
56247 22897069 15255803 1943018 -29537433 -65690053 -85418312 -88049132 -80469618
56240 -80469618 -52539250 2999558 54815844 55494914 7090715 -28765720 -5831000
56233e831000N0014603P547261m8677633m2656374J7354212M7534915L989722
56226B9275706n3996114m6865680J1653077L7542383K302180k9918156o750354
56219e6756958L5970782M2085242K4273868K7229031M1107740K1596134k3288189
56212A12217650l8574276j2564360N513054j2103690l2990167k6718046j0411433
56205a5631268o143309r04078J8926858L2169414J6679557j0333506j8041291
56198A6722377n465361Q436710J6579708J9164126Q503092j3590322k2480361
56191B7869969m677843J1271276r183268n0412484o1354088k4391679K2786416
56184h8091701L9178408K6032670R041085j537511j3032319k4455751k1213561
$$ plain form
56233 -5831000 44183603 51730864 3053231 -39603143 -22248931 25285984 29275706
56226 29275706 -24720408 -71586088 -59933011 -22390628 -20088448 -50006604 -56756958
56219 -56756958 -20786176 21299066 45572934 72801965 113909705 135505839 112217650
56212 112217650 73643374 61079014 66592068 54488378 21498211 -5219835 -15631268
56205 -15631268 -21774577 -22678655 -3751797 28417617 45097174 34763668 16722377
56198 16722377 11257016 19693726 36273434 55437560 63940652 50350330 27869969
56191 27869969 23192126 34463402 25280134 -25132350 -86486438 -110878117 -88091701
56184 -88091701 -48913293 -22880623 -13839538 -15377049 -28409368 -52865119 -74078680
56177g4078680J822832K8105707L8888052L3835545K1079349j178851l2526810
56170A5947144m8733759k5338529J4380860J5423054k7617680m8746174m161274
56163a08846358N4067705N0741621J829717j3537260J9438598L2415412q234410
56156B7875025m5619299k7838259J0117735J0455903j4000668j0257628K4499998
56149b4767193M3919128K8365174N877693R40499O421449Q853475O715533r80489
56141G5345269j7049644l2320207l0036580p946381J7429027K7724663J4509177
56134D7655324j8015472n0110522n5528110k7213673J2432419L5577256L3411808
56127b1790970J1869335j8383281l7733814k4826210J5935851N1190422N6618637
$$ plain form
56177 -74078680 -72255848 -44150141 -5262089 28573456 49652805 48473954 15947144
56170 15947144 -32786615 -58125144 -43744284 -28321230 -55938910 -104685084 -108846358
56163 -108846358 -54778653 -4037032 -2207315 -15744575 3694023 36109435 27875025
56156 27875025 -17744274 -45582533 -35464798 -25008895 -39009563 -49267191 -24767193
56149 -24767193 19151935 47517109 53394802 54335301 60756750 69610225 76325758 75345269
56141 75345269 58295625 25975418 -4061162 -12007543 5421484 33146147 47655324
56134 47655324 29639852 -20470670 -75998780 -103212453 -90780034 -55202778 -21790970
56127 -21790970 -9921635 -28304916 -66038730 -90864940 -74929089 -23738667 32879970
56120C2879970M0082108J6666646j2587824m0472249m2351268j1378950J9423071
56113B261504J7916458n282036k0680032k1246260j2638431R257260L6338082
56106E926545L2849581j4082129n2945836k8618551L1973857N1461139J1296510
56099C7861116l0299815l1371411j4918964r253103J31281K7312631M3049128
56092B2510863J7861748k2619922k8449021M715596L4192452L0360664M243157
56085F2815537k2032198l8967696l8292251r739399L2934779M7301347J2130408
56078D6150527l1200058k2760384L1002034N7887114K0757897k7053563k2931553
56071E1852014R432434L971286l4735523l8322537Q581013L9985903J6749380
$$ plain form
56120 32879970 72962078 89628724 77040900 36568651 -5782617 -17161567 2261504
56113 2261504 20177962 14895926 -5784106 -27030366 -39668797 -30411537 5926545
56106 5926545 38776126 24693997 -28251839 -56870390 -24896533 26564606 37861116
56099 37861116 7561301 -23810110 -38729074 -47982177 -47850896 -20538265 22510863
56092 22510863 40372611 17752689 -10696332 -5980736 28211716 58572380 62815537
56085 62815537 40783339 1815643 -36476608 -46216007 -13281228 34020119 46150527
56078 46150527 14950469 -7809915 23192119 81079233 101837130 74783567 51852014
56071 51852014 61284448 65255734 30520211 -7802326 778687 40764590 57513970
56064E7513970j4435817o599094J4061133Q947059k852094O238294R910967j8764333
56056E4020085m2132585k0136347O418828k1438095o9037752n2006374K5872707
56049a18439533P3478395M9146346P050699j940925P778692J0823233J1438931
56042C9335838Q123961j5626743m4201625l4967098J0940783M1745441L3402076
56035C8752633J4301471J110849k1209138m1289807k0116813K8024253L2325265
56028C1898713k1996237n5173086j2309433N0513078N4351720R564179j9973073
56021C6875861j4285311P21005R218646R679105m364837k4186243j9961582R748080
56013C444724K3285222L182216j1999910R49303N708910k0662727l3842182m04206
$$ plain form
56064 57513970 43078153 36479059 50540192 59487251 56635157 62873451 72784418 54020085
56056 54020085 11887500 -8248847 -1830019 -23268114 -92305866 -144312240 -118439533
56049 -118439533 -44961138 4185208 11235907 9294982 17073674 27896907 39335838
56042 39335838 47459799 31833056 -12368569 -47335667 -36394884 5350557 38752633
56035 38752633 53054104 54164953 32955815 -8333992 -28450805 -426552 31898713
56028 31898713 9902476 -45270610 -57580043 -7066965 47284755 56848934 36875861
56021 36875861 22590550 23311555 32530201 42209306 37844469 13658226 -6303356 3444724
56013 3444724 26729946 29912162 17912252 18861555 24570465 3907738 -29934444 -30338650
56005c0338650L0006638J386440n0594426n3744704j1160812J9592372K3830754
55998g1022388K7473788K6960470J881946k3912851j1660430J8221747J4629015
55991a7428703j7245561k8279751q358172J3044758K9879661N0384149M7417741
55984F9414122j462883m5365601k0697730L6074505L4263510k1586541l6314175
55977A4325207J6164111N1501373J8949712k2588736j5751825O213849l152155
55970F5661536k0620433q754702J3619119J5111447Q638866J1864253M599558
55963I0119644k4565946m1533452k5199705j0327424k2525651k4623946J5468354
55956d3188126N4038477L3793742k1932804m2651225j1045851K9380294M4415208
$$ plain form
56005 -30338650 -332012 1054428 -49539998 -103284702 -114445514 -94853142 -71022388
55998 -71022388 -43548600 -16588130 -14706184 -38619035 -50279465 -32057718 -17428703
55991 -17428703 -34674264 -62954015 -71312187 -58267429 -28387768 21996381 69414122
55984 69414122 67951239 22585638 1887908 37962413 72225923 50639382 14325207
55977 14325207 30489318 81990691 100940403 78351667 62599842 68813691 65661536
55970 65661536 45041103 36286401 49905520 65016967 73655833 85520086 90119644
55963 90119644 65553698 24020246 -1179459 -11506883 -34032534 -58656480 -43188126
55956 -43188126 10850351 44644093 22711289 -19939936 -30985787 -1605493 42809715
55949D2809715L2596042r77731m2257084n6349190k5914749J2813746J4756337
55942b2522914r538974j5321545P322649K7992130K6363015R206257j1816133
55935A1684485k5681366j7846228R435041K7036457J5112065r232836k2683825
55928a2176207k7233471k6982607q356785K5359453L7174642J1290322j2944016
55921a3868669k558227J4828996N740233m697358J7200275L9794281J3786429
55914G0225960l5918201m2133737r06121K9130797K0983912J087587j3868451
55907B8601746k9939795l1975974Q20000L8103588K8842988j3338341k7971901
55900f857689p835336k057409j9396868j6078746J1106760J2092303j7158840
$$ plain form
55949 42809715 75405757 74428026 32170942 -24178248 -50092997 -37279251 -22522914
55942 -22522914 -32061888 -47383433 -40060784 -12068654 14294361 23500618 11684485
55935 11684485 -13996881 -31843109 -22408068 4628389 19740454 10507618 -12176207
55928 -12176207 -39409678 -66392285 -74749070 -49389617 -12214975 -924653 -13868669
55921 -13868669 -16426896 -1597900 4142333 -555025 16645250 56439531 70225960
55914 70225960 34307759 -7825978 -8732099 20398698 41382610 42470197 28601746
55907 28601746 -1338049 -33314023 -32494023 5609565 34452553 21114212 -6857689
55900 -6857689 -14693025 -16750434 -36147302 -52226048 -41119288 -29026985 -46185825
55893d6185825j7009339K5555944M4370715J0015726j8333405n522609n011532
55886a2120325m6034758n6235005J4754933Q2812124M8791884l7228354n0725030
55879e5984531J4294079N2396446K2729971r372716o714097j3434294m9774549
55872d5859691o2265991k0776051K3376672K3570420P851149J3733205J9611184
55865d0759103k454484k0862724M638652M4488611L7254218j4017745m3782192
55858c5494767j7856301K5368918L4789720R653771j2215102p144681R587514
55851F689072O744327k1927587m4520478k6592344K1927104N1850776L2795012
55844B6965882j0529802l1732260j8551346R90318J169629j0382804q615188J1253984
$$ plain form
55893 -46185825 -63195164 -37639220 6731495 16747221 -1586184 -7108793 -12120325
55886 -12120325 -58155083 -114390088 -99635155 -16823031 31968853 -5259501 -55984531
55879 -55984531 -41690452 10705994 33435965 24063249 17349152 3914858 -45859691
55872 -45859691 -108125682 -128901733 -105525061 -81954641 -74103492 -60370287 -40759103
55865 -40759103 -43213587 -64076311 -59437659 -14949048 22305170 8287425 -35494767
55858 -35494767 -53351068 -27982150 6807570 16461341 4246239 -2898442 6689072
55851 6689072 13433399 -8494188 -53014666 -79607010 -57679906 -5829130 26965882
55844 26965882 16436080 -15296180 -33847526 -32857208 -31687579 -42070383 -50685571 -39431587
55836c9431587K3874860Q390777j5303018o390400L5733506N8333033K5123279
55829I0330450k6576886l4616229k38943J9312358N05675j8055765o907182Q217987
55821C1971465k298717j9447557j0138021J8865447L8925060M5367245M7123681
55814A50368603L2689758j0651048n6852096o3788721l1794246j104566O640962
55807B5508646N083062J047930j8954683m6831599m1120792J3970265O8739537
55800G442366O3535400P489314l5124183l1022373j1960435j5400566k8160888
55793d3201365j4554588K3162074M7872170M3565531L0999176K2115788k236608
55786A07722178m7268108p1147555l5433537L0432282N9111734L3721452J475946
$$ plain form
55836 -39431587 -15556727 -7165950 -22468968 -28859368 6874138 65207171 90330450
55829 90330450 63753564 29137335 28898392 48210750 48716425 30660660 23753478 31971465
55821 31971465 29672748 10225191 87170 18952617 57877677 103244922 150368603
55814 150368603 183058361 172407313 115555217 51766496 19972250 18867684 25508646
55807 25508646 30591708 31639638 12684955 -34146644 -75267436 -61297171 7442366
55800 7442366 70977766 78467080 43342897 12320524 360089 -15040477 -43201365
55793 -43201365 -57755953 -34593879 13278291 56843822 87842998 109958786 107722178
55786 107722178 60454070 -10693485 -46127022 -15694740 43416994 77138446 78614392
55779G8614392l198340p38900j6042162l2514864k6101000q959354m276914n522791
55771a8739933K550152O241713j2383741l0483070r805193L9441542O3726690
55764D0548160L7173727j0054504l8353058l9039436k2811675j967144O986266
55757b7517664n774491k0220218m785053L1973432M1760244N018282l4733082
55750a4278550l0335353L584102J7157301j951921j9236610j0310369Q214718
55743d7156682J1273477J665120j314600N635246P150996l090775q258864P851238
55735b6244844L1205614L0121406M95675k2546962j2086493J1592463J3137813
55728B5674672l721668p965023K614812q68669k2920765l0549104q581260J4496445
$$ plain form
55779 78614392 75416052 74677152 58634990 26120126 19126 -8940228 -13217142 -18739933
55771 -18739933 -16189781 -9948068 -22331809 -52814879 -62620072 -23178530 40548160
55764 40548160 77721887 67667383 29314325 -9725111 -32536786 -34503930 -27517664
55757 -27517664 -33292155 -53512373 -58297426 -26323994 15436250 20454532 -14278550
55750 -14278550 -44613903 -41029801 -23872500 -25824421 -45061031 -55371400 -47156682
55743 -47156682 -35883205 -34218085 -35532685 -29897439 -22746443 -25837218 -34096082 -26244844
55735 -26244844 4960770 35082176 35577851 13030889 944396 12536859 25674672
55728 25674672 21953004 13987981 16602793 15734124 -7186641 -37735745 -46317005 -31820560
55720c1820560J6492105J5775339K7274093K5112134j0582273m3567547k8016469
55713b9333178J7415556L4998855J3533380p091174j0711846k2864580m5885584
55706d9938571l8405729J3441669N6288631M0226267p447140k2011306R057784
$$ plain form
55720 -31820560 -15328455 446884 27720977 52833111 42250838 -1316709 -29333178
55713 -29333178 -11917622 23081233 36614613 29523439 18811593 -4052987 -49938571
55706 -49938571 -88344300 -74902631 -18614000 21612267 14165127 -7846179 1211605
$$ [...]
##END NTUPLES=NMR SPECTRUM
##END=
