##TITLE=31Pdec_SR145_rm1d
  124 sc
 27.9.2022
##JCAMPDX= 6.0         $$ Bruker NMR JCAMP-DX V2.0
##DATA TYPE= NMR SPECTRUM
##DATA CLASS= NTUPLES
##ORIGIN= UXNMR, Bruker Analytische Messtechnik GmbH
##OWNER= root
$$ XWIN-NMR		Version 3.5
$$ Wed Sep 28 14:28:15 2022 Russian Standard Time (UT+4h)  she@DPX200
##.OBSERVE FREQUENCY= 81.013821
##.OBSERVE NUCLEUS= ^31P
##.ACQUISITION MODE= SIMULTANEOUS
##.ACQUISITION SCHEME= undefined
##.AVERAGES= 124
##.DIGITISER RES= 16
##SPECTROMETER/DATA SYSTEM= spect
##.PULSE SEQUENCE= zgpg30
##.SOLVENT NAME= DMSO
##.SHIFT REFERENCE= (INTERNAL, DMSO, 0, 248.564)
##AUDIT TRAIL= $$ (NUMBER, WHEN, WHO, WHERE, WHAT)
$$ ##TITLE= Audit trail, XWIN-NMR		Version 3.5
$$ ##JCAMPDX= 5.01
$$ ##ORIGIN= Bruker BioSpin GmbH
$$ ##OWNER= she
$$ F:/spectra/data/she/nmr/P31/1/pdata/1/auditp.txt
$$ ##AUDIT TRAIL=  $$ (NUMBER, WHEN, WHO, WHERE, WHAT)
(   1,<2022-09-28 14:27:09.96 +0400>,<she>,<DPX200>,
      <continue with go, POWCHK disabled, PULCHK disabled
       configuration hash MD5:
       00 E9 B6 7A A2 85 ED C7 34 08 36 98 17 FE 4E 26
       data hash MD5: 32K
       73 70 C8 7F 18 D6 40 8B 9E 58 F2 64 17 B1 EF B7>)
(   2,<2022-09-28 14:27:22.87 +0400>,<she>,<DPX200>,
      <Start of raw data processing
       efp BC_mod = 2 LB = 1 FT_mod = 6 PKNL = 1 PHC0 = -10281.2 PHC1 = 80.25658 SI = 64K 
       data hash MD5: 64K
       DF C4 02 A8 A8 17 2D 13 A2 1F 9A 38 6B 83 42 D9>)
(   3,<2022-09-28 14:27:39.20 +0400>,<she>,<DPX200>,
      <pk PHC0 = -5.819635 PHC1 = 0 
       data hash MD5: 64K
       1A 2C 5B 85 2D DC 39 6C 08 68 79 33 1A D6 DC 11>)
(   4,<2022-09-28 14:27:43.96 +0400>,<she>,<DPX200>,
      <abs ABSG = 5 
       data hash MD5: 64K
       B1 8F B6 8A 8E 1D BC 3B A5 83 8B 40 30 26 2D AA>)
$$ ##END=
$$ 
$$ hash MD5
$$ 1F 1A 01 BF AD 1B A2 9D 02 9F 0C E9 03 61 F0 46
##$RELAX= 
##$RELAX= 
##$RELAX= 
##$RELAX= 
##$RELAX= 
##$RELAX= 
##$RELAX= 
##$RELAX= 
##$RELAX= 
$$ Bruker specific parameters
$$ --------------------------
##$DU= <F:/spectra>
##$EXPNO= 1
##$NAME= <P31>
##$PROCNO= 1
##$TYPE= <nmr>
##$USER= <she>
##$AMP= (0..31)
100 100 100 100 100 100 100 100 100 100 100 100 100 100 100 100 100 100 
100 100 100 100 100 100 100 100 100 100 100 100 100 100 
##$AQSEQ= 0
##$AQ_mod= 1
##$AUNM= <au_zg>
##$AUTOPOS= <>
##$BF1= 81.014009
##$BF2= 200.13
##$BF3= 200.13
##$BF4= 200.13
##$BF5= 200.13
##$BF6= 200.13
##$BF7= 200.13
##$BF8= 200.13
##$BYTORDA= 1
##$CFDGTYP= 0
##$CFRGTYP= 5
##$CHEMSTR= <none>
##$CNST= (0..31)
1 1 145 1 1 1 1 1 1 1 1 1 1 1 1 1 1 1 1 1 1 1 1 1 1 1 1 1 1 1 1 1 
##$CPDPRG= <waltz16>
##$CPDPRG1= <>
##$CPDPRG2= <waltz16>
##$CPDPRG3= <>
##$CPDPRG4= <mlev>
##$CPDPRG5= <mlev>
##$CPDPRG6= <mlev>
##$CPDPRG7= <mlev>
##$CPDPRG8= <mlev>
##$CPDPRGB= <>
##$CPDPRGT= <>
##$D= (0..31)
0 1 0 0 0 0 0 0 0 0 0 0.03 2e-05 3e-06 0 0 0 0 0 0 0 0 0 0 0 0 0 0 0 0 
0 0 
##$DATE= 1664360628
##$DBL= (0..7)
120 120 120 11 120 120 24 19 
##$DBP= (0..7)
150 150 150 150 150 150 150 150 
##$DBP07= 0
##$DBPNAM0= <>
##$DBPNAM1= <>
$$ [...]
##$SUBNAM3= <"">
##$SUBNAM4= <"">
##$SUBNAM5= <"">
##$SUBNAM6= <"">
##$SUBNAM7= <"">
##$SUBNAM8= <"">
##$SUBNAM9= <"">
##$SW= 501.771253377433
##$SWIBOX= (0..15)
0 1 3 0 0 0 0 0 0 0 0 0 0 0 0 0 
##$SW_h= 40650.406504065
##$TD= 32768
##$TD0= 1
##$TE= 0
##$TE2= 300
##$TE3= 300
##$TEG= 300
##$TL= (0..7)
0 120 53 12 22 120 120 120 
##$TP= (0..7)
150 150 150 150 150 150 150 150 
##$TP07= 0
##$TPNAME0= <>
##$TPNAME1= <>
##$TPNAME2= <>
##$TPNAME3= <>
##$TPNAME4= <>
##$TPNAME5= <>
##$TPNAME6= <>
##$TPNAME7= <>
##$TPOAL= (0..7)
0.5 0.5 0.5 0.5 0.5 0.5 0.5 0.5 
##$TPOFFS= (0..7)
0 0 0 0 0 0 0 0 
##$TUNHIN= 0
##$TUNHOUT= 0
##$TUNXOUT= 0
##$USERA1= <user>
##$USERA2= <user>
##$USERA3= <user>
##$USERA4= <user>
##$USERA5= <user>
##$V9= 5
##$VALIST= <valist>
##$VCLIST= <CCCCCCCCCCCCCCC>
##$VD= 0
##$VDLIST= <DDDDDDDDDDDDDDD>
##$VPLIST= <PPPPPPPPPPPPPPP>
##$VTLIST= <TTTTTTTTTTTTTTT>
##$WBST= 1024
##$WBSW= 4
##$XGAIN= (0..3)
0 0 0 0 
##$XL= 0
##$YL= 0
##$YMAX_a= 19823
##$YMIN_a= -28577
##$ZGOPTNS= <>
##$ZL1= 120
##$ZL2= 120
##$ZL3= 120
##$ZL4= 120
##$ABSF1= 248.5645
##$ABSF2= -253.2056
##$ABSG= 5
##$ABSL= 3
##$ALPHA= 0
##$AQORDER= 0
##$ASSFAC= 0
##$ASSFACI= 0
##$ASSFACX= 0
##$ASSWID= 0
##$AUNMP= <proc_1d>
##$AZFE= 0.1
##$AZFW= 0.5
##$BCFW= 0
##$BC_mod= 2
##$BYTORDP= 0
##$COROFFS= 0
##$CY= -3
##$DATMOD= 1
##$DC= 0
##$DFILT= <>
##$DTYPP= 0
##$F1P= 0
##$F2P= 0
##$FCOR= 1
##$FTSIZE= 65536
##$FT_mod= 6
##$GAMMA= 0
##$GB= 0
##$INTBC= 1
##$INTSCL= 6.834604e-11
##$ISEN= 30
##$LB= 1
##$LEV0= 0
##$LPBIN= 0
##$MAXI= 10000
##$MC2= 0
##$MEAN= 0
##$ME_mod= 0
##$MI= 50
##$NCOEF= 0
##$NC_proc= -9
##$NLEV= 6
##$NOISF1= 182.463
##$NOISF2= 159.3651
##$NSP= 0
##$NTH_PI= 0
##$NZP= 0
##$OFFSET= 248.5645
##$PC= 4
##$PHC0= -10287.02
##$PHC1= 80.25658
##$PH_mod= 1
##$PKNL= yes
##$PPARMOD= 0
##$PSCAL= 0
##$PSIGN= 0
##$REVERSE= no
##$SF= 81.0140089999694
##$SI= 65536
##$SIGF1= 159.3651
##$SIGF2= -187.1042
##$SINO= 113.3802
##$SIOLD= 16384
##$SREGLST= <1H.CDCl3>
##$SSB= 0
##$STSI= 65536
##$STSR= 0
##$SW_p= 40650.406504065
##$SYMM= 0
##$S_DEV= 0
##$TDeff= 32768
##$TDoff= 0
##$TI= <>
##$TILT= no
##$TM1= 0
##$TM2= 0
##$TOPLEV= 0
##$USERP1= <user>
##$USERP2= <user>
##$USERP3= <user>
##$USERP4= <user>
##$USERP5= <user>
##$WDW= 1
##$XDIM= 65536
##$YMAX_p= 479890889
##$YMIN_p= -199876725
$$ End of Bruker specific parameters
$$ ---------------------------------
##NTUPLES= NMR SPECTRUM
##VAR_NAME=  FREQUENCY,     SPECTRUM/REAL,   SPECTRUM/IMAG
##SYMBOL=    X,             R,               I
##VAR_TYPE=  INDEPENDENT,   DEPENDENT,       DEPENDENT
##VAR_FORM=  AFFN,          ASDF,            ASDF
##VAR_DIM=   65536,         65536,           65536
##UNITS=     HZ,            ARBITRARY UNITS, ARBITRARY UNITS
##FACTOR=    0.620285442955139, 1,           1
##FIRST=     20137.2065510682, 0,            0
##LAST=      -20513.1999529968, 0,           0
##MIN=       -20513.1999529968, -199876725,  0
##MAX=       20137.2065510682, 479890889,    0
$$ Real data points
##PAGE= N=1
##DATA TABLE= (X++(R..R)), XYDATA
$$ [...]
42904C7103060m538555j2798234j5215959p978831K60314K301528K822908O032385
42896G988616P278113N081836N739126Q194347K380118q908954p631246Q208823
42888B8330779J3658972n780296k7243925k2610804L39696J3295782R797853N401262
42880A5189319M828516k136826j3785334j2726019N310076J9926274J2724652
42873B9330658q409585k1171868j6209959l456280M911653Q760768J4222397J8925751
42865B6903535J2339641o249242k0132160j5151077M61547Q983591Q694706R649134
42857B5499675J0335113R04370j2366828j1175047L461402R652636K34019o633281
42849A9912059j295258P32910j0529073j8882271r621209N775169J1329334J0838829
$$ y = [37103060, 32564505, 19766271, 4550312, -3428519, -3168205, -866677, 1956231, 7988616, 15266729, 20348565, 26087691, 34282038, 36662156, 27753202, 20121956, 28330779, 41989751, 36209455, 8965530, -13645274, -13305578, -9796, 9788057, 15189319, 20017835, 17881009, 4095675, -8630344, -3320268, 16606006, 29330658, 20921073, -250795, -16460754, -19917034, -15005381, -6244613, 7977784, 26903535, 39243176, 32993934, 12861774, -2289303, -1827756, 7155835, 15850541, 25499675, 35834788, 36739158, 24372330, 13197283, 16658685, 26311321, 26545340, 19912059, 18616801, 19349711, 8820638, -10061633, -19682842, -13907673, -2578339, 8260490]
42841H260490J1148771L498981j6148307k8484049j6786323N523878J6261165
42834a6725394J6640360J9004533J9802486J0212698j620461m525005o311101
42827C6478116j7178481k6154207j9382470o043648J21731P025053K2645870K7379532
42819B4891496L909228k2906852j7076362J0768862K0334049O458186l67666P033028
42811C3043969M246344j1753909j3406450L655328Q144158r127464j3809262J1983310
42803A2976024L3144116J5967745j8444059k9711841j7131063p387397o725041
42796a7311516j555230Q925872J3730892J3077284J2848450O851610r610029k0035732
42788F921601q088628J0829643Q208387j3210341k2850499q631090Q416802R348229
$$ y = [8260490, 19409261, 22908242, 6759935, -21724114, -38510437, -32986559, -16725394, -85034, 18919499, 38721985, 48934683, 47314222, 42789217, 36478116, 19299635, -6854572, -26237042, -32280690, -32158959, -25133906, -2488036, 24891496, 28800724, 5893872, -11182490, -413628, 19920421, 26378607, 26010941, 33043969, 37290313, 25536404, 12129954, 15785282, 23929440, 14801976, 992714, 12976024, 46120140, 62087885, 43643826, 13931985, -3199078, -10586475, -17311516, -18866746, -9940874, 3790018, 16867302, 29715752, 36567362, 26957333, 6921601, -1167027, 9662616, 17871003, 4660662, -18189837, -26820927, -18404125, -9055896]
42780i055896J529179l57389L317084M477330K133636n41515l426516n088022
42772g012109N80812J5312013K9466757L0784514J7376913j698386j5928874k0764211
42764D8117429j8561096j5040549j3515386j1414089l872444Q797679J9063207
42757A3574751J8757147P279893p136037j4548514j2272033o638409n134438p564372
42749a3682012o768576K172630J5417968K3374508J9219332M958263r601970j4238683
42741B0851460o071543Q976002K0934876K1608001R707792n606063j0290644j622666
42733E8487215M834942n359367k2511569k4103880q523057K039558k683848m657991
42725b477997J0470481K5963547J8467656n373197j9195057j3698071j471153
$$ y = [-9055896, -7526717, -7884106, -4567022, -89692, 2043944, 1502429, -1924087, -7012109, -6431297, 8880716, 38347473, 69131987, 86508900, 84810514, 68881640, 48117429, 29556333, 14515784, 1000398, -10413691, -14286135, -5488456, 13574751, 32331898, 39611791, 32475754, 17927240, 5655207, -983202, -6117640, -13682012, -20450588, -18277958, -2859990, 20514518, 39733850, 44692113, 35090143, 20851460, 14779917, 23755919, 44690795, 66298796, 76006588, 70400525, 60109881, 58487215, 63322157, 57962790, 35451221, 11347341, 2824284, 4863842, 2179994, -2477997, 7992484, 33956031, 52423687, 47050490, 27855433, 14157362, 12686209]
42718A2686209O878536R747618M605651o703428q810011P619029K2763840J0374725
42710E9162169j9684083l0742321j1951175R179877J2362416J0424044J6796300
42703D5547227J7678136j432346k3471485j9898114P799996K8709148K0754138
42696G5686700p020298k8486109k6383659n752273J2466666J2757640O03936p931940
42688B5940663q427379q326555p959559R38970J5304937J8215004L799075j1569881
42680B7915275j2111345k561122L973655M887161M796533M743379M376739N608040
42672D1628315O652980J912163o649953r153394l921779j144388n057384p039537
42664A7227023l068244j957427p350483q150445J543708Q923290K842051o690002
$$ y = [12686209, 19564745, 29312363, 33918014, 27214586, 18404575, 26023604, 48787444, 59162169, 39478086, 8735765, -3215410, 5964467, 18326883, 28750927, 45547227, 63225363, 61793017, 38321532, 18423418, 26223414, 54932562, 75686700, 68666402, 40180293, 13796634, 8044361, 20511027, 33268667, 33872603, 25940663, 17513284, 9186729, 1227170, 2166140, 17471077, 35686081, 39485156, 27915275, 15803930, 13242808, 17216463, 22103624, 26900157, 31643536, 36020275, 41628315, 48281295, 50193458, 43543505, 34390111, 30468332, 29323944, 24266560, 17227023, 14158779, 12201352, 4850869, -3299576, -1755868, 7167422, 10009473, 3319471]
42656C319471n206328K357057J957801m720112m026513O100698J2916852P660223
42648B0359149m924271j4602617j4059075k339095J1906486J4913487L845090
42641A5099154o311424n46872J5691561K2865390J1708754o842828j5613186r566522
42633B6484027P41743K734742k374906k437097M171265Q96841k0963408l9259704
42625c0006497k5646914J1049343L1787737J9700607j105689n762745L25647L195134
42617C536623N743318J2639891J3154662J061014p754218p44046N818164p400997
42609B6054411k6290765k1638200N008807K3223157J7963392M356694k111848
42602B6565648m060286o031498k955077O036664R761950J713410p253120l338787
$$ y = [3319471, -1886857, 470200, 2428001, -2292111, -6318624, -217926, 12698926, 20359149, 15434878, 832261, -13226814, -15565909, -3659423, 11254064, 15099154, 8787730, 8240858, 23932419, 46797809, 58506563, 51663735, 36050549, 26484027, 27225770, 29960512, 27585606, 25148509, 29319774, 30216615, 9253207, -30006497, -55653411, -44604068, -12816331, 6884276, 5778587, 15842, 341489, 3536623, 9279941, 21919832, 35074494, 36135508, 28381290, 27637244, 33455408, 26054411, -236354, -21874554, -16865747, 6357410, 24320802, 28677496, 26565648, 22505362, 16473864, 13518787, 19555451, 29317401, 31030811, 23777691, 20438904]
42594B0438904J0124859J6290905O390020r057883j3282725n076508r54098j1240719
42586A3632755k2006083j3365637R129290K0034624J1311905J908100L835848
42579B4480802L129147j1314845k2863365j2623643P299464J0997260j283774
42572b178954n742404O804160J8948223J4344768j230911j1101077q074866O93630
42564A2462569L727859j126188l175644N785729J5227959Q442581r048585j3507726
42556A8788554L98252J0744789N140955n42182M595614L370864j5674327k7744765
42548i22246o585819K9139071L7990624J2633276j6316824k4414873j3164231
42541A8358978N514722J7547021Q585548j6471220k7168899o913537J6607123
$$ y = [20438904, 30563763, 46854668, 53244688, 44186805, 30904080, 25827572, 24873474, 13632755, -8373328, -21738965, -12609675, 7424949, 18736854, 20644954, 24480802, 27609949, 16295104, -6568261, -19191904, -11892440, -895180, -2178954, -7921358, -1117198, 17831025, 32175793, 30944882, 19843805, 11768939, 12462569, 16190428, 15064240, 11888596, 17674325, 32902284, 41344865, 32296280, 18788554, 19186806, 29931595, 35072550, 34530368, 39125982, 42496846, 26822519, -922246, -7508065, 21631006, 59621630, 72254906, 55938082, 31523209, 18358978, 23873700, 41420721, 50006269, 33535049, 6366150, -547387, 16059736]
42534A6059736J0828477r906455j0096450N939848N168213j2450684j4760754
42527i218069K560094R743723R49066M751670K5582490K8590880K027908j6573855
42519D8413907k355323J5960348P958623q747281o253783M255588K32450p606786
42511E1857743k74058P044156q102323k7257727j6297311J4616005K2559643k138149
42503D2007979k4558051k0496775m094866M997164P329466P454596J448120p978976
42495F108657p519294M263784R975573k16595j1664612o214519J1941631K2334290
42487B9008915J3268267o865059j9690976j4475789K509562J6141234J9758938
42480C9655092J8231908J3018184k172133k3060618k8411074q101528J5643160
$$ y = [16059736, 26888213, 16981758, 6885308, 12825156, 17993369, 5542685, -9218069, -6657975, 3085748, 4034814, 8786484, 34368974, 62959854, 64987762, 48413907, 46058584, 62018932, 69977555, 61230274, 54976491, 59232079, 59464529, 51857743, 51583685, 58627841, 50525518, 23267791, 6970480, 21586485, 44146128, 42007979, 17449928, -3046847, -7141713, -2144549, 5184917, 12639513, 14087633, 6108657, -1410637, 2853147, 12828720, 12612125, 947513, -5267006, 6674625, 29008915, 42277182, 35412123, 15721147, 1245358, 3754920, 19896154, 39655092, 57887000, 70905184, 68733051, 45672433, 17261359, 9159831, 24802991]
42473B4802991J6020412O48279k367657Q600124O231330j7760586l3067976j4031105
42465a0924188K0776963L2588890J2477150j2784854j8459257p355129K074483
42458A8394058n76104r634461j1983198r12240J5944999K3057660J3720028k147717
42450D5863025j0220963q392685n631842o534352n245339K770972J0149479O054942
42442B8813237p221706j4572010p374049M800882P557084J130037k419394J248421
42434A1962502L203534k908818j0175763r326624k340715K254062K531618M020678
42426g79526R728772J5321148J3936216L506712r073059j1696756o33916J0297943
42418C0607534M261498j3017190j6120751M457576K4854336J9541031l150566
$$ y = [24802991, 40823403, 41471682, 39104025, 47704149, 53935479, 36174893, 3106917, -10924188, 9852775, 42441665, 54918815, 42133961, 23674704, 16319575, 18394058, 17817954, 8183493, -3799705, -4711945, 11233054, 34290714, 48010742, 45863025, 35642062, 27249377, 21617535, 15083183, 9837844, 12608816, 22758295, 28813237, 21591531, 7019521, -354528, 4446354, 12003438, 13133475, 10714081, 11962502, 15166036, 12257218, 2081455, -7245169, -9585884, -7331822, -4800204, -779526, 8949246, 24270394, 38206610, 41713322, 32640263, 20943507, 20309591, 30607534, 34869032, 21851842, 5731091, 10188667, 35043003, 54584034, 51433468]
42411E1433468j6506925j5938586j8542995k6077671j8350049R575950L1424592
42404b982216K6041441P345774p05338K4442o019838j5351828j2532793j221521
42396e401877J337261k445627O368174K5008378K6727881N713090q885361l43622
42388D8078297O569309j0701153k8865786j4303867J8423984K5493164J567629
42381D6261577j4865712l831988J1390967J0348544N186368P628811L518147j5208122
42373E0428592k4244144k944271K5977632K5153428l254541k3144231j6325333
42366C1647132m5104M927911r94101n607879j468507R086678J5024027N850966
42358E8421123j2261295j8770133o595210O013185M051629j037100N118063J1347049
$$ y = [51433468, 34926543, 18987957, 444962, -25632709, -43982758, -34406808, -2982216, 23059225, 30404999, 29699661, 29724103, 23704265, 8352437, -4180356, -5401877, -4064616, -6510243, -142069, 24866309, 51594190, 57307280, 48421919, 48078297, 54647606, 43946453, 15080667, 776800, 19200784, 44693948, 46261577, 31395865, 27563877, 38954844, 49303388, 54489756, 62118567, 65636714, 50428592, 26184448, 23240177, 49217809, 74371237, 71116696, 47972465, 31647132, 31602028, 36529939, 35535838, 29927959, 28459452, 37546130, 52570157, 58421123, 46159828, 27389695, 20794485, 26807670, 30859299, 29822199, 34940262, 46287311]
42350D6287311Q24029j5782356j6134233m255386j861651r265910p367676N102428
42342b453444R249592Q90757m076425j195157k904886q751444k106740J6457380
42334E109633K3559038J0392438l245052k945948K68988m215903p837948l465768
42326A7619478K16217j610498L00676P347835N869428n460503p819981L543526
42318B0006178O027485j0650486k0749365l142950K0662585J8753701j784999
42311B9122149r660830J261559R761074N790823O27487J536244K652123J284377
42303D2375006J684480J740188n604402j6264734j6350771k562955J0566452P462338
42295B3045602j0522809k5291478j9103198N257214K3173836J5512876n672232
$$ y = [46287311, 47111340, 31328984, 15194751, 10939365, 9077714, -188196, -7555872, -2453444, 6796148, 7686905, 3610480, 2415323, -489563, -9241007, -11347747, 5109633, 28668671, 39061109, 35816057, 32870109, 33139097, 28923194, 21085246, 17619478, 17835695, 16225197, 16525873, 23873708, 29743136, 24282633, 16462652, 20006178, 26033663, 15383177, -5366188, -8509138, 12153447, 30907148, 29122149, 19461319, 20722878, 30483952, 36274775, 36902262, 38438506, 41090629, 42375006, 44059486, 45799674, 40195272, 23930538, 7579767, 5016812, 15583264, 23045602, 12522793, -12768685, -31871883, -26614669, -3440833, 12072043, 6399811]
42288F399811j2574220K3598J1589622J0671579P910449R728054O379963m279498
42280C5849358q210804k066783j207634q579991o364759O592103M712369j6129403
42272D594456j9763433J0561806L3048379R230317k9598675k8329528O052000
42265a4204678K1296903N821080k988675Q947431J2977914k504064r189480P785795
42257B7942226K1741798J0990240o659420q646329k830242m624881p939792k553805
42249B7419795L119374j121451o969232l813046J739868J07635l035662J153552
42241A8600833Q538685J2127201J4252098J5503028O665134j3391547k5857319
42234C6438113j5133006O460728J4136536M017724n356886k232434K964177m637818
$$ y = [6399811, -6174409, -6150811, 5438811, 16110390, 24020839, 33748893, 40128856, 35849358, 27638554, 25571771, 24364137, 15784146, 9419387, 16011490, 20723859, 4594456, -15168977, -4607171, 28441208, 37671525, 8072850, -20256678, -14204678, 7092225, 12913305, 9924630, 18872061, 31849975, 29345911, 20156431, 27942226, 49684024, 60674264, 54014844, 45368515, 42538273, 37913392, 29973600, 27419795, 30539169, 29417718, 22448486, 18635440, 20375308, 20482943, 17447281, 18600833, 27139518, 39266719, 53518817, 69021845, 75686979, 62295432, 36438113, 21305107, 27765835, 41902371, 45920095, 40563209, 38330775, 41294952, 36657134]
42226C6657134k0612278k4004992m750968J9103878K1677202M700406l760526
42219B9009856Q822660J9546924O647752j4796881j7539836n767470l867757j3093145
42211H962103j3670268m241602k503337p134596K370153K2746158K3363429k459890
42203B7432150k0634801q948684Q704311M436503q781229m132555J1704637J2114956
42195B1895288l019231p535558Q933937K6493259K4636590P316771o105363m467574
42187F8148119M141656K481381j3696218k7152649k1189576m405827K740420J148286
42179A2215592Q886037K4463050K4556279N610643m644262P376594J5226393n081356
42171H8608970l3086539l2823445m984141J8818038K1360775J2407849M535224
$$ y = [36657134, 16044856, -7960136, -12711104, 6392774, 28069976, 32770382, 29009856, 37832516, 57379440, 64027192, 49230311, 31690475, 25923005, 22055248, 8962103, -4708165, -8949767, -11453104, -18587700, -16217547, 6528611, 29892040, 27432150, 6797349, -2151335, 6552976, 10989479, 2208250, -1924305, 9780332, 21895288, 18876057, 11340499, 20274436, 46767695, 71404285, 78721056, 72615693, 68148119, 72289775, 74771156, 61074938, 33922289, 12732713, 8326886, 11067306, 12215592, 21101629, 45564679, 70120958, 75731601, 71087339, 78463933, 93690326, 88608970, 55522431, 22698986, 17714845, 36532883, 57893658, 70301507, 74836731]
42164G4836731Q29686J767343M895495K552865n663390p478029J416206N560004
42156G8716911m579437j2023728n90868J3465085M781467j8299379k4902379q762808
42148B7804864O632164P410440L628443L135334R8770n698264m563908J674482
42140D0122325j237090j1868146r312239J0883943K1228558O28428l0311366l4110070
42132a3975657o118076K2073687K5291511J1013927K09113j031457q08036k535434
42124C4119578n46645O902851J2564205J1724775Q666095O208369j94900r476558
42116F9967770r055186M024195R701649o046182k1090095n910914K5085428K8763830
42108I5440495K95145j8281422o758554L076275j1629005k1346419J556950K6878216
$$ y = [74836731, 75666417, 77433760, 82329255, 84882120, 79218730, 71740701, 73156907, 78716911, 74137474, 62113746, 61522878, 74987963, 79769430, 61470051, 36567672, 27804864, 34437028, 41847468, 45475911, 48611245, 48710015, 43011751, 38447843, 40122325, 38885235, 27017089, 17704850, 28588793, 49817351, 50445779, 20134413, -13975657, -20093733, 1979954, 27271465, 38285392, 38494505, 37463048, 36655012, 34119578, 33572933, 40475784, 53039989, 64764764, 73430859, 79639228, 79444328, 69967770, 60912584, 64936779, 74638428, 68592246, 47502151, 41591237, 66676665, 95440495, 95735640, 77454218, 70695664, 73771939, 62142934, 40796515, 42353465, 69231681]
42100F9231681J3533962j9166161k2640868K81448O143635r176344n956416K1993048
42092E4243985L0177392J84853k4926500r757357J7995975J6001644p542620j5779051
42084F0598321k597560Q112228N150591j848841n968512p069377j221824J1126273
42076F6281299J5798742L825566j1126678j3508397j0711739j5239653j6304672
42069A9014468K811339K8330241K8482628J471067j9059016j2216821L168145
42062E2002051J455633j1850593j3091566J220564R615301j460824j6374427j1034295
42054A0481844J2235322K4304548P698975j7192467j8093342M264903J7941917
42047D1641700P464615m593966M595450K0931141J5636394r339567k4377203j6153773
$$ y = [69231681, 82765643, 63599482, 40958614, 41240062, 47383697, 38207353, 32250937, 54243985, 84421377, 84606230, 59679730, 49922373, 67918348, 83919992, 76377372, 60598321, 58000761, 66112989, 71263580, 69414739, 63446227, 56376850, 55155026, 66281299, 82080041, 85905607, 74778929, 61270532, 50558793, 35319140, 19014468, 21825807, 50156048, 78638676, 80109743, 61050727, 48833906, 52002051, 53457684, 41607091, 28515525, 29736089, 39351390, 37890566, 21516139, 10481844, 22717166, 47021714, 54720689, 37528222, 19434880, 23699783, 41641700, 49106315, 44512349, 49107799, 70038940, 85675334, 76335767, 51958564, 35804791]
42039C5804791k846161j830936m784341M199593K1295770K7921486J5929133m105993
42031I1583342j7467816j8843606j0830360K805461J6827627K1363277Q450418
42024I3888343j4152279k3688049p588269J5413256J3837506j4343942l4211888
42017B9154678j8448156J4614200K4130757L61064k4551709k0003322O860421
42010A2117933K5753043K1299366N409452k460536L380902J3411283J5719925
42003I4631368P573767k997067n372843K370999R599877L433767j4525455k5497238
41995F9217175j4213042R419959J9769728Q681323m391415l264466J22359j0793948
41987G4547673k2445481p844002K5552673L6969225R493779k3744337k6690590
$$ y = [35804791, 32958630, 31127694, 26343353, 30542946, 51838716, 79760202, 95689335, 91583342, 74115526, 55271920, 44441560, 47247021, 64074648, 85437925, 93888343, 79736064, 56048015, 48459746, 63873002, 77710508, 63366566, 29154678, 10706522, 25320722, 49451479, 49812543, 25260834, 5257512, 12117933, 37870976, 59170342, 64579794, 62119258, 65500160, 78911443, 94631368, 102205135, 99208068, 93835225, 96206224, 105806101, 109239868, 94714413, 69217175, 55004133, 64424092, 84193820, 92875143, 88483728, 85219262, 85341621, 74547673, 52102192, 44258190, 69810863, 106780088, 116273867, 92529530, 65838940]
41980F5838940p352360M587874M511862P920295J3897112O975266r651258j4606010
41972G2121721l845353K442637o083383j4593688j0611606l640105m985215p510238
41964B3294770m41324J0311774J2050306N488553J224151K849523N169731M423053
41956F4370537J345270j906696j951275L567930R993323R082688J575352l122567
41948H2954562k828322n526962j1821690j0386487M12205L971595p514161j4772064
41940C4488676l36667J8386988J0941420j8404464l2945114j4763541J2231723
41933I599021J7622999J512005j3977120j4024246j358303J1421437J2048255
41926B2844048M54890o506984N690529K4658965K3607463J162255j4352709q376147
$$ y = [65838940, 58486580, 63074454, 67586316, 75506611, 89403723, 96378989, 86727731, 72121721, 68276368, 70719005, 64635622, 50041934, 39430328, 35790223, 30805008, 23294770, 22853446, 33165220, 45215526, 50704079, 51928230, 54777753, 59947484, 64370537, 65715807, 63809111, 61857836, 65425766, 75419089, 84501777, 86077129, 82954562, 80126240, 74599278, 62777588, 52391101, 52803306, 56774901, 49260740, 34488676, 34152009, 52538997, 63480417, 45075953, 12130839, -2632702, 9599021, 27222020, 28734025, 14756905, 732659, -625644, 10795793, 22844048, 23298938, 16791954, 22482483, 47141448, 70748911, 71911166, 57558457, 49182310]
41918D9182310j212961r975131j7267794l924012J1159575k47482k2958342j6828154
41910a2071991J6671430L1276151O728921k0143915j3173805J1932759K0131480
41903D1351030R928622J932099k106297j2997422k1826128j1112688Q630133R499344
41895B3298693p580248j2146097N754687J8915722P914567q125306m042935J2406889
41887C6395972J6382897M404850n585441l751792J622472M30482o710869j0985779
41879C2202792l665251J3673211K4481462J3309108j0072758j8021208k803539
41872D9103817J1984619Q212145p91658J881092N858432m190921j5320664p661401
41864D9075461N476056l750791k6747547k7039103K30985J9432681J2398561K936514
$$ y = [49182310, 47969349, 37994218, 20726424, 16802412, 27961987, 27714505, 4756163, -12071991, 4599439, 35875590, 42604511, 22460596, 9286791, 21219550, 41351030, 51279652, 53211751, 51105454, 38108032, 16281904, 5169216, 13799349, 23298693, 15718445, 3572348, 9327035, 28242757, 36157324, 28032018, 23989083, 36395972, 52778869, 57183719, 51598278, 47846486, 49468958, 49899440, 43188571, 32202792, 28537541, 42210752, 66692214, 80001322, 69928564, 51907356, 49103817, 61088436, 69300581, 68508923, 70390015, 76248447, 72057526, 56736862, 49075461, 54551517, 50800726, 24053179, -2985924, -2754939, 16677742, 29076303, 32012817]
41856C2012817Q662129J0407827o194403j7160777j085942J8107562Q302071j4967835
41848C8083449j3074856J0841810J7698623k335213j6182117m013537J2413878
41841D3432037R954878k203313n577374j244250J799807M611509Q209444M892842
41833F3875580n490276r073203j801797k37550j2825748k0620021o548405J4336332
41825B1614912J7308604N839267R44466L613047l189100j9490680k4401077r826725
41817g587286P017772J0850875O603064L069541j695241q373182p448143M196560
41809F633960J1360696P32686j5960998j5486998L984461J9571372J5059400J618140
41801B7512719k58243R954826J3738463K007542j0411369n592166J1255580J8560991
$$ y = [32012817, 40674946, 51082773, 44888370, 27727593, 26641651, 44749213, 53051284, 38083449, 25008593, 35850403, 53549026, 51213813, 35031696, 31018159, 43432037, 53386915, 51183602, 45606228, 44361978, 46161785, 50773294, 58982738, 63875580, 58385304, 49312101, 47510304, 47272754, 34447006, 13826985, 7278580, 21614912, 38923516, 44762783, 45707249, 49320296, 46131196, 26640516, 2239439, -7587286, -569514, 10281361, 16884425, 19953966, 18258725, 9885543, 2437400, 6633960, 17994656, 18727342, 2766344, -12720654, -8736193, 10835179, 25894579, 27512719, 27254476, 37209302, 50947765, 52955307, 42543938, 36951772, 48207352, 66768343]
41793F6768343Q095895o321822j1420951j0426215r532988l657900J0867052K0469357
41785F4840771Q845238j7022638l1942534k3399379l457166J0796029J5105488
41778B3765809J3668117R448746M563292K065328K177801J403154k273314o499241
41770D8319692o338309L062457K0207765L0312195J5802441j6888956l4583935
41763E9893350j8071794P247864N190540j7095124k1046816N36762J1876253n386196
41755B3144839k0082242k519121K5951648K6604374L179726q176270M443987J8035829
41747G0582770J5620275M974135l850765j0634213j1956453k710764N745643m482541
41739F3288087k4248111k1829794Q328063K9202813J1615040k1976341k7725550
$$ y = [66768343, 74864238, 68542416, 57121465, 46695250, 37162262, 33504362, 44371414, 64840771, 73686009, 56663371, 24720837, 1321458, -2135708, 8660321, 23765809, 37433926, 46882672, 51445964, 53511292, 55689093, 57092247, 54818933, 48319692, 41981383, 45043840, 65251605, 95563800, 111366241, 94477285, 59893350, 41821556, 49069420, 54259960, 37164836, 16118020, 16654782, 28531035, 23144839, 3062597, 543476, 26495124, 53099498, 56279224, 48102954, 52546941, 70582770, 86203045, 91177180, 87326415, 76692202, 64735749, 62024985, 67770628, 63288087, 39039976, 17210182, 25538245, 54741058, 66356098, 44379757, 16654207]
41732A6654207P74542K9029869K9292861P790335j4223680k5280673k4879808
41725A9157653j5486771j544212J0639907J6968341J6883952J1459012M094521
41718F2172403j80865j768708p920608j8951903j9489092K477142L0630270L2579142
41710G9547781J668121l0134335l0785475n698402J6069382K0701246J6239608
41703F7607926P908122r120930k9175368l0854907n244100K5222149L1602018
41696E7944910J3984975k593165k539486N498996O690312k418148j6546051k8388780
41688C1633563k8635606j1670307J2883402K5222913J8575947P017117L252840
41681E8279869J109872q572337j6737332q306146J0888681J8935961R132071j922616
$$ y = [16654207, 17428749, 46458618, 75751479, 83541814, 69318134, 44037461, 19157653, 3670882, 2126670, 12766577, 29734918, 46618870, 58077882, 62172403, 61991538, 60222830, 52302222, 33350319, 13861227, 16338369, 46968639, 79547781, 81215902, 51081567, 20296092, 14597690, 30667072, 51368318, 67607926, 75516048, 66395118, 37219750, 6364843, 1120743, 26342892, 57944910, 71929885, 69336720, 66797234, 72296230, 78986542, 76568394, 60022343, 31633563, 2997957, -8672350, 4211052, 29433965, 48009912, 55027029, 58279869, 59389741, 50817404, 34080072, 25773926, 36662607, 55598568, 64730639, 62808023]
41673F2808023m71921P627758J2030164J2566198R629635l285814k3757934l2083040
41665D5063069j6991403J950947j35125j3449177o188267K3920792M1269489K3957370
41657I9397695n727773j8822293k0075648k5766830k5078206O37424L3450469
41650C8014838L4844016M952543j4664977m881486M692326j0066316k6344042
41643B6546902j5389019P422956J0302338m09657M661602K2023109J9743785m956299
41635F9945717j7405706k606990J0325036k819104k2860182k0194287J133336
41628A5517820J7137512K0541916J8050266P661718j3482878k8870841j8413632
41621A8141881Q358731J9721384M203627j5677437j7249446o577520l465075j0632694
$$ y = [62808023, 62336102, 69963860, 81994024, 94560222, 104189857, 100904043, 77146109, 45063069, 28071666, 30022613, 29887488, 16438311, 10250044, 34170836, 75440325, 99397695, 93669922, 74847629, 54771981, 29005151, 3926945, 4564369, 38014838, 72858854, 77811397, 63146420, 58264934, 62957260, 52890944, 26546902, 11157883, 18580839, 28883177, 28473520, 33135122, 55158231, 74902016, 69945717, 52540011, 49933021, 60258057, 57438953, 34578771, 14384484, 15517820, 32655332, 53197248, 71247514, 78909232, 65426354, 36555513, 18141881, 26500612, 46221996, 50425623, 34748186, 17498740, 10921220, 7456145, -3176549]
41613c176549j1800290L092295K2618417K7650652J4312604l391927j1841062
41606C7464140j0068137k486128Q895281J7927749J2888606m867689j2491432
41599D7262390M847015K5456609J7205605j3274720k7522498j1710240P371884
41592D9636045R581334Q328395J4878934J2273645r738379k5407279j1003068
41585D8549627J2711639J1798509o237549p895647R077589J4766430j169874j5982183
41577F5618541j4281675p184951n137265k260273M169150N060438j438666m932283
41569C9613016k766386l000787l636826O458442K0804699J6532986q233548k4436905
41561D1334691j2837430Q763369J4660215O668196K227993M216612L086133j656921
$$ y = [-3176549, -14976839, -11884544, 10733873, 38384525, 52697129, 49305202, 37464140, 27396003, 24909875, 33805156, 51732905, 64621511, 59753822, 47262390, 52109405, 77566014, 94771619, 81496899, 53974401, 42264161, 49636045, 59217379, 67545774, 82424708, 94698353, 84959974, 59552695, 48549627, 61261266, 73059775, 66822226, 58926579, 68004168, 82770598, 81600724, 65618541, 51336866, 44151915, 39014650, 36754377, 40923527, 45983965, 44545299, 39613016, 36846630, 33845843, 30209017, 36667459, 57472158, 74005144, 65771596, 41334691, 28497261, 37260630, 51920845, 58589041, 60817034, 65033646, 68119779, 66462858]
41553F6462858j623791L240155K808842p762266j9190570j6271376N279646K8310548
41545F1254046K6521828l763830l1383227k5147545N100527K2243945J2529873
41538F7355617k706906o025459n305098q728707p102737M877711J4046950J1150773
41530F7562144O362250O949279J292040j6764840k8750079j8374134M44038N542152
41522B4262850J306579O795716K0866933K4965738J4084068J486382l704888l570640
41514H6492738K02411O564772P759123q71831q575053m143836K838843m554972
41506H5712195k0990197k4797021j1387221K012179N693841Q230505J3652669
41499E8126950J1169670k748355j2075322m235967R837750J2667688N128387n50894
$$ y = [66462858, 64839067, 68079222, 70888064, 63125798, 43935228, 27663852, 32943498, 61254046, 87775874, 84012044, 52628817, 27481272, 32581799, 54825744, 67355617, 64648711, 58623252, 53318154, 44589447, 37486710, 42364421, 56411371, 67562144, 73924394, 80873673, 82165713, 65400873, 36650794, 18276660, 18720698, 24262850, 25569429, 32365145, 53232078, 78197816, 92281884, 93768266, 90063378, 86492738, 86695149, 93259921, 101019044, 100147213, 91572160, 87428324, 90267167, 85712195, 64721998, 39924977, 28537756, 30549935, 36243776, 44474281, 58126950, 69296620, 66548265, 54472943, 50236976, 60074726, 72742414, 77870801, 77319907]
41491G7319907k949125r111363j5279831r519518M951634Q156312o592451j7669232
41483B9306333n092730J6891923J8278013j703688j3905296n332561L318668k710408
41475C9050254n770880Q818709J9518900M009952j4985928j942352K8491694L1066911
41467A08257260O647183J876988K5476952K7343011j5042790m9855411l0770869
41460G3932324Q510766J1708223j0050783p738754J5330638J2564127j8442043
41453H5814498k7548259L587217L1557225K2040993k764091j0185151n632762
41446I6869670q227909j3728945r955180k510158m73334J636985P536013O723622
41438G7870764l234092n100085P809710J3548262l560710k2501696j6940456J815968
$$ y = [77319907, 74370782, 65259419, 49979588, 40460070, 45411704, 53568016, 46975565, 29306333, 24213603, 41105526, 59383539, 57679851, 43774555, 38441994, 41760662, 39050254, 33279374, 42098083, 61616983, 65626935, 50641007, 48698655, 77190349, 108257260, 114904443, 116781431, 142258383, 169601394, 154558604, 104703193, 73932324, 82443090, 94151313, 84100530, 76361776, 91692414, 104256541, 85814498, 58266239, 61853456, 93410681, 115451674, 112687583, 102502432, 96869670, 88641761, 74912816, 64957636, 62447478, 61974144, 63611129, 71147142, 77870764, 74636672, 69536587, 77346297, 90894559, 87333849, 64832153, 47891697, 49707665]
41430D9707665L594403j1737438j6015749J679000K0929767K3235196J5013998
41423H6406842J1240376J3382304J1139260k725716k2584605l1318047j6141348
41416D9399066J1805834K3678729Q328377j0523737o899894J0205888J3150336
41409I9144599q3346m992462P399307J6384786P164894n395982l655772K919870
41401A18885894m449724j9301966j7078769O579547K6649618K2191340K111756
41394A35587696j0857437r435964l618176r01500J390411M803411L581553m739345
41386A15810649j0712543l312525J3531937K2227728J1346605r726626j9435793
41379A19729432p521632J2428379J7275052J807064j3618862q466025J0119907
$$ y = [49707665, 53302068, 41564630, 25548881, 27227881, 48157648, 71392844, 86406842, 97647218, 111029522, 122168782, 119443066, 96858461, 65540414, 49399066, 61204900, 84883629, 93212006, 82688269, 75788375, 85994263, 99144599, 99061253, 94068791, 101468098, 117852884, 125017778, 119621796, 115966024, 118885894, 114436170, 95134204, 78055435, 84634982, 111284600, 133475940, 135587696, 124730259, 115294295, 111676119, 110774619, 112165030, 116968441, 120549994, 115810649, 105098106, 101785581, 115317518, 137545246, 148891851, 139165225, 119729432, 112207800, 124636179, 141911231, 143718295, 130099433, 121633408, 131753315]
41372A31753315J6309210J806011j2182466o000852J0017697J2208573j093061
41365A52818427r261418j524258R563775J0476723O035606P603924J3765307J4073903
41357B03551989N950714k735781o022444o421986q542260j1988732j2777257q814753
41349A52199490j782038N246225R826937R607827K766774p932532j3559894p042482
41341A49330307O692632J4231755R078985j861523q800635r338402n712971M22033
41333A54042181O300840Q329430P605428O900441L04006k0216522m2693740l8489868
41325H2082196j513061L3468480L2188339O844578m144170P487315J3603383k400359
41317A67616701k2571260k5836546j5579678n008389K593589O661644J831475
$$ y = [131753315, 148062525, 149868536, 137686070, 131685218, 141702915, 153911488, 152818427, 143557009, 142032751, 151596526, 162073249, 168108855, 175712779, 189478086, 203551989, 209502703, 206766922, 200744478, 194322492, 185780232, 173791500, 161014243, 152199490, 150417452, 155663677, 165490614, 175098441, 177865215, 169932683, 156372789, 149330307, 156022939, 170254694, 179333679, 177472156, 168671521, 159333119, 153620148, 154042181, 160343021, 168672451, 176277879, 183178320, 183482326, 163265804, 120572064, 82082196, 80569135, 114037615, 146225954, 153070532, 148926362, 156413677, 170017060, 167616701, 145045441, 119208895, 103629217, 98620828, 101214417, 107876061, 109707536]
41310A09707536q894663r935333M337462J7114849J2232184l491244j3664303
41303A07406488j4781467j1631916l388081R752294J6747711R120495m099609
41296A09125915r898924j0490921j2843046r893704O147929J9753656Q310133
41289A00211038j8343135k3342784M440393L0066321K0791850q072418j8729018
41282H7022247o134471K063316n369869p749790P064672J8296689P420092p123471
41274I5489415J822256K3407484K3932115J683889j0842942k448133j263885k2656118
41266A09124081l7159747j7155555J5418301K2198609O308841q68290N440033
41259A03306273L161228j0436492j4385124m490856J711214K315017J3602209
$$ y = [109707536, 100812873, 90877540, 95215002, 112329851, 124562035, 121070791, 107406488, 92625021, 80993105, 77605024, 87357318, 104105029, 113225524, 109125915, 99226991, 88736070, 75893024, 65999320, 72147249, 91900905, 100211038, 81867903, 58525119, 62965512, 93031833, 113823683, 105751265, 87022247, 80887776, 82951092, 77581223, 69831433, 76896105, 95192794, 102612886, 95489415, 97311671, 120719155, 144651270, 146335159, 135492217, 133044084, 131780199, 109124081, 71964334, 54808779, 70227080, 92425689, 98734530, 97866240, 103306273, 106467501, 96031009, 81645885, 77155029, 78866243, 81181260, 94783469]
41252I4783469L0421964K5196206l416503k1207075j1585898J583338O96534K313114
41244A18785149J6114234J8223264l922338j8664696R36504K8318391K4299265
41237A84089773j197135j1702871n059380n473511j2711482p253451N599358M061388
41229A50352689n558435Q03244J5817478J0232382j0830980j1657970J0926635
41222A60085043K0110209M048245m183307J1618745K0360832N35267j9236428
41215A93338606r572382R278478M310540j4219021j3909861N102018J6054723
41208A90383101J1246405N576583M406366N88505l232331J312301P128099J099079
41200B18508108r964637q055140N221074J1103918M670836m8388M622660J1184440
$$ y = [94783469, 125205433, 150401639, 146985136, 125778061, 114192163, 115775501, 116472035, 118785149, 134899383, 153122647, 149200309, 130535613, 131472117, 159790508, 184089773, 182892638, 171189767, 166130387, 160656876, 147945394, 140691943, 146291301, 150352689, 144794254, 145597498, 161414976, 171647358, 160816378, 149158408, 160085043, 180195252, 184243497, 180060190, 191678935, 212039767, 212575034, 193338606, 183766224, 193044702, 197355242, 183136221, 169226360, 174328378, 190383101, 201629506, 207206089, 211612455, 212200960, 208968629, 210280930, 217409029, 218508108, 208543471, 200488331, 205709405, 216813323, 221484159, 221435771, 226058431, 237242871]
41192B37242871J3940324J5039552J2426004K0924j7584928k5662673j6809859
41185B18612215K689098K1639690K9053873J7608709m769706j5142737k570022
41178B67121120J4766077J6098398Q481023Q546832Q890827o285664k2971112
41171B94647501j3002211J5227495K2611919J05901j7745623j0313518L76934
41164B91908398l963020m751807J3374867K6914844J2198659j0640727r967826
41157C15073388N829130Q866264K740759Q873764J7562860J980754k5364404k1807049
41149C13755466J5121973L5983115J2774559k0227060k1340695M48231J0803514
41142C47319103M057629o78133J580243r92994r781862j3049191p690216l237665
$$ y = [237242871, 251183195, 266222747, 278648751, 278669675, 261084747, 235422074, 218612215, 221301313, 242941003, 271994876, 289603585, 284833879, 269691142, 267121120, 281887197, 297985595, 306466618, 315013450, 323904277, 317618613, 294647501, 281645290, 296872785, 319484704, 319590605, 301844982, 291531464, 291908398, 287945378, 283193571, 296568438, 323483282, 335681941, 325041214, 315073388, 320902518, 329768782, 332509541, 341383305, 358946165, 360926919, 335562515, 313755466, 328877439, 364860554, 377635113, 357408053, 336067358, 336515589, 347319103, 351376732, 350698599, 352278842, 351285848, 341503986, 328454795, 320764579, 317526914]
41134C17526914n148433r004786j0027810p476508k264827J938131K18560m994984
41126B80766257m953608O8536k030452j4678679k2504784j3021486L621901R638013
41118B36905698M179696m39611J184441L581956L5500j2250120k8374427l2698136
41110A72124997j4061819J1298563J3432850o429884j2559880Q330345K0126316
41103A92261488n181568l5831530k6822554P293615J5956092o303165j7362592
41096A24009786k132483P418960m907624j1332752O058111K1181490R965531r077547
41088A41183472r166146K452526N424548J790324K479332K661756k826646k496555
41080A41502611P858458Q296843j1089598k3969094p015006J7727901J5303993
$$ y = [317526914, 312378481, 303373695, 293345885, 285869377, 283604550, 285542681, 285761241, 280766257, 275812649, 275881185, 273850733, 259172054, 236667270, 223645784, 227267685, 236905698, 241085394, 240645783, 241830224, 245412180, 245447680, 233197560, 204823133, 172124997, 158063178, 169361741, 182794591, 176364707, 163804827, 172135172, 192261488, 187079920, 151248390, 124425836, 131719451, 147675543, 141372378, 124009786, 121877303, 129296263, 124388639, 113055887, 119113998, 140295488, 150261019, 141183472, 132017326, 134469852, 139894400, 141684724, 144164056, 146825812, 143999166, 141502611, 149361069, 157657912, 146568314, 122599220, 115584214, 133312115, 148616108]
41073A48616108o423641j2180904L396469J3931110Q815460L237548L655726K27277
41065A63275153n983202k630030N465778O43625j2427683r791208Q692740J4090373
41057A61335546m194007j9403597j0250866P758786J1941278O653577O632192
41050A60472909Q009719l53163j1787838j1053127M08442P856135O101272L053493
41042A62707842M447991P967991R945314Q499783K891690l751446n453765k155998
41034A85099402j424564o569445j0073751m402945O874219J3678956J0048496
41027A93230368j983389j2987272j1129236M202880J5410868O378868j2493520
41020A80629567j6808869n730488k861094j3708277j1776623J5629851L6269740
$$ y = [148616108, 142192467, 130011563, 133408032, 147339142, 156154602, 159392150, 163047876, 163275153, 157291951, 154661921, 160127699, 160771324, 148343641, 138552433, 147245173, 161335546, 157141539, 137737942, 127487076, 135245862, 147187140, 153840717, 160472909, 168482628, 168129465, 156341627, 145288500, 145696942, 153553077, 159654349, 162707842, 167155833, 175123824, 185069138, 193568921, 196460611, 192709165, 187255400, 185099402, 183674838, 177105393, 167031642, 162628697, 169502916, 183181872, 193230368, 191246979, 178259707, 167130471, 171333351, 186744219, 193123087, 180629567, 163820698, 158090210, 155229116, 141520839, 129744216, 145374067, 181643807]
41013A81643807J7051082k1017348k8735483l0922K2200307J2555602m614677
41006A79052368j897154R042997N787983l258847K651922J5268286J0205524p510270
40998B09342809q276148J0510429J5588073p336687k5323747q283471K1237621
40991B07458879K0906827p244455k2937256r983642O497348P303725N266021J2178429
40983B19445876J4232266R00168r550930J326499J8813351J7146705n5042q471893
40975B53787000j450066O890898R395131J0553417Q469770j915957j0530495l147494
40967B72052204J0636746P780052q525348r241945J3349069K8653279J2683014
40960C27387071j5347101k1802638n894359M926072k818016j3268877p259421
$$ y = [181643807, 198694889, 177677541, 148942058, 148911136, 171111443, 183667045, 179052368, 177155214, 186198211, 191986194, 188727347, 191379269, 206647555, 216853079, 209342809, 201066661, 211577090, 227165163, 219828476, 194504729, 186221258, 207458879, 228365706, 221121251, 198183995, 188200353, 194697701, 202001426, 207267447, 219445876, 233678142, 234578310, 225027380, 226353879, 245167230, 262313935, 262258893, 253787000, 252336934, 259227832, 268622963, 279176380, 287646150, 285730193, 275199698, 272052204, 282688950, 290469002, 281943654, 272701709, 286050778, 314704057, 327387071, 312039970, 290237332, 284342973, 289269045, 286451029, 273182152, 265922731]
40953B65922731J2720498K8077971K6543090J4200417O099358P323011Q226890
40946C69113966R64336p409399p263243m003215q755768j6099899r381685J1245397
40938C28410490K4291762J5156466n982210j9355969j6018761l32586J4664794
40931C40833986J3104853p240604k3682225j2185265J6146845K4209656k29254
40924C50957992k6805339k5748211n019883J0326588J3761985J3005917Q117871
40917C38596920l971840j4456643j2346678j813879N765327Q850660J0794274
40910C31418141P767516l095797j2425329j0699537l809052k748038o029580n514176
40902B94864148q34227M430377J0614709J4288379O484871p988275o853106J6049051
$$ y = [265922731, 278643229, 306721200, 333264290, 347464707, 353564065, 360887076, 369113966, 370078302, 362668903, 355405660, 351402445, 342646677, 326546778, 317165093, 328410490, 352702252, 367858718, 361876508, 342520539, 326501778, 326169192, 340833986, 353938839, 346698235, 323016010, 310830745, 326977590, 351187246, 350957992, 324152653, 298404442, 293384559, 303711147, 317473132, 330479049, 338596920, 334625080, 320168437, 307821759, 306007880, 311773207, 320623867, 331418141, 339185657, 336089860, 323664531, 312964994, 309155942, 306407904, 300378324, 294864148, 294029921, 298460298, 309075007, 323363386, 329848257, 321859982, 315006876, 331055927]
40894C31055927L2514090J9143763m000039m425922R377962L713733k0775404
40887C66604110k9195329j2493263k183197j3969750j9682746L270622L1127490
40880C23477937L0949896J0643459K32362L283963J33176j2680312j8819164j3244000
40872C23977317p829339o437054p12865O909527J471941j6281338k3214152p386164
40864B70497873J0826760P303754j0303770j5404426l490181J842218j3675659
40857B47596569l1259684k4640990K299261J9604733J0541563q790292j4315432
40850B01035728n839157k398259j2208931k2233159j9281030q114272j137019
40843A29823901L20604L637645R077251Q714458Q17935o082827o143066l253318
$$ y = [331055927, 363570017, 382713780, 378713741, 374287819, 383665781, 387379514, 366604110, 337408781, 324915518, 322732321, 308762571, 289079825, 292350447, 323477937, 354427833, 365071292, 365303654, 368587617, 368720793, 356040481, 337221317, 323977317, 316147978, 309710924, 308998059, 315907586, 317379527, 301098189, 277884037, 270497873, 281324633, 288628387, 278324617, 262920191, 259430010, 261272228, 247596569, 216336885, 191695895, 193995156, 213599889, 224141452, 215351160, 201035728, 195196571, 192798312, 180589381, 158356222, 139075192, 130960920, 129823901, 130144505, 133782150, 142859401, 151573859, 152391794, 146308967, 140165901, 136912583]
40835A36912583j333899K029176O151546K596102r947114j6475486n744463Q746858
40827A22935303O303938p760804r293823N035713J1985877J622839o062952J646829
40819A26412920N684507r150371k0604926k856900K6272817K9645088R121398
40812A64524533j655349M317115J488806j4989335j8351716l086714m01777k0518742
40804A11326821k5998649O407353L8315663K4400540j7044510l3363047j5252426
40797H8791745J960592J302179J45123O780199O669278k844950l820026O828970
40789A05813110P597798r943016k4080188j7805023m734802m189493j1490720
40782D1167666j0004015K430549J4226361J7113714J1807299M340407K470426
$$ y = [136912583, 135578684, 137607860, 143759406, 146355508, 136408394, 119932908, 114188445, 122935303, 129239241, 121478437, 112184614, 117220327, 129206204, 130829043, 124766091, 126412920, 132097427, 122947056, 102342130, 99485230, 125758047, 155403135, 164524533, 162869184, 167186299, 168675105, 153685770, 135334054, 132247340, 131845563, 111326821, 85328172, 91735525, 130051188, 154451728, 137407218, 104044171, 88791745, 90752337, 92054516, 92199639, 98979838, 105649116, 102804166, 98984140, 105813110, 113410908, 103467892, 79387704, 61582681, 56847879, 52658386, 41167666, 31163651, 33594200, 47820561, 64934275, 76741574, 81081981, 83552407]
40775H3552407P967658J1339075M334391m480140r88142J0502380J2954701M559502
40767A29741832m76696J082977j596109p073335j2814J7000181J9231497k82746
40759A57614787j5343322q009114K720835m018707j3542597k477171J7628325
40752A34573036J7644809n93774q106107L745378J3283947P487041m87873N8875
40744A67605332p32884j0133947j4485764q23224J8799073K2103065O687251j0036331
40736A78982571j5641482j3407996j0363711p608108m598359l124450k635805
40729A21602660J425345R225771J1815560K336404j0762654j1359184K172779
40722A26456681J2734766Q098480j091458K569201J6129524J9742266N626443
$$ y = [83552407, 91520065, 102859140, 107193531, 102713391, 101725249, 112227629, 125182330, 129741832, 129265136, 130348113, 128752004, 121678669, 121665855, 138666036, 157897533, 157614787, 142271465, 134262351, 136983186, 132964479, 119421882, 116944711, 134573036, 152217845, 151624071, 143517964, 147263342, 160547289, 168034330, 167546457, 167605332, 166872448, 156738501, 142252737, 141429513, 160228586, 182331651, 189018902, 178982571, 163341089, 149933093, 139569382, 131961274, 127362915, 124238465, 121602660, 123028005, 132253776, 144069336, 146405740, 135643086, 124283902, 126456681, 139191447, 147289927, 146198469, 148767670, 164897194, 184639460, 190265903]
40715A90265903j1094167j3369523j592892J2679261K1549813K3125236J7486493
40708B39050124P123903k972330q557335n961938P923472K6103459K7067209k281836
40700B87494728l9342077m3771736j0035498K0568710J3946743j2288650j8632957
40693A97939263J8252J5005151J0843367J566465K53141l43735q753314j7379982
40685A99148608j6071219r461838q712294j3562875j2984504j080495J4627300
40678A51902683K1686162J7236438J1567483J4229945J9114439J2407058m017484
40671B44126724j1207284j480377Q000892K593076n145342K774836J7413257J7311129
40663B74386911N356829J981418O822016M72444j4730859j2252233J1220431K2648206
$$ y = [190265903, 179171736, 165802213, 164209321, 176888582, 198438395, 221563631, 239050124, 246174027, 243201697, 234644362, 228682424, 236605896, 262709355, 289776564, 287494728, 248152651, 204380915, 194345417, 214914127, 228860870, 216572220, 197939263, 197957515, 212962666, 223806033, 225372498, 225625639, 225281904, 216528590, 199148608, 183077389, 173615551, 164903257, 151340382, 138355878, 137275383, 151902683, 173588845, 190825283, 202392766, 216622711, 235737150, 248144208, 244126724, 232919440, 231439063, 239439955, 242033031, 236887689, 239662525, 257075782, 274386911, 279743740, 281725158, 288547174, 289019618, 274288759, 262036526, 273256957, 295905163]
40655B95905163M457979j4789856o149906J4151525J6132642O583781J0143222
40648C26434550J9620858R298968j2196387r176810K0190430L5695467J7578880
40641D07445956n022064m952458K764506l993125j3246414m324360J1408199J0257072
40633D00337312j178984R01643J3023706J0008554q744872j4786355L242765K0973388
40625D23777157J5933825j994525j0103586k630060J0986087K1002824J9665103
40618D76636825L254064j8062142k5485941j5234099l872510k936340l863358
40611D10436499K594536Q871158N739949J43120K253397O489725J783838q154395
40603D30157827j0730725l880411M690996J1135818J4539731R302353o448900
$$ y = [295905163, 300363142, 285573286, 279423380, 293574905, 309707547, 316291328, 326434550, 346055408, 355354376, 343157989, 333981179, 354171609, 389867076, 407445956, 402423892, 397471434, 400235940, 396242815, 382996401, 378672041, 390080240, 400337312, 399158328, 400059971, 413083677, 423092231, 414347359, 399561004, 402803769, 423777157, 439710982, 437716457, 427612871, 424982811, 435968898, 456971722, 476636825, 479890889, 461828747, 436342806, 421108707, 417236197, 414299857, 410436499, 413031035, 421902193, 427642142, 427785262, 430038659, 436528384, 438312222, 430157827, 419427102, 415546691, 420237687, 431373505, 445913236, 455215589, 448766689]
40596D48766689k0176074j7918124m438529L471236K14271n728173q342848r026497
40588C86821951p582778k692377k7083o439981j6995899k0221031j4944847j0047436
40580C07870519r681933j0891909j2877906j5568245j2485572M30887J2091389
40573B58887230Q230929o175652j3178936q833915n701275q458831o659926M611632
40565B22721256J4855186J4542815O800712j402361o392553m590589L103815L865753
40557B53504034j2281074l0153297k3600053M812173K2284936J1367565p420497
40550B18513787j0237441k916198j844213k930875P152910K1991342K1693344
40543B51422656L257463j4864462j8109049j1455232q331679j3321552j8643832
$$ y = [448766689, 428590615, 410672491, 406233962, 409705198, 409919469, 404191296, 395848448, 386821951, 379239173, 376546796, 376519713, 370079732, 353083833, 332862802, 317917955, 307870519, 298188586, 287296677, 274418771, 258850526, 246364954, 246795841, 258887230, 267118159, 260942507, 247763571, 238929656, 233228381, 224769550, 218109624, 222721256, 237576442, 252119257, 258919969, 257517608, 251125055, 246534466, 249638281, 253504034, 241222960, 211069663, 187469610, 192281783, 214566719, 225934284, 218513787, 208276346, 205360148, 203515935, 200585060, 207737970, 229729312, 251422656, 254680119, 239815657, 221706608, 210251376, 201919697, 188598145, 169954313]
40536A69954313j4755654l194872M293225K700402K251283J0287182J4492291
40529A86028170K017358j3013198o562906J4042946J6111484p999043k8112096
40522A62512715k2284141l905700R118279J9248055K6762557J6097228j2317376
40515A95231617k7656099j2854860N354711p91259j5724426j1805118K424736
40508A34179302L584427r30742Q367774J8238532L487931k1044088j8673369O117327
40500A33327094J3220637n207669j2797630Q166898K9249986K4584049N984314
40493A96527679n829453q746156l338039J5816630L7250251L3997079M654008
40486B70331999j7211758j0587809N827372R425780N538341N784831N298738J506450
$$ y = [169954313, 155198659, 152003787, 156297012, 158997414, 161248697, 171535879, 186028170, 188045528, 175032330, 168469424, 182512370, 198623854, 190624811, 162512715, 140228574, 136322874, 145441153, 164689208, 191451765, 207548993, 195231617, 167575518, 154720658, 160075369, 159284110, 143559684, 131754566, 134179302, 137763729, 136832987, 145200761, 163439293, 166927224, 145883136, 127209767, 133327094, 146547731, 141340062, 128542432, 136709330, 165959316, 190543365, 196527679, 190698226, 181952070, 178614031, 194430661, 231680912, 265677991, 270331999, 253120241, 242532432, 248359804, 257785584, 263323925, 269108756, 274407494, 275913944]
40478B75913944O412145J9526028J7899028m644940j8486347l803869J4962965
40471C07778954R900380m387789j014412Q902936j917189k3125016k0179710O600784
40463B82558938K0025536L331799j8921294k2469629j2957060n852992l875801
40456B41839497l411387k505800L431614J5727360K0915529N699045j6117456
40449B65578402j6018794O005522J6616522k840279k7514365k3888719M484286
40442B22422575K4467315J6511643o486823j9796847j3191599M256052J7507940
40435B45690256J9219838J1161728l026081j9245541k7412805j6973473M962827
40428B14376749J3533139l378464k5469493k6620898j0974055k288008n644937
$$ y = [275913944, 282326089, 301852117, 319751145, 315106205, 296619858, 292815989, 307778954, 317679334, 313291545, 312277133, 321180069, 319262880, 296137864, 275958154, 282558938, 302584474, 305916273, 286994979, 264525350, 251568290, 245715298, 241839497, 238428110, 235922310, 239353924, 255081284, 275996813, 281695858, 265578402, 249559608, 255565130, 272181652, 269341373, 241827008, 217938289, 222422575, 246889890, 263401533, 256914710, 237117863, 223926264, 228182316, 245690256, 264910094, 276071822, 273045741, 253800200, 226387395, 209413922, 214376749, 227909888, 224531424, 199061931, 172441033, 161466978, 159178970, 153534033]
40421A53534033n556788O76776k625102j6537420j8427941O38389J5010784R41855
40413A27654586k5435154l0445684j0932083N315300K209026o387271l726262
40406E8252458N947103R733749P096445O204509P883438N989598P76949K39366
40398A02123615O694311J1375271O522010m260333j2959705j7741284j9030948
40391G2722937j1477981Q166335K7838112K9011298J0866437p096929r993227
40384A20036982k496156M720800Q455056O768728l880006j5724719j1713847O413767
40376A12580605J1416694r223466k5919820o886699K9848710L8383397J1382471
40369A61581892j3004606j1485517l409716p254749p392618J2761485L3640319
$$ y = [153534033, 147977245, 148654021, 146028919, 129491499, 111063558, 111701947, 126712731, 127654586, 102219432, 71773748, 60841665, 66156965, 68365991, 61978720, 58252458, 64199561, 73933310, 81029755, 87234264, 95117702, 101107300, 101884249, 102123615, 108817926, 120193197, 126715207, 122454874, 109495169, 91753885, 72722937, 61244956, 69411291, 97249403, 126260701, 137127138, 130030209, 120036982, 117540826, 122261626, 130716682, 137485410, 133605404, 117880685, 106166838, 112580605, 123997299, 114773833, 88854013, 81967314, 111816024, 150199421, 161581892, 148577286, 137091769, 133682053, 126427304, 119034686, 131796171, 165436490]
40362A65436490K5430758n478415k4288126j4361284P263596J7277136R982448
40355A81262603m824380j2821207m682715J4040437K4382306J4445109n283841
40348B06518312j5733858j2809764p103318n741854o470771o591571o606158o515752
40340A38945266p020842j1099900j6017164r490925J4022695L7089916L4370947
40333A80799993N476270k0482676j8523113L563042J7166321P631068j1092813
40326A64538092j6110067l184785J0403154R109740k141509p221448r92106O683501
40318A61084572O681604M07172n908360p332600j314378P448795N859887j0441787
40310A56484905k2318340q968549J6440202J8528543p700357k5418406j0714624
$$ y = [165436490, 190867248, 185388833, 161100707, 146739423, 154003019, 171280155, 181262603, 176438223, 163617016, 158934301, 172974738, 197357044, 211802153, 206518312, 190784454, 177974690, 170871372, 165129518, 158658747, 152067176, 145461018, 138945266, 131924424, 120824524, 104807360, 95316435, 109339130, 146429046, 180799993, 186276263, 165793587, 147270474, 150833516, 167999837, 175630905, 164538092, 148428025, 145243240, 155646394, 164756134, 162614625, 155393177, 154401071, 161084572, 167766176, 168173348, 162264988, 154932388, 153618010, 161066805, 166926692, 156484905, 134166565, 125198016, 141638218, 160166761, 152466404, 127047998, 116333374]
40303A16333374J1195742P198063j3015079j7872880n161091K484738j51216P08644
40295A01720295M994903N45831o282255J784163J5726858Q708104j5195165k0709013
40287I1293721J295264J6786501M699881r379879Q69168J8252801J3977341m061475
40279A33733323q011641M992433J6203508J7791359J2861005j429750k0748655
40272A55391582j9514863J5242769M8346603L4359856j4171369l7616147j1135381
40265A70903050K4964851K7700642O479114m127122L427744J0316982N537151
40258B45202412m632010j1648695j1611222m168103L664188J021176j0552794
40251B07274952j5619831q353464l214263j0652956j7887953j0046286L667067
$$ y = [116333374, 127529116, 134727179, 121712100, 103839220, 98678129, 101162867, 101011651, 101720295, 106715198, 107261029, 100978774, 102762937, 118489795, 127197899, 112002734, 91293721, 92588985, 109375486, 114075367, 104695488, 105564656, 123817457, 137794798, 133733323, 125721682, 130714115, 146917623, 164708982, 177569987, 176140237, 155391582, 135876719, 151119488, 199466091, 233825947, 219654578, 182038431, 170903050, 195867901, 223568543, 230047657, 225920535, 229348279, 239665261, 245202412, 240570402, 228921707, 217310485, 213142382, 216806570, 217827746, 207274952, 191655121, 183301657, 180087394, 169434438, 151546485, 141500199, 145167266]
40244A45167266M999365l045868l888020J582027k553597j4571792j1986414J1191008
40236A26893975K7796221J3115909j9177536l4393458k1013457r7039O051544
40229I9176159j721581q689746p003791m63567M355045M581387J161659k256208
40221H9139357j149561N319716J1319163R215008j152886j0558661j0291187k728552
40213H9112397J328591l533289r724823o222588N476071R887996m647705k8824409
40205E2852241l8596188k1203114Q765924K4470340J6587613J455260j500965
40198D2831111P672003J4865948J2765708O467378J297485l406036o664057k697939
40190G3131601R116918J8924863J7866445R695653M291733L830201K904175k22073
$$ y = [145167266, 150166631, 147120763, 143232743, 144814770, 142261173, 127689381, 115702967, 126893975, 154690196, 167806105, 148628569, 114235111, 93221654, 93124615, 99176159, 97454578, 88764832, 81761041, 81297474, 85652519, 90233906, 91395565, 89139357, 87989796, 93309512, 104628675, 113843683, 112690797, 102132136, 91840949, 89112397, 90440988, 86907699, 77182876, 70960288, 76436359, 86324355, 81676650, 52852241, 14256053, -6947061, 1818863, 26289203, 42876816, 44332076, 42831111, 50503114, 65369062, 78134770, 84602148, 85899633, 82493597, 75829540, 73131601, 82248519, 101173382, 119039827, 128735480, 133027213, 136857414, 139761589, 139539516]
40182A39539516r19369K569321M042042l100293j5865783k2160593j2879674N307104
40174I6532271J2473286k195734k1586723j6880550J2240899K9188045O604925
40167A16376419l2399597m1951783j5293786R798467Q776667N38845O974241J4791862
40159F7611335L407057j4471799j3859426k122958m316914j3694884m62742K9888197
40151E1977866L3918988j245498l1556158k1688619L527194N717911n065183K419445
40143C8005946J8884936J1097331j4375577j7729515N738189J5936216n044605
40136E2512921k4546547j4656592O778242J2847282Q484991Q749490P588276l478694
40128E4279369j1424003m667576K569392l559272p761921P413888K5666151K0185821
$$ y = [139539516, 138620147, 141189468, 145231510, 142131217, 126265434, 104104841, 91225167, 96532271, 109005557, 106809823, 85223100, 68342550, 80583449, 109771494, 116376419, 83976822, 42025039, 26731253, 36529720, 45306387, 45845232, 52819473, 67611335, 71018392, 56546593, 42687167, 40564209, 36247295, 22552411, 22089669, 51977866, 85896854, 84651356, 53095198, 31406579, 34933773, 40651684, 35586501, 38005946, 56890882, 67988213, 53612636, 35883121, 41621310, 57557526, 52512921, 27966374, 13309782, 20088024, 32935306, 41420297, 50169787, 57758063, 54279369, 42855366, 38187790, 40757182, 37197910, 29435989, 36849877, 62516028, 82701849]
40120H2701849k853119j6073665j2903001o341021J236517J3633171J7573458
40113G6974189o26503k3597136k3893123q885958p038097j6174141q067176J7201523
40105E893578K7104529J2087562M53228P552686J3042472K841350p603057q631090
40097E2741258j4208557k5145847j5923986J7245257L5254100J2714256k0567974
40090D2108507k6756143j3979734p924216l085353J6129952L3783746K6506373
40083F6783132P307428J874251J896513j2505066k4280655n500053K3191026J6515265
40075G5281841j8661746k9743361k956855J8795765J2425886P704578K2517070
40068H5363178K3897092j1092748m4267922l0642828J0480359K5186708L811758
$$ y = [82701849, 79848730, 63775065, 50872064, 44531043, 45767560, 59400731, 76974189, 76347686, 52750550, 28857427, 19971469, 12933372, -3240769, -11307945, 5893578, 32998107, 45085669, 45538897, 53091583, 66134055, 68975405, 61372348, 52741258, 38532701, 13386854, -2537132, 14708125, 49962225, 62676481, 42108507, 15352364, 1372630, -6551586, -9636939, 6493013, 40276759, 66783132, 74090560, 75964811, 77861324, 65356258, 41075603, 35575550, 58766576, 75281841, 56620095, 26876734, 23919879, 42715644, 55141530, 62846108, 85363178, 109260270, 98167522, 53899600, 23256772, 33737131, 58923839, 62735597]
40061F2735597j4887034p365683Q268305Q949214l083730j2352472j0567757j6762
40053C1679678R667497P633236m791192j0930491M164J5141323J4809348Q92209
40045F4105772p337251k209881L942738J58305p940045r232922l485579L13513
40037C8314650k243776n466501l078266J387293N2148m464412n20543J1757200
40029C5737793J5006376J385868r754006K74876J7126178J4815185n29754j372415
40021G2690101J1363511Q927257j0606227j2398901J4774013L1770481R475140
40014A25995375k2871547k4651109o150741k297204j0511894k848864J6244370
40007G2908386J5332632o006384j3518409L780897J6679565O531335o998517l185619
$$ y = [62735597, 47848563, 40482880, 48751185, 57700399, 54616669, 42264197, 31696440, 31679678, 41347175, 48980411, 44189219, 33258728, 33262892, 48404215, 63213563, 64105772, 56768521, 54558640, 58501378, 58659683, 50719638, 41486716, 38001137, 38314650, 36070874, 30604373, 27526107, 28913400, 28965548, 24501136, 23980593, 35737793, 50744169, 52130037, 42376031, 42650907, 59777085, 74592270, 74062516, 72690101, 84053612, 92980869, 82374642, 69975741, 84749754, 116520235, 125995375, 103123828, 78472719, 72321978, 70024774, 59512880, 56664016, 72908386, 88241018, 82234634, 68716225, 72497122, 89176687, 95708022, 88709505, 85523886]
39999H5523886R190573J4650933J4340047J0133028o403228l0619574l5907183
39992F0908482r653497K2018965K6311094M668376j6325172j9770617p426686
39985F0730945J0818009J9756581O505915j8076600k2549960K102441K1818025
39978H1105356N981737k3902517k4200544M644516K0271243M835048j0757660
39971E7977179L46784J9524661J5803984m953771j1673265L816784J7511525J0723735
39963A09077616n160769q281205K951256R583996q77561j6540764j5545616M243339
39955G9450292J9431185J0717677j0262065j6700641m823218K278386p916899
39948G2174717j7028766n755884J3337319J3790257m078019j4804730p718129
$$ y = [85523886, 94714459, 109365392, 123705439, 133838467, 127435239, 96815665, 60908482, 51254985, 73273950, 99585044, 104253420, 87928248, 68157631, 60730945, 71548954, 91305535, 97811450, 79734850, 57184890, 59287331, 81105356, 87087093, 63184576, 38984032, 43628548, 63899791, 68734839, 57977179, 58323963, 77848624, 93652608, 88698837, 77025572, 80842356, 98353881, 109077616, 103916847, 95635642, 98586898, 108170894, 107293333, 90752569, 75206953, 79450292, 98881477, 109599154, 99337089, 82636448, 77813230, 80091616, 72174717, 55145951, 49390067, 62727386, 76517643, 72439624, 57634894, 49916765]
39941D9916765R8774m008587p575899K197812J3142448P180081q666757j2743684
39933C9540953l410522J7902r850512j7335444j0304974K082880O899324N716155
39925A3355762M807683K118565l621783m171738L690202O901353m466168j7154271
39917A459605j2903693J745666N354114m040781q198099p53920N375145N263502
39909f698461J0057791K0466980J9299530L110122n379148N559046J3049608k428947
39901E7036521j9561218r228601J3552727J0763997j4868554k1580448M117746
39894B0232170K6151117J7151092l277759r092744q888002j7634934j9731925
39887D909015K501137K6230380J5622001j9892362l5574270j5728500J0201192
$$ y = [49916765, 50015539, 46006952, 38431053, 40628865, 53771313, 60951394, 52284637, 39540953, 36130431, 36148333, 26297821, 8962377, -1342597, 740283, 7639607, 13355762, 18163445, 20282010, 16660227, 12488489, 16178691, 23080044, 18613876, 1459605, -11444088, -9698422, -4344308, -8385089, -16583188, -17337108, -11961963, -6698461, 3359330, 23826310, 43125840, 46235962, 40856814, 46415860, 59465468, 57036521, 37475303, 28246702, 41799429, 52563426, 37694872, 16114424, 20232170, 46383287, 63534379, 60256620, 51163876, 42275874, 24640940, 4909015, 7410152, 33640532, 49262533, 29370171, -6204099, -21932599, -11731407]
39880a1731407J7230280J3441319J1732566P586219j631947m232248L396937O127337
39872D1919056l277083r372303j039303Q522813N258760l077597n327005p680905
39864B5926433j6535563k0131140r111840K686446J550652M85487J5688623L2005666
39856C2564764K2710562o609703k5187815k1486683j0268202p37579J0726114
39849A711458J8612206J1351818k876730m294858L387179j846285j7996152j7711792
39841i663156L921441J7661741Q796808M06489R404124J5169447j951413k1344619
39833B2400862j2719608J5667690L0185006J8148515n704425k5287130l0955888
39826A1735022j5408101J2591083K3507181K522765k2327554j5453574J3514652
$$ y = [-11731407, 5498873, 18940192, 30672758, 38258977, 36627030, 32394782, 35791719, 41919056, 38641973, 29269670, 28230367, 36753180, 42011940, 38934343, 33607338, 25926433, 9390870, -10740270, -19852110, -17165664, -15615012, -15129525, 559098, 32564764, 55275326, 48665623, 23477808, 1991125, -8277077, -9014656, 1711458, 20323664, 31675482, 28798752, 24503894, 27891073, 26044788, 8048636, -9663156, -5741715, 11920026, 20716834, 21123323, 30527447, 45696894, 43745481, 22400862, 9681254, 25348944, 55533950, 73682465, 67978040, 42690910, 11735022, -3673079, 8918004, 32425185, 34947950, 12620396, -2833178, 10681474]
39819A0681474K3224148P31996k3966152k3565208m146935J4017889K1098168
39812A8075380J6809780N386684k675081Q4416N189925M82330o853914J00583
39804C6600103J6412895J7729364j612526j7288480j0873973M664613P862998
39797E3494994q72702o736775n155647l067786l135715j182835K938696L012536
39789C9294766l559353j0026936q320890j092212l88473j0104064j5343601r69463
39781a0510226K1725394K5336606O905718m948206N294152J4165029q29273k0132835
39773C7006359j2484318J2071222J7382401j025798j3675136q816537m850132
39766B5608061q863476m868663Q118892P570602r151933j2864554P238625K0264550
$$ y = [10681474, 33905622, 34637618, 10671466, -12893742, -17040677, -3022788, 18075380, 34885160, 40271844, 37596763, 37681179, 42871104, 43353434, 36499520, 36600103, 53012998, 70742362, 69129836, 51841356, 40967383, 45631996, 53494994, 52622292, 45885517, 40729870, 37662084, 34526369, 33343534, 36282230, 39294766, 35735413, 25708477, 17387587, 16295375, 15906902, 5802838, -9540763, -10510226, 11215168, 36551774, 43457492, 38509286, 43803438, 57968467, 57139194, 37006359, 24522041, 36593263, 53975664, 52949866, 39274730, 30458193, 25608061, 16744585, 11875922, 19994814, 27565416, 18413483, 5548929, 12787554, 33052104]
39758C3052104M965608j2219992j617675J8908576J4553990r036675j8481617
39751C0124319p160703J693159k180795n924241k763924J70374K204363R614148
39743B5776700J6496872J0764125j614668l407430L511020M44895j4191059j9753238
39735A8027217p407126N415034L241538n701270o015347L479243J4100814J8961673
39727D4101776J3148317l862741j9474284j5892222N719841K2179752J7146406
39720F3066845O37209q375426o670876m176977o705164j2113205j6932269j7275797
39712h545660q166843R456763K4115985K3122982N856075j4921117k3257441j2309606
39704d648862Q230615J7970119O850966j0277989j0298707O886309J7556405Q453862
$$ y = [33052104, 38017712, 25797720, 24180045, 43088621, 57642611, 48605936, 30124319, 22963616, 24656775, 22475980, 16551739, 13787815, 13958189, 16162552, 25776700, 42273572, 53037697, 51423029, 48015599, 51526619, 51971514, 37780455, 18027217, 10620091, 16035125, 19276663, 13575393, 7560046, 11039289, 25140103, 44101776, 57250093, 53387352, 33913068, 18020846, 23740687, 45920439, 63066845, 63704054, 55328628, 48657752, 44480775, 37775611, 25662406, 8730137, -8545660, -16712503, -7255740, 16860245, 39983227, 45839302, 30918185, 7660744, -4648862, 3581753, 21551872, 28402838, 18124849, 7826142, 14712451, 32268856, 40722718]
39696D0722718m319347q32365J2751113J5672250M498539n136042m764074j772623
39688E6820169q33806M183256J3278085J2803178l232828j7971219j3283063K799882
39680E4563654P908117j228019p679699n317576p081538j6302363j4668037O163115
39672A6357654K2938666J3447078o126175n017139J2019282J2800009o648787
39665E9770588j3073236Q005043K4743950Q642647j9432129k2323953k851574
39658D3481336P348810J071292J97081J1142297J2731601m939181k1230718j7544891
39650C2257627m173578J064525P03645N899653J2274728Q142029k198898m001332
39642D9968399K673150K981884n903261o767921J0775536L0037215K7386599M775154
$$ y = [40722718, 36403371, 35571006, 48322119, 63994369, 68492908, 63356866, 58592792, 56820169, 55986363, 60169619, 73447704, 86250882, 83018054, 65046835, 51763772, 54563654, 62471771, 61243752, 53564053, 48246477, 41164939, 24862576, 10194539, 16357654, 39296320, 52743398, 46617223, 41600084, 53619366, 66419375, 59770588, 46697352, 54702395, 79446345, 88088992, 68656863, 46332910, 43481336, 50830146, 51901438, 52098519, 63240816, 75972417, 71033236, 49802518, 32257627, 28084049, 29148574, 29852219, 35751872, 48026600, 56168629, 53969731, 49968399, 52641549, 55623433, 49720172, 42952251, 53727787, 83765002, 111151601, 115926755]
39634A15926755j3179119j2580944m718250l686302n988273k921309O15484l921838
39626F9546204r377860l397561P098381M910065n278727n04231J9657539K5060148
39618A07713958J425501k2914594j8042311L325679R250764k681573j0644129
39611F7433295q743463q220743o768934P611128K4223256J7484412q679988j9301457
39603F5037506p38222J8473480J3307291j935099k708411P169154Q767863j51338
39595A07222224q941351j3729345j3218599o24374J9989630K5705283N998214
39588A22401682j3447044m588630J8397144J9028884n147177k0076254q649131
39581A07919474P002773M187253q895173j3161287o412685L188074J2048153J5627224
$$ y = [115926755, 102747636, 90166692, 85448442, 81762140, 75773867, 72852558, 73468042, 69546204, 60168344, 56770783, 63869164, 68779229, 63500502, 62996271, 82653810, 107713958, 109139459, 86224865, 68182554, 71508233, 80758997, 78077424, 67433295, 58689832, 50469089, 43700155, 51311283, 75534539, 93018951, 84338963, 65037506, 64299284, 82772764, 96080055, 94144956, 91436545, 98605699, 107373562, 107222224, 98280873, 84551528, 71332929, 70708555, 90698185, 116403468, 122401682, 108954638, 104366008, 122763152, 141792036, 136644859, 116568605, 107919474, 114922247, 119109500, 110214327, 97053040, 90640355, 93828429, 105876582, 121503806]
39573A21503806N679268j2504589j7167084q49905J2359645L39107k0993298k0055022
39565F8311928J917212J3795002L256001q083231l842012K287674m988056j4131380
39557E8523138p623572O583787Q581274M05470P71184J0493416R602799p728652
39549G9608844j9378467o999747J5852391K1139897K077253k0918514k5505440
39542D5876217r946456P840437R530801m124367j4143358p336446O429795J0876693
39534D5003316R198401J4364624J8562223N40180l1923594l9239127o556534K6480018
39526C6429507J8986334j2029497j9436388L484112J9361223P777386r622002
39519D4950675r653873J632727R403194J2304489J1454093J815741j1915342j2548700
$$ y = [121503806, 127183074, 114678485, 97511401, 96661496, 109021141, 109360248, 88366950, 68311928, 70229140, 84024142, 87280143, 79196912, 75354900, 77642574, 72654518, 58523138, 50899566, 57483353, 66064627, 66470097, 67241281, 77734697, 87337496, 79608844, 60230377, 53230630, 69083021, 90222918, 92300171, 71381657, 45876217, 35929761, 43770198, 53300999, 49176632, 35033274, 27696828, 34126623, 45003316, 54201717, 68566341, 87128564, 87668744, 55745150, 16506023, 9949489, 36429507, 55415841, 43386344, 23949956, 27434068, 46795291, 54572677, 44950675, 35296802, 36929529, 46332723, 58637212, 70091305, 71907046, 59991704, 47443004]
39511D7443004K916885J3859009O638604n272709o093685k162310m302227n656922
39503D7369649J756788N930116m994364j5490934l618925J9541567K1720690j027456
39495G1187131j6672936m750697J5438463J6462542J049274q583039n780922m175772
39487F4174044j2012603j9286325j3939333K59400Q929476N588723j801376k786939
39479B9125067K552020N799165K143101m693385q263841n505289K088183Q583231
39471C1828252O420082m655891j3282332r453094j81911o66394r573793q312272
39463g877353R639869K4477126J6531190n474769j7372012j2315983m114370j877673
39455A616025J093762J0662505J8598144J3764580p10453r452313l414960Q098164
$$ y = [47443004, 50359889, 64218898, 70857502, 65584793, 59491108, 57328798, 53026571, 47369649, 49126437, 55056553, 50062189, 34571255, 30952330, 50493897, 72214587, 71187131, 54514195, 49763498, 65201961, 81664503, 82713777, 74130738, 68349816, 64174044, 52161441, 32875116, 18935783, 19195183, 28124659, 33713382, 31912006, 29125067, 31677087, 37476252, 39619353, 34925968, 26662127, 21156838, 23245021, 31828252, 38248334, 33592443, 20310111, 10857017, 10675106, 10008712, 434919, -7877353, 1762516, 26239642, 42770832, 37296063, 19924051, 7608068, 3493698, 1616025, 2709787, 13372292, 31970436, 45735016, 45024563, 35572250, 32157290, 40255454]
39447D0255454P669928p346279j7970528p037826J4591575J8743643j834122k1950143
39439B5121702j7986818K137442J5207784J4793701J0039683L197710j0170606
39432D2340598k2983560k0723299n356651M256162K52974l852811K475475R460790
39424E869678N410288j960618J769904J2561855J2909245o70728j2140579j0708100
39416A3040945n436047o907280p893443K721112J5094920Q707178j1566026j3510727
39408e749368J5472735M0308923K1214942k6850515m7821284j7696119K5645079
39401D524393L5249161J1375039j1780984j4945693p413421l714019p636120j4612565
39393h954209j5134269j004920K0348936K6674191R056464j1017700q801227R171244
$$ y = [40255454, 47925382, 40579103, 22608575, 15570749, 30162324, 48905967, 47071845, 25121702, 7134884, 9272326, 24480110, 39273811, 49313494, 52511204, 42340598, 19357038, -1366261, -6722912, -2466750, -2213776, -6066587, -3591112, 5869678, 11279966, 9319348, 11089252, 23651107, 36560352, 35889624, 23749045, 13040945, 7604898, 697618, -7195825, -4474713, 10620207, 19327385, 7761359, -5749368, 9723367, 50032290, 71247232, 44396717, -3424567, -21120686, 4524393, 39773554, 51148593, 39367609, 24421916, 17008495, 13294476, 5658356, -8954209, -24088478, -25093398, -4744462, 21929729, 30986193, 19968493, 11167266, 20338510]
39385B0338510J6513663N280958q380481j2674449j2090155j0695616m221483
39378e929053O980857J3430889R750517O40545p791735j1818371p160110M859278
39370B962817J1140629J520031j3169473j3622990L14846J1668593J2460987Q516615
39362B1792055J943157q292352j0740366O648318K7980278K2646914p192508k4004445
39354C0781051j0629552M496178m129852j8065585r738183R125376Q818096o637341
39346D020188p304722J0941158J9914894N839135j0743469j0056204k50915L210047
39338A5570112K853315P497086J1424866M078224p937318p051981Q176622J7781343
39330E2392269O868610j3961411k3350182j7399279j1022356j2603902j2148108
$$ y = [20338510, 36852173, 42133131, 33752650, 21078201, 8988046, -1707570, -5929053, 1051804, 14482693, 24233210, 24873755, 17082020, 5263649, -1896461, 2962817, 14103446, 15623477, 2454004, -11168986, -10854140, 814453, 13275440, 21792055, 23735212, 15442860, 4702494, 11350812, 39331090, 61978004, 54785496, 30781051, 20151499, 24647677, 20517825, 2452240, -7285943, 1839433, 10657529, 4020188, -3284534, 7656624, 27571518, 33410653, 22667184, 12610980, 12360065, 15570112, 18423427, 25920513, 37345379, 41423603, 33486285, 26434304, 34610926, 52392269, 59260879, 45299468, 21949286, 4550007, -6472349, -19076251, -31224359]
39323c1224359q62699J1402825J1458570N511833R158772K0070842K0474983O156172
39315E2146939p092952q546513m480943j022855M369845Q179654m73890j7037976
39307B6041309j9573719j893144J3335119R147441r73800q68928J7698r762083
39299A5469893j4538972K974081K4274920J8097696r543849k3601319j2888204
39292B44246N6610M62923j837406J20394j234011o234520m049568L426342K164957
39283f880033m560564K012677J8871505J9755438P38872r062812K743969R437504
39275C3056556n635828j5770021K336100K3100477J2627075j2799100j4084461
39268B2830798L960553L070614j9913686k6280233j006574K2207747J5073180
$$ y = [-31224359, -32087058, -20684233, -9225663, -3713830, 5444942, 25515784, 45990767, 52146939, 45053987, 36507474, 32026531, 31003676, 35373521, 43553175, 43079285, 26041309, 6467590, 4574446, 17909565, 27057006, 26083206, 25214278, 25231976, 15469893, 930921, 3905002, 28179922, 46277618, 36733769, 13132450, 244246, 300856, 763779, -1073627, -953233, -2187244, -8421764, -12471332, -9044990, -6880033, -11440597, -9427920, 9443585, 29199023, 29937895, 20875083, 23619052, 33056556, 27420728, 11650707, 13986807, 37087284, 49714359, 36915259, 22830798, 26791351, 29861965, 9948279, -16331954, -17338528, 4869219, 19942399]
39261A9942399n820692j2395191n314021N98279M569910J0264456Q548713o292579
39253A4101274j7754079p208153J6602376K7758609J6402450m251669j7910998
39246B7739810j7742344n215049R283390J0054255o023334k0244351j4217077
39239a6364700L939662J0567532q7077j0197936o079378N116539J0783887J0691977
39231H370506J1184235J0957388K959413j1684426j9467312q357010J4814635
39224H777429K6300545J1606229j2843304j6382124N220489K1628560R822429
39217E4130253j2582725j3615059O332403J8101034Q090923p399931j2771102
39210D0285796j1814093r826450k124253Q980700Q837420l874813p556921Q952360
$$ y = [19942399, 14121707, 1726516, -3587505, -2989226, 1580684, 11845140, 20393853, 14101274, -3652805, -10860958, 5741418, 33500027, 49902477, 45650808, 27739810, 9997466, 4782417, 14065807, 24120062, 18096728, -2147623, -16364700, -12425038, -1857506, -1944583, -12142519, -18221897, -13105358, -2321471, 8370506, 19554741, 30512129, 33471542, 21787116, 2319804, -6037206, 8777429, 35077974, 46684203, 33840899, 17458775, 22679264, 44307824, 54130253, 41547528, 27932469, 34264872, 52365906, 60456829, 53056898, 40285796, 28471703, 18645253, 16521000, 25501700, 34339120, 30464307, 22907386, 31859746]
39202C1859746K3725504J4460180l888642j890504J6021293J8195536k566397
39195I5916716j6999871n496347J2803755J1065594o978473j7579156j1727225
39188F1004993j301871K659620K279033M347872R416736J0851666J925920j4690461
39180G6493508k5329348j9370206m130503L906388K962321P455873K1610279K7732342
39172I1330654J1792468j2606544k1166681j1508284k630541o146514j4261351
39165C4803207j5844109r630578P38533J1932631J7476711J0384196n635459j6708171
39157B7516961j5592113r757569p779644o711287m75059P137313Q058371L659486
39149F056459J888709L060981J56244o427958o881489J162101N562913k553555
$$ y = [31859746, 55585250, 70045430, 66156788, 64266284, 80287577, 98483113, 95916716, 78916845, 73420498, 86224253, 97289847, 90311374, 72732218, 61004993, 59703122, 62362742, 64641775, 68989647, 78406383, 89258049, 91183969, 76493508, 51164160, 31793954, 27663451, 31569839, 34532160, 41988033, 63598312, 91330654, 103123122, 90516578, 69349897, 57841613, 55211072, 49064558, 34803207, 18959098, 9328520, 10067053, 21999684, 39476395, 49860591, 44225132, 27516961, 11924848, 2167279, -5612365, -12323652, -12798711, -5661398, 2396973, 6056459, 7945168, 11006149, 11162393, 4734435, -2147054, -984953, 4577960, 2024405]
39141B024405j3552011j2560647j020501P480866P888138N633240R37843j0951224
39133a4119891k2466636j6628646N413170J8916046R545102n154872m270522L989958
39125b4776291O21132p539680J503888K3771035L0010124R855307j3308090j8612615
39117A524810j2650110q183804l017110N690442Q087970l24133n457878L207282
39109a1122531J3330934J0266682J764599K878240R488211P545261j752819o503720
39101B5894857n405762n217732m791330j54216K738064j431255l792019K655290
39093A0495897N887378l627977q802478P351812K4285229J0491893k0488860k4434171
39085A158723K731664J6222613m309383k1209127k295498K5606001K1202106o671193
$$ y = [2024405, -11527606, -24088253, -25108754, -17627888, -9739750, -4106510, -3168667, -14119891, -36586527, -53215173, -47802003, -28885957, -19340855, -24495727, -28766249, -24776291, -24155159, -31694839, -30190951, -6419916, 23590208, 33445515, 20137425, 1524810, -11125300, -19309104, -22326214, -16635772, -8547802, -8871935, -14329813, -11122531, 2208403, 12475085, 14239684, 17117924, 26606135, 34151396, 32398577, 25894857, 20489095, 15271363, 10480033, 10325817, 13063881, 11632626, 7840607, 10495897, 16383275, 12755298, 3952820, 11304632, 35589861, 46081754, 25592894, 1158723, 3890387, 20113000, 15803617, -5405510, -7701008, 17904993, 39107099, 32435906]
39077C2435906j8946913q067820Q98119k717070n701831k104993L27528J973101
39069a903973R742559J6364541R364165k610865j376597O276166k169097k1957854
39061A1729045k3291509j947431R762465m206140j5857575O43164K6212652K7928742
39053C0973413R090673k511987j66644p76615j0964335j9915735k1939006k0175004
39045c6385240j0594155J1917930L2065691K5683449k607959j8468251l545064
39038a933599J9914199K1940564L285220j3340531j5202706o980051K774551P480957
39030A7938604K471091q142485j1515643l716307J963151l776832q657637N47164
39022a2888894J1336710L293627j3954429r710130J8783230L6658183K1911592
$$ y = [32435906, 13488993, 5421173, 6319292, 3602222, -2099609, -4204602, -3877074, -1903973, 7838586, 24203127, 33567292, 30956427, 29579830, 35855996, 33686899, 11729045, -11562464, -13509895, -3747430, -7953570, -23811145, -23167981, 3044671, 30973413, 40064086, 37552099, 37385455, 36608840, 25644505, 5728770, -16210236, -36385240, -46979395, -35061465, -2995774, 22687675, 20079716, 1611465, -1933599, 17980600, 39921164, 43206384, 29865853, 14663147, 7683096, 10457647, 17938604, 20409695, 12267210, 751567, -2964740, -1001589, -4778421, -13436058, -12888894, -1552184, 1741443, -12212986, -21923116, -3139886, 33518297, 55429889]
39015E5429889k667291p349355p70291r329068k7813965k5529888K044357K2542652
39007F557040J4978809j888137m484912j191651j0884114k4091672j6009237R497853
38999b7516021K0605728N407132r648287o10083J9039210K2463338R873131J732309
38991D1346457L529556L521402N59833O270715J7217653J2631688j0533927k5506714
38983D9036663j3871407N758869O285478r043864j8415379j6296184j1216839
38976g762663j939044J4920933K3084911N694420j8486654j4430858J2781254
38969A3862299K0790306k586992j7191235M949767L2968255K5053442q836185
38962F9009657k7413849j8095539j048288Q962664R826354l472862k6007247k8507349
$$ y = [55429889, 52762598, 45413243, 44642952, 35313884, 7499919, -18029969, -15985612, 6557040, 21535849, 19647712, 15162800, 13971149, 3087035, -21004637, -37013874, -27516021, -6910293, -1503161, -11151448, -11761531, 7277679, 29741017, 39614148, 41346457, 44876013, 48397415, 48957248, 55227963, 72445616, 85077304, 74543377, 49036663, 35165256, 40924125, 47209603, 38165739, 19750360, 3454176, -7762663, -9701707, 5219226, 28304137, 33998557, 15511903, 1081045, 13862299, 34652605, 32065613, 14874378, 19824145, 52792400, 77845842, 69009657, 41595808, 23500269, 22451981, 31414645, 41240999, 37768137, 11760890, -16746459]
38954a6746459N697211M1207004L0884890j1870256k8452993j772861K3114100
38947D2060636J3476626p521384j1113343r020118j9680626k7630150j2139720
38940c1568079J1981898J7312597O758867J618882M125669K355504j987005K89937
38932A0888270L906308l35247m807560M74942O075138J081814k552361P866699
38924B2598003J5354039j064606k3644204j8141174R073476J8560362J346481
38917B4082377r302607L300168J2375002l554135k3070458j7260341N805639J7666676
38909A0042321J0471990j812152q250083p088594J014176R906246R440471K260237
38901B5984612M764025J9429671K4229239N601182j6349566j6145097p62856M383489
$$ y = [-16746459, -11049248, 30157756, 61042646, 49172390, 20719397, 18946536, 42060636, 55537262, 48015878, 36902535, 27882417, 8201791, -19428359, -31568079, -19586181, -2273584, 4485283, 6104165, 10229834, 12585338, 10598333, 10888270, 14794578, 14459331, 9651771, 10126713, 16201851, 17283665, 14731304, 22598003, 37952042, 36887436, 13243232, -4897942, 4175534, 22735896, 24082377, 14779770, 18079938, 30454940, 26900805, 3830347, -13429994, -7624355, 10042321, 20514311, 18702159, 10452076, 3363482, 4377658, 14283904, 23724375, 25984612, 30748637, 50178308, 74407547, 80008729, 63659163, 47514066, 46751210, 51134699]
38893E1134699m867622j1460635r034134p154579p607267j412186R021664Q869000
38885B7488940l010859q611359R74165J1084539P214090l451073o561053l564991
38877B1562399n982120j4788179j9136714j2526341k32334Q124174P284403q3804
38869a5778516m487507J465178J1947422J2947080L166728n74278J1418089K2076043
38861D2180239R972428j5384576k2783480m569166J1332774L676357j0784283
38854A3640293n827846J2651479J8054240N538163m350153j690857O76447n376663
38846C3315103r753625o473974n202879q717482k757241J5466980K1940586J307712
38838C9125180k2310586j7404626P100586J7152552O777727J623524J2182773
$$ y = [51134699, 46267077, 34806442, 25772308, 18617729, 11010462, 9598276, 18619940, 27488940, 24478081, 15866722, 16840887, 27925426, 35139516, 31688443, 25127390, 21562399, 15580279, 792100, -18344614, -30870955, -31103289, -22979115, -15694712, -15778516, -20266023, -18800845, -6853423, 6093657, 9260385, 8686107, 20104196, 42180239, 52152667, 36768091, 13984611, 9415445, 20748219, 24424576, 13640293, 7812447, 20463926, 38518166, 44056329, 39706176, 38015319, 38691766, 33315103, 23561478, 17087504, 11884625, 3167143, 409902, 15876882, 37817468, 39125180, 16814594, -590032, 6510554, 23663106, 30440833, 32064357, 44247130]
38831D4247130J8800784Q301186o862066j5255606k2135371k6531714j2827361
38824a2263018J7135336L1188791R532186k1589224k4723546k818597J1268805
38817G730733M634148m892093j991562Q743476J7789881K0772784J3302784m678180
38809F1411971j9139715j4921052J210182Q060183L81568o855318n090657k726762
38801B2330400n429713n988788p13558J994098k148073m206429K375927J1318480
38793A9532344J6029813J7548956J2926035n862922l0417819l3410214n233235
38786h887042K3938548K1126889l273270j2294961K688086J4010742N071007n491862
38778C6888137J915187J5277822J1691290o096384j5264900p273688K902657Q01788
$$ y = [44247130, 63047914, 71349100, 64487034, 49231428, 27096057, 564343, -12263018, 4872318, 36061109, 45593295, 24004071, -719475, -3538072, 7730733, 12364881, 7472788, 5481226, 14224702, 32014583, 52787367, 66090151, 61411971, 42272256, 27351204, 28561386, 36621569, 37003137, 30147819, 25057162, 22330400, 16900687, 10911899, 10198341, 12192439, 10044366, 5837937, 8213864, 19532344, 35562157, 53111113, 66037148, 60174226, 29756407, -3653807, -8887042, 15051506, 36178395, 32905125, 20610164, 23298250, 37308992, 42379999, 36888137, 38803324, 54081146, 65772436, 59676052, 44411152, 37137464, 40040121, 40841909]
38770D0841909r396127j3299478l299566J4940243K7020623K1311561J496160
38763G9615325j4378759j3335063k621643J757878l053973p038185n827952m662951
38755C0454677l783368M088189J6984779K0078884P834386l911698k95329R337156
38747H0787676N677715j0758280k1154266j6438852o790680k471992r96858K705718
38739C0560181O913832R513750J2423438J3690514N948640r878615j9271878j2127011
38731C7772851J425895M082827m436934p752006L833419K1086979K9097830K4264910
38723A09375771J3686918L528360n590682j3216952j5201246q161649M277282
38716H8697802J2902326J1063662K11260j1793933j5630252n809217J3184795
$$ y = [40841909, 31445782, 18146304, 14846738, 29786981, 56807604, 78119165, 79615325, 65236566, 51901503, 49279860, 51037738, 47983765, 40945580, 35117628, 30454677, 26671309, 30759498, 47744277, 67823161, 75657547, 71745849, 71450520, 80787676, 86465391, 75707111, 54552845, 38113993, 31323313, 28851321, 27854463, 30560181, 37474013, 46987763, 59411201, 73101715, 79050355, 69171740, 49899862, 37772851, 39198746, 43281573, 38844639, 31092633, 34926052, 56013031, 85110861, 109375771, 123062689, 126591049, 121000367, 107783415, 92582169, 84420520, 88697802, 101600128, 112663790, 112875050, 101081117, 85450865, 79641648, 92826443]
38709I2826443K6063996K0194014L114794k516847J1710604K5105232J4208425
38702A90706661j2734291k3652633m226416K4279244L2902609J7643797k260566
38695B22658405q547825J203527J5984353K1421526J1114128p467729k0291406
38688B36074979k0270215j0263736L805963J4915329J3936437q21518j4493673
38681B22883566j0852667K684285K292138j6476541k9615735k0078707k794592
38674A48041747J36743p436609o693295L247050N050682p784522k0604011j8216181
38666I5741604l005435J0054750Q932164m942584j7014952j3705526N28381P392151
38658H3980553l04485r280507p801271k701708l572982n142173p47479J082108
$$ y = [92826443, 118890439, 139084453, 142199247, 139682400, 151393004, 176498236, 190706661, 177972370, 154319737, 150093321, 174372565, 207275174, 224918971, 222658405, 214110580, 215314107, 231298460, 252719986, 263834114, 256366385, 236074979, 215804764, 205541028, 209346991, 224262320, 238198757, 237377239, 222883566, 212030899, 214715184, 217007322, 200530781, 170915046, 150836339, 148041747, 148178490, 140741881, 134048586, 137295636, 142346318, 134561796, 113957785, 95741604, 92736169, 102790919, 111723083, 106780499, 89765547, 76060021, 76588402, 83980553, 83676068, 74395561, 66594290, 63892582, 60319600, 55177427, 54429948, 55512056]
38650E5512056p195744j2363665m0529J6294781J2658363n437770r799159M896267
38642E4524600J3040586L00914j5679635j6805299j0098904p963541o086105K276582
38634A3509198Q743196M182649l807295m090393l36943j186236l807662k107008
38626A1099506l2067j532435J372092J3522493K0185838N655030j8661850k5747077
38618E861530r668698R338799J5968653J5531636J5204080R801690m201669j5772500
38610D2063521j3085224j180036N867007M915883M636865Q594744Q441859l098334
38602E7156285j9525096k6113893j6210046J514843J1911786P715923m397978
38595A2051824j0447160k684243J1333110J4768566N61060j7218220j8156279
$$ y = [55512056, 48316312, 35952647, 35912118, 52206899, 64865262, 59427492, 49628333, 54524600, 67565186, 67866100, 52186465, 35381166, 25282262, 17318721, 11232616, 13509198, 22252394, 26435043, 22627748, 18537355, 18200412, 17014176, 13206514, 11099506, 11067439, 9535004, 10907096, 24429589, 44615427, 50270457, 31608607, 5861530, -3807168, 5531631, 21500284, 37031920, 52236000, 62037690, 57836021, 42063521, 28978297, 27798261, 33665268, 38581151, 43218016, 51812760, 60254619, 57156285, 37631189, 11517296, -4692750, -3177907, 8733879, 16449802, 12051824, 1604664, -1079579, 10253531, 25022097, 25583157, 8364937, -9791342]
38588i791342j813406J0884547O501085k773420O11197J2542148J5718284P422768
38580C9301861J99807j573596n006726q100047J548815K1261946K8400138J2160246
38572H8192444q970930j5193895j2550834j4914326j6054145k971375J4420754
38565C1957693J3480708n289410j7745022j2195225k242407R49810N980208K0253836
38557C5150191L0925411K2192545j55554j6437699j8493863j4215923j0813795
38550B8151313o436485J100592P081392N139522m409435j3895407j5039365o778377
38542e086250K987428N225895J20372l039089K482279J2357677J6371120R798510
38534D1217942k102628r236551n707110M078673Q752561K841249m926848k094755
$$ y = [-9791342, -11604748, -720201, 5780884, 3007464, 3618661, 16160809, 31879093, 39301861, 39501668, 37928072, 32921346, 24821299, 26370114, 47632060, 76032198, 88192444, 79221514, 64027619, 51476785, 36562459, 20508314, 17536939, 31957693, 45438401, 40148991, 22403969, 10208744, 7966337, 8916147, 14896355, 35150191, 66075602, 88268147, 88112593, 71674894, 53181031, 38965108, 28151313, 21714828, 22815420, 29896812, 35036334, 30626899, 16731492, 1692127, -5086250, -2098822, 3127073, 3247445, 208356, 2690635, 15048312, 31419432, 41217942, 39115314, 29878763, 24171653, 28250326, 37002887, 39844136, 34917288, 32822533]
38526C2822533R110357J2535741J75620j5744333j8910328q938315K874500R868126
38518B3793901J1005736K699711j4727917k5810260j4183403R518478J4085990
38511F382236r314432k9892675j8003678J3123103K7188031J4870329j120979
38504C231935n472628n808964o142198M968696K6697379L2709068P151020k4401057
38496C2933251k5137136K150578J9934311P931572j4289598j9256533m976627
38489g10182J0984165J5209776P454768l992612r025937m092605L386514M881706
38481B4095593L121386M596389L175649j2099968l1792144k9125566K426897L2581087
38473c020677L0358747M056667j2412893n134424P415819O073797m099659o984846
$$ y = [32822533, 41932890, 54468631, 54644251, 38899918, 19989590, 11051275, 13925775, 23793901, 34799637, 37499348, 22771431, -3038829, -17222232, -7703754, 6382236, -2932196, -32824871, -50828549, -37705446, -10517415, 4352914, 3231935, -2240693, -8049657, -14191855, -9223159, 17474220, 50183288, 57334308, 32933251, 7796115, 9946693, 29881004, 37812576, 23522978, 4266445, -710182, 10273983, 25483759, 32938527, 28945915, 19919978, 15827373, 19213887, 24095593, 27216979, 31813368, 34989017, 22889049, -8903095, -38028661, -35601764, -3020677, 27338070, 31394737, 18981844, 13847420, 21263239, 27337036, 23237377, 16252531]
38465A6252531p291M965149k30592j0255836j4358934q507121K149221R625466
38457c67407R596785L437645l013885l078501M681753J2926733J1832476J021476
38449C7037075q521466p298146J647894P846868N753585j633092p420314n593906
38441B1818498L714762J0266432K609363j3851701j7782086l09045J7701037J0689836
38433C4857096j6709087l5889017l0562837r915443J1241103K6427875L1092324
38426A0542014K1109260K555160j1219767j5629473j5577048j0769899L202399
38419a5787354J8453264J8631145L559225p863081m700865L364407N598652M132958
38411B5388351J931722m483823j2485663j1545452j705586M404358M433749R471169
$$ y = [16252531, 16245240, 21210389, 20979797, 10723961, -3634973, -12142094, -9992873, -367407, 9229378, 12667023, 9653138, 6574637, 11256390, 24183123, 36015599, 37037075, 28515609, 21217463, 22865357, 30712225, 36465810, 34832718, 27412404, 21818498, 25533260, 35799692, 38409055, 24557354, 6775268, 6466223, 24167260, 34857096, 18148009, -17741008, -48303845, -58219288, -46978185, -20550310, 10542014, 31651274, 34206434, 22986667, 7357194, -8219854, -18989753, -15787354, 2665910, 21297055, 24856280, 16993199, 12292334, 15656741, 21255393, 25388351, 27320073, 22836250, 10350587, -1194865, -2900451, 1503907, 5937656, 15408825]
38403A5408825J6723171N860120k3052096l5602347r334703K8688340L6729549
38396C5420859J3671296p411348q054011O55159M392273J632021m007685q683246
38388B7615318q514101p230627j4626170k6110143k0076105Q201437K9732375
38381a1008016K1419616K743469M204407J7335439J1962365r434743j5635726
38374B1586811r13680O138828p679753j9990002j2674075J561701O180574N910582
38366A20986R545931J1305929M895749k550442l783139k797652l082707n06804
38358A3147851M038981J731013o998491r891981m541443l445950r179124n513323
38350b0652467J4354845L0239512K1747491j968322j5464697r785234K259044
$$ y = [15408825, 32131996, 37992116, 14940020, -20662327, -29997030, -1308690, 35420859, 49092155, 41680807, 33626796, 34281955, 38674228, 40306249, 36298564, 27615318, 19101217, 11870590, -2755580, -28865723, -48941828, -40740391, -11008016, 10411600, 13155069, 17359476, 34694915, 46657280, 37222537, 21586811, 20673131, 26811959, 19132206, -857796, -13531871, -11970170, -5789596, 120986, 9666917, 20972846, 25868595, 23318153, 19535014, 16737362, 13654655, 13147851, 17186832, 18917845, 11919354, 2027373, -2514070, -5960020, -15139144, -20652467, -6297622, 23941890, 45689381, 43721059, 28256362, 18471128, 20730172]
38343B0730172O210230m48206r951984j1624877j738835J0561629J2902195N241165
38335C1881489k717695p232664j0987573j0572555l59151J1551655R849275l901834
38327A7510947j2204337p994297l12425O589030J5893611J8448847o12784k8660649
38319H657943l0282294J478378K8793986K1877913q22760p726194j766056l828115
$$ y = [20730172, 26940402, 26492196, 16540212, 4915335, 3176500, 13738129, 26640324, 31881489, 29163794, 21931130, 10943557, 371002, 11851, 11563506, 21412781, 17510947, 5306610, -2687687, -3000112, 3588918, 19482529, 37931376, 37318592, 8657943, -21624351, -20145973, 8648013, 30525926, 29703166, 21976972, 20210916, 16382801]
$$ [...]
##END NTUPLES=NMR SPECTRUM
##END=
