##TITLE=31Pdec_SR145-CDCl3TFA
 CDCl3, 124 sc
 22.11.2022
##JCAMPDX= 6.0         $$ Bruker NMR JCAMP-DX V2.0
##DATA TYPE= NMR SPECTRUM
##DATA CLASS= NTUPLES
##ORIGIN= UXNMR, Bruker Analytische Messtechnik GmbH
##OWNER= root
$$ XWIN-NMR		Version 3.5
$$ Tue Nov 22 16:11:47 2022 Russian Standard Time (UT+4h)  she@DPX200
##.OBSERVE FREQUENCY= 81.013821
##.OBSERVE NUCLEUS= ^31P
##.ACQUISITION MODE= SIMULTANEOUS
##.ACQUISITION SCHEME= undefined
##.AVERAGES= 124
##.DIGITISER RES= 16
##SPECTROMETER/DATA SYSTEM= spect
##.PULSE SEQUENCE= zgpg30
##.SOLVENT NAME= CDCl3
##.SHIFT REFERENCE= (INTERNAL, CDCl3, 0, 248.564)
##AUDIT TRAIL= $$ (NUMBER, WHEN, WHO, WHERE, WHAT)
$$ ##TITLE= Audit trail, XWIN-NMR		Version 3.5
$$ ##JCAMPDX= 5.01
$$ ##ORIGIN= Bruker BioSpin GmbH
$$ ##OWNER= she
$$ F:/spectra/data/she/nmr/P31/1/pdata/1/auditp.txt
$$ ##AUDIT TRAIL=  $$ (NUMBER, WHEN, WHO, WHERE, WHAT)
(   1,<2022-11-22 16:07:27.18 +0400>,<she>,<DPX200>,
      <continue with go, POWCHK disabled, PULCHK disabled
       configuration hash MD5:
       00 E9 B6 7A A2 85 ED C7 34 08 36 98 17 FE 4E 26
       data hash MD5: 32K
       DE 9E 9F 01 9B 93 7D BA 72 FE 72 4A DB 76 A1 2E>)
(   2,<2022-11-22 16:10:30.70 +0400>,<she>,<DPX200>,
      <Start of raw data processing
       efp BC_mod = 2 LB = 1 FT_mod = 6 PKNL = 1 PHC0 = -10209.64 PHC1 = -24.14404 SI = 64K 
       data hash MD5: 64K
       A2 C9 B9 66 18 C8 5E 60 F4 95 54 A1 FF 5F F9 D3>)
(   3,<2022-11-22 16:11:08.15 +0400>,<she>,<DPX200>,
      <pk PHC0 = 146.0283 PHC1 = -464.8 
       data hash MD5: 64K
       C5 93 D9 D6 E0 71 32 58 B9 2C FC 16 3A 29 B9 71>)
(   4,<2022-11-22 16:11:11.48 +0400>,<she>,<DPX200>,
      <abs ABSG = 5 
       data hash MD5: 64K
       50 7D D5 BD E3 C1 96 B0 57 DF 24 24 0D 64 F3 DA>)
$$ ##END=
$$ 
$$ hash MD5
$$ 23 3E 47 C5 6F 80 FA 8E 19 E2 A3 9F 3E C1 74 00
##$RELAX= 
##$RELAX= 
##$RELAX= 
##$RELAX= 
##$RELAX= 
##$RELAX= 
##$RELAX= 
##$RELAX= 
##$RELAX= 
$$ Bruker specific parameters
$$ --------------------------
##$DU= <F:/spectra>
##$EXPNO= 1
##$NAME= <P31>
##$PROCNO= 1
##$TYPE= <nmr>
##$USER= <she>
##$AMP= (0..31)
100 100 100 100 100 100 100 100 100 100 100 100 100 100 100 100 100 100 
100 100 100 100 100 100 100 100 100 100 100 100 100 100 
##$AQSEQ= 0
##$AQ_mod= 1
##$AUNM= <au_zg>
##$AUTOPOS= <>
##$BF1= 81.014009
##$BF2= 200.13
##$BF3= 200.13
##$BF4= 200.13
##$BF5= 200.13
##$BF6= 200.13
##$BF7= 200.13
##$BF8= 200.13
##$BYTORDA= 1
##$CFDGTYP= 0
##$CFRGTYP= 5
##$CHEMSTR= <none>
##$CNST= (0..31)
1 1 145 1 1 1 1 1 1 1 1 1 1 1 1 1 1 1 1 1 1 1 1 1 1 1 1 1 1 1 1 1 
##$CPDPRG= <waltz16>
##$CPDPRG1= <>
##$CPDPRG2= <waltz16>
##$CPDPRG3= <>
##$CPDPRG4= <mlev>
##$CPDPRG5= <mlev>
##$CPDPRG6= <mlev>
##$CPDPRG7= <mlev>
##$CPDPRG8= <mlev>
##$CPDPRGB= <>
##$CPDPRGT= <>
##$D= (0..31)
0 1 0 0 0 0 0 0 0 0 0 0.03 2e-05 3e-06 0 0 0 0 0 0 0 0 0 0 0 0 0 0 0 0 
0 0 
##$DATE= 1669118680
##$DBL= (0..7)
120 120 120 11 120 120 24 19 
##$DBP= (0..7)
150 150 150 150 150 150 150 150 
##$DBP07= 0
##$DBPNAM0= <>
$$ [...]
##$SUBNAM3= <"">
##$SUBNAM4= <"">
##$SUBNAM5= <"">
##$SUBNAM6= <"">
##$SUBNAM7= <"">
##$SUBNAM8= <"">
##$SUBNAM9= <"">
##$SW= 501.771253377433
##$SWIBOX= (0..15)
0 1 3 0 0 0 0 0 0 0 0 0 0 0 0 0 
##$SW_h= 40650.406504065
##$TD= 32768
##$TD0= 1
##$TE= 0
##$TE2= 300
##$TE3= 300
##$TEG= 300
##$TL= (0..7)
0 120 53 12 22 120 120 120 
##$TP= (0..7)
150 150 150 150 150 150 150 150 
##$TP07= 0
##$TPNAME0= <>
##$TPNAME1= <>
##$TPNAME2= <>
##$TPNAME3= <>
##$TPNAME4= <>
##$TPNAME5= <>
##$TPNAME6= <>
##$TPNAME7= <>
##$TPOAL= (0..7)
0.5 0.5 0.5 0.5 0.5 0.5 0.5 0.5 
##$TPOFFS= (0..7)
0 0 0 0 0 0 0 0 
##$TUNHIN= 0
##$TUNHOUT= 0
##$TUNXOUT= 0
##$USERA1= <user>
##$USERA2= <user>
##$USERA3= <user>
##$USERA4= <user>
##$USERA5= <user>
##$V9= 5
##$VALIST= <valist>
##$VCLIST= <CCCCCCCCCCCCCCC>
##$VD= 0
##$VDLIST= <DDDDDDDDDDDDDDD>
##$VPLIST= <PPPPPPPPPPPPPPP>
##$VTLIST= <TTTTTTTTTTTTTTT>
##$WBST= 1024
##$WBSW= 4
##$XGAIN= (0..3)
0 0 0 0 
##$XL= 0
##$YL= 0
##$YMAX_a= 4109
##$YMIN_a= -10393
##$ZGOPTNS= <>
##$ZL1= 120
##$ZL2= 120
##$ZL3= 120
##$ZL4= 120
##$ABSF1= 248.5645
##$ABSF2= -253.2056
##$ABSG= 5
##$ABSL= 3
##$ALPHA= 0
##$AQORDER= 0
##$ASSFAC= 0
##$ASSFACI= 0
##$ASSFACX= 0
##$ASSWID= 0
##$AUNMP= <proc_1d>
##$AZFE= 0.1
##$AZFW= 0.5
##$BCFW= 0
##$BC_mod= 2
##$BYTORDP= 0
##$COROFFS= 0
##$CY= -3
##$DATMOD= 1
##$DC= 0
##$DFILT= <>
##$DTYPP= 0
##$F1P= 0
##$F2P= 0
##$FCOR= 1
##$FTSIZE= 65536
##$FT_mod= 6
##$GAMMA= 0
##$GB= 0
##$INTBC= 1
##$INTSCL= 6.047779e-11
##$ISEN= 30
##$LB= 1
##$LEV0= 0
##$LPBIN= 0
##$MAXI= 10000
##$MC2= 0
##$MEAN= 0
##$ME_mod= 0
##$MI= 50
##$NCOEF= 0
##$NC_proc= -9
##$NLEV= 6
##$NOISF1= 182.463
##$NOISF2= 159.3651
##$NSP= 0
##$NTH_PI= 0
##$NZP= 0
##$OFFSET= 248.5645
##$PC= 4
##$PHC0= -10063.61
##$PHC1= -488.944
##$PH_mod= 1
##$PKNL= yes
##$PPARMOD= 0
##$PSCAL= 0
##$PSIGN= 0
##$REVERSE= no
##$SF= 81.0140089999694
##$SI= 65536
##$SIGF1= 159.3651
##$SIGF2= -187.1042
##$SINO= 113.3802
##$SIOLD= 16384
##$SREGLST= <1H.CDCl3>
##$SSB= 0
##$STSI= 65536
##$STSR= 0
##$SW_p= 40650.406504065
##$SYMM= 0
##$S_DEV= 0
##$TDeff= 32768
##$TDoff= 0
##$TI= <>
##$TILT= no
##$TM1= 0
##$TM2= 0
##$TOPLEV= 0
##$USERP1= <user>
##$USERP2= <user>
##$USERP3= <user>
##$USERP4= <user>
##$USERP5= <user>
##$WDW= 1
##$XDIM= 65536
##$YMAX_p= 434735271
##$YMIN_p= -165373959
$$ End of Bruker specific parameters
$$ ---------------------------------
##NTUPLES= NMR SPECTRUM
##VAR_NAME=  FREQUENCY,     SPECTRUM/REAL,   SPECTRUM/IMAG
##SYMBOL=    X,             R,               I
##VAR_TYPE=  INDEPENDENT,   DEPENDENT,       DEPENDENT
##VAR_FORM=  AFFN,          ASDF,            ASDF
##VAR_DIM=   65536,         65536,           65536
##UNITS=     HZ,            ARBITRARY UNITS, ARBITRARY UNITS
##FACTOR=    0.620285442955139, 1,           1
##FIRST=     20137.2065510682, 0,            0
##LAST=      -20513.1999529968, 0,           0
##MIN=       -20513.1999529968, -165373959,  0
##MAX=       20137.2065510682, 434735271,    0
$$ Real data points
##PAGE= N=1
##DATA TABLE= (X++(R..R)), XYDATA
$$ [...]
12197C2984916k6077074k0753257P134221K4460246J0171683j2662922j2710269
12190B547544L112197O498388l945267m097425J0909534J6622222o9094j8041109
12182A3536990j3085761P137231J4993280l93847k1533769k4253166l650370K0462792
12174f786620K3004512J560001j8166043j2076535J1266177K1474481O600669
12167B6876642j2929954j4307241j200210O253006m92235j1382004j3432039l951667
12159b4565702R839349J7692817J3723146J761917o801156l922050N703379Q468295
12151B1899995k606999j6690995j4576585O463167K3367151J3966281j0509068
12144B1312947j7417478J28728J1024512o244807k7395173j8120720J1658167
$$ plain form
12197 32984916 6907842 -13845415 -6711194 17749052 27920735 15257813 2547544
12190 2547544 5659741 12158129 8212862 4115437 15024971 31647193 31578099 13536990
12182 13536990 451229 7588460 22581740 22187893 654124 -23599042 -27249412 -6786620
12174 -6786620 16217892 17777893 -388150 -12464685 -1198508 20275973 26876642
12167 26876642 13946688 -360553 -1560763 4692243 4200008 -7181996 -20614035 -24565702
12159 -24565702 -14726353 2966464 16689610 18451527 11650371 7728321 13431700 21899995
12151 21899995 19292996 2602001 -11974584 -5511417 17855734 31822015 21312947
12144 21312947 3895469 4024197 15048709 8803902 -18591271 -36711991 -25053824
12137b5053824K2411258N878601n845822N012413J5421530L736698j4231908j4155772
12129f826826l477152m687519j3978251p224366J7683756L2890099J9555622o685969
12121B7249394j8738480j2065775l696608m632443o717542R50375J2450270J1925474
12113F724665j527829q589564L483405J9653318J6433377m265062j8300314j4450002
12105h38006o670931p893871j1232860n565742P016559J8952273K6938764K4577891
12097D5284077L216556k6706612l4207298p288496K2226786J8184144p566121
12090A3143036j2463243J2034144K7676689Q611805j9509210j9378282L038836
12083A3153775J1212254n974422k1051117j2050246O949431J1382209L059071
$$ plain form
12137 -25053824 -2642566 3236035 -2609787 2402626 17824156 21560854 7328946 -6826826
12129 -6826826 -10303978 -14991497 -28969748 -36194114 -18510358 14379741 33935363 27249394
12121 27249394 8510914 -3554861 -7251469 -11883912 -18601454 -17651079 -5200809 6724665
12113 6724665 5196836 -3392728 90677 19743995 36177372 31912310 13611996 -838006
12105 -838006 -7508937 -15402808 -26635668 -32201410 -25184851 -6232578 20706186 45284077
12097 45284077 48500633 21794021 -12413277 -19701773 2525013 20709157 13143036
12090 13143036 679793 12713937 40390626 49002431 29493221 10114939 13153775
12083 13153775 24366029 18391607 -2659510 -14709756 -7760325 3621884 6680955
12076F680955K467996J3632982J7896913L289236j7984347k7341249k1025239
12069b2382753o300695J0032029J9614942J2425174p644538j8388133o469053
12062a9113027J1005756J0461893k566304n408247J724702k263848j7736897j8177358
12054d2073330N021722K3177498J2992278p723355q776155Q450907J9366360J3570135
12046B4006060R65982q611486j1298388m309580O345906L957217j4485700k4577666
12038b8007655o777243K0339042K4861485Q727638o6661M529838J170050j5607462
12030I169032k2570124q235718O025812J825975o293518J855204J5772030J0887324
12022H436017j0423670k0622140p276888J0891513J2707682K275952j755136N167012
$$ plain form
12076 6680955 9148951 22781933 40678846 43968082 25983735 -1357514 -22382753
12069 -22382753 -28683448 -18651419 963523 13388697 5744159 -12643974 -19113027
12062 -19113027 -8107271 2354622 -211682 -5619929 -3895227 -6159075 -23895972 -42073330
12054 -42073330 -37051608 -13874110 -881832 -8605187 -17381342 -8930435 10435925 24006060
12046 24006060 24972042 16360556 5062168 752588 7098494 11055711 -3429989 -28007655
12038 -28007655 -34784898 -14445856 10415629 19143267 19076606 23606444 24776494 9169032
12030 9169032 -13401092 -21636810 -15610998 -13785023 -20078541 -18223337 -2451307 8436017
12022 8436017 -1987653 -22609793 -29886681 -18995168 -6287486 -4011534 -5766670 -599658
12014e99658Q615362j544783j4716733j4339080k541157L083478k846046m928251
12006b9816868O773892J7468427R132948r780810j4702513R0580J5497450J5912743
11998A0575849O570607L04553J091895M394194L780832m230344j4088859j3142414
11990d743687O86360R842674R7189j4596550r761781J1554721K1574038Q660903
11982B3313867q599651j2121600n779361L65264M797397N107846m450195j6272902
11974a3639335j1766104Q795129K0875498J2655565L649527R869099J5031349
11967D5470728L7240j9881825j7030416L113497R196632q413855k5823995k1821061
11959c5153055k174871J5131558J9707458J0598142n627842j5590803j0609895
$$ plain form
12014 -599658 8015704 6470921 -8245812 -22584892 -25126049 -22042571 -24888617 -29816868
12006 -29816868 -23042976 -5574549 3558399 -6222411 -20924924 -20834344 -5336894 10575849
11998 10575849 17146456 17451009 18542904 22937098 26717930 22487586 8398727 -4743687
11990 -4743687 -4057327 5785347 5882536 -8714014 -18475795 -6921074 14652964 23313867
11982 23313867 14714216 2592616 -3186745 -2821481 1975916 7083762 2633567 -13639335
11974 -13639335 -25405439 -16610310 4265188 16920753 20570280 30439379 45470728
11967 45470728 45507968 25626143 8595727 11709224 20905856 12492001 -13331994 -35153055
11959 -35153055 -37327926 -22196368 -2488910 8109232 2481390 -13109413 -23719308
11952b3719308J455474O560312L965958K937468M241195O38762o466461p415845
11944a7802445j135599L812072M916619P165541R155786M310209l220798j330929
11936E870456Q647722J0886823J53767r165961o040230J202036Q18025m258072
11928H114566m689276l38427K606643K374475J402318J702963N555672J3561759
11920C0290693J8701670J1694982m482501j6303333j8912370k0215049k1790839
11913b1016747j2984174P056790J9249319J0825662l292675k727097P161992O704867
11905A0977937m119565o332979N646275J4526359O821000q931590j6986005j3919927
11897a2318495o652246r94287J493765J624030J494758J384641j623610o981412
$$ plain form
11952 -23719308 -22263834 -15703522 -11737564 -8800096 -4558901 -3920139 -10386600 -17802445
11944 -17802445 -18938044 -15125972 -10209353 -3043812 6111974 10422183 7201385 5870456
11936 5870456 14518178 25405001 25558768 16392807 10352577 11554613 12372638 8114566
11928 8114566 3425290 3086863 5693506 8067981 9470299 11173262 16728934 30290693
11920 30290693 48992363 60687345 56204844 39901511 20989141 774092 -21016747
11913 -21016747 -34000921 -26944131 -7694812 3130850 -161825 -2888922 4273070 10977937
11905 10977937 6858372 525393 6171668 20698027 27519027 18587437 1601432 -12318495
11897 -12318495 -18970741 -19965028 -18471263 -16847233 -15352475 -13967834 -15591444 -22572856
11889b2572856p003715J611224Q301089L404991k871991O243535K3939351K4135721
11881C5187349k75450k4395958k4841773p707462O935928J0531940M284576r909466
11873a0190316k1966059j4475367J1170175K5887492J0801315j1713760r805574
11866b0292094R264999J3237026j763847q019823M608684J3544042M867962n069504
11858A0377445k611523N81366m875941n666099N738381R979264n685376j7928558
11850a0091041l138170J7907362Q705398k2290142l0596738k846513K4771823
11843a7578021K2014650L369015k413036O731284J3415459R168980j178262r974699
11835B3555370r316554M489306J9399467J4163328j3185794l6218128l0663372
$$ plain form
11889 -22572856 -29576571 -27965347 -19664258 -16259267 -19131258 -12887723 11051628 35187349
11881 35187349 34911899 10515941 -14325832 -22033294 -15097366 -4565426 -280850 -10190316
11873 -10190316 -32156375 -46631742 -35461567 -9574075 1227240 -10486520 -20292094
11866 -20292094 -11027095 2209931 446084 -7573739 -2965055 10578987 15446949 10377445
11858 10377445 7765922 8347288 3471347 -2194752 3543629 13522893 7837517 -10091041
11850 -10091041 -13229211 4678151 13383549 -8906593 -39503331 -42349844 -17578021
11843 -17578021 4436629 7805644 5392608 12123892 25539351 34708331 33530069 23555370
11835 23555370 14238816 18728122 38127589 52290917 39105123 2886995 -27776377
11828b7776377l174093K0478715K4998989J3255240m282319j5587870j1360783
11821c448498M490494J4557793P785238o350678j1663163n983798R18391L251384
11813C557163L075807K812404K452535J578914p77153m475725m450291M156448
11805G930102J5077080J5071880K190062j0837352j4344522j0351592j240720
11798C494938J3390510K3865158J4471936j0387427k4336749j5286401k720384
11791B491581m426921r059148j559117P283488K581560l884929M818260J5705315
11783A3950089O788747j0327473p009794J1794732J4761009r20461n545926Q177646
11775C1668569J1041721r264841k3448514r881602R177964O710205n740780l687585
$$ plain form
11828 -27776377 -30950470 -10471755 14527234 27782474 23500155 7912285 -3448498
11821 -3448498 1041996 15599789 23385027 17034349 5371186 -612612 305779 3557163
11813 3557163 6632970 9445374 11897909 13476823 12699670 8223945 3773654 7930102
11805 7930102 23007182 38079062 40269124 29431772 15087250 4735658 3494938
11798 3494938 16885448 40750606 55222542 44835115 20498366 5211965 2491581
11791 2491581 -1935340 -10994488 -12553605 -5270117 -2688557 -6573486 -1755226 13950089
11783 13950089 20738836 10411363 3401569 15196301 29957310 29036849 23490923 31668569
11775 31668569 42710290 33445449 9996935 115333 9293297 16003502 10262722 6575137
11767F575137P377226P027113j574584j175477M710627j501028j7357895k2431903
11759a8350784j1497506j41110J678154o76340k667960n822860o643422O06445
11751d3515383R235704O191031n818049r446233J563612J3941687J5795135J1036476
11743a016020P987272O635752L389298j491971o608995j1650015j3190667o097354
11735b2042700P055058J4935675J0172308j589042q714237o620828j516149k279390
11727a0599305r160598j1855688k555897J0454876J0778163k931761j3005560
11720b8875770p214612M954149Q901335N300058K230831r28221o769319p604306
11712c0005855K629773J2881055J0166435K381085M925054J1625537M099375j3487129
$$ plain form
11767 6575137 13952363 20979476 19404892 18229415 22940042 21439014 4081119 -18350784
11759 -18350784 -29848290 -29989400 -28311246 -28987586 -31655546 -37478406 -44121828 -43515383
11751 -43515383 -34279679 -28088648 -33906697 -43352930 -41789318 -27847631 -12052496 -1016020
11743 -1016020 6971252 13607004 16996302 15504331 8895336 -2754679 -15945346 -22042700
11735 -22042700 -14987642 -51967 10120341 8531299 -182938 -6803766 -8319915 -10599305
11727 -10599305 -19759903 -31615591 -34171488 -23716612 -12938449 -15870210 -28875770
11720 -28875770 -36090382 -31136233 -22234898 -16934840 -14704009 -15632230 -22401549 -30005855
11712 -30005855 -27376082 -14495027 -4328592 -1947507 2977547 14603084 18702459 5215330
11704E215330j7304483l178742O160960n8915l756905P684904J7987444J1041350
11696B3790943n75286J490989R209854L962008r719019j2576795l765549N18700
11688A2335845l364641l655092J375399k20027r808182j3195404n330467J011460
11680b0851109j184118q61562R117421J5795012O296441j0005891j5518109r977109
11672b7189024n264703k850295M922561J4993277J4583077L467064k316616N858119
11664F203460J6503748J5755768N124716o200850j4955451k0329415j7758828
11657a5656852p513167l63069k540688l849815N365795J4682065R203416k790367
11649c462682r27890J1452966R407447j2028162k6313270j6052862J577283O241908
$$ plain form
11704 5215330 -12089153 -15267895 -9106935 -9165850 -12922755 -5237851 12749593 23790943
11696 23790943 23215657 24706646 33916500 37878508 28159489 15582694 11817145 12335845
11688 12335845 8971204 5316112 6691511 6471484 -3336698 -16532102 -21862569 -20851109
11680 -20851109 -22035227 -22896789 -13779368 2015644 8312085 -1693806 -17211915 -27189024
11672 -27189024 -32453727 -35304022 -30381461 -15388184 -805107 2661957 345341 6203460
11664 6203460 22707208 38462976 43587692 37386842 22431391 2101976 -15656852
11657 -15656852 -23170019 -23533088 -26073776 -29923591 -24557796 -9875731 -672315 -3462682
11649 -3462682 -4390572 7062394 16469841 4441679 -21871591 -37924453 -36347170 -30105262
11641c0105262N952005J4882608K2227382J1947307l310894j043741R113437j728840
11633B7934002l0383970m0638467j8566553O492432P858023l127881m103072L237213
11625e1298273N489093L567712M997811O330867K854177J825456P844511R184839
11617i203807k265177j1495293k301949J3460088J2323207l925502j2327264m053576
11609a9789273Q516018J6235939K0109000J5622217l673751k4854238k4116270
11602a1950358k939027Q977450l571789j9406569j5332501l54479L436521k952950
11594d4093702j329634J1126950J8434521J2894996N641616O998694J1654777
11587B1328218R563692J453126l655666j492823K704710J916418k935852l540187
$$ plain form
11641 -30105262 -24153257 -9270649 12956733 24904040 21593146 20549405 29662842 27934002
11633 27934002 -2449968 -43088435 -61654988 -55162556 -47304533 -50432414 -54535486 -51298273
11625 -51298273 -45809180 -42241468 -37243657 -30912790 -28058613 -26233157 -18388646 -9203807
11617 -9203807 -11468984 -22964277 -25266226 -11806138 517069 -3408433 -15735697 -19789273
11609 -19789273 -11273255 4962684 25071684 40693901 37020150 12165912 -11950358
11602 -11950358 -14889385 -5911935 -9483724 -28890293 -44222794 -44577273 -41140752 -44093702
11594 -44093702 -45423336 -34296386 -15861865 -2966869 2674747 9673441 21328218
11587 21328218 30891910 32345036 28689370 27196547 29901257 31817675 28881823 25341636
11579B5341636L344080P230627l767920k1460530k1583116K545359K3317840J2097894
11571B7065870j8734427k9194403p414525J3137100L296873j8040091j2793783
11564d2677386J7666396L3434972J5372952p585536l584039J5340113J5556150
11557D3523622m827110j5642590m755640L463190r623660k3369250q925398K2395875
11549B239039L0201410J710712k9385607k8631745l842558J2852160J0938388
11542c918201P892901J4664904J8401267O542401j0256753j3553475m765422j040423
11534A3967199q315769j5188842j3206540o756651K757R194171J6277479Q941166
11526D914970j0334131j8074183k030154J6146343J1232014n917985n670717J1956819
$$ plain form
11579 25341636 28685716 35916343 32148423 10687893 -10895223 -8349864 14967976 27065870
11571 27065870 8331443 -20862960 -28277485 -15140385 -11843512 -29883603 -42677386
11564 -42677386 -25010990 8423982 23796934 16211398 12627359 27967472 43523622
11557 43523622 38696512 23053922 18298282 21761472 12137812 -11231438 -20156836 2239039
11549 2239039 32440449 34151161 4765554 -23866191 -27708749 -14856589 -3918201
11542 -3918201 3974700 18639604 37040871 43583272 33326519 19773044 15007622 13967199
11534 13967199 5651430 -9537412 -22743952 -29500603 -29497846 -20303675 -4026196 4914970
11526 4914970 -5419161 -23493344 -25523498 -9377155 1854859 -4063126 -9733843 2222976
11518B222976J8337827N456967p08460J3709175K3526267L906249k8106089l6674537
11510A670375j6207584P225651J3889176P153580k226923q247961p948142l365710
11502h057538l154819j0024027j2273572j347540J0039815M967599q594693o866609
11494c5311384J2813250K5721010J4706057p142850j6545013q638180L224770
11487a1172340O462293r7861q655206r785523p43815J1334305J7325591J5857270
11479B0524714J0788256K769777q706799j7464489j4737146j635809J0367911
11472A906415J2399984N741102l310987j0404847j4594552j6213589j3167621
11465c7644095o50640J9530985L1474691K0016928n112879j6701921p215880J545637
$$ plain form
11518 2222976 20560803 26017770 25309310 39018485 62544752 66451001 38344912 1670375
11510 1670375 -14537209 -7311558 6577618 13731198 11504275 3256314 -4691828 -8057538
11502 -8057538 -11212357 -21236384 -33509956 -34857496 -24817681 -19850082 -28444775 -35311384
11494 -35311384 -22498134 3222876 17928933 10786083 -5758930 -14397110 -11172340
11487 -11172340 -4710047 -4807908 -13463114 -23248637 -23992452 -12658147 4667444 20524714
11479 20524714 31312970 34082747 25375948 7911459 -6825687 -8461496 1906415
11472 1906415 14306399 20047501 16736514 6331667 -8262885 -24476474 -37644095
11465 -37644095 -38294735 -18763750 12710941 32727869 27614990 10913069 3697189 5242826
11457E242826m085081o883581Q082847K2083464J2194937q152465j1762187m825451
11449A1895309j2029202k5032161j1931066K1899358L0732586j667501l3175045
11442a9307722k4995512N202052J7722657P628271k410870l013155j343340J650209
11434a8867410R451485J4193948N512070j0468508j8191484j2995314j871383
11427c3236596P648676Q872420k171026j5553271j2144750Q661663K1888396J1808806
11419d225682l402742M3432J4866547J6626972K255515r278348p965095k044459
11411F876140N28848N34752j369164o067565r535194p517607l990185m003307
11403b4543282k971888N273378J4873216J4478529L678523p327852j0767979o162262
$$ plain form
11457 5242826 1157745 -5725836 2357011 24440475 36635412 28482947 16720760 11895309
11449 11895309 -133893 -25166054 -37097120 -15197762 15534824 13867323 -19307722
11442 -19307722 -44303234 -39101182 -21378525 -13750254 -16161124 -19174279 -20517619 -18867410
11434 -18867410 -9415925 4778023 10290093 -178415 -18369899 -31365213 -33236596
11427 -33236596 -25587920 -16715500 -18886526 -34439797 -46584547 -37922884 -16034488 -4225682
11419 -4225682 -7628424 -7584992 7281555 23908527 26164042 16885694 8920599 6876140
11411 6876140 7404988 7939740 6570576 503011 -9032183 -16549790 -20539975 -24543282
11403 -24543282 -27515170 -22241792 -7368576 7109953 10788476 3460624 -7307355 -13469617
11395a3469617K444256P432492K729793o360491p007498L148440J2842704J5054451
11387A6814530J3260384P217835p483912k0905226j4488375N962971J0838469
11380A1216676o977089j7336354k508662J2123330K971336r923699l39142J5390466
11372D616862Q626324p726058k294746J6572009J5442262l583862p958868N759023
11364B9452946Q545314n803210j2437528n779655q023533k0046099j4030119J2361795
11356a5760089K3588615N770617q240978M200508J7779995O123503j3145236j2271926
11348H045009N48394K239892m358351k996896L607058L181943j686668l554890
11340E025491p396671j5810194j5622034o98009J1710803Q807176M751108J2367110
$$ plain form
11395 -13469617 -11025361 -3592869 -863076 -7223567 -14231065 -11082625 1760079 16814530
11387 16814530 30074914 37292749 29808837 8903611 -5584764 378207 11216676
11380 11216676 4239587 -13096767 -15605429 -3482099 -510763 -10434462 -10773604 4616862
11372 4616862 13243186 5517128 3222382 19794391 35236653 31652791 23693923 29452946
11364 29452946 37998260 32195050 19757522 13977867 5954334 -14091765 -28121884 -15760089
11356 -15760089 7828526 13599143 5358165 9558673 27338668 33462171 20316935 8045009
11348 8045009 8593403 10833295 6474944 3478048 7085106 10267049 8580381 5025491
11340 5025491 -2371180 -18181374 -33803408 -34501417 -22790614 -13983438 -9232330 3134780
11332C134780J5901849m43538j8727033j3451730O281249J3299626O452070M974613
11324A7421886J0134251O406001n654511r665069l305728M25721r23911J460085
11316A6298725N322381j28699j1436769j4867145j0911836j1255580j3881209
11309d0860132n447472J2595524K3447963K0169999J0600401l63639j2013549
11302H129095j5593601m502186P261895K164648r557315m143076J3274677J3747913
11294A0782050o066614j5324905J034129J8159280J2624395k667896n013390J980068
11286A5507117J653203n328632o774132k293497q78781m067686o872874p415620
11278a6470902m660572L087597Q778811K68573j6913663j8802536J208313J5879833
$$ plain form
11332 3134780 19036629 18593091 -133942 -13585672 -7304423 5995203 12447273 17421886
11324 17421886 27556137 33962138 28307627 18642558 15336830 15762551 14838640 16298725
11316 16298725 21621106 21492407 10055638 -4811507 -15723343 -26978923 -40860132
11309 -40860132 -46307604 -33712080 -10264117 9905882 20506283 20142644 8129095
11302 8129095 -7464506 -11966692 -4704797 -2540149 -12097464 -16240540 -2965863 10782050
11294 10782050 4715436 -10609469 -9575340 8583940 21208335 18540439 13527049 15507117
11286 15507117 17160320 11831688 5057556 2764059 1885278 -2182408 -9055282 -16470902
11278 -16470902 -21131474 -18043877 -9265066 -8996493 -25910156 -44712692 -43504379 -27624546
11270b7624546L054307j7773869j3543898J2067613K6601941J9225529J0702941
11263A2710018J2924198J0595271p385760k4804503k1810309m269559N947517
11256a6093127l50520j2722968j6177627n280112J1503690J8148341Q593422k517372
11248a4896273J548225J1505112J885551k6617863l8378748j0814919K9560707
11241d6208208M0293030J7262161q135255j5212500j0285981k226098Q909938
11234a5602913J6767599R568193o792438j0279913L924223J3901789M917406r354162
11226G049784j1978219o981130k977186N286193J9262307K1226447R85773j9407141
11218A2466828j5125191J689348K429929r140201m670076J6293830K0811330l689093
$$ plain form
11270 -27624546 -24570239 -42344108 -55888006 -43820393 -17218452 2007077 12710018
11263 12710018 25634216 36229487 28843727 4039224 -17771085 -22040644 -16093127
11256 -16093127 -16443647 -29166615 -45344242 -50624354 -39120664 -20972323 -12378901 -14896273
11248 -14896273 -13348048 -1842936 42615 -26575248 -64953996 -75768915 -46208208
11241 -46208208 -5915178 11346983 3211728 -12000772 -22286753 -24512851 -15602913
11234 -15602913 1164686 10732879 3940441 -6339472 -2415249 11486540 16403946 7049784
11226 7049784 -4928435 -11909565 -14886751 -9600558 9661749 30888196 31873969 12466828
11218 12466828 -2658363 -969015 1460914 -7679287 -12349363 3944467 24755797 21066704
11210B1066704k5919214j6576268J0028219J9359191K679064j8433756k1642715
11203b9438775m399039J6844494K0683986K646016j5362604j0168079R637877
11196i556124J4916817l24256j1750480n388541L172912O22257k081644M386217
11188f002842P264015k196023p073487O432679K0293019J2004647p213054j0579045
11180A2929909J978782R600037P782677Q891203J1859327K632758j6196432k4770616
11172A4707645j7319043r191420r365248r146850k924694J628275J102747M950207
11164b5558381J7194501K4381695J2545503j2044067k7454056j9003839M923977
11157b5014667K0005519J2182715m479844o212456N257817N532744r727609j2725908
$$ plain form
11210 21066704 -4852510 -21428778 -11400559 7958632 10637696 -7796060 -29438775
11203 -29438775 -33837814 -16993320 3690666 6336682 -9025922 -19194001 -9556124
11196 -9556124 5360693 5036437 -6714043 -12102584 -8929672 -8307415 -10389059 -6002842
11188 -6002842 1261173 -934850 -8008337 -1575658 18717361 30722008 23508954 12929909
11180 12929909 14908691 24508728 32291405 41182608 53041935 55674693 39478261 14707645
11172 14707645 -2611398 -11802818 -21168066 -30314916 -33239610 -31611335 -30508588 -25558381
11164 -25558381 -8363880 16017815 28563318 16519251 -10934805 -29938644 -25014667
11157 -25014667 -5009148 7173567 2693723 -3518733 1739084 7271828 -2455781 -15181689
11149a5181689R473144K5595186O777821k2859497k0876398O274182J5677993
11142D880742j934397j3555525n210204j029345j0914868q968454J5068133K7826378
11134F162460N352200k2924259j8249841P881114J6069860J115495p324587L634716
11126h282842J4242818P490045q259507j5917940r522096M764728J4198556Q544786
11118G258548n281187n971661J1526868K1263602K375882k3348881j8951244R865540
11110a262533J9695047m353608k4356668p895769K1527861K0712548p688411k0908118
11102d529651n50034K3735526K1390034J766099q462005o443279q670153j7954096
11094B82441k0332795j1685829l821880j746650L328575J2513437J2325779o05284
$$ plain form
11149 -15181689 -5708545 19886641 26664462 3804965 -17071433 -10797251 4880742
11142 4880742 2946345 -10609180 -15819384 -16848729 -27763597 -36732051 -21663918 6162460
11134 6162460 11514660 -11409599 -29659440 -21778326 -5708466 -4592971 -11917558 -8282842
11126 -8282842 5959976 13450021 5190514 -10727426 -20249522 -15484794 -1286238 7258548
11118 7258548 1977361 -3994300 7532568 28796170 31172052 7823171 -11128073 -1262533
11110 -1262533 18432514 14078906 -10277762 -18173531 3354330 24066878 16378467 -4529651
11102 -4529651 -5079685 18655841 40045875 41811974 33349969 26906690 18236537 282441
11094 282441 -20050354 -31736183 -35558063 -37304713 -33976138 -21462701 -9136922 -9742206
11086i742206q445599l8311R411809M856779r94477Q839063J9986467O308526
11078C0182051k2558693k8686203k876127K0522899J6082494K424506O697357
11071B1788284K0850846J8552163j945622j8795924k1110152j7116911j1399601
11064i176917J533843J7884195K0391795L354983j3497077r454980P828188J2582725
11056C1446755k377323j5876065j0209981L158863L424145n570680k621800J2989778
11048A4363692J6910598l45049j4713530n770199R700735M463132j5192141j9736832
11040a0319594j810674J6164992J6675272M752476q028443j4732715r190908P412366
11032I22772J7571024O900949j0227046q485672Q310328J2886121j081303j1807418
$$ plain form
11086 -9742206 -18187805 -18226116 -8814307 -3957528 -4952005 3887058 23873525 30182051
11078 30182051 7623358 -21062845 -23938972 -3416073 12666421 15090927 21788284
11071 21788284 42639130 61191293 59245671 40449747 19339595 2222684 -9176917
11064 -9176917 -7643074 10241121 30632916 33987899 20490822 11035842 18864030 31446755
11056 31446755 29069432 13193367 2983386 6142249 9566394 3995714 1373914 14363692
11048 14363692 31274290 30929241 16215711 10445512 20146247 24609379 9417238 -10319594
11040 -10319594 -12130268 4034724 20709996 25462472 17434029 2701314 -6489594 922772
11032 922772 18493796 25394745 15167699 6682027 14992355 27878476 26797173 14989755
11024A4989755q994097o541023q701751P26572K1880251K5966399r03025k9963007
11016H460074k8688411m497607J1925226P533703p911241j9602329j4661161R765946
11008c7675800L2255255K3710266q898830k3326553k438627J9066748J0690625
11001A3383084o807974k514205R796700n43806k3867305k6516459p543516O029429
10993c8584052Q261581J3518492J6107940j745003k5360782j9522419J2200264
10986c5123979K6821471Q487586r456999j655120J3160235J1405288P99632m748633
10978I689481j1524527k2668287j9672916N527934K7004978K2237866R068802
10971A9663331J3658044K2578346M645059l1697909m3626890j6944237J2630733
$$ plain form
11024 14989755 5995658 -545365 -9247116 -8520544 13359707 39326106 38423081 8460074
11016 8460074 -20228337 -24725944 -12800718 -5267015 -13178256 -32780585 -47441746 -37675800
11008 -37675800 -5420545 18289721 9390891 -13935662 -16374289 2692459 13383084
11001 13383084 6575110 4060905 13857605 13313799 -10553506 -37069965 -44613481 -38584052
10993 -38584052 -30322471 -16803979 -696039 -2441042 -27801824 -47324243 -35123979
10986 -35123979 -8302508 185078 -9271921 -10927041 2233194 13638482 14438114 9689481
10978 9689481 -1835046 -24503333 -44176249 -38648315 -11643337 10594529 19663331
10971 19663331 33321375 55899721 60544780 28846871 -14780019 -31724256 -19093523
10964a9093523J1091434r952085j7079991k439364J2352816R870650l666492j1558348
10956c0474903o794334M016650J0407016Q261124K294445j46978K358066M600453
10948e478461L310427K109754L636717J698058r176895j8672708r720352J3769336
10940a8524124K5180827J1936965l242152L873879J9576001J3474979j0918671
10933D1357704k0848931q001436k2629j0630948j6354154k57983J6327066J0211937
10925A1780626n821996r793318q241063j5395683j8377386N74030K5160426K6044798
10917E930434P819147j959067L62347l206828j1734405p393711N733778M762547
10909C14242j0197636j5617260p230545m714512j0445606l085805K0105297L2451179
$$ plain form
10964 -19093523 -8002089 -17954174 -35034165 -37473529 -25120713 -15250063 -18916555 -30474903
10956 -30474903 -37269237 -33252587 -22845571 -14584447 -12290002 -12436980 -10078914 -5478461
10948 -5478461 -2168034 -58280 3578437 5276495 -3900400 -22573108 -32293460 -18524124
10940 -18524124 6656703 18593668 15351516 19225395 38801396 52276375 41357704
10933 41357704 20508773 12507337 12484708 1853760 -14500394 -14758377 1568689 11780626
10925 11780626 5958630 -3834688 -12075751 -27471434 -45848820 -45274790 -20114364 5930434
10917 5930434 13749581 11790514 12152861 8946033 -2788372 -10182083 -4448305 314242
10909 314242 -9883394 -25500654 -32731199 -37445711 -47891317 -50977122 -30871825 1579354
10901A579354K0198920J707716n776648n973065k037631J0323157J9791750O309074
10893D6122627j9122817k0814655L378977J3209519p413146k0962637M31202K6047866
10885B0876936J5905927j6937251l1543108j8484913K384123J9455244K9687437
10878B1344395K2950207l14677j5063624n880890N277978n034609k1924929k0351806
10870a8997955q133837m938058l078007J1019013J9991237M248298j3869534k579893
10862a6338736K0906562J6113662j0746477j7776285N47776R969474J927349L017101
10854G620426J5730502R945010j5752142k2958722l96796J4539965K647524m405261
10846F970506J3676642K4938885L545868j9039561n791175K1436416J7397269
$$ plain form
10901 1579354 21778274 23485990 17709342 11736277 9698646 20021803 39813553 46122627
10893 46122627 26999810 6185155 9564132 22773651 15360505 -5602132 -5170930 20876936
10885 20876936 36782863 19845612 -11697496 -30182409 -27798286 -8343042 21344395
10878 21344395 44294602 43979925 28916301 23035411 28313389 23278780 1353851 -18997955
10870 -18997955 -27131792 -32069850 -35147857 -24128844 -4137607 110691 -13758843 -16338736
10862 -16338736 4567826 20681488 9935011 -7841274 -7293498 2675976 4603325 7620426
10854 7620426 23350928 33295938 17543796 -5414926 -5811722 8728243 11375767 6970506
10846 6970506 20647148 45586033 49131901 30092340 24301165 45737581 63134850
10839F3134850j4275373l1493154j8040901M925163J8502707J9902329P871441
10832E0527062j2424677k0601059o915099N965790l697257j7860404p052396J7702824
10824E644784K0671249l30527j2733412l715558M131470m509260j5295603j3092894
10816a9229751l973126P95613M9350l552306o102654P55617J5993037J9031881
10808C767661j342986j8452585k692896K4244544J5579186k1760737k9046436
10801b9704249J1055701M0262843J2833209l3334156l6572316k293883J7208635
10794b0544216O567462m216756j366925k508275j1081819n483712J7106612K7909117
10786F381488J1707313r396975j2723284n720618l352876j671100O526608J1902354
$$ plain form
10839 63134850 48859477 17366323 -674578 4250585 22753292 42655621 50527062
10832 50527062 38102385 17501326 10586227 16552017 12854760 -5005644 -12058040 5644784
10824 5644784 26316033 25985506 13252094 9536536 13668006 9158746 -6136857 -19229751
10816 -19229751 -23202877 -22407264 -22357914 -25910220 -32012874 -31257257 -15264220 3767661
10808 3767661 2424675 -16027910 -18720806 5523738 21102924 -657813 -29704249
10801 -29704249 -18648548 21614295 34447504 1113348 -35458968 -37752851 -20544216
10794 -20544216 -13976754 -18193510 -19560435 -22068710 -33150529 -38634241 -21527629 6381488
10786 6381488 18088801 8691826 -4031458 -9752076 -13104952 -14776052 -8249444 3652910
10778C652910N520657j719765K692956R401166L031719r472205q612085N463323
10770I958676J1851035l10788j7106374j8737057j833882J8924482K4213455O728416
10762C3687963j8862356k6995176r805965J1802058J4952369L778876k151223
10755F406546O46361k42620n939885l397799P793723R981346k548726j0725206
10747A973740j635884P857324k425484k1572819k2913795m616079R558871P228739
10739b6545387J369179M526831J0329072Q473436J925146k42447L781616R500725
10731A3118171J1689157N177639r706459j9875384j0747330J1087675K1112831
10724B1856300Q932808q419971j2995290q417914m879526m42134O458267L747255
$$ plain form
10778 3652910 9173567 7453802 10146758 19547924 22579643 13107438 4495353 9958676
10770 9958676 21809711 21498923 4392549 -14344508 -16178390 2746092 26959547 33687963
10762 33687963 14825607 -12169569 -21975534 -10173476 4778893 8557769 6406546
10755 6406546 7052907 6810287 870402 -2527397 5266326 15247672 12698946 1973740
10747 1973740 337856 8195180 5769696 -15803123 -38716918 -43332997 -33774126 -26545387
10739 -26545387 -25176208 -20649377 -10320305 -1846869 78277 -164170 3617446 13118171
10731 13118171 24807328 29984967 20278508 403124 -10344206 743469 21856300
10724 21856300 30789108 22369137 9373847 955933 -3923593 -4365727 2092540 5839795
10716E839795j3653598k4913930j0201446J4987866K0189742N905844k021370
10709c867097J503423l385338j8051013j6928125O053052K0041251N907168j0802231
10701a9528910j306295K0019652K1358062L748567q089706r764986j6138629k4536778
10693c4239023j5556957Q985828K1729835J0011601o234572n729747O656694J3519347
10685h56994R116587M64948l849641K83437Q544939R006525l131092j4290416
10677E288293r555473K910686K307828j2012274j8758538o992504J0302782J8138514
10669h370686J5120421L819317j3207528k2974500j0319909J5600855K5172348
10662D840318Q202745j1710559j3015631l203027L277743R594200J9976546K0511148
$$ plain form
10716 5839795 -7813803 -32727733 -42929179 -27941313 -7751571 -1845727 -3867097
10709 -3867097 -2363674 -5749012 -23800025 -40728150 -34675098 -14633847 -8726679 -19528910
10701 -19528910 -20835205 -815553 20542509 24291076 16201370 6436384 -9702245 -34239023
10693 -34239023 -49795980 -40810152 -19080317 -9068716 -15303288 -21033035 -14376341 -856994
10685 -856994 8259593 8724541 4874900 5158337 13703276 22709801 19578709 5288293
10677 5288293 -4267180 -1356494 951334 -11060940 -29819478 -36811982 -26509200 -8370686
10669 -8370686 6749735 10569052 -2638476 -25612976 -35932885 -20332030 4840318
10662 4840318 13043063 1332504 -11683127 -14886154 -11608411 -2014211 17962335 38473483
10654C8473483M64806k3053048k6074599j2064100k633975l840072m425075j8121
10646c3170701L595620O520530J2935897J6629737Q126883o120312j0203680k666469
10638d352495L194505Q47378m288186q677520j2735615j1254159J107720J6249655
10630a9908717K0701902J4791308P803145n01097j3636147j9790295n616930J3331801
10622b825030O542385k2149250l1473978k399063K9532318K3588061q722455k3654594
10614c1561606o951131J4934407J8960234J1571039Q193826J0424051J1343855
10607C6914675P391313k104517j4913421k0614193q252419J4559383K3101757
10600C6082578N393339j9756544k5278358q374835J1090274J8005875J3850095
$$ plain form
10654 38473483 38938289 15885241 -10189358 -22253458 -24887433 -28727505 -33152580 -33170701
10646 -33170701 -29575081 -23054551 -10118654 6511083 14637966 8517654 -1686026 -4352495
10638 -4352495 -1157990 -310612 -4598798 -13276318 -26011933 -37266092 -36158372 -19908717
10630 -19908717 793185 15584493 23387638 22886541 9250394 -10539901 -16156831 -2825030
10622 -2825030 3717355 -18431895 -49905873 -52304936 -22772618 815443 -7907012 -31561606
10614 -31561606 -38512737 -23578330 -4618096 6952943 15146769 25570820 36914675
10607 36914675 44305988 42201471 27288050 6673857 -1578562 12980821 36082578
10600 36082578 41475917 21719373 -3558985 -11933820 -843546 17162329 31012424
10593C1012424M811750o069271j3534683j1183679k294049J898209j507306m269264
10585a135869l762828p563519j5136162j2420762M018191J4976049O825861m912457
10577a9111496r43837Q642821L624583o684845K630175K3927421K2161811o825913
10569B7420720k3041694l020879K2265893J4842268j3874384k4928624j0418830
10562a0755530L266271J468289j665482O869836J7595506J5240879J240922r664271
10554B3596420q954386l710558n539959j2627562j0460727M557181J3709924K718524
10546C288857j1265209l191182J6717295J4904655j0906350k5352348j1225922
10539b7030204O032906M331422j974845L720341Q438135q95111p672447M182095
$$ plain form
10593 31012424 35824174 29754903 16220220 5036541 2742492 4640701 3133395 -1135869
10585 -1135869 -4898697 -12462216 -27598378 -40019140 -36000949 -21024900 -14199039 -19111496
10577 -19111496 -20055333 -11412512 -7787929 -14472774 -11842599 12084822 34246633 27420720
10569 27420720 4379026 1358147 23624040 38466308 24591924 -336700 -10755530
10562 -10755530 -7489259 -6020970 -7686452 -816616 16778890 32019769 33260691 23596420
10554 23596420 14642034 10931476 5391517 -7236045 -17696772 -13139591 570333 3288857
10546 3288857 -7976352 -11167534 5549761 20454416 9548066 -15804282 -27030204
10539 -27030204 -20997298 -16665876 -18640721 -14920380 -6482245 -7377356 -15049803 -10867708
10531a0867708J7688857J1936675j422019k738120q53248j1104994k0338417j0377975
10523b8076949M567787J690631q274659j413989J3982280J2082663m716672j3169965
10515b3328873r239277m330292L731385J9186398K4179568M607168j6355226r682188
10507a1231337J1687334J5521220J470696r681337j4840025j6580385j742262
10500b5396096K4722681K2565501j6687384l3630121M689199L2696699o664535
10493B295944m7600987j0205942L8020082j3645513r1519978j2525705J97897723
10486F2715624K77105872R4913775j41758840j80207863n5578285K4537880O6748
10479H1794911k3991913j942724M058927k3531203k5334272Q047154J4911901
$$ plain form
10531 -10867708 6821149 18757824 17335805 14597685 13744437 2639443 -17698974 -28076949
10523 -28076949 -23509162 -21818531 -30093190 -31507179 -17524899 -5442236 -10158908 -23328873
10515 -23328873 -32568150 -36898442 -33167057 -13980659 10198909 14806077 -1549149 -11231337
10507 -11231337 455997 15977217 17447913 7766576 -7073449 -23653834 -25396096
10500 -25396096 -673415 21892086 5204702 -28425419 -23736220 8960479 2295944
10493 2295944 -45305043 -55510985 -17490903 -31136416 -122656394 -135182099 62715624
10486 62715624 339821496 434735271 292976431 112768568 57190283 81728163 81794911
10479 81794911 57802998 55860274 59919201 36387998 11053726 19100880 34012781
10472C4012781j7144563k8185490L63947J5965461k867943j3495832J589727N171403
10464d590509j2494194r902930K1178430L0285237k639349k8827984j3232015
10457b0223314J4250239K1605560K2618322K9471173K0375785j0543385k8268916
10450D9285464j5876799n055662j5851490j9984899J710416J8680948N798708
10443A8706686j0242730m66391J5400386R818767j684787M967536J3004345l443803
10435D6060009k7060256k3461438J255935J2546175K442002o565190l240233R20410
10427B897414k449523p577562p275358K15813J2155083J8996841J1307587m163212
10419B4107083j0054189m753076l345605p926272k665243J3734944J9118729L646572
$$ plain form
10472 34012781 16868218 -11317272 -10953325 5012136 2144193 -11351639 -9761912 -4590509
10464 -4590509 -17084703 -26987633 -5809203 24476034 21836685 -6991299 -20223314
10457 -20223314 -5973075 15632485 38250807 67721980 88097765 77554380 49285464
10450 49285464 33408665 28353003 12501513 -7483386 -5772970 12907978 18706686
10443 18706686 8463956 7997565 23397951 33216718 31531931 36499467 49503812 46060009
10435 46060009 18999753 -4461685 -3205750 9340425 11782427 5217237 1977004 2897414
10427 2897414 447891 -7129671 -14405029 -14189216 -2034133 16962708 28270295 24107083
10419 24107083 14052894 9299818 5954213 -1972059 -4637302 9097642 28216371 31862943
10411C1862943j2714673j2334301l883313n65167L68026L079095K651246M63397
10403H927253N059133R816403r61651j7278192j0739160J4472759J9941303l105635
10395B6132213j4566489P060431K5378308O878227k2493704k1862729j87280P504857
10387A3843834l47130j064817N496966K840994n676873n375506j221957n059175
10379C436336o918529O369890J9161947Q683298j4897060k3817163j4688700k923994
10371b5593975Q848844K2644462K2589463j159578k1080181n999500K5868921
10364B6118456L0336341M511458j4005987r937054n918663j4470994j9642373
10357c008816j3327715q853796r226866L40835J8221848K1287167N922709j246214
$$ plain form
10411 31862943 19148270 6813969 2930656 2365489 2733515 5812610 8463856 8927253
10403 8927253 13986386 23802789 22841138 5562946 -5176214 9296545 29237848 26132213
10395 26132213 11565724 18626155 44004463 50882690 28388986 6526257 6338977 13843834
10387 13843834 13496704 12431887 17928853 20769847 15092974 9717468 8495511 3436336
10379 3436336 -3482193 2887697 22049644 30732942 15835882 -7981281 -22669981 -25593975
10371 -25593975 -16745131 5899331 28488794 27329216 6249035 249535 26118456
10364 26118456 56454797 60966255 46960268 37023214 31104551 16633557 -3008816
10357 -3008816 -16336531 -25190327 -34417193 -34076358 -15854510 5432657 11355366 10109152
10349A0109152J1898330K1534388R170557p425227o786672M46738n314915j4982448
10341A8649903n875538J7388719K5549300O233276j9284457k4466716p863280
10334A0331207J0690241J5331564Q155248J94103m026271p675555j1092361r802381
10326A2105795m254857j034302j066335J612155N327975N82480q785562m053219
10318D34130J5920545K2586988j006680k7010476j9578367R882788J8585122l263875
10310A6550175k0538982q436519J4433666J9223309N904699n866936n974612L74962
10302A5669762L793498k528880j7836014k9605086k3496228j176201K0380474
10295c4798675K8115920K2116740P954408p477502j4120924o850299M842843P981459
$$ plain form
10349 10109152 22007482 43541870 52712427 45287200 38500528 38947266 33632351 18649903
10341 18649903 12774365 30163084 55712384 61945660 42661203 18194487 10331207
10334 10331207 21021448 36353012 44508260 44702363 40676092 33000537 21908176 12105795
10326 12105795 7850938 6816636 5750301 7362456 12690431 13272911 4487349 434130
10318 434130 16354675 38941663 37934983 10924507 -8653860 1228928 19814050 16550175
10310 16550175 -3988807 -12425326 2008340 21231649 27136348 21269412 15294800 15669762
10302 15669762 19463260 16934380 -901634 -30506720 -54002948 -55179149 -34798675
10295 -34798675 -6682755 15433985 23388393 15910891 1789967 -5060332 -217489 7763970
10287G763970M572383M948654P007365M07211j0850508j0998019R51169P930238
10279A1732463K019542m806031k643966K570926M382053O978346J2245394J1696943
10271D4175670J147088j0125292j3827888j3382295j1767093k621810J5167262
10264H765642K6101616J5531481q240219k2208510j6077411j267886O314950L916377
10256A2836040L21634J518073K503325m713723j7033311k0715026r086630O650553
10248b7719065J0661708J619565q426457r968377l433116N375637R957087O865452
10240a5067566N48009q46068J022392m917153j8241324j9813785J499244K6878963
10232b8937288K9717801J1518752k833077l07892Q461885J0128852L938401l947374
$$ plain form
10287 7763970 12336353 17285007 24292372 24699583 13849075 2851056 3802225 11732463
10279 11732463 13752005 8945974 6302008 8872934 13254987 20233333 32478727 44175670
10271 44175670 45322758 35197466 21369578 7987283 -3779810 -6401620 8765642
10264 8765642 34867258 50398739 42158520 19950010 3872599 2604713 8919663 12836040
10256 12836040 13157674 14675747 17179072 12465349 -4567962 -25282988 -34369618 -27719065
10248 -27719065 -17057357 -15437792 -23864249 -33832626 -37265742 -31890105 -21933018 -15067566
10240 -15067566 -14519557 -15365625 -14343233 -19260386 -37501710 -57315495 -55816251 -28937288
10232 -28937288 780513 12299265 9466188 9158296 17620181 27749033 31687434 27740060
10224B7740060p733693m317688J511379q55024j0705840j1002642N915592K0338425
10216B0890569J1764024q751648j5877680q831496o021917r374198m846168N501635
10208a5546879M964337l289620L310447K5318239L2569269R040830k1084277k6950176
10200H332170q755597J1598137J8780320J0924494m945790j4149632o304932P029214
10192B2508384L575878j5620337k3992077q785010R594977R149897l135702o857880
10184a3561870J781151J0459439J0218756K680474m624683m131555K892212L515918
10176I229842r138442j9347129p948363J5743311K4189024J1862952j049648m459016
10168A9082531p208566q049722O781452K8773559K6894084l306916k5832993j7903882
$$ plain form
10224 27740060 20006367 15688679 17200058 16345034 5639194 -5363448 552144 20890569
10216 20890569 32654593 23902945 8025265 -806231 -6828148 -16202346 -21048514 -15546879
10208 -15546879 -10582542 -13872162 -10561715 14756524 47325793 56366623 35282346 8332170
10200 8332170 -423427 11174710 29955030 40879524 35933734 21784102 15479170 22508384
10192 22508384 26084262 10463925 -13528152 -22313162 -12718185 -3568288 -6703990 -13561870
10184 -13561870 -11780719 -1321280 8897476 11577950 6953267 2821712 5713924 9229842
10176 9229842 91400 -19255729 -27204092 -11460781 12728243 24591195 23541547 19082531
10168 19082531 11873965 3824243 10605695 39379254 66273338 62966422 37133429 19229547
10160A9229547k751753o353773j5626582q285149N925391O648127R46151O022531
10152E754490J3868901P068098o166481n948002L206135K136830p876399j0448381
10144A595191n189712l687391k701841Q735711K1730518J6516449m386316j8752943
10136A3859666j7420544r854704j194855J0898147J9502303J3602817j055442
10129B8337388q362950o705204o459826p291871o61545R327713J1021901P185711
10121B6391317Q309309Q922872l275087j8569653j4597533N606424J4469868K309973
10113B9567490r746665o048387J518594j720172r801407j0317968m196762O44966
10105a0100311K266745K723377L708431Q353547J6589623J8365692M996850j3421914
$$ plain form
10160 19229547 16477794 10124021 -5502561 -13787710 -7862319 -1214192 -268041 5754490
10152 5754490 19623391 26691489 20525008 14577006 17783141 19919971 12043572 1595191
10144 1595191 -3594521 -7281912 -9983753 -1248042 20482476 36998925 32612609 13859666
10136 13859666 -3560878 -13415582 -14610437 -3712290 15790013 29392830 28337388
10129 28337388 19974438 13269234 6809408 -482463 -1144008 8183705 19205606 26391317
10121 26391317 34700626 43623498 40348411 21778758 7181225 12787649 27257517 29567490
10113 29567490 19820825 13772438 15291032 13570860 3769453 -6548515 -10745277 -10100311
10105 -10100311 -7833566 -5110189 -1401758 6951789 23541412 41907104 46903954 33482040
10097C3482040j7650032n877599N986991R495433J0171773R138691k76012j4312338
10089C0158947j7831877p212092L794110N906848M606459M312965K71357q146762
10081A5859955j2418753q724300k910730R85071L222234K07747r327147j2384663
10073b5490586L446113K4894651K6327508P867265n554682m036969k743661q817693
10065A5891946r931666l305863l634616j1317319o219959J2805344J7258244k927349
10057H618762j6017045J270290K3644797J8976665J59294j876021P979232M159992
10049D6915966q548188m298400J2775769J1730244j2003286k8125851k0540080
10042b093826p084555k543666K237411J2128086J1601506n767878j8829778r688125
$$ plain form
10097 33482040 15832008 9954409 15941400 25436833 35608606 44747297 44471285 30158947
10089 30158947 12327070 5114978 8909088 14815936 19422395 23735360 24006717 15859955
10081 15859955 3441202 -5283098 -8193828 -7208757 -3986523 -3778776 -13105923 -25490586
10073 -25490586 -22044473 2850178 29177686 37044951 31490269 27453300 24709639 15891946
10065 15891946 5960280 2654417 -980199 -12297518 -18517477 -5712133 11546111 8618762
10057 8618762 -7398283 -6127993 17516804 36493469 36652763 34776742 42755974 46915966
10049 46915966 38367778 34069378 46845147 58575391 46572105 18446254 -2093826
10042 -2093826 -9178381 -11722047 -9484636 2643450 14244956 8477078 -10352700 -20040825
10034b0040825Q138806J2071625L628548j008114O7983l404740j0524129q701898
10026a9772744M634810J5684666J1979009l282953j6197964j5334193l76416J7076475
10018e589310K2284160J1504029l619011q997422k999644N222298Q840853Q653432
10010C5299385O551686J049485p524652j2226473n988574P302465J4191693P706312
10002D6361327k575379l155077L459165J707641j2568094k2776015j4678438J145059
9994c079811L218480r309669j4958061j505217J5810002J5942862J134230p957140
9986g04324j431628R145896J0649240O299598O036362Q023385K193333j0580928
9978B9630934j6326807p740762N358346J0339277O079982k647441j2991559j8068675
$$ plain form
10034 -20040825 -11902019 169606 3798154 2790040 2858023 -546717 -11070846 -19772744
10026 -19772744 -15137934 546732 12525741 9242788 -6955176 -22289369 -22665785 -5589310
10018 -5589310 16694850 28198879 24579868 15582446 12582802 17805100 26645953 35299385
10010 35299385 41851071 42900556 35375904 23149431 17160857 24463322 38655015 46361327
10002 46361327 43785948 40630871 44090036 45797677 33229583 10453568 -4224870 -3079811
9994 -3079811 138669 -9171000 -24129061 -25634278 -9824276 6118586 7252816 -704324
9986 -704324 -2135952 7009944 17659184 23958782 29995144 38018529 40211862 29630934
9978 29630934 13304127 5563365 10921711 21260988 27340970 24693529 11701970 -6366705
9970f366705p471524J3254274J8687291j792831j9709146m546821K5570615K5101030
9962D2726183r388765l1017067j2961574J3358230J0928218q384819j2173955
9955f913549j651575q76629j0352536r331928M599651J2815414Q500038J737428
9947a473686n149110j7659442k6129312j2863502J5730392L2296558K7321704
9940A2073602J8040461J5054635Q533470n150045j1208425k553012O171375L326333
9932D4288394k451773j848065o89051l293648q67262Q771800J0040158m632229
9924D9318324j6446879p818848P226960L310566j5990301k2562500n437615J4168563
9916E768270J3385679k982638j1840586k325389J2120417J2824251J114952l691440
$$ plain form
9970 -6366705 -13838229 -583955 18103336 16310505 -3398641 -7945462 17625153 42726183
9962 42726183 33337418 2320351 -10641223 2717007 13645225 5260406 -6913549
9955 -6913549 -8565124 -9441753 -19794289 -29126217 -24526566 -11711152 -3211114 -1473686
9947 -1473686 -6622796 -24282238 -50411550 -63275052 -47544660 -15248102 12073602
9940 12073602 30114063 45168698 53702168 48552123 37343698 34790686 40962061 44288394
9932 44288394 41836621 39988556 39299505 36005857 35138595 43910395 53950553 49318324
9924 49318324 32871445 25052597 32279557 35590123 19599822 -2962678 -8400293 5768270
9916 5768270 19153949 16171311 4330725 2005336 14125753 26950004 28064956 24373516
9908B4373516P515252J9447712J5191936J027613o648624q196746j3614596j7107018
9900B1989045n012390J4488414J7802862K570718r556963p435792Q48285J2630276
9892D8324455L0218857L6640295J2843791j8378318j3590235J9247453K5867267
9885A41173565l718447j5627048J2115296L0355230J7603139L1965340R2491469
9878C06358544R4245421m5905517k17484827k28974052p3613528N9127470N0199976
9871e6046513j3106314j2735669K5837522K0447468j4873201j4123274J2582599
9864e2017382O751052k2802562j6923800K1874192L2082808K453924j1607254
9857d0189022J1733958K6442116L892065j9568489r495038J1149186P905434q907014
$$ plain form
9908 24373516 31888768 51336480 66528416 67556029 60907405 52710659 39096063 21989045
9900 21989045 16976655 31465069 49267931 51838649 42281686 34845894 35694179 48324455
9892 48324455 78543312 115183607 128027398 109649080 96058845 115306298 141173565
9885 141173565 137455118 121828070 133943366 164298596 181901735 213867075 306358544
9878 306358544 400603965 354698448 137213621 -91760431 -165373959 -106246489 -56046513
9871 -56046513 -69152827 -81888496 -56050974 -35603506 -50476707 -64599981 -52017382
9864 -52017382 -45266330 -68068892 -84992692 -63118500 -31035692 -28581768 -40189022
9857 -40189022 -28455064 -2012948 1879117 -17689372 -27184410 -16035224 -8129790 -17036804
9849a7036804r184864P660631J9461345J5234393n38882j9084613k7155097j4768434
9841d5412325N808954J0093681j582269k996537J3249075K0884367M289859j4040080
9833i705275j0974015J451362K724908L09050R827019J9758422R032334j3440499
9825H983306j9433503m484844R609781J1598467J1378844J3731713Q662824o828989
9817C3217599j9646647k0120642j3111038m652917N333983J2040153N677785r583939
9809a0845663j3611464J746394J7261013J2083991o937301j6818597j0542128
9802b7663755p50030L618708O107624Q233334M260778m367259n194369N580772
9794a0174197J2440907J465347j7624006k3985349j3779656j079107N280481R267460
$$ plain form
9849 -17036804 -26221668 -18561037 900308 16134701 15595819 -3488794 -30643891 -45412325
9841 -45412325 -39603371 -29509690 -31091959 -34088496 -20839421 44946 4334805 -9705275
9833 -9705275 -20679290 -19227928 -16503020 -16193970 -6366951 13391471 22423805 8983306
9825 8983306 -10450197 -14935041 -5325260 6273207 17652051 31383764 40046588 33217599
9817 33217599 13570952 -6549690 -19660728 -24313645 -18979662 -6939509 -1261724 -10845663
9809 -10845663 -24457127 -22710733 -5449720 6634271 -303030 -17121627 -27663755
9802 -27663755 -28413785 -24795077 -18687453 -10454119 -6193341 -10560600 -15754969 -10174197
9794 -10174197 2266710 3732057 -13891949 -37877298 -51656954 -52736061 -47455580 -38188120
9786c8188120J2503207R118825M74685o30043J1062902K1876993J6076886m078320
9778B8217015k2464572k6075895j3163732O549137J5746783M838477j2500542
9771a8853329j2885530L615404J2785477N747214L818081J8119266K2368390n609744
9763B9105229l8270065l2517379L893696K2846105Q638702m905126M034374J2341526
9755E167062j479846j8300473j3381195J167123J058301o254001K678467K1866588
9747g477974K1862904k748438k3086505j6653629N718765J9797467J7009837O464221
9739B0886648j98687L59324J967912k860519j1081870j0899594l2393P499423
9731E640244J795466o616961l832001M773819N796797K441708O962208J4416136
$$ plain form
9786 -38188120 -25684913 -16566088 -16091403 -16721446 -5658544 16218449 32295335 28217015
9778 28217015 5752443 -20323452 -33487184 -26938047 -11191264 -6352787 -18853329
9771 -18853329 -31738859 -28123455 -15337978 -9590764 -5772683 12346583 34714973 29105229
9763 29105229 -9164836 -41682215 -37788519 -14942414 -6303712 -11208838 -7174464 5167062
9755 5167062 3687216 -14613257 -27994452 -26827329 -25769028 -32023029 -29344562 -7477974
9747 -7477974 14384930 11636492 -11450013 -28103642 -22384877 -2587410 14422427 20886648
9739 20886648 20687961 21047285 23015197 20154678 9072808 -1826786 -1859179 5640244
9731 5640244 7435710 818749 -3013252 1760567 7557364 9999072 16961280 31377416
9723C1377416Q134276r316953j5664601l970155N762342j234269j2878043j3051859
9715a0841846n754748r73925N178964J6963138K1314197O959699j0108266o707989
9707A6029224Q504652N735195j6274489k3749873p85640K2601588J5339284p611161
9699A9788780j1154371M763340R763345m787599j4305713n130780L796235l885281
9691a152044j4021287q490009L104361J855897o598393k641044J2360452J7820363
9683B238296P527111k801362k993281j491939n587366p594465j2082R243924P373586
9674E902422m984782j4152911r037857P343162K0232767J7493699L516328n409173
9666B0903655k421448J771014j980982o146441j930463L142146k21338l152315
$$ plain form
9723 31377416 39511692 30194739 14530138 10559983 16322325 15088056 2210013 -10841846
9715 -10841846 -16596594 -17570519 -12391555 4571583 25885780 32845479 22737213 16029224
9707 16029224 24533876 30269071 13994582 -9755291 -10540931 12060657 27399941 19788780
9699 19788780 8634409 13397749 23161094 18373495 4067782 -1062998 2733237 -1152044
9691 -1152044 -15173331 -23663340 -20558979 -18703082 -25301475 -27942519 -15582067 2238296
9683 2238296 9765407 6964045 3970764 2478825 -3108541 -10703006 -10715088 -1471164 5902422
9674 5902422 917640 -13235271 -22273128 -14929966 5302801 22796500 26312828 20903655
9666 20903655 18482207 20253221 18272239 12125798 10195335 13337481 13116143 9963828
9658I963828N048503J1263954l334846k5925742k4665056J392791J8453871R781568
9650A978871k559565P43760O357143j932405j3406481j2926077p966773r002815
9642c8714342n637242J1261191K3869521J3176944o072983p398672L359221m73211
9634f629573j8626294k2894026l976915J3426756R056736o115128j0815534m03398
9626d6977376J5869281K7531830K5355352O070805j8164358k7001719j4255905
9619c1572090O119023J7929334J6606806O175215n178819p141061K342416J0087866
9611A5368690M251729n940209l832737N600948K633756j2009508j5008035J029807
9603g905559J3729878P319196k415278L098978J3387851Q342869o715565j0547646
$$ plain form
9658 9963828 15012331 26276285 22941439 -2984303 -27649359 -26256568 -7802697 1978871
9650 1978871 -580694 163066 6520209 4587804 -8818677 -21744754 -29711527 -38714342
9642 -38714342 -44351584 -33090393 -9220872 3956072 -2116911 -9515583 -6156362 -6629573
9634 -6629573 -25255867 -48149893 -52126808 -38700052 -29643316 -35758444 -46573978 -46977376
9626 -46977376 -31108095 -3576265 21779087 27849892 9685534 -17316185 -31572090
9619 -31572090 -25453067 -7523733 9083073 15258288 10079469 2938408 5280824 15368690
9611 15368690 19620419 13680210 9847473 15448421 18082177 6072669 -8935366 -7905559
9603 -7905559 5824319 13143515 10728237 13827215 27215066 35557935 28842370 18294724
9595A8294724r89375M359546j966285r760549j2342829j3620340j2734304k895165
9587c1654577J0182501R275683p148791j7612211p912400Q668578J4037280J0859296
9579a1304641Q767333J785999j6908764k9915215j4859070J5394527K3331722
9572b3708109J238265j6171589l652213K0448194K8048644K0036128Q961008q651824
9564B6548504l2488448l5747315j331161L5897393K7417989j5623355l3674420
9557b9000813m691112K8030651K4048557l298769k2200068k7020702k3056932
9550e7189188l805165K5999855L5081401O896554k6938689k6881390K74808J8468729
9542b8093085J5255572M962481m834055j5143227j5502734L583437K5879532K8149343
$$ plain form
9595 18294724 17305349 21664895 19698610 9938061 -2404768 -16025108 -28759412 -31654577
9587 -31654577 -21472076 -12196393 -19345184 -36957395 -44869795 -36201217 -22163937 -11304641
9579 -11304641 -2537308 -751309 -17660073 -47575288 -62434358 -47039831 -23708109
9572 -23708109 -22469844 -38641433 -42293646 -21845452 6203192 26239320 35200328 26548504
9564 26548504 -5939944 -41687259 -43018420 -7121027 20296962 4673607 -29000813
9557 -29000813 -33691925 -5661274 18387283 15088514 -7111554 -34132256 -57189188
9550 -57189188 -60994353 -34994498 86903 6983457 -19955232 -46836622 -46561814 -28093085
9542 -28093085 -12837513 -7875032 -12709087 -27852314 -43355048 -39771611 -13892079 14257264
9534A4257264J5246086O311804k087411k2806157l8475025j8955820K2723031
9527b3786228L7099166R074106j9945571j5035718N775660R139337k291760l649537
9519c620545Q867828J6228697P516030q400100j7258232j2659173O19540R807330
9511A101375O529787k021664l177415J623939J333937k744299J368871J1996926
9503A6011457J2910169R97571p360292m353558k581150r107931j0240937L686214
9495c8457J7936424J4806297M99968o714912m213218m002074j0583298j4751463
9487g060733p972992O287529J5918450J2226701j35837q002804q184787j2536535
9479i461008k4865114k5738775l64893K8884361K6212206m800541k3572139j0444697
$$ plain form
9534 14257264 29503350 35815154 33727743 10921586 -27553439 -46509259 -23786228
9527 -23786228 13312938 22387044 2441473 -12594245 -6818585 2320752 28992 -3620545
9519 -3620545 5247283 21475980 28992010 20591910 3333678 -9325495 -8705955 1101375
9511 1101375 7631162 5609498 2432083 4056022 5389959 2645660 4014531 16011457
9503 16011457 28921626 29919197 22558905 18205347 15624197 6516266 -3724671 -38457
9495 -38457 17897967 32704264 33204232 26489320 22276102 18274028 7690730 -7060733
9487 -7060733 -15033725 -8746196 7172254 19398955 19263118 11260314 3075527 -9461008
9479 -9461008 -34326122 -60064897 -60429790 -31545429 -5333223 -10133764 -33705903 -44150600
9471d4150600J0229684J3335073O899545P780719J2131090R270190K474278k145475
9463A5824504q204841j5340399j2695665Q4173O534912J292138L83493R322394
9455b799291Q720684r281297j9513943l635998J6135374J2700993j604373k3932
9447F98217J0940673O400685j0416582j5305259o209847j888590m960159k361304
9439b3102166L336897p70953o130549O245191K5530542K1290887m771975j7643377
9431C984497n159439N562716j495941n580998Q246891J8976367O923666j0473642
9423B0984117q556478L734267K695621r299496j1995103l695494n28084o009537
9415a2670187p253029O81314P977042P269153R62219p369284j4303401j1861030
$$ plain form
9471 -44150600 -33920916 -20585843 -13686298 -5905579 6225511 15495701 17969979 15824504
9463 15824504 7619663 -7720736 -20416401 -20332228 -13797316 -12505178 -12121685 -2799291
9455 -2799291 5921393 -3359904 -22873847 -26509845 -10374471 2326522 722149 698217
9447 698217 11638890 18039575 7622993 -7682266 -13892113 -15780703 -20740862 -23102166
9439 -23102166 -19765269 -20536222 -26666771 -20421580 5108962 26399849 21627874 3984497
9431 3984497 -1174942 4387774 2891833 -2689165 5557726 24534093 31457759 20984117
9423 20984117 12427639 16161906 18857527 9558031 -2437072 -6132566 -6660650 -12670187
9415 -12670187 -19923216 -19241902 -11264860 -3995707 -3033488 -10402772 -24706173 -36567203
9407c6567203L701711K0233522K1307258Q757228n2946K561759N726517j466283
9399B4201563j4315265j9721941j1784258K506970R224961Q89027j2017964r220249
9391c0237156J1856145K5589965R401310k1307927k9145030m431591K2725251
9384a5549033K4483154P743189n253251q523280q968489p321768j299162K513515
9376a2175125j972987o738879k251083M244501J123381n049382o23244Q293596
9368a5149222N186462m536085N63927J8637334K2363814L299028j2925341q265225
9360I174692J592499k2221k336443N377376O714894j1604845k6752298j1878725
9352b9735071J7192850K4311927Q263187l006034l277447j0856575k3932638j7447983
$$ plain form
9407 -36567203 -32865492 -12631970 8675288 17432516 17379570 19941329 25667846 24201563
9399 24201563 9886298 -9835643 -21619901 -19112931 -9887970 -8998943 -21016907 -30237156
9391 -30237156 -18381011 7208954 16610264 -4697663 -33842693 -38274284 -15549033
9384 -15549033 8934121 16677310 11424059 2900779 -6067710 -13389478 -14688640 -12175125
9376 -12175125 -14148112 -20886991 -23138074 -18893573 -17770192 -22819574 -23442818 -15149222
9368 -15149222 -9962760 -14498845 -13934918 4702416 27066230 30365258 17439917 9174692
9360 9174692 10767191 10744970 8408527 13785903 20500797 8895952 -17856346 -29735071
9352 -29735071 -12542221 11769706 20032893 17026859 13749412 2892837 -21039801 -38487784
9344c8487784R294145K2421368L838782k1604095k3680899l813230J8278168K9952987
9336c800558K6428308R393239o020030m840460K828096m085596j7883070j0634466
9328h614537J3367159J5241743j5163640l6594977j9162363J0383487J4458223
9321b6084905m22716o948571l298069j054610N127202J9273093K0668270l415936
9313C843758k4469761j1951010J5063686J7698242J90242l361733Q914934Q419967
9305A4348325o238164n190424J5738908K2832449N86237k2430702j9725992l409199
9297c488562L005685r91898l510686k065988Q95988N774002P682115k063881j7891762
9288a2654987k1277892p459473P005089R689044O738209N461575J851190n901367
$$ plain form
9344 -38487784 -29193639 -6772271 -2933489 -24537584 -48218483 -52031713 -33753545 -3800558
9336 -3800558 22627750 32020989 26000959 21160499 23988595 19902999 2019929 -8614537
9328 -8614537 4752622 19994365 4830725 -31764252 -50926615 -40543128 -26084905
9321 -26084905 -26507621 -33456192 -36754261 -37808871 -32681669 -13408576 7259694 3843758
9313 3843758 -20626003 -32577013 -17513327 184915 375157 -2986576 5928358 14348325
9305 14348325 8110161 2919737 18658645 41491094 42077331 19646629 -79363 -3488562
9297 -3488562 -482877 -1474775 -4985461 -7051449 -6155461 -381459 7300656 5236775 -12654987
9288 -12654987 -33932879 -41392352 -34387263 -24698219 -17960010 -12498435 -10647245 -16548612
9280a6548612q673932p03791J0764600J6994704J7169461J2695428M404742k825265
9272C3277335n147998q580015j8850861k5806138j5319999O398277J9741458J9755978
9264E468037J6283997J0419328l777904j6416395r708638R159064J2577333m844694
9256A9160128j7401640r569455L058967M304983L73159l18730l149627q890074
9248a2432289n060516R116744J4176470K807738m678100M603749J1664512j049089
9240A9149219j5964146p847744J3397519J7818832K356728o965148L523465J6868956
9232D2337681J1818188r359449k4383370j5728498Q579860J9522200M66297k6668270
9224F584639k5920674J881959J7942374K422116j6680779q500894J4492340K0390781
$$ plain form
9280 -16548612 -25222544 -25926335 -15161735 1832969 19002430 31697858 36102600 33277335
9272 33277335 28129337 19549322 698461 -25107677 -40427676 -34029399 -14287941 5468037
9264 5468037 21752034 32171362 28393458 11977063 2268425 11427489 24004822 19160128
9256 19160128 1758488 -7810967 -4752000 -447017 -73858 -392588 -3542215 -12432289
9248 -12432289 -17492805 -8376061 5800409 8608147 3930047 8533796 20198308 19149219
9240 19149219 3185073 -4662671 8734848 26553680 28910408 21945260 25468725 42337681
9232 42337681 54155869 44796420 20413050 4684552 13264412 32786612 33252909 6584639
9224 6584639 -19336035 -17454076 488298 2910414 -13770365 -22271259 -7778919 12611862
9216A2611862O291395o189059q851067j0775513j3299398q712002N88567M701382
9208b3633833M062110N466548O617413L024309J448592O998855P903520m580738
9200G306776j3657884j532415J5272177Q072638j4160027j5035040R742487K3110877
9192A9119589M980013j8488630j9369985p262269k799429j454462R732245K1513822
9184E970894J7105645L150129o61869O397965Q459353P89500o908581j0253403
9176B4049633j2980059j3700434q654758l552029l985158J14766J8266738L3310588
9168C2869287J9833327j1663203k1615000J91714J7386902M375223j3674353n871045
9160B1832852R775201l114377l3236406l3920145K195837K8570745J4758301j1723131
$$ plain form
9216 12611862 18903257 12714198 3863131 -6912382 -20211780 -28923782 -28335215 -23633833
9208 -23633833 -19571723 -14105175 -7487762 -4463453 -3014861 3983994 11887514 7306776
9200 7306776 -6351108 -7883523 7388654 15461292 1301265 -13733775 -3991288 19119589
9192 19119589 24099602 5610972 -13759013 -21021282 -23820711 -25275173 -15542928 5970894
9184 5970894 23076539 26226668 25564799 31962764 40422117 41211617 34303036 24049633
9176 24049633 11069574 -2630860 -11285618 -14837647 -18822805 -18708039 -441301 32869287
9168 32869287 52702614 41039411 19424411 19616125 37003027 41378250 27703897 21832852
9160 21832852 31608053 28493676 -4742730 -38662875 -36467038 -7896293 6862008 -4861123
9152d861123j3242360M086310J1303054M183771m94919J659455K065865J43804
9144D843857m81063o125048j9437658k2897257j997400K4704926K6833722O413962
9136A1858041q512342r118908j1825793j9737976j3665610J0255863K6458501
9129a4288224J7780818J057895j139235P720528J1542769Q280059N204683J475073
9121C7634366p086042j5049366j4014921o205972o61549q60315l365835l579681
9113a3189315J425562R748609J2854712M855972o756285r563970l745914O05769
9105c764860N51990M75577n28018m456052l131915Q208320J2868157n110508k6336678
9096b1223987j7144538J5629939K9131362Q798570j2777352j2253342p202866
$$ plain form
9152 -4861123 -18103483 -14017173 -2714119 1469652 974733 2634188 4700053 4843857
9144 4843857 4362794 -1762254 -21199912 -44097169 -46094569 -21389643 5444079 11858041
9136 11858041 3345699 -5773209 -17599002 -37336978 -51002588 -40746725 -14288224
9129 -14288224 3492594 4550489 3411254 11131782 22674551 30954610 36159293 37634366
9121 37634366 30548324 15498958 1484037 -4721935 -5383484 -6243799 -9609634 -13189315
9113 -13189315 -11763753 -2015144 10839568 15695540 8939255 -624715 -4370629 -3764860
9105 -3764860 -3212870 -2737293 -3265311 -7721363 -10853278 -2644958 10223199 5112691 -21223987
9096 -21223987 -38368525 -22738586 6392776 15191346 2413994 -9839348 -17042214
9089a7042214j2727615j0678970R790638K1462575L562452j7920599j2126060
9082c5679793O060568P853837L030594J4214359K4704320M883866k7096608k6847488
9074b8876345L454803J9398462Q056680Q33386R209864N671040j7301868k4299563
9066b3853541K629499K7739233J6192484j2938396k0705584n102064Q794750J1472604
9058D228985R607272K585926j0712329j5616365r37117J6405174J3001776m266328
9050A4296994j0035046j224407L006853j545162J949877J6220992J8471277l239094
9042C7902284k6185819k4141308n676743P36413r401061j2640325K262915J5288160
9034b1855484P430374q077206o407934R461487J4754199M309590M76024J4011896
$$ plain form
9089 -17042214 -29769829 -40448799 -30658161 -9195586 -5633134 -23553733 -35679793
9082 -35679793 -29619225 -21765388 -18734794 -4520435 20183885 25067751 -2028857 -28876345
9074 -28876345 -25421542 -6023080 2033600 2866986 12076850 17747890 446022 -23853541
9066 -23853541 -21224042 6515191 22707675 9769279 -10936305 -16038369 -7243619 4228985
9058 4228985 13836257 16422183 5709854 -9906511 -10843628 5561546 18563322 14296994
9050 14296994 4261948 3037541 6044394 4499232 6449109 22670101 41141378 37902284
9042 37902284 11716465 -12424843 -18101586 -17365173 -26766234 -39406559 -37143644 -21855484
9034 -21855484 -14425110 -22502316 -28910250 -19448763 -4694564 -384974 91050 14102946
9026A4102946K3813652J0484751j1543309j5812941k439473P096624L309815n087156
9018B3924909j1156691j4530327j1245713Q33106J0840053Q843640M928649J2308358
9010B4745984J8829328L870449k0308375j9019800Q402891J9500963q743510m1718479
9002a4440549l5931520j78286K1820220J3676046k88052J991725J2766850J3627666
8994A3044100J986740r064228p164335P026932J8961419J3281817p449168k2685762
8986G937515j9269930q770098q908009j5865024j0834571R516901K6775849K6804059
8978G386692J5899038N530517m087447j5166542j9055267o646113J2857181J8643057
8970A5361116M812144j2179835j6036478r030125j867577L125100P775653O474505
$$ plain form
9026 14102946 37916598 48401349 36858040 21045099 18605626 25702250 29012065 23924909
9018 23924909 12768218 -1762109 -13007822 -12174716 -1334663 7508977 12437626 24745984
9010 24745984 43575312 47445761 27137386 8117586 16520477 36021440 27277930 -14440549
9002 -14440549 -50372069 -50550355 -28730135 -15054089 -15342141 -13350416 -583566 13044100
8994 13044100 15030840 5966612 -1197723 5829209 24790628 38072445 30623277 7937515
8986 7937515 -11332415 -20102513 -29010522 -44875546 -55710117 -46193216 -19417367 7386692
8978 7386692 23285730 28816247 24728800 9562258 -9493009 -16139122 -3281941 15361116
8970 15361116 20173260 7993425 -8043053 -17073178 -18940755 -15815655 -8040002 -1565497
8962a565497n724004j8236811j5617544k286436J959828o388847q072715O176672
8954d9755354J8026692J1069786j378710J816719J4631353J4592430n94301j1836314
8946c427699r924066m209132j065026L286461P003226K209639n774381p03710
8938a2604688J6605087K3443983P744408j3184170j7769905q148737q01770k493415
8930g209207q104995j2213517j1541386m046835N753953Q983605O327936Q656361
8922a3394085J6972821J6062838j131564j7307971j4183123l03127K646412o719060
8914a7356859r818894J092415J2439663J2165412N995398M559327P009992N375887
8906B1462341k995713j4140809k2645308k2773992j0529436Q922291K0719111
$$ plain form
8962 -1565497 -7289501 -25526312 -41143856 -43430292 -41470464 -47859311 -55932026 -49755354
8954 -49755354 -31728662 -20658876 -22037586 -20220867 -5589514 9002916 8408615 -3427699
8946 -3427699 -13351765 -17560897 -18625923 -15339462 -8336236 -6126597 -11900978 -12604688
8938 -12604688 4000399 27444382 35188790 22004620 4234715 -3914022 -4715792 -7209207
8930 -7209207 -15314202 -27527719 -39069105 -43115940 -37361987 -28378382 -22050446 -13394085
8922 -13394085 3578736 19641574 18510010 1202039 -12981084 -13284211 -10637799 -17356859
8914 -17356859 -27175753 -26083338 -13643675 -1478263 4517135 9076462 16086454 21462341
8906 21462341 18466628 4325819 -18319489 -41093481 -51622917 -42700626 -21981515
8899b1981515J5136647P93277m910125J877620P480454J341513q963333j0175111
8891a9400573k723210L157188N414980J0235180J5558484J1146089j124201m239256
8883A8024681P442636J4614257L87169k1346203k3280396l124085J4687799J3362941
8875B0768799J581699m682178k456737Q70865l67780n306917q122862m175537
8867a890648J748180p14709r493668p327213J0877881K1502157L499118k4376407
8859f175309k4846023L377680K2561126J0779630j0246518j2304046J502525J1613863
8851c737072J2611735J0892009P990654L306737J320057K361450j879442j2067905
8843B0798223j4668168m328834K954603n013808j3596091l490402J5915498J8422102
$$ plain form
8899 -21981515 -6844868 -6051591 -10961716 -9084096 -1603642 -262129 -9225462 -19400573
8891 -19400573 -22123783 -18966595 -13551615 -3316435 12242049 23388138 22263937 18024681
8883 18024681 25467317 40081574 40468743 19122540 -4157856 -7281941 7405858 20768799
8875 20768799 22350498 17668320 15211583 16082448 15714668 10407751 2284889 -1890648
8867 -1890648 -142468 -857177 -10350845 -17678058 -6800177 14701980 18201098 -6175309
8859 -6175309 -31021332 -27643652 -5082526 5697104 -4549414 -16853460 -15350935 -3737072
8851 -3737072 8874663 19766672 27757326 31064063 32384120 34745570 32866128 20798223
8843 20798223 6130055 1801221 4755824 -257984 -13854075 -17344477 -1428979 16993123
8835A6993123M45213j4001598p921678P857554J2509608O19634j5169785j9411837
8827a8079766q639649O079954J1770636Q452650N609579M944875p49924r345140
8819D3215p198696P026674J4850135O805875j71049Q138430J5371003K99835k4182792
8810B0982630k7469449q552190M470329k00255n286110j96558K674764l197926
8802a6774765l735242O812457J0019710l805246j1886001N927780K8159012J9588956
8794C4306661j3064486k7875060q736449J4156878J2784540n32774n05368R959489
8786B0493431J0356642j59743l183473N706735R614211k19145r305935l541131
8778B9761592Q581339R737086j569612j3203725j8700830k0854056j9868555j1378912
$$ plain form
8835 16993123 17438336 3436738 -4484940 3372614 15882222 16501856 1332071 -18079766
8827 -18079766 -26719415 -20639461 -8868825 -416175 5193404 10138279 9388355 43215
8819 43215 -7155481 -128807 14721328 21527203 21356154 29494584 44865587 45165422 20982630
8810 20982630 -6486819 -15039009 -10568680 -10768935 -16055045 -16251603 -13576839 -16774765
8802 -16774765 -20510007 -13697550 -3677840 -7483086 -19369087 -13441307 14717705 34306661
8794 34306661 21242175 -6632885 -15369334 -1212456 11572084 11039310 10533942 20493431
8786 20493431 30850073 30690330 27506857 33213592 42827803 42608658 33302723 29761592
8778 29761592 38342931 48080017 46510405 33306680 14605850 -6248206 -26116761 -37495673
8770c7495673K743283J1676963P316603o011044j5101031r500765Q340540K2919876
8762a5111248K0404712N823624j729919N220547J1915701L719561j2482118k0919618
8754c158758k0034567j7461416j1480438K984620J6138728J3391582J629501K298186
8746a5692562J6725599K2111326P721383q352347q736226j976917m442410j4105947
8738f748101j7773553j2099266l392288M007042P807103N381392O14216K930050
8730a9273405J1144975J0569300m330775j7916114j5501230m042844K410911M566602
8722c2372580R741134J4086358J0523155M579951M164571K158073j1105994k4626549
8714b2851881j7764029P568154K6564195K4862343J3358406N958031M93939r820775
$$ plain form
8770 -37495673 -34752390 -23075427 -15758824 -21769868 -36870899 -46371664 -38031124 -15111248
8762 -15111248 5293464 11117088 9387169 14607716 26523417 30242978 17760860 -3158758
8754 -3158758 -23193325 -40654741 -52135179 -49150559 -33011831 -19620249 -17990748 -15692562
8746 -15692562 1033037 23144363 30865746 22513399 13777173 11800256 7357846 -6748101
8738 -6748101 -24521654 -36620920 -40013208 -36006166 -28199063 -22817671 -22203455 -19273405
8730 -19273405 -8128430 2440870 -1889905 -19806019 -35307249 -39350093 -36939182 -32372580
8722 -32372580 -22631446 -8545088 1978067 6558018 10722589 12880662 1774668 -22851881
8714 -22851881 -40615910 -33047756 -6483561 18378782 31737188 37695219 38189158 28368383
8706B8368383j9518257j7238633l502137P262810L093920j0881674j6947159n284494
8698c4647241J2936769J8679515R062984j629232m432194m882422o496250k528717
8690a3936788P130746Q792085k079631q432582M45383O577937p077052k0563336
8682b9143238l278380L1114202L4329015o363349m3378523l1333347J3236093
8675c4817527L8136617K3448676l192990j1602419l498409J857216k450644p035076
8667H45444m537155j27320j847530p642698q689909l417115N89499N92347M410752
8658a9823685J5177026J9947765N975732j6650136k3156625n519817J6575148
8651g474592J9739765K630900j6444070k0690325r123389N904800J1425454N099315
$$ plain form
8706 28368383 8850126 -8388507 -11890644 -4627834 -1533914 -12415588 -29362747 -34647241
8698 -34647241 -21710472 -3030957 6032027 4402795 -29399 -4911821 -11408071 -13936788
8690 -13936788 -6806042 1986043 -93588 -8526170 -8080787 -1502850 -8579902 -29143238
8682 -29143238 -32421618 -1307416 33021599 26658250 -16720273 -48053620 -34817527
8675 -34817527 3319090 26767766 23574776 11972357 8473948 10331164 7880520 845444
8667 845444 -3691711 -3819031 -5666561 -13309259 -21999168 -25416283 -24826784 -24234437 -19823685
8658 -19823685 -4646659 15301106 21276838 4626702 -18529923 -24049740 -7474592
8651 -7474592 12265173 14896073 -1547997 -22238322 -31361711 -25456911 -14031457 -8932142
8643h932142n053525j0946425j0546155l555898J0650738K5788911K8156662J2612377
8635C8174543p251093j4967029j1563589q871189q491728k673880O368972N744537
8627c530456n764996j0260021N481311K8760481L3730449J1676104j8828234l1652014
8619I612624j9288546J551830R762706K936520l611080k6877N334554J508129
8611G779860o469679n497845M639258J0976862O762250l76675j154435L608792
8603B0268388O720045L876494l330401j0069688j2617892j1231057p775193j571439
8595a5730743P486181J3258732J0236443N593706J0486921J7757304P954614j5318889
8587D1724269k0580962M164312K3876810M327637l1498002l2174914N111646K7895927
$$ plain form
8643 -8932142 -13985667 -24932092 -35478247 -39034145 -28383407 -2594496 25562166 38174543
8635 38174543 30923450 15956421 4392832 -4478357 -12970085 -15643965 -9274993 -3530456
8627 -3530456 -9295452 -19555473 -14074162 14686319 48416768 60092872 41264638 9612624
8619 9612624 -9675922 -8124092 1638614 4575134 964054 937177 6271731 7779860
8611 7779860 1310181 -4187664 451594 11428456 18190706 17814031 16659596 20268388
8603 20268388 26988433 30864927 27534526 17464838 4846946 -6384111 -14159304 -15730743
8595 -15730743 -8244562 5014170 15250613 20844319 31331240 49088544 57043158 41724269
8587 41724269 21143307 25307619 49184429 53512066 22014064 -10160850 -5049204 22846723
8579B2846723M404519l2311212l3790602q00884K5055019J7561044q898553k3908615
8571b9842561j4592666N066754J1893657Q19062q361183J724959J9576179K1532470
8563G816671Q490788K287962P201500M499461r113688j0368139Q321901J7399995
8555C6536451m550163l1027390k4985612L687025J4783970N14506q214319L225723
8547a0029809J2130360J996976q974945j938403Q709535P27917j6607921j6957437
8539c0943727L03295J0533754L864236k839540K254895P735148K820957k251901
8531h522883M561764J4028387J0679352n44229l405913J180303j663330j1825000
8523D488451j2139461J880056J2806540Q633992j327609o554085j0460995j3955476
$$ plain form
8579 22846723 27251242 -5059970 -38850572 -39651456 -14596437 2964607 -5933946 -29842561
8571 -29842561 -44435227 -39368473 -27474816 -26655754 -35016937 -33291978 -13715799 7816671
8563 7816671 16307459 18595421 25796921 30296382 21182694 10814555 19136456 36536451
8555 36536451 31986288 958898 -24026714 -20339689 -5555719 -5041213 -13255532 -10029809
8547 -10029809 2100551 4097527 -4877418 -6815821 1893714 2621631 -13986290 -30943727
8539 -30943727 -30640432 -20106678 -16242442 -19081982 -16827087 -9091939 -6270982 -8522883
8531 -8522883 -3961119 10067268 20746620 20202391 16796478 17976781 16313451 4488451
8523 4488451 -7651010 -5770954 7035586 15669578 14341969 7787884 -2673111 -16628587
8515a6628587n558547J5128374K4072337N183005j9633392j8309962M360860J5048364
8507C662452J682839j3239162r877836M162267J1833657Q511408j110163j1290947
8499e665485j4170163m379330J0415010J5654714R046052J563142r51365l144917
8491H367658o553619n714832K34555N794394R554389J2833221R905976l776753
8483C0644989j6079600j1245192K293350N81333j6970904k2949043l492472K0358069
8475a6859470K4213628J1007077k840333j1286988j4131191p457472N383359R513428
8467b457962P17454l759910P811643K0170579J4713479n23900n708166j910986
8459B9052231n303255j5752403j5576274O85142J6012954J4577002P96824j0074570
$$ plain form
8515 -16628587 -22187134 -7058760 17013577 22196582 2563190 -15746772 -11385912 3662452
8507 3662452 5345291 -7893871 -17771707 -13609440 -1775783 6735625 5625462 -5665485
8499 -5665485 -19835648 -24214978 -13799968 1854746 10900798 12463940 11512575 8367658
8491 8367658 1814039 -3900793 -3666238 2128156 11682545 24515766 34421742 30644989
8483 30644989 14565389 3320197 5613547 6194880 -10776024 -33725067 -37217539 -16859470
8475 -16859470 7354158 18361235 15520902 4233914 -9897277 -17354749 -11971390 -2457962
8467 -2457962 -1740508 -5500418 2311225 22481804 37195283 36671383 30963217 29052231
8459 29052231 23748976 7996573 -7579701 -6894559 9118395 23695397 24492221 14417651
8451A4417651j0090499l061439K465005J418691l643872n946509k677758K657241
8443d461489N829126M974128q92375q889979r211484L900164J8252359J4763233
8435B4263683n050059j7847043r762663O444290J2410818O899303j255143p965711
8427H137475j1003421n522146O390783J2977968R108381L860727M070366M201759
8419C2221892R02563J401356O985928N577130o220224j1530033K95273J2507138
8411D2141023N134767j4087910k2846895j6169157n463190L434167J1179463J3079300
8403A6401568N783075j768236j124758O98427n164478j2272205j2165378j1142379
8395b0754364j4701891j0950185P261283J9737377O792580j4168297j2081242
$$ plain form
8451 14417651 4327152 1265713 3730718 5149409 1505537 -4440972 -7118730 -4461489
8443 -4461489 1367637 6341765 5449390 -3440589 -12652073 -8751909 9500450 24263683
8435 24263683 19213624 1366581 -8396082 -1951792 10459026 17358329 16103186 8137475
8427 8137475 -2865946 -8388092 -1997309 10980659 20089040 23949767 28020133 32221892
8419 32221892 33124455 34525811 41511739 47088869 40868645 29338612 29633885 42141023
8411 42141023 47275790 33187880 10340985 -5828172 -11291362 -7857195 3322268 16401568
8403 16401568 22184643 20416407 19291649 19990076 14825598 2553393 -9611985 -20754364
8395 -20754364 -35456255 -46406440 -39145157 -19407780 -12615200 -26783497 -38864739
8388c8864739Q682686J7948897J0531998Q180476J3820720O706303j2251075j4133139
8380F22127O353302J5268135l929543j7685440L891373L3410255K4718292j5762267
8372D6886234l7804774k0049170N580748O768930n690604l139026J4957124K2775867
8364C0285329P857996j1860722j4352975k019384O447257M096841P06640J583960
8356B2744942j359970j1955803j9323665j5173005p398684m272418N50224J2142629
8348b4045750J8386332R287454j948899k07133L265323p602664j7075258M40543
8340a9500052K8870040K4988071j2032286l1999588r462497J6918991O967426
8333D750105j8793179j6525214J0316422K0971282K795446j5525686j2626972
$$ plain form
8388 -38864739 -30182053 -12233156 -1701158 6479318 20300038 27006341 14755266 622127
8380 622127 6975429 22243564 18314021 628581 4519954 37930209 62648501 46886234
8372 46886234 9081460 -10967710 -5386962 1381968 -4308636 -7447662 7509462 30285329
8364 30285329 38143325 26282603 11929628 9910244 16357501 20454342 21160982 22744942
8356 22744942 21384972 9429169 -9894496 -25067501 -32466185 -36738603 -36188379 -24045750
8348 -24045750 -5659418 3628036 1679137 1472004 4737327 -2865337 -19940595 -19500052
8340 -19500052 9369988 34358059 22325773 -9673815 -19136312 -2217321 4750105
8333 4750105 -14043074 -30568288 -20251866 719416 3514862 -12010824 -24637796
8326b4637796M07444P413493R436813J1296229R236359K295604j086923K164013
8318A6525236J319002j1425527k4259061j7153193J0999036L4756982K7653322
8311C8415797n156171k8330811j7793937P885644J3230140l209639r076678Q130795
8303D095140J9413978K559363j8084557r133522J6536788J9071327m907470j8472071
8295A1078976m448316J0162556J480336j3731819q668574J0321956J6520250M256133
8287B6971498p616551p737879n153833q839703j2183444n208532P904476J2617969
8279G54001L157865q777090p653705N898219J4854712P929857n201198q129626
8271B833035q85253L418054J969395N522982J4990693J2992134r327957l1078923
$$ plain form
8326 -24637796 -24230352 -16816859 -7380046 3916183 13152542 15448146 14361223 16525236
8318 16525236 17844238 6418711 -17840350 -34993543 -23994507 10762475 38415797
8311 38415797 33259626 4928815 -12865122 -4979478 8250662 5041023 -4035655 4095140
8303 4095140 23509118 26068481 7983924 -1149598 15387190 34458517 29551047 11078976
8295 11078976 6630660 16793216 18273552 4541733 -4126841 6195115 22715365 26971498
8287 26971498 19354947 11617068 6463235 -2376468 -14559912 -19768444 -11863968 754001
8279 754001 3911866 -4865224 -12518929 -6620710 8234002 16163859 10962661 2833035
8271 2833035 1947782 5365836 7335231 12858213 27848906 40841040 31513083 434160
8263D34160k5302989K415844J8783601P527667r740290o635681R385849R235069
8255F103230j2575503k6183781p484787K5240839L2853156P111804j9380826j8262154
8247a2578022n18003O099604j369149l509038M855153O370599o390374j4159487
8239b1198717m71165J9507086J9075761k58353j0153726M459941K5458608K7059777
8231F3479212P411941j3624475j9459878j0720053J403305P945673Q353469P375909
8223E2165103O698384J566557j0682237k1359472j8361465m697208J169719j0201850
8215c702469k2968601j4588586J3338489L4212462K7503763J741185j7305378
8208A8230865j5469084k161720M014946l326539j3068712j1188403K459301J4447121
$$ plain form
8263 434160 -24868829 -22452985 -3669384 3858283 -5882007 -12517688 -3131839 6103230
8255 6103230 -6472273 -32656054 -40140841 -14900002 17953154 25064958 5684132 -12578022
8247 -12578022 -13096025 -6996421 -8365570 -11874608 -7019455 -648856 -7039230 -21198717
8239 -21198717 -21669882 -2162796 16912965 16654612 6500886 10960827 36419435 63479212
8231 63479212 70891153 57266678 37806800 27086747 28490052 36435725 44789194 52165103
8223 52165103 58863487 60430044 49747807 28388335 10026870 5329662 6499381 -3702469
8215 -3702469 -26671070 -41259656 -27921167 6291295 33795058 35536243 18230865
8208 18230865 2761781 600061 4615007 1288468 -11780244 -22968647 -20509346 -6062225
8200f062225J3427214J409589j0533118j2996190l999176J0037101J7177171J0335791
8192A8796157k647086o663124J50796L711411l062580p670185J013828J2048639
8184A5677856Q901876l163560o080823P66691J929903m400258k900652Q963415
8176A9694448J2331824k323413j8100519j8299606j0582506q913970q806189J87886
8168c4812045J0399267O060255r235824j5040412k642412J4129509J7203414L263971
8160a0674277j4497277j7042639L409661L0885757L8070783J8159956o007194
8153D2304770j2925821q763328r803031j3377123o221417P932493J1680801J586696
8145A2414040p498764n665037Q99654K623145k306423q854350q113685N273368
$$ plain form
8200 -6062225 7364989 8774578 -1758540 -14754730 -18753906 -8716805 8460366 18796157
8192 18796157 16149071 9485947 9636743 13348154 10285574 2615389 3629217 15677856
8184 15677856 24579732 21416172 15335349 16102040 18031943 13631685 10731033 19694448
8176 19694448 32026272 29702859 11602340 -6697266 -17279772 -26193742 -34999931 -34812045
8168 -34812045 -24412778 -18352523 -27588347 -42628759 -45271171 -31141662 -13938248 -10674277
8160 -10674277 -25171554 -42214193 -38804532 -7918775 30152008 48311964 42304770
8153 42304770 29378949 20615621 10812590 -2564533 -8785950 -853457 10827344 12414040
8145 12414040 4915276 -749761 149893 2773038 466615 -8387735 -16501420 -11228052
8137a1228052K0228365J5324962r993673k5965815j2415182R443244J0077731
8130d528420j275520L652918J9378690J5777180n575932j0578676P865557J6245853
8122D0961650j271837j6248926p460679L424242n899522j8309092j0889327L764790
8114a1928701L992193r63931O801448J5798172O758183q402690p648857K1814
8106D427631m804944q234269J2923109L6419747J8041128l2076001n2271472j8365717
8098d3940788K2417359K5175492O692450L482736J2205970Q120871o907214j2899194
8090A4347682r085871q130455o956948M171094J3964604L993785j5413947j4806752
8082a7916808R098460K6708783J8138277k943581j4606888j3127245n167943O391868
$$ plain form
8137 -11228052 9000313 24325275 14331602 -11634213 -24049395 -14606151 -4528420
8130 -4528420 -5803940 -2151022 17227668 33004848 27428916 16850240 24715797 40961650
8122 40961650 39689813 23440887 15980208 19404450 13504928 -4804164 -15693491 -11928701
8114 -11928701 -7936508 -8900439 -2098991 13699181 20457364 12054674 4405817 4427631
8106 4427631 -377313 -8611582 4311527 40731274 58772402 26696401 -25575071 -43940788
8098 -43940788 -21523429 3652063 10344513 13827249 26033219 34154090 27246876 14347682
8090 14347682 5261811 -2868644 -9825592 -5654498 8310106 12303891 -3110056 -17916808
8082 -17916808 -8818348 17890435 36028712 33085131 18478243 5350998 183055 6574923
8074F574923J6728298J4974458n85366j4310990j2985229n241386q103107j9875233
8066b2823632k0960463j884141K1754061K7795156J4183073m44509j529733M362319
8058B0452131K687873n236641m364410P427930J1372987l419705j8402389j1005807
8050d88031Q994750J2679007k956394j1494840j659682N143353o421398j8749566
8042a4952801j2861390r60458j872121n914616M985684J9559147J4773171j070585
8034A686031j390545R806685M674343j3787837j0494846J9391652L3896963Q982669
8026E2765115k3300320k7045662j3266821p224353k000462J6310480K7788733
8019B4026710Q024756k3161672k7524392p585896M001707J271169N061756J5679675
$$ plain form
8074 6574923 23303221 38277679 37692313 23381323 10396094 5154708 -2948399 -22823632
8066 -22823632 -43784095 -45668236 -23914175 3880981 18064054 17619545 16089812 20452131
8058 20452131 23140004 17903363 13538953 20966883 32339870 28920165 10517776 -488031
8050 -488031 8506719 21185726 18229332 6734492 5074810 10218163 3796765 -14952801
8042 -14952801 -27814191 -28774649 -30646770 -36561386 -31575702 -12016555 2756616 1686031
8034 1686031 295486 10102171 14776514 988677 -9506169 9885483 43782446 52765115
8026 52765115 29464795 2419133 -10847688 -18072041 -20072503 -3762023 24026710
8019 24026710 32051466 8889794 -18634598 -26220494 -22218787 -20947618 -15885862 -206187
8011b06187J3814458M373537R974793K1062078M366446l3433000m4274088j4137751
8003c8459714J2872812O070409p222013L820706K1759735J8296084L115722k144548
7995A8109193m123901j3741413j3959268P720193K3552848O473077j8401367j0870874
7987e241512J5959770J6130320j2868500k7915638j1334113P536067O990004J942731
7979h800871O856976J0932813N644757K716798Q880547J1848755N616246K706793
7971D6402814P783634N718409r108083j7150172m967294J0208189O696280q948595
7963C6635182j5566125r919646n616197q145259r144207k484913O974688J0558549
7955C292072N118668m073218q429077o839525q237312j6607247j9514226m377986
$$ plain form
8011 -206187 13608271 17981808 27956601 49018679 53385125 19952125 -24321963 -38459714
8003 -38459714 -25586902 -19516493 -26738506 -22917800 -1158065 17138019 20253741 18109193
7995 18109193 13985292 243879 -13715389 -5995196 17557652 24030729 5629362 -5241512
7987 -5241512 10718258 26848578 13980078 -13935560 -25269673 -17733606 -10743602 -8800871
7979 -8800871 -1943895 8988918 14633675 17350473 26231020 38079775 43696021 46402814
7971 46402814 54186448 59904857 50796774 33646602 28679308 38887497 45583777 36635182
7963 36635182 21069057 11149411 5533214 -2612045 -11756252 -14241165 -7266477 3292072
7955 3292072 8410740 4337522 -4091555 -10931080 -19168392 -35775639 -55289865 -59667851
7947e9667851J8746196K7575703J8610994R137032Q519071P895607J046285n380957
7939B6482080p760197j1558641j5093254p295619J0129125J8055328P593869n938073
7931A4614618p517931k932749k621700k502626M307550J1302811R640392L884222
7923B8174587K506015K688714k287601r600742j3022275j4164782j6357325j5056698
7915c7120107n094116Q588288J5928864J2562397J612509q252821o053512Q582251
7907i246247J6509084L46572k4716565k4327341N588939K9081072K1113856J077826
7899A5427196k164156P209415Q383589J383257n0359J822428n220174j6619500
7891A0171696j6509036m581140M657449M575061n03276p932450j4331750r624795
$$ plain form
7947 -59667851 -40921655 -13345952 5265042 14402074 22921145 30816752 31863037 26482080
7939 26482080 18721883 7163242 -7930012 -15225631 -5096506 12958822 20552691 14614618
7931 14614618 7096687 4163938 1542238 -960388 3347162 14649973 24290365 28174587
7923 28174587 30680602 33369316 31081715 21480973 8458698 -5706084 -22063409 -37120107
7915 -37120107 -42214223 -33625935 -17697071 -5134674 -3522165 -11774986 -17828498 -9246247
7907 -9246247 7262837 7609409 -17107156 -41434497 -35845558 -6764486 14349370 15427196
7899 15427196 13263040 20472455 28856044 30239301 30188942 32011370 26791196 10171696
7891 10171696 -6337340 -10918480 -6261031 -1685970 -2189246 -10121696 -24453446 -34078241
7883c4078241P318548J7416950O648351q584787m938263J0040726J0706232m692822
7875a63306j4445480j0813272o845920p512745l617456M707303O615295M171512
7867b7904069R772617J8629837J3042205l005283m770545J1122193J6934825k692832
7859C1128948k6417101k9113878j3612154M270623J8168860K4113937J4139509
7852B2678744p083614j9259286j4402603q157025j0719930r029055O780455K1881607
7844a7310707K0145315Q892071J718523l977228j3040144j5251306l128915R777074
7836a2175317R180448K834482L257655M792577j179056n923218r40152K213463
7828B060882n927938r998676K890298J2987024j185519j9412210p369791K4187006
$$ plain form
7883 -34078241 -26759693 -9342743 -2694392 -11279179 -16217442 -6176716 4529516 -163306
7875 -163306 -14608786 -25422058 -32267978 -39780723 -43398179 -38690876 -32075581 -27904069
7867 -27904069 -18131452 498385 13540590 10535307 5764762 16886955 33821780 31128948
7859 31128948 4711847 -24402031 -38014185 -33743562 -15574702 8539235 22678744
7852 22678744 15595130 -3664156 -18066759 -26223784 -36943714 -45972769 -39192314 -17310707
7844 -17310707 2834608 11726679 13445202 9467974 -3572170 -18823476 -21952391 -12175317
7836 -12175317 -2994869 -160387 3097268 7889845 6710789 787571 -152581 2060882
7828 2060882 -3867056 -13865732 -10975434 2011590 826071 -18586139 -25955930 -1768924
7820a768924L1875129P023488j4446664j2104766o020824j1483855j1682477N627692
7812a2981201K0403657J2800961m340948q726288k463892j218690p297355j2588066
7804a6411822j3369692p153723R162970K4776952J7778391j1925538l2063825
7797b9206287j8839519R755030K1534071J3897812P150386Q601985R035401N921441
7789B7850320N232261M647981l272093j3919345j5491339q385493k958196j433262
7781g729166J713218N389854M271387J402575K185484O93397j0473285k1467148
7773b4013684j5889437K526406J3716835J0426045L850300J229648q82011k81480
7765i317378J0850465K5228069K2708804J300795j5216099j0947830N94148J090921
$$ plain form
7820 -1768924 30106205 37129693 22683029 10578263 4557439 -6926416 -18608893 -12981201
7812 -12981201 7422456 20223417 15882469 7156181 4692289 3473599 -3823756 -16411822
7804 -16411822 -29781514 -36935237 -27772267 -2995315 14783076 2857538 -29206287
7797 -29206287 -48045806 -38290776 -16756705 -2858893 4291493 12893478 21928879 27850320
7789 27850320 33082581 37730562 34458469 20539124 5047785 -3337708 -6295904 -7729166
7781 -7729166 -6015948 -626094 3645293 5047868 7233352 7926749 -2546536 -24013684
7773 -24013684 -39903121 -37376715 -23659880 -13233835 -9383535 -8153887 -9035898 -9317378
7765 -9317378 1533087 26761156 49469960 50770755 35554656 24606826 25200974 26291895
7757B6291895n232052m971504n95561k856596q578307n887376L561997N950706
7749G683202k308351r322081o314402J543932N892851O132942N322476L239779
7741A1870348j145804n234029n799274m023022l639220n041074m595105l97315
7733a8004495M100676M636031K672851L386134P095304P901905L007926k055750
7725A2740582j461014K715275N173639N070895L271401k076435r477258r709771
7717F247314K141204J4847453J3014841j761820j3419042j3017960n949032K72152
7709B375110K616403r02533p380868m437798J3931483K9213198J6794860j6319147
7701C5890708l5222814k3906430m579518r16982o322715l568565O059776J2045493
$$ plain form
7757 26291895 21059843 16088339 15492778 12636182 4057875 -1829501 1732496 7683202
7749 7683202 5374851 -3947230 -10261632 -8717700 -2824849 3308093 8630569 11870348
7741 11870348 10724544 5490515 -308759 -4331781 -7971001 -13012075 -17607180 -18004495
7733 -18004495 -13903819 -9267788 -6594937 -3208803 3886501 11788406 14796332 12740582
7725 12740582 11279568 13994843 19168482 24239377 27510778 25434343 15957085 6247314
7717 6247314 8388518 23235971 36250812 34488992 21069950 8051990 2102958 2375110
7709 2375110 4991513 4088980 -3291888 -7729686 6201797 35414995 52209855 35890708
7701 35890708 667894 -23238536 -27818054 -28735036 -35057751 -38626316 -32566540 -20521047
7693b0521047J4826428J7042487J0951918m986182j2967198j971051Q622893j842604
7685I155644j6771701n492999K3588327K9973689J849415k6330053k5554833q579178
7677a8161689J29964J783718R528975J8605377J4397104j268370j2991033j5055155
7669c031109j4774304j5738181j2048327K32972J4903888K0416126J0497035p462830
7661g004730j5129017k011256J8148620K0919703L257943j1985236q940749R6016
7653b648706k859499j3012741j3167228k238359N284196L582417J208821L213373
7645b0637726L955601M51194j034247L167843O616534L504064j116793Q76725
7637d216805P440252Q343762o08345j1250702j2922145n131204L459938P241722
$$ plain form
7693 -20521047 -5694619 11347868 22299786 17313604 4346406 2375355 10998248 9155644
7685 9155644 -7616057 -13109056 10479271 40452960 42302375 15972322 -9582511 -18161689
7677 -18161689 -18031725 -16248007 -6719032 11886345 26283449 25015079 12024046 -3031109
7669 -3031109 -17805413 -33543594 -45591921 -45358949 -30455061 -10038935 458100 -7004730
7661 -7004730 -22133747 -24145003 -5996383 14923320 18181263 6196027 -2744722 -2648706
7653 -2648706 -5508205 -18520946 -31688174 -33926533 -28642337 -25059920 -23851099 -20637726
7645 -20637726 -16682125 -16230931 -17265178 -14097335 -7480801 -3976737 -5093530 -4216805
7637 -4216805 3223447 11567209 10958864 -291838 -13213983 -18345187 -14885249 -7643527
7629g643527Q701134R491393M823128n754034r668037L202643K0316814J8952695
7621D2422209l29577j2243964m505956M464365k151028j1332590n055888M723584
7613A5991155n382892k6680896k6331711J257397K3305497J7244079J116105M04174
7605I22908R623521Q069240m485445j1729698r203114n557965k266927N408714
7597i218766J0826299K200558j3308973j4397816J268687J0937071K254276o954303
7589a6392967R51567J2493110M315942j6748307k0852835K59310K1042352J9648460
7581D716632N421739j962234j955984n043505q426261r10008J2759816J3586276
7573A8186471k794804j6418951r700819R146610J9072760J3512079L719683n58996
$$ plain form
7629 -7643527 1057607 10549000 15372128 9618094 -49943 3152700 23469514 42422209
7621 42422209 42092632 29848668 25342712 29807077 27656049 16323459 11267571 15991155
7613 15991155 10608263 -16072633 -42404344 -41146947 -17841450 -597371 518734 922908
7605 922908 10546429 18615669 14130224 2400526 -6802588 -12360553 -14627480 -9218766
7597 -9218766 1607533 3808091 -9500882 -23898698 -22630011 -11692940 -9438664 -16392967
7589 -16392967 -15441400 -2948290 1367652 -15380655 -36233490 -35974180 -14931828 4716632
7581 4716632 10138371 8176137 6220153 1176648 -7249613 -8159621 4600195 18186471
7573 18186471 15391667 -1027284 -10728103 -1581493 17491267 31003346 34723029 34164033
7565C4164033k598218r775242k0174126k2479142r537068R544755J5962975M209839
7557f82194p682739j458243J2717915Q737826j3603910k2718990k028139K1023621
7549e694853J4085191j0868062j6860103P96941J1363421J132708p812209N7883
7541a3799083P715256r8186o893282N763737K1782297J4096178j0244492j9864341
7533a541916o434486P799683P784323K570098J675483K72656m971137o503313
7525F51391r49162L344758J394789n76102J495101K663450P87106N90436J356583
7516A0758350l396112r178140k152119J4947474J8537541k176968k5595328k6549009
7508b4804311q984223N874292R539054P425698L071827o58833L934030J5341741
$$ plain form
7565 34164033 31565815 21790573 1616447 -20862695 -30399763 -20855008 -4892033 -682194
7557 -682194 -8364933 -9823176 2894739 11632565 -1971345 -24690335 -26718474 -5694853
7549 -5694853 8390338 -2477724 -19337827 -18540886 -7177465 -6044757 -13856966 -13799083
7541 -13799083 -6083827 -6182013 -13075295 -7311558 14470739 28566917 18322425 -1541916
7533 -1541916 -7976402 -176719 7607604 10177702 11853185 12125841 7154704 651391
7525 651391 -297771 3046987 4441776 3865674 5360775 8024225 8811331 9401767 10758350
7516 10758350 7362238 -1815902 -3968021 10979453 29516994 27340026 1744698 -24804311
7508 -24804311 -33788534 -27914242 -18375188 -10949490 -7877663 -8536496 -4602466 10739275
7500A0739275J4937220o544264k6220533j7279700Q766322J6347968j142199j3030777
$$ plain form
7500 10739275 25676495 19132231 -7088302 -24368002 -15601680 746288 -395911 -13426688
$$ [...]
##END NTUPLES=NMR SPECTRUM
##END=
