##TITLE=31Pdec_SR144rm1h
 , 24 sc
 27.9.2022
##JCAMPDX= 6.0         $$ Bruker NMR JCAMP-DX V2.0
##DATA TYPE= NMR SPECTRUM
##DATA CLASS= NTUPLES
##ORIGIN= UXNMR, Bruker Analytische Messtechnik GmbH
##OWNER= root
$$ XWIN-NMR		Version 3.5
$$ Tue Sep 27 15:50:10 2022 Russian Standard Time (UT+4h)  she@DPX200
##.OBSERVE FREQUENCY= 81.013821
##.OBSERVE NUCLEUS= ^31P
##.ACQUISITION MODE= SIMULTANEOUS
##.ACQUISITION SCHEME= undefined
##.AVERAGES= 24
##.DIGITISER RES= 16
##SPECTROMETER/DATA SYSTEM= spect
##.PULSE SEQUENCE= zgpg30
##.SOLVENT NAME= CD2Cl2
##.SHIFT REFERENCE= (INTERNAL, CD2Cl2, 0, 248.564)
##AUDIT TRAIL= $$ (NUMBER, WHEN, WHO, WHERE, WHAT)
$$ ##TITLE= Audit trail, XWIN-NMR		Version 3.5
$$ ##JCAMPDX= 5.01
$$ ##ORIGIN= Bruker BioSpin GmbH
$$ ##OWNER= she
$$ F:/spectra/data/she/nmr/P31/1/pdata/1/auditp.txt
$$ ##AUDIT TRAIL=  $$ (NUMBER, WHEN, WHO, WHERE, WHAT)
(   1,<2022-09-27 15:48:55.32 +0400>,<she>,<DPX200>,
      <created by zg, POWCHK disabled, PULCHK disabled
       configuration hash MD5:
       00 E9 B6 7A A2 85 ED C7 34 08 36 98 17 FE 4E 26
       data hash MD5: 32K
       30 F0 43 A7 F8 4F 81 16 C5 7D 60 61 31 8D 76 8F>)
(   2,<2022-09-27 15:49:30.07 +0400>,<she>,<DPX200>,
      <Start of raw data processing
       efp BC_mod = 2 LB = 1 FT_mod = 6 PKNL = 1 PHC0 = -10235.42 PHC1 = 39.25659 SI = 64K 
       data hash MD5: 64K
       2B 92 60 10 DF F0 80 17 97 5B 36 22 33 42 74 EC>)
(   3,<2022-09-27 15:49:43.46 +0400>,<she>,<DPX200>,
      <pk PHC0 = -28.68154 PHC1 = 0 
       data hash MD5: 64K
       F8 EA 9D 76 81 44 72 22 07 CD 80 DB 35 10 4F EA>)
(   4,<2022-09-27 15:49:46.85 +0400>,<she>,<DPX200>,
      <abs ABSG = 5 
       data hash MD5: 64K
       6D 2C 37 4A 85 1F 6A 47 4C EC D8 0B 65 E7 C2 9F>)
$$ ##END=
$$ 
$$ hash MD5
$$ 58 45 5C B6 9C 8C 48 E1 A7 20 1F A1 63 D6 FB 32
##$RELAX= 
##$RELAX= 
##$RELAX= 
##$RELAX= 
##$RELAX= 
##$RELAX= 
##$RELAX= 
##$RELAX= 
##$RELAX= 
$$ Bruker specific parameters
$$ --------------------------
##$DU= <F:/spectra>
##$EXPNO= 1
##$NAME= <P31>
##$PROCNO= 1
##$TYPE= <nmr>
##$USER= <she>
##$AMP= (0..31)
100 100 100 100 100 100 100 100 100 100 100 100 100 100 100 100 100 100 
100 100 100 100 100 100 100 100 100 100 100 100 100 100 
##$AQSEQ= 0
##$AQ_mod= 1
##$AUNM= <au_zg>
##$AUTOPOS= <>
##$BF1= 81.014009
##$BF2= 200.13
##$BF3= 200.13
##$BF4= 200.13
##$BF5= 200.13
##$BF6= 200.13
##$BF7= 200.13
##$BF8= 200.13
##$BYTORDA= 1
##$CFDGTYP= 0
##$CFRGTYP= 5
##$CHEMSTR= <none>
##$CNST= (0..31)
1 1 145 1 1 1 1 1 1 1 1 1 1 1 1 1 1 1 1 1 1 1 1 1 1 1 1 1 1 1 1 1 
##$CPDPRG= <waltz16>
##$CPDPRG1= <>
##$CPDPRG2= <waltz16>
##$CPDPRG3= <>
##$CPDPRG4= <mlev>
##$CPDPRG5= <mlev>
##$CPDPRG6= <mlev>
##$CPDPRG7= <mlev>
##$CPDPRG8= <mlev>
##$CPDPRGB= <>
##$CPDPRGT= <>
##$D= (0..31)
0 1 0 0 0 0 0 0 0 0 0 0.03 2e-05 3e-06 0 0 0 0 0 0 0 0 0 0 0 0 0 0 0 0 
0 0 
##$DATE= 1664279334
##$DBL= (0..7)
120 120 120 11 120 120 24 19 
##$DBP= (0..7)
150 150 150 150 150 150 150 150 
##$DBP07= 0
##$DBPNAM0= <>
##$DBPNAM1= <>
$$ [...]
##$SUBNAM3= <"">
##$SUBNAM4= <"">
##$SUBNAM5= <"">
##$SUBNAM6= <"">
##$SUBNAM7= <"">
##$SUBNAM8= <"">
##$SUBNAM9= <"">
##$SW= 501.771253377433
##$SWIBOX= (0..15)
0 1 3 0 0 0 0 0 0 0 0 0 0 0 0 0 
##$SW_h= 40650.406504065
##$TD= 32768
##$TD0= 1
##$TE= 0
##$TE2= 300
##$TE3= 300
##$TEG= 300
##$TL= (0..7)
0 120 53 12 22 120 120 120 
##$TP= (0..7)
150 150 150 150 150 150 150 150 
##$TP07= 0
##$TPNAME0= <>
##$TPNAME1= <>
##$TPNAME2= <>
##$TPNAME3= <>
##$TPNAME4= <>
##$TPNAME5= <>
##$TPNAME6= <>
##$TPNAME7= <>
##$TPOAL= (0..7)
0.5 0.5 0.5 0.5 0.5 0.5 0.5 0.5 
##$TPOFFS= (0..7)
0 0 0 0 0 0 0 0 
##$TUNHIN= 0
##$TUNHOUT= 0
##$TUNXOUT= 0
##$USERA1= <user>
##$USERA2= <user>
##$USERA3= <user>
##$USERA4= <user>
##$USERA5= <user>
##$V9= 5
##$VALIST= <valist>
##$VCLIST= <CCCCCCCCCCCCCCC>
##$VD= 0
##$VDLIST= <DDDDDDDDDDDDDDD>
##$VPLIST= <PPPPPPPPPPPPPPP>
##$VTLIST= <TTTTTTTTTTTTTTT>
##$WBST= 1024
##$WBSW= 4
##$XGAIN= (0..3)
0 0 0 0 
##$XL= 0
##$YL= 0
##$YMAX_a= 5083
##$YMIN_a= -6239
##$ZGOPTNS= <>
##$ZL1= 120
##$ZL2= 120
##$ZL3= 120
##$ZL4= 120
##$ABSF1= 248.5645
##$ABSF2= -253.2056
##$ABSG= 5
##$ABSL= 3
##$ALPHA= 0
##$AQORDER= 0
##$ASSFAC= 0
##$ASSFACI= 0
##$ASSFACX= 0
##$ASSWID= 0
##$AUNMP= <proc_1d>
##$AZFE= 0.1
##$AZFW= 0.5
##$BCFW= 0
##$BC_mod= 2
##$BYTORDP= 0
##$COROFFS= 0
##$CY= -3
##$DATMOD= 1
##$DC= 0
##$DFILT= <>
##$DTYPP= 0
##$F1P= 0
##$F2P= 0
##$FCOR= 1
##$FTSIZE= 65536
##$FT_mod= 6
##$GAMMA= 0
##$GB= 0
##$INTBC= 1
##$INTSCL= 6.834604e-11
##$ISEN= 30
##$LB= 1
##$LEV0= 0
##$LPBIN= 0
##$MAXI= 10000
##$MC2= 0
##$MEAN= 0
##$ME_mod= 0
##$MI= 50
##$NCOEF= 0
##$NC_proc= -9
##$NLEV= 6
##$NOISF1= 182.463
##$NOISF2= 159.3651
##$NSP= 0
##$NTH_PI= 0
##$NZP= 0
##$OFFSET= 248.5645
##$PC= 4
##$PHC0= -10264.1
##$PHC1= 39.25659
##$PH_mod= 1
##$PKNL= yes
##$PPARMOD= 0
##$PSCAL= 0
##$PSIGN= 0
##$REVERSE= no
##$SF= 81.0140089999694
##$SI= 65536
##$SIGF1= 159.3651
##$SIGF2= -187.1042
##$SINO= 113.3802
##$SIOLD= 16384
##$SREGLST= <1H.CDCl3>
##$SSB= 0
##$STSI= 65536
##$STSR= 0
##$SW_p= 40650.406504065
##$SYMM= 0
##$S_DEV= 0
##$TDeff= 32768
##$TDoff= 0
##$TI= <>
##$TILT= no
##$TM1= 0
##$TM2= 0
##$TOPLEV= 0
##$USERP1= <user>
##$USERP2= <user>
##$USERP3= <user>
##$USERP4= <user>
##$USERP5= <user>
##$WDW= 1
##$XDIM= 65536
##$YMAX_p= 518945258
##$YMIN_p= -59842920
$$ End of Bruker specific parameters
$$ ---------------------------------
##NTUPLES= NMR SPECTRUM
##VAR_NAME=  FREQUENCY,     SPECTRUM/REAL,   SPECTRUM/IMAG
##SYMBOL=    X,             R,               I
##VAR_TYPE=  INDEPENDENT,   DEPENDENT,       DEPENDENT
##VAR_FORM=  AFFN,          ASDF,            ASDF
##VAR_DIM=   65536,         65536,           65536
##UNITS=     HZ,            ARBITRARY UNITS, ARBITRARY UNITS
##FACTOR=    0.620285442955139, 1,           1
##FIRST=     20137.2065510682, 0,            0
##LAST=      -20513.1999529968, 0,           0
##MIN=       -20513.1999529968, -59842920,   0
##MAX=       20137.2065510682, 518945258,    0
$$ Real data points
##PAGE= N=1
##DATA TABLE= (X++(R..R)), XYDATA
$$ [...]
42633a4486472J1237307O457216l301104m834854K494399O558330J219528n150595
42625A93755l458656K705554M144604K76454k069138n52352P42099j13967r25495
42616I42858j852713n185150p704887k601666Q159151J2725798N471296m349196
42608E605491o304229l114890l227931n963218m136364K616399P272568O438105
42600h14069L264769N79877j130050l20541L277827M511320q22460o926535m378000
42591b757862N096849R794107M484061l808246p707364p494707n004997O11762
42583f786397P107484P931752J700505m280906m193420n03197L092639P504403
42575A1572863J1936654R756924j946214j4264517j5530470n479420N303563P605524
$$ plain form
42633 -14486472 -3249165 3208051 -93053 -4927907 -2433508 4124822 5344350 193755
42625 193755 -3264901 -559347 3585257 3861711 1792573 1240221 1982320 1868353 942858
42616 942858 -909855 -6095005 -13799892 -16401558 -8242407 4483391 9954687 5605491
42608 5605491 -698738 -3813628 -7041559 -13004777 -17141141 -14524742 -7252174 -814069
42600 -814069 2450700 3030577 1900527 1579986 4857813 9369133 8546673 1620138 -2757862
42591 -2757862 2338987 12133094 16617155 12808909 5101545 -2393162 -7398159 -6786397
42583 -6786397 321087 8252839 9953344 5672438 1479018 975821 4068460 11572863
42575 11572863 23509517 33266441 31320227 17055710 1525240 -3954180 1349383 8954907
42567H954907J192010o871892q306279j304715N939096M152990l375921l721746
42559c341550O242019J3017744N577452p879304j1882211n512185q71602l710188
42551h359825p446668n756876n32230M055646O905842P474382M845141J233898
42543B419310O32582K476985K077556j438365l328758j178038J066254j07951
42535B619575k028874r50445J010007p47002m894146m901031J096368O297822
42527b497726M382959r35822q49403N382323R018867N161886Q2291L99815J853314
42518B1998504k921345j0316233j0175855k519173J656057k554021p105267m505207
42510a6442540J822246N197755M827180K388543k064228n564547k098578P021184
$$ plain form
42567 8954907 10146917 3275025 -5031254 -6335969 -396873 3756117 380196 -3341550
42559 -3341550 2900469 15918213 21495665 13616361 1734150 -3778035 -4649637 -8359825
42551 -8359825 -15806493 -21563369 -22095599 -18039953 -11134111 -3659729 1185412 2419310
42543 2419310 3051892 5528877 7606433 6168068 2839310 1661272 2727526 2619575
42535 2619575 590701 -359744 650263 -96739 -4990885 -9891916 -8795548 -2497726
42527 -2497726 1885233 949411 100008 5482331 14501198 19663084 19745375 20145190 21998504
42518 21998504 19077159 8760926 -1414929 -3934102 -2278045 -4832066 -11937333 -16442540
42510 -16442540 -14620294 -9422539 -4595359 -2206816 -4271044 -9835591 -11934169 -4912985
42502d912985J1031460M725997k710400j621013L562063L004383k445214m502999
42494F131292j559206J145513J744349K112910J128829k706303m642524N04635
42486C859495P920628P839584j57027o931083o974935l189978P06321L944353
42478G017358N019451K147218k405591m934526o086602p524762n564386L271138
42470i060702J2473602J1451201J108192o255210l768946K403160M258313K133580
42462A4743190L50929l48161j912112m724833p007788o151824n88301O963429
42454A324529R733135M226278m493055q697938o739152k284530J268578J395116
42446d267039l347457q467933n163523O706508J4489843R643229O87661p73667
$$ plain form
42502 -4912985 6118475 10844472 8134072 6513059 10075122 13079505 10634291 6131292
42494 6131292 4572086 5717599 7461948 9574858 10703687 7997384 3354860 3859495
42486 3859495 11780123 19619707 19462680 12531597 5556662 2366684 3073005 7017358
42478 7017358 12036809 14184027 11778436 6843910 757308 -6767454 -12331840 -9060702
42470 -9060702 3412900 14864101 15972293 9717083 5948137 8351297 12609610 14743190
42462 14743190 15094119 14745958 12833846 8109013 1101225 -5050599 -5638900 1324529
42454 1324529 11057664 15283942 10790887 2092949 -4646203 -6930733 -5662155 -4267039
42446 -4267039 -7614496 -16082429 -21245952 -14539444 -49601 9593628 10281289 9507622
42438I507622J898437n88938m862388j798818M240735J636355o814203p987764
42430d768962k292479k589838q939456o761375N886974J1739744K766943n965454
42422a0923903j673526O058091L946185k606478j088910O614845R472717N123675
42414A4922696p22652n346291q245600o290093M36387M790152L024378J318437
42406C887414M008536M641206k142625r232086p849837j448758J338790O7445
42398f729915o70116k36007Q29462M364009P546423K528108q445037j0041360
42390a0854433L092455J3822460P251057n305278m649661N607883P523024m09701
42382A6077806l839246K19279p4628p407266r566079j462217N847266L778499
$$ plain form
42438 9507622 11406059 10817121 5954733 4155915 8396650 10033005 3218802 -4768962
42430 -4768962 -7061441 -9651279 -18590735 -25352110 -19465136 -7725392 -4958449 -10923903
42422 -10923903 -12597429 -6539338 -2593153 -5199631 -6288541 326304 9799021 14922696
42414 14922696 14200044 8853753 608153 -5681940 -5245553 -455401 2568977 3887414
42406 3887414 7895950 12537156 10394531 1162445 -6687392 -8136150 -6797360 -6729915
42398 -6729915 -7400031 -7636038 -6806576 -2442567 5103856 7631964 -813073 -10854433
42390 -10854433 -7761978 6060482 13311539 8006261 3356600 8964483 16487507 16077806
42382 16077806 12238560 12457839 12383211 4975945 -4590134 -6052351 -205085 3573414
42374C573414j751073k833465q65463L44591J361641J854326j522238p479508
42366g317775q956962l147914M739526R410396R844529N898330j007425m693350
42358D769355j060270L430931N57575m860168j921565O408771O021654m749567
42350H596716j0978838m733839L123872J370981n462633p368290l236357K912305
42342a5776083R232601J2133034N752449o754659j1690785k981029P730502P676364
42334E322394J40290m248025m096973m325590m461250j514737J216165n34790
42326a2502516k522957J247820O388482M279427k401048k544473N241628R244000
42318F430363K132342q122025r877460l414520J419231k09393k363454J896485
$$ plain form
42374 3573414 1822341 -1011124 -1876587 -1531996 -170355 1683971 161733 -7317775
42366 -7317775 -16274737 -19422651 -14683125 -5272729 4571800 10470130 9462705 4769355
42358 4769355 3709085 7140016 7697591 2837423 915858 7324629 13346283 8596716
42350 8596716 -2382122 -7115961 -3992089 -2621108 -8083741 -15452031 -18688388 -15776083
42342 -15776083 -6543482 5589552 11342001 4587342 -7103443 -10084472 -2353970 5322394
42334 5322394 5462684 1214659 -2882314 -7207904 -11669154 -13183891 -11967726 -12502516
42326 -12502516 -15025473 -13777653 -7389171 -3109744 -5510792 -8055265 -2813637 6430363
42318 6430363 8562705 440680 -9436780 -12851300 -11432069 -11641462 -14004916 -12108431
42310a2108431R448670J0497054K865836l150121R91302P955755L802569j0205076
42302A0097558j6907491p576516N010843N624503j429475j231077P148305R544812
42294A0281462j36397r526753n801162N990553J0888849M751715k398587k564771
42286A1484909J03889j187795m019525k059067K094893k55081q371681j0835408
42278a3044866l635958K220034j129916m209864L543122J3213415R088012m043061
42270B000918o398884M873331J0647873J020243r350587o367194J920092K137653
42262D83445j838179N49901N366508J703101p101229p843703M34830N456442K181312
42253f07572q40596K565230O799764M992359o38349l321038o75188L726658M115676
$$ plain form
42310 -12108431 -2659761 7837293 10703129 7553008 8544310 16500065 20302634 10097558
42302 10097558 -6809933 -14386449 -9375606 -3751103 -5180578 -6411655 736650 10281462
42294 10281462 10145065 618312 -5182850 807703 11696552 16448267 14049680 11484909
42286 11484909 11588798 10401003 6381478 4322411 6417304 6162223 -2209458 -13044866
42278 -13044866 -16680824 -14460790 -15590706 -19800570 -16257448 -3044033 6043979 2000918
42270 2000918 -4397966 475365 11123238 12143481 2792894 -3574300 -1654208 483445
42262 483445 -1354734 -804833 4561675 6264776 -836453 -8680156 -8245326 -2788884 -607572
42253 -607572 -1448168 1117062 7916826 12909185 12270836 8949798 8274610 12001268 16116944
42244A6116944k380288j1209100j2951593m368468O250698R480252O363271L754986
42236A1056702K851503K80893k994618k735457M00188J669233j8996j986961l554743
42227D967744n390189n507567k421107N91036O31426M98229K263303J434053m014952
42218f948024n785845K146248R670473L751058r137491j0561644J499640R630976
42210e734609M117435m333958l944584J915867N056470N392804N122948J294263
42202H886636o788013j1371185n865443N453957J3242044J2969002N658574m142193
42194A8043379q576239l093707M869151L485497n325149p386078J104997O713953
42186I835804M79655q166897q014181l004421j866405l014188j532770k94983
$$ plain form
42244 16116944 13736656 2527556 -10424037 -14792505 -8541807 938445 7301716 11056702
42236 11056702 13908205 14189098 11194480 8459023 8859211 10528444 10509448 8522487 4967744
42227 4967744 -422445 -5930012 -8351119 -7760083 -7128657 -6630428 -4367125 -2933072 -6948024
42218 -6948024 -12733869 -10587621 -917148 2833910 -6303581 -16865225 -15365585 -5734609
42210 -5734609 -1617174 -5951132 -9895716 -7979849 -2923379 2469425 7592373 8886636
42202 8886636 2098623 -9272562 -15138005 -9684048 3557996 16526998 22185572 18043379
42194 18043379 9467140 6373433 11242584 14728081 9402932 2016854 3121851 9835804
42186 9835804 10315459 2148562 -5865619 -8870040 -10736445 -13750633 -15283403 -15578386
42178a5578386j958616k82348P849228J2129321M609049m339228j775871N355395
42170F008544J904407q497782q732328K868303R847315M442397k514942j855839
42162C470075J393674R77398m13079q6458j355741m425493k940080M237523Q293187
42153I151006L592100l738491o012849m305175l267619l330004l002403k394010
42145a3307445q37701K815988N776843M238058J050751J711683L163045k041289
42137B569933j0312403r728033j07866N237244J818396P51311O489254O738738
42129C456574m058392j0035089P39284J2676452N663490j0600776j0009676Q423037
42121c745096J8421967O418353j0530077j2919649m328390J179978J039371J275842
$$ plain form
42178 -15578386 -17537002 -17819350 -9970122 2159199 6768248 2429020 653149 6008544
42170 6008544 7912951 -584831 -9317159 -6448856 3398459 7840856 5325914 3470075
42162 3470075 4863749 5841147 5428068 5341610 3985869 -439624 -3379704 857819 9151006
42153 9151006 12743106 9004615 2991766 -1313409 -4581028 -7911032 -10913435 -13307445
42145 -13307445 -14145146 -11329158 -5552315 -1314257 -263506 1448177 4611222 2569933
42137 2569933 -7742470 -17470503 -17578369 -12341125 -10522729 -9771418 -3282164 3456574
42129 3456574 -601818 -10636907 -9897623 2778829 8442319 -2158457 -12168133 -3745096
42121 -3745096 14676871 21095224 10565147 -2354502 -6682892 -5502914 -4463543 -3187701
42113c187701K467645Q94816k285373k961341j663711j700919k336349j23087
42105a0896020M481879O875854M421014j84651j800811J720575O718586P307920
42097A8644346K866670q22963n84991j592047q359353j4332374r667493K486262
42089a1361943Q432321L771904m75506M301898J0983290Q458390j431417p692410
42081A4986527o121035k623579k675883n033046n775862l120704K056370O735250
42073a571962P198800L067682j109052j253032Q15531Q07495r26680m43901K145557
42064H730438J518051m512666r922953p588440P28797O000566L579227j258658
42056b725638j598718J410611J919154j41880J018872O323734Q750414M219929
$$ plain form
42113 -3187701 -720056 174760 -2110613 -5071954 -6735665 -8436584 -10772933 -10896020
42105 -10896020 -6414141 461713 4882727 4698076 2897265 4617840 11336426 18644346
42097 18644346 21511016 20688053 20103062 18511015 10151662 -4180712 -13848205 -11361943
42089 -11361943 -2929622 842282 366776 4668674 15651964 24110354 22678937 14986527
42081 14986527 8865492 6241913 3566030 -1467016 -7242878 -10363582 -8307212 -1571962
42073 -1571962 5626838 8694520 7585468 6332436 7147967 7955462 7028782 6584881 8730438
42064 8730438 10248489 5735823 -4187130 -11775570 -11046773 -5046207 -1466980 -2725638
42056 -2725638 -4324356 -2913745 -994591 -1136471 -117599 6206135 14956549 19176478
42048A9176478j514854k040222p3729j420242m566297m303986j450245l13931
42040C492972k00629J277191M18065n832038r130356p9230J2338298R032645q995246
42031B321672j7525335l869363J3339161J1936596j597107n096565M721496J0546936
42023A4777491L096586p540228j0096627n952879j364297J683128K668865L98130
42015b329831k447912o58319M644958O018091J014382m159512m836236l762727
42007f517106l543332j417127L664988O253442K829494j101276P23019M767576
41999E659678L223361k954487n048817j14372M753349L732090O39863J572264
41991A1462929M641703L595581j141944k836918j12505j20463o511659j1655762
$$ plain form
42048 19176478 17661624 15621402 15547673 14127431 9561134 5257148 3806903 3492972
42040 3492972 3292343 4569534 4987599 -844439 -9974795 -10054025 2284273 11316918 2321672
42031 2321672 -15203663 -19073026 -5733865 6202731 4605624 -490941 4230555 14777491
42023 14777491 17874077 10333849 237222 -5715657 -7079954 -5396826 -2727961 -2329831
42015 -2329831 -4777743 -5436062 -791104 5226987 6241369 2081857 -2754379 -6517106
42007 -6517106 -10060438 -11477565 -7812577 -1559135 1270359 169083 892102 5659678
41999 5659678 8883039 5928552 879735 765363 5518712 9250802 9890665 11462929
41991 11462929 16104632 19700213 18558269 15721351 15608846 15488383 8976724 -2679038
41983b679038p525285J212619L797156k93200j831286K436356N706836M052981
41975D877139K040464K026702p58851p067472q723986k142270L818530K264294
41967c665450K26946N581527J1757109Q454555m75895m214293l404206n884003
41959H376290r234138m613253M973545P780558L490874K510047N252201J311944
41951A9848068q555235r923256L93024O879055J081022m455799Q26849O784791
41943A2878519J242861q364450q713520l183548k786842m614442J439944J1139379
41935i62099J0786275Q87440l595257K803203Q294060L162670o621153r773165
41927D981974l939956M600234Q746501N587133j516420n428922l600019j633904
$$ plain form
41983 -2679038 -10204323 -8991704 -5194548 -5487748 -7319034 -4882678 824158 4877139
41975 4877139 6917603 8944305 8185454 1117982 -7606004 -9748274 -5929744 -3665450
41967 -3665450 -3438504 2143023 13900132 22354687 21878792 17664499 14260293 8376290
41959 8376290 -857848 -5471101 -497556 7283002 10773876 13283923 18536124 19848068
41951 19848068 11292833 1369577 1762601 8641656 9722678 5266879 6093728 12878519
41943 12878519 14121380 5756930 -2956590 -6140138 -8926980 -13541422 -12101478 -962099
41935 -962099 9824176 10711616 7116359 9919562 18213622 21376292 14755139 4981974
41927 4981974 1042018 5642252 14388753 19975886 18459466 13030544 9430525 7796621
41919G796621m319207p721878o090451j099826K851920O138667Q564800M545378
41911A0666024n789689r532532J038714J1825264N571051r704983j1645642J150791
41903f421002Q336868K307071j788232M442825Q151073K65940p730476n185678
41895B378389l22780k203858l381077K750756M903358o168316j6040226p365417
41887b5449171R668020J1855936j49835m746957M763231J2536791Q909968K883863
41879B0271846J633819r72784q183409j0930909l486485N760493P418350L249986
41871A4760907j348357n801898r323798q121389l051207k3933R20100N448827
41863f540748J0850431O460363o760536j2821314m695855M132098K327641j137512
$$ plain form
41919 7796621 3477414 -4244464 -10334915 -11434741 -8582821 -2444154 6120646 10666024
41911 10666024 4876335 -4656197 -3617483 8207781 13778832 4073849 -7571793 -6421002
41903 -6421002 1915866 4222937 2434705 6877530 15028603 15294543 7564067 2378389
41895 2378389 2055609 -148249 -3529326 -778570 4124788 -2043528 -18083754 -25449171
41887 -25449171 -15781151 -3925215 -4075050 -8822007 -4058776 8478015 17387983 20271846
41879 20271846 21905665 20932881 12749472 1818563 -1667922 4092571 11510921 14760907
41871 14760907 13412550 7610652 -1713146 -9834535 -12885742 -12909675 -11989575 -6540748
41863 -6540748 4309683 10770046 4009510 -8811804 -13507659 -9375561 -7047920 -8185432
41855h185432M841471J1994935O773184n300796q380032j739493K496378J723006
41847D223221L670595P718451M764245m171633p412103k578450k2459l435742
41839B756125l969513J717980M397299K46026k05114Q973888J5353516O127169
41831C5397376j0582673j6347815p973369J030528J429436j775410q52809L220902
41823C546166M395098J195972j242593J837957P438899O861832k675326j1717704
41815I640301r784375o03879K850889j733981k782391N036587J0229576K562866
41807A5415593q897232q093192M043724J1281078N607603l538212m972144m6688
41799A0800530L027901J652202k08693n359L9594k206853m212276k074758K309357
$$ plain form
41855 -8185432 -3343961 8650974 15424158 10123362 1743330 3837 2500215 4223221
41847 4223221 7893816 15612267 20376512 16204879 8792776 6214326 6191867 2756125
41839 2756125 -1213388 504592 4901891 5147917 4942803 13916691 29270207 35397376
41831 35397376 24814703 8466888 493519 1524047 2953483 1178073 325264 3546166
41823 3546166 7941264 9137236 7894643 9732600 17171499 24033331 21358005 9640301
41815 9640301 -144074 -747953 2102936 368955 -2413436 2623151 12852727 15415593
41807 15415593 6518361 -1574831 2468893 13749971 19357574 15819362 10847218 10800530
41799 10800530 13828431 15480633 15271940 15266581 15306175 13099322 8887046 6812288 9121645
41790I121645J984283m338542p271035P36527J1413650R554611m331265j2463015
41782D406859m832701O222492M526800o558291j0212561k60743J1584336J1382126
41774A6258317j519196j4619622j4522350p92055J1624856Q698709m269170r482072
41766h622583k379545K961431j685955n138393K582183J1927069J0235741K790353
41758A2670301R42434J346165m232683r173891l332119M713903K33594r412511
41750f244807m866764J0536648J3937952J003314p819331l029103J011967l281877
41742A247999k425971R088466J3236592o86515j4196629q979497L078944J695215
41734B058604p991458p766389J615721N724955L332780L538741M071007l256119
$$ plain form
41790 9121645 11105928 6767386 -503649 232878 11646528 21201139 16869874 4406859
41782 4406859 -425842 5796650 10323450 3765159 -6447402 -6708145 4876191 16258317
41774 16258317 14739121 119499 -14402851 -15194906 -3570050 5128659 859489 -8622583
41766 -8622583 -11002128 -8040697 -9726652 -14865045 -12282862 -355793 9879948 12670301
41758 12670301 13612735 14958900 10726217 1552326 -1779793 2934110 3167704 -6244807
41750 -6244807 -11111571 -574923 13363029 14366343 6547012 3517909 4529876 1247999
41742 1247999 -1177972 7910494 21147086 20460571 6263942 -2715555 363389 2058604
41734 2058604 -5932854 -13699243 -12083522 -6358567 -3025787 512954 4583961 1327842
41726A327842j1185978n395004R007592J2975425M222292q57729L435578M375147
41718A7905165l694617q680749k883474L984206L142934J042225M915514Q482053
41710B4213257L387867o164449j0788781r304531n890811j660817K922064M324526
41702A038325J881609Q73088L520531M127492o46269m653726k724565k68393l363930
41693b15838o294327j43937J0539662J1902580R61467r626429r358197k922082
41685e157101m48311k098406m22137N056778N358964l046463r171526j581885
41677a1510087J2681090J4850175J124483j0228949m995379O037535M432583o944707
41669E446744r323597J477002Q966894K803106o158434m997632J884465K962273
$$ plain form
41726 1327842 -9858136 -15253140 -6245548 6729877 10952169 10094440 13530018 17905165
41718 17905165 14210548 5529799 2646325 6630531 9773465 10815690 15731204 24213257
41710 24213257 27601124 21436675 10647894 1343363 -4547448 -6208265 -3286201 1038325
41702 1038325 2919934 3793022 7313553 11441045 10794776 6141050 3416485 3148092 -215838
41693 -215838 -6510165 -6654102 3885560 15788140 16749607 7123178 -2235019 -5157101
41685 -5157101 -5605412 -7703818 -8125955 -3069177 2289787 -756676 -9928202 -11510087
41677 -11510087 1171003 16021178 17145661 6916712 1921333 7958868 12391451 5446744
41669 5446744 -3876853 -2399851 6567043 9370149 3211715 -1785917 98548 3060821
41661C060821j770020l825550o37829L564511O119191O244347J963390m959020
41653I759841o415132Q40873P026376K573861n893925n252619K467635L089959
41645H196869n653940r363089l02639R797323Q400131P39680j384813O02309k795181
41636H236650j0140175j0174504p15416P389578P082413L546749K158133j77717
41628G205711n375716o640182K98472O892213L641495l938107l555937L560664
41620B088613M570665l344547p858964j499992O656470O075780M53761n38036
41612F603750L233164M948111L157353J692122Q53727k121521n735862n495790
41604G135054j613344J301327J442167Q59032M27789o35453j315438r7948J317250
$$ plain form
41661 3060821 1290801 -2534749 -3172578 391933 6511124 12755471 14718861 9759841
41653 9759841 3344709 4185582 11211958 13785819 7891894 2639275 5106910 8196869
41645 8196869 2542929 -6820160 -7122799 2674524 11074655 11814335 10429522 11031831 8236650
41636 8236650 -1903525 -12078029 -12793445 -5403867 1678546 5225295 7383428 7205711
41628 7205711 1829995 -4810187 -4511715 2380498 6021993 2083886 -1472051 2088613
41620 2088613 6659278 3314731 -4544233 -6044225 612245 6688025 7141786 6603750
41612 6603750 9836914 14785025 17942378 19634500 20488227 18366706 12630844 7135054
41604 7135054 5521710 6823037 8265204 9124236 9552025 8916572 7601134 7503186 8820436
41595H820436K66254k301858l638911l442543k351709N32487M222425M234229
41587F340810j98918k315975K005038N720061R73989p046548p431187j282148
41579c234878J32815n992558r633556l905348N353427Q977743N098624j836302
41571e040033n509619n80440J1378825J9062018J2892121j344001r399109p773354
41563A3686408n188509n955438m965877l84885K149647Q53420N21501J046501
41555A762768l256486r410182n883682P465589J4782715P230818l913995n954633
41547B822912k039617M60686M007779J0454891J0335205j922524j3225133q661148
41539B233051N597391J2152469P256192j57282o472283j2841339j3295743k685421
$$ plain form
41595 8820436 9086690 6784832 3145921 -296622 -2648331 -2115844 2106581 6340810
41587 6340810 6141892 3825917 5830955 11551016 12525005 5478457 -1952730 -3234878
41579 -3234878 -3102063 -9094621 -18728177 -22633525 -17280098 -8302355 -3203731 -5040033
41571 -5040033 -10549652 -11130092 248733 19310751 32202872 30858871 21459762 13686408
41563 13686408 8497899 2542461 -2423416 -2808301 -658654 194766 716267 1762768
41555 1762768 -1493718 -10903900 -16787582 -9321993 5460722 12691540 8777545 2822912
41547 2822912 783295 1243981 5251760 15706651 26041856 24119332 10894199 2233051
41539 2233051 7830442 19982911 27239103 27081821 20609538 7768199 -5527544 -8212965
41531h212965P855420L347918r466432r673335M870115J3903130P379079k85369
41523I717561L467884Q863974K188620j0673821j3651720l938975O799353Q805610
41515A1578486K099549p082983j0390014l282281P273956P886425k667736q711113
41507c295711L74747J2724838J0261373m591255j2954207p421142m56849k590926
41499g949132o463508l37049J2184955J6581582P847251l522983o786199m032062
41491G522855l819115p306702p612843j437355N754355P697273M575368m28180
41483D945656o062557j0241708q028094J197028Q948750P677890K280955K800128
41475C518048Q033953P207151j844569p942046l818562K461435Q0440q309151
$$ plain form
41531 -8212965 -357545 2990373 -6476059 -16149394 -11279279 2623851 10002930 9717561
41523 9717561 13185445 22049419 24238039 13564218 -87502 -4026477 2772876 11578486
41515 11578486 13678035 6595052 -3794962 -7077243 196713 8083138 5415402 -3295711
41507 -3295711 -2920964 9803874 20065247 15473992 2519785 -4901357 -5358206 -7949132
41499 -7949132 -14412640 -14749689 -2564734 14016848 21864099 18341116 11554917 7522855
41491 7522855 3703740 -3602962 -11215805 -12653160 -6898805 798468 5373836 4945656
41483 4945656 -1116901 -11358609 -19386703 -18189675 -9240925 -1563035 717920 3518048
41475 3518048 11552001 18759152 16914583 8972537 5153975 7615410 7695850 -613301
41467f13301j0925979l030448Q224559J2954749P842211j829209o562612j754901
41459D305069O020713O198636j240362n422758j333949K308192k067017p565240
41451A203284m353500K826751J641628o931924q837935J118298J0589517P319471
41443D575590m664079j2249921r241232N08274J0083154J3890689R385151j07671
41435A2179955o854884o727774l083467l20670J837715M110383L152220k748655
41427A544823p444348l642903N892835J0837291O756080k63610l146608k110156
41419H423404j472848k918518m724993m951918l297379j159213k43668J36578
41411a0208555K807434P221378P210235m90445q215815n906896L293611O024350
$$ plain form
41467 -613301 -11539280 -14569728 -6345169 6609580 14451791 12622582 6059970 4305069
41459 4305069 10325782 16524418 15284056 9861298 8527349 10835541 8768524 1203284
41451 1203284 -3150216 -323465 1318163 -5613761 -14451696 -13333398 -2743881 4575590
41443 4575590 -88489 -12338410 -21579642 -21071368 -10988214 2902475 12287626 12179955
41435 12179955 5325071 -1402703 -4486170 -4806840 -2969125 1141258 4293478 1544823
41427 1544823 -5899525 -9542428 -3649593 7187698 13943778 13680168 10533560 8423404
41419 8423404 6950556 4032038 -692955 -5644873 -8942252 -10101465 -10345133 -10208555
41411 -10208555 -7401121 -179743 7030492 6540047 -1675768 -7582664 -4289053 1735297
41403A735297j144925o009467j94423P447975N989118N43688K332945Q182030
41395A8882238N808566l843886o906633l41615K039398o815487j3651182n672913
41387a0501514P635667P639695n679003j4085304p301948M768378Q356118L515646
41379e652265N7345K533103N988790M724798j8627k648255j108055Q66917m6004
41370D697747j660873o15109J103524m03548k757229l08787M749494L968023k258186
41361F515056k412024P207221J2727836K459035j3055261j4907936l676738L117769
41353b025042p36806k668667M641019R621318J585220r926428q879952K831242
41345e558096Q985235L157699m459632m450860k34498O18087k423416n407973
$$ plain form
41403 1735297 590372 -5419095 -5613518 1834457 7823575 8367263 10700208 18882238
41395 18882238 24690804 20846918 13940285 13598670 15638068 8822581 -4828601 -10501514
41387 -10501514 -2865847 4773848 -905155 -14990459 -22292407 -17524029 -9167911 -5652265
41379 -5652265 -5594920 -3061817 2926973 7651771 7633144 4984889 3876834 4743751 4697747
41370 4697747 3036874 2421765 3525289 3121741 364512 55725 4805219 8773242 6515056
41361 6515056 4103032 11310253 24038089 26497124 13441863 -1466073 -5142811 -2025042
41353 -2025042 -2761848 -5430515 -789496 8831822 10417042 490614 -8389338 -5558096
41345 -5558096 3427139 6584838 2125206 -2325654 -2560152 -1942065 -4365481 -9773454
41337i773454o541652m606742L316297J5431501K0890783J1023134o170985j2406411
41329A1162471k241071R279588P185571l594379p517207j392845L548121N76629
41321A7006878l930507l029125O22887J965450J911432K509542J196340l391845
41313A4861052n951597j871069M716312O700757L417355j549874o774672j0700631
41305B847633q674053j93137O033376K948361l698306m250937j20155R18292m68785
41296d657711J853409N012292O72910p611942o588378M793208J1435813N112149
41288A0021750l549539l470352N03435l59601k357641K366773R688785Q797136
41280B1640746r57637r844441j1498956p332386P9949Q618063J3142923R118968
$$ plain form
41337 -9773454 -16315106 -20921848 -17605551 -2174050 18716733 29739867 23568882 11162471
41329 11162471 8921400 18200988 25386559 21792180 14274973 12882128 16430249 17006878
41321 17006878 13076371 10047246 10670133 12635583 14547015 17056557 18252897 14861052
41313 14861052 8909455 7038386 11754698 18455455 21872810 20322936 13548264 2847633
41305 2847633 -5826420 -6019557 13819 2962180 -736126 -4987063 -5107218 -4188926 -4657711
41296 -4657711 -2804302 2207990 2880900 -4731042 -11319420 -6526212 4909601 10021750
41288 10021750 6472211 3001859 3505294 3145693 788052 3154825 12843610 21640746
41280 21640746 20683109 10838668 -660288 -7992674 -7912725 705338 13848261 22967229
41272B2967229k50712o933325p537509m618213n09172L969146O203253L733358
41264A7024055q30002k325481l11144Q41710j157564l624938k856565J694162
41256H454233O445894N847858j445120p824786m152581N877376P344662m652451
41248A5895085j5118405r810843L342229O624240o07584l862380J103362L499245
41240A064949o55531r95502O744000J0388647J641015q303699o528557M78584
41232C833906j078319q238469p036437K502719N832322j447408o151996N31698
41224a1251984Q975981P187722r37907l671001M09146L228317J461234o00676
41216D800832o68323j488100l693934l472881L48491K644174j359579q891842
$$ plain form
41272 22967229 22716517 15783192 8245683 3627470 3118298 7087444 13290697 17024055
41264 17024055 16194053 13868572 13557428 14399138 13241574 9616636 6760071 8454233
41256 8454233 14900127 20747985 19302865 11478079 7325498 13202874 20547536 15895085
41248 15895085 776680 -9034163 -5691934 932306 324722 -3537658 -2434296 1064949
41240 1064949 409418 -586084 6157916 16546563 18187578 9883879 3355322 3833906
41232 3833906 2755587 -5482882 -12519319 -10016600 -4184278 -5631686 -11783682 -11251984
41224 -11251984 -2276003 4911719 3973812 302811 711957 3940274 5401508 4800832
41216 4800832 4132509 2644409 -1049525 -4522406 -4173915 -1529741 -2889320 -11781162
41208a1781162j1759530m850723P894796J5693612J1147298k09363m341763L640063
41200E433228J1118011M442962j0281475j4101445k395874Q355401N390064k423126
41192E537746j133923N461157L974383m747609o983171M72811N379636J214013
41184I175043k760308J021144N238583J667413l594936j131099M517055K518720
41176A6651615n050321o535049o55547J996101k033537l475491K411253O843111
41168A0152135K596189l734356l446031M8113q46737l497451n62397N265421M977688
41159A0952574o46621j763436L452260N353223n52100n502673j640385N661629
41151A5314471O680043R07145n306999q192053o795057j96468P943669Q282861
$$ plain form
41208 -11781162 -23540692 -28391415 -20496619 -4803007 6344291 6134928 1793165 5433228
41200 5433228 16551239 20994201 10712726 -3388719 -5784593 2570808 7960872 5537746
41192 5537746 4403823 9864980 13839363 9091754 2108583 2581394 7961030 9175043
41184 9175043 6414735 7435879 12674462 14341875 10746939 9615840 14132895 16651615
41176 16651615 11601294 5066245 4410698 6406799 4373262 897771 3309024 10152135
41168 10152135 12748324 9013968 5567937 5616050 4769313 1271862 709465 5974886 10952574
41159 10952574 10305953 8542517 11994777 17348000 16795900 11293227 9652842 15314471
41151 15314471 21994514 22901659 17594660 9402607 2607550 2411082 10354751 18637612
41143A8637612j931779j1001579p195136L724822O944699R98511j924359K774433
41135A1027224N438723j57769o391594n370145j355536j609781l893408j695850
41127d008136M670399R987599J1814795R832011L288728m536073n658458J593869
41119B6984734P111908K705245m713656l312930M989675P051766k188017j3131989
41111B5496736j4506703n104325P603498J4279585R862332j357880q148468m827034
41103B3297741J571353J870971k413701m172570l128972l235895k181905M472746
41095A6079768J1120272P043351o329272j5242810j2153073l455202K737922N396684
41087E197640N085846R16783l715250k512577L320486N547595K142314l10438
$$ plain form
41143 18637612 16705833 5704254 -1490882 2233940 9178639 10177150 8252791 11027224
41135 11027224 16465947 16308178 9916584 4546439 3190903 1581122 -2312286 -4008136
41127 -4008136 662263 10649862 22464657 32296668 35585396 31049323 25390865 26984734
41119 26984734 34096642 36801887 32088231 28775301 33764976 40816742 38628725 25496736
41111 25496736 10990033 5885708 13489206 27768791 37631123 36273243 28124775 23297741
41103 23297741 24869094 26740065 24326364 20153794 17024822 13788927 11607022 16079768
41095 16079768 27200040 34243391 27914119 12671309 518236 -2936966 -199044 5197640
41087 5197640 10283486 11200269 7485019 4972442 8292928 13840523 15982837 15672399
41079A5672399L37866j559055o137208m665157M281571Q305077l50744j1190054
41071D694695j0680251j651164L694176K586570J693576L546868M606272M170381
41063A2661123M960921N813747K296213n111721r650215o018958L465590J0192313
41055A8609013O599855m721126j0483048j763440J1551526J1567044j887360r912100
41047A9560364k912546N370332J142233p504110n850650K709961M354269j131408
41039A5738445k203507L088354N322675J643086r18094n7047q92435l229901j072485
41030A7419091L328133J19290r770068j2022736j133524Q645283L724736q757277
41022A552928j2348164m608440L140001M826674N738905R618338J0989937N098644
$$ plain form
41079 15672399 16010265 14451210 8314002 3648845 7930416 16235493 15884749 4694695
41071 4694695 -5985556 -7636720 -3942544 -1355974 337602 3884470 8490742 12661123
41063 12661123 17622044 23435791 25732004 20620283 10970068 4951110 8416700 18609013
41055 18609013 25208868 20487742 10004694 8241254 19792780 31359824 29472464 19560364
41047 19560364 16647818 22018150 23160383 15656273 9805623 12515584 16869853 15738445
41039 15738445 13534938 16623292 21945967 23589053 22670959 22613912 21721477 18491576 17419091
41030 17419091 20747224 20866514 11096446 -926290 -2059814 6585469 10310205 1552928
41022 1552928 -10795236 -15403676 -12263675 -7437001 -1698096 7920242 18910179 24008823
41014B4008823j936833l68407Q305244J1563832K832963q673457j0582217m579878
41006B0570070k176452n865519o219368N10398M428843k005400j0740103j0080784
40998a1578315j708066M426003N722242O452746O450730J946084m587083n997387
40990A126954j122792M413421O549870M755596j072056p916995q253767k32088
40982a751857N908572J932664l906340M69023R524925P972815k981127o244454
40974A0924221L337876J1145604P493177J553677K452911L556505k847757r322058
40966B8294156n559832L263813M595325j813346n843134m237443k767764l060577
40958A2871198Q8990O850935Q647869P80538q673646q659239j47924N090373O09091
$$ plain form
41014 24008823 22071990 21703583 30008827 41572659 44405622 35732165 25149948 20570070
41006 20570070 18393618 12528099 6308731 6819129 11247972 9242572 -1497531 -11578315
40998 -11578315 -13286381 -8860378 -3138136 3314610 9765340 11711424 7124341 1126954
40990 1126954 4162 4417583 10967453 15723049 14650993 6733998 -1519769 -1751857
40982 -1751857 4156715 6089379 2183039 2652062 12176987 20149802 17168675 10924221
40974 10924221 14262097 25407701 32900878 34454555 36907466 40463971 37616214 28294156
40966 28294156 22734324 25998137 30593462 28780116 22936982 18699539 15931775 12871198
40958 12871198 12960188 19811123 28458992 29239530 20565884 11906645 11758721 16849094 17458185
40949A7458185n978636m230424L652813O174860K39823m433248j629799J347168
40941A2600742k590837o434196l93932J0029302J1028696J609679o338858p143876
40933A2366720o216900o165613k775783L230954M401506j23182k139076J355886
40925C934512L779533K185515J853525L537725p1643r069840j1053904M62439
40917d442138J3759147J4266686L280464o972897r268487n096000O88042K874996
40909I089813l82110l463734o4529N082415K007926o294471o167776L321080O791316
40900I919930j238822n501304L732025J1905701L324503j2121604j3692091n63781
40892d235443J0346204J0027536M032365j360577m637596m446088j746267k279520
$$ plain form
40949 17458185 11479549 7249125 10901938 17076798 17316621 12883373 11253574 12600742
40941 12600742 10009905 3575709 3181777 13211079 24239775 25849454 19510596 12366720
40933 12366720 6149820 -15793 -2791576 439378 4840884 4717702 2578626 3934512
40925 3934512 7714045 9899560 11753085 15290810 15219167 6149327 -4904577 -4442138
40917 -4442138 9317009 23583695 26864159 19891262 10622775 5526775 6214817 9089813
40909 9089813 8707703 5243969 5179440 10261855 12269781 5975310 -192466 3128614 9919930
40900 9919930 8681108 3179804 6911829 18817530 22142033 10020429 -3671662 -4235443
40892 -4235443 6110761 16138297 20170662 18810085 14172489 9726401 7980134 5700614
40884E700614o999692o999974J964861R205790N235298k054089j203180L317054
40876H166682J435737k792648o4323M408909Q2070p125165l663366O245286O599207
40867A3292389j955736k988330O620602J1541905M530507l647743n075452n053939
40859A7264203o260630k054822P503426J0727312L044509n011479n464604l557714
40851A6190201m247511l005581K730437O614222M544710K55601m552887j1613146
40843F916046j4514408l152662J5236170J8846588L020878j0550541o683024J658041
40835A0777088j354316p363054j262859J0094564Q861914l791695j0039287k943807
40827B978548O635393Q187625J845765p014598j1359488m627618R512087J5213648
$$ plain form
40884 5700614 -1299078 -8299052 -6334191 2871599 8106897 6052808 4849628 8166682
40876 8166682 9602419 6809771 6745448 11154357 11236427 4111262 447896 6693182 13292389
40867 13292389 11336653 8348323 14968925 26510830 31041337 27393594 22318142 17264203
40859 17264203 11003573 8948751 16452177 27179489 30223998 25212519 19747915 16190201
40851 16190201 11942690 8937109 11667546 18281768 22826478 23082079 18529192 6916046
40843 6916046 -7598362 -10751024 4485146 23331734 26352612 15802071 9119047 10777088
40835 10777088 9422772 2059718 796859 10891423 19753337 15961642 5922355 2978548
40827 2978548 9613941 17801566 19647331 12632733 1273245 -3354373 6157714 21371362
40819B1371362M110636r922604r153556K095787O034580j07891l113978J263590
40811A2577926K522435l397631o035610N82810O764380L113135m776730o463134
40803D887581k072872J266949J602516K245377L845843L826686K014145J356077
40795A8972302L204805N052696L434866j739735n984026m587904R62507L394155
40787B2709666j302369q088648r429363m790990M34341K837261L192462K832148
40779H394508K341635K226452J405700k211590o480112n142127K160080O093576
40771H788122R39485m656238l20779P879331N240094p454590j2623023j644792
40763c852390J1908053J1669914L26023o942455l644937L030074M946114K180852
$$ plain form
40819 21371362 25481998 15559394 6405838 8501625 14536205 14428314 11314336 12577926
40811 12577926 15100361 11702730 5667120 6249930 13014310 16127445 11350715 4887581
40803 4887581 2814709 4081658 5684174 7929551 11775394 15602080 17616225 18972302
40795 18972302 22177107 27229803 30664669 28924934 22940908 18353004 19315511 22709666
40787 22709666 21407297 13318649 3889286 -901704 -467363 2369898 5562360 8394508
40779 8394508 10736143 12962595 14368295 12156705 5676593 534466 2694546 8788122
40771 8788122 9727607 5071369 4750590 12629921 17870015 10415425 -2207598 -3852390
40763 -3852390 8055663 19725577 20051600 13109145 9464208 12494282 17440396 19621248
40755A9621248j79817J315246N558961P567067K667713p702030j5731819j5078473
40747a961904p498796M61423N218673P356404O846487J943031o077852j0919968
40739d632502p130763L158177J1800388J2766192O981098l21393m390517l218770
40731A5011910J263469L206754j651798q538222p152802L661850J1413534O802444
40723B4017139j824869j235064N354146M226869m383229n788263L092969O579204
40715C0038902l149853j0924237l006624R422742Q290924k033109l249621O459848
40707C1848972J1270035M404296l597981m461330k640013k714761j316630L374580
40699C6167168O301190M798273L231032M196532L996477L11086l886205o761790
$$ plain form
40755 19621248 19441431 20756677 26315638 33882705 36550418 28848388 13116569 -1961904
40747 -1961904 -9460700 -8999277 -3780604 3575800 10422287 12365318 6287466 -4632502
40739 -4632502 -11763265 -8605088 3195300 15961492 22942590 22621197 18230680 15011910
40731 15011910 16275379 19482133 17830335 9292113 2139311 5801161 17214695 24017139
40723 24017139 22192270 20957206 26311352 30538221 26154992 20366729 23459698 30038902
40715 30038902 26889049 15964812 12958188 22380930 30671854 28638745 25389124 31848972
40707 31848972 43119007 47523303 43925322 39463992 36823979 34109218 32792588 36167168
40699 36167168 42468358 47266631 50497663 54694195 58690672 59001758 55115553 48353763
40691D8353763r938198j2360500j0047664l888997J93832K41327k51975l2002
40683A2269586q89551j402934O99642J357300l515505o616146J657393J3706678
40675A7266463J1688248m003864j2413356l990840M956340j19177r070074o453979
40667b140239K466619L440613j139315J418430R317520Q280569l766116j2322529
40659E555552q180617J195647N156381K776360j235676l936994l699542N25864
40651a843025O366223R385853Q652267O697155M203119j93238m920081n576626
40643B2771647j001301M514779N987237K641332j800376k701989L81061K231893
40635C3024283j489572p009472o945576j549121J915663J386261K166385M958857
$$ plain form
40691 48353763 38415565 26055065 16007401 12118404 12312236 12553563 12301588 12269586
40683 12269586 11380035 9977101 10676743 12034043 8518538 1902392 3559785 17266463
40675 17266463 28954711 24950847 12537491 8546651 13502991 13383814 4313740 -2140239
40667 -2140239 326380 3766993 2627678 4046108 13363628 21644197 17878081 5555552
40659 5555552 -2625065 -1429418 3726963 6503323 5267647 1330653 -2368889 -1843025
40651 -1843025 4523198 13909051 22561318 29258473 33461592 33268354 28348273 22771647
40643 22771647 21770346 26285125 32272362 34913694 33113318 30411329 30792390 33024283
40635 33024283 31534711 24525239 17579663 16030542 17946205 19332466 21498851 26457708
40627B6457708K970106m576071p901576k576485J747518k472227p057775j937308
40619D653890P492053R658107M960188J108888j993467p980965j1055544l403667
40611C439483Q327667R856179O67109n998970l216408L311848P608678Q597589
40603C2593175M518252m158338q092281K25411J1036860Q306713n155501j0822331
40595B8451960k850911N202374M515436K675699N767381P104581K030691k036377
40587E0860834M35670K972508P3636k410527Q40885L976380N86485n218854o940498
40578D5176519n519011l648378J44343N150860O448651N161509R103658J7126390
40570G9144541J6584208M325404m843972j415646K176323p755145k2078133k2272537
$$ plain form
40627 26457708 29427814 24851743 16950167 14373682 16121200 13648973 6591198 4653890
40619 4653890 12145943 21804050 26764238 27873126 25879659 17898694 6843150 3439483
40611 3439483 11767150 21623329 22290438 16291468 13075060 16386908 23995586 32593175
40603 32593175 37111427 32953089 24860808 25086219 36123079 44429792 39274291 28451960
40595 28451960 25601049 30803423 35318859 37994558 43761939 50866520 52897211 50860834
40587 50860834 51296504 54269012 54342648 51932121 52773006 56749386 57335871 52117017 45176519
40578 45176519 39657508 36009130 36153473 41304333 47752984 52914493 62018151 79144541
40570 79144541 95728749 100054153 95210181 93794535 95970858 88215713 66137580 43865043
40562D3865043q383126L379377M448231k11571m848512p169796m068312L902994
40554C0914328P815913J662245o619391o348195J13997M144568N440940O830088
40546D3954493L362198p918167j5653594r130437J952933J848878m333339m13388
40538A3669577R674322O708808q609434j3159643J110999J4105375J1058641L778359
40530C8337004N524244P951050K6128r597522q433485k920014n255323r890215
40522A5741867m154338O905884Q119949R78258Q71202R387153J0941710l54649
40514D8437036j0109344o393116L194959O042313L228259L103515N188733K183693
40506E4876048o008968j0626057o388369J709814N838137N334813O441851J3043817
$$ plain form
40562 43865043 35481917 38861294 43309525 43097954 38249442 31079646 27011334 30914328
40554 30914328 38730241 40392486 33773095 27424900 27538897 31683465 37124405 43954493
40546 43954493 47316691 39398524 23744930 14614493 16567426 18416304 14082965 13669577
40538 13669577 23343899 30052707 21443273 8283630 9394629 23500004 34558645 38337004
40530 38337004 43861248 51812298 51838426 42240904 33807419 30887405 25632082 15741867
40522 15741867 11587529 18493413 26613362 27591620 28462822 37849975 48791685 48437036
40514 48437036 38327692 31934576 35129535 41171848 44400107 47503622 52692355 54876048
40506 54876048 48867080 38241023 31852654 33562468 39400605 44735418 51177269 64221086
40498F4221086K0245020J9590049J0575459K925404M312331R525458P732404j533352
40490A37593859p557610m362644J159373J043702j655126K50948M625368K842581
40482A33940451n894659j2726110j2705904j1346522j4175432j7434352j4678221
40475D4979251p044846q07399J341883O62746k279618o072712n476778K429149
40467B7731676J1160748J1776215N537986J382982K051040K482176J631815M206071
40459F7960709Q742789O669121k148391n782144O12377M762587l326460j3760066
40451F3730522j2244768l675712l472498j1077750j0795602J534773J0917435
40444C4916400O448962l268073n280615r15336k02422n547019j0068540q466960
$$ plain form
40498 64221086 84466106 104056155 114631614 117557018 121869349 131394807 139127211 137593859
40490 137593859 130036249 125673605 126832978 127876680 126221554 126472502 131097870 133940451
40482 133940451 128045792 115319682 102613778 91267256 77091824 59657472 44979251
40475 44979251 37934405 37127006 38468889 39131635 36852017 30779305 25302527 27731676
40467 27731676 38892424 50668639 56206625 57589607 59640647 62122823 63754638 67960709
40459 67960709 76703498 83372619 81224228 75442084 76054461 80817048 77490588 63730522
40451 63730522 51485754 47810042 44337544 33259794 22464192 23998965 34916400
40444 34916400 41365362 38097289 32816674 31901338 31698916 26151897 16083357 7616397
40436G616397k618047K262437L006348R10565L65367L736904P798762P696912
40428C0775645L492565n53827j842546p50704J981924M714938M066243m80892
40420D1403346m084738l957995m749395r451272j0757985j960215Q683961Q095900
40412B3221607k13718r19150P270302Q606659k937802j2225435o865798L651333
40404A9587998M667119j050341j573819L013494L001575k863195o047925k950310
40396A5784596R91883J440508k37008k432731n260673o808539m067722K030933
40388A441247P356936R666540Q942341M784554j754555n740533k893826M402756
40380B6205460R467652Q469757K560070m582311q495936o440870j308595L68733
$$ plain form
40436 7616397 4998350 7260787 10267135 11177700 11543067 15279971 23078733 30775645
40428 30775645 34268210 33714383 31871837 31121133 33103057 37817995 41884238 41403346
40420 41403346 37318608 33360613 28611218 19159946 8401961 6441746 15125707 23221607
40412 23221607 23007889 22088739 29359041 37965700 35027898 22802463 15936665 19587998
40404 19587998 24255117 23204776 21630957 24644451 27646026 24782831 18734906 15784596
40396 15784596 16776479 18216987 17979979 15547248 10286575 3478036 -589686 1441247
40388 1441247 8798183 18464723 27407064 32191618 30437063 24696530 21802704 26205460
40380 26205460 35673112 44142869 46702939 42120628 33624692 27183822 25875227 26243960
40372B6243960k754318m339885k67288M015341J251355o544104j0593998o487384
40364E23679K141031R102543J0747978P369968K779821R53441J511500J034974
40356C6164935r14405j638300j293948k759444m972431m098506k156582m781110
40348A3550209q645552l347995R780389J4513730L440023q577939n929834M864321
40340A9647352P772197K502307O42257L657484K562142l630981o128927k696261
40332B4327570p06839k875810l320612N61128M202505N363466O658330P642435
40324D1852173M938153Q11875J020981L914275K690310j627839j624176J888519
40316E3864271K13485o624895q015702j142377L245515q63840m728348j023947
$$ plain form
40372 26243960 23489642 19149757 18882469 22897810 24149165 17605061 7011063 523679
40364 523679 2664710 11767253 22515231 29885199 32665020 33618461 35129961 36164935
40356 36164935 35250530 33612230 32318282 29558838 24586407 20487901 18331319 13550209
40348 13550209 4904657 1556662 11337051 25850781 29290804 20712865 14783031 19647352
40340 19647352 27419549 29921856 30564113 34221597 36783739 33152758 27023831 24327570
40332 24327570 23620731 20744921 17424309 17985437 22187942 27551408 34209738 41852173
40324 41852173 46790326 47602201 48623182 52537457 55227767 53599928 51975752 53864271
40316 53864271 54077756 47452861 39437159 38294782 41540297 40676457 35948109 34924162
40308C4924162K990717j268052q030788o590418J187628M688910J227721k030594
40300B7099286n00814K687729L247258N57085l499123n599345k371061M973083
40292B6594098R437390N885575k215871p511569p623310n136499j442758M049411
40284B2036467R525196J0633648N841324q25925l664987j207304K214224J352228
40276D5904871l182448m933813k19193N940757O355673J773552j006796L41057
40268E0973660J666493O85735J78785J616944K456019J752293J863614K309171
40260F3502714r37033o665755o297127M095214J5521346J6324745O966134j566104
40252I0944134j812965L296312O668728N363163K041053N55242R05468j089399
$$ plain form
40308 34924162 37914879 36646827 28616039 22025621 23213249 27902159 29129880 27099286
40300 27099286 26598472 29286201 32533459 33090544 29591421 23992076 21621015 26594098
40292 26594098 36031488 41917063 39701192 32189623 24566313 19429814 17987056 22036467
40284 22036467 31561663 42195311 48036635 47210710 43545723 42338419 44552643 45904871
40276 45904871 42722423 37788610 37569417 43510174 49865847 51639399 50632603 50973660
40268 50973660 52640153 53325888 53504673 55121617 57577636 59329929 61193543 63502714
40260 63502714 62565681 55899926 49602799 53698013 69219359 85544104 92510238 90944134
40252 90944134 89131169 92427481 99096209 104459372 106500425 107055667 107961135 106871736
40244A06871736p771553j4423856j3828534o153515L81573K67680k426672p80429
40236F2136430M983771P989147L813791l745914o567598j616765M352528K361674
40228G3707064n773982p442368L556260J5848192J4517334J789031o791968m447795
40220H4961768P50740J890153J924974L249006J796611k383712p00242R700181
40212A01189479J7798315J4516342P425436Q376196J4124167J2695186M444390
40205A80569511K151256J0517738J9284419K0072943J8578371K3816469L3649415
40198C08640122L9181271L8989817L9812159M2756413L6960351J2605125k2974497
40191D95970761m9269848n4181421m5979432m0258513m0446429l7851816k7551345
$$ plain form
40244 106871736 99100183 84676327 70847793 64694278 65075851 65343531 62916859 62136430
40236 62136430 67120201 75109348 78923139 75177225 68609627 66992862 71345390 73707064
40228 73707064 67933082 60490714 64046974 79895166 94412500 96201531 89409563 84961768
40220 84961768 85712508 87602661 89527635 92776641 94573252 92189540 91489298 101189479
40212 101189479 118987794 133504136 140929572 149305768 163429935 176125121 180569511
40205 180569511 182720767 193238505 212522924 232595867 251174238 274990707 308640122
40198 308640122 347821393 386811210 426623369 469379782 506340133 518945258 495970761
40191 495970761 446700913 392519492 346540060 306281547 265835118 227983302 200431957
40184B00431957j5335567q482575p169446o968125m153635K890701J2329933J8176993
40176A91720236J6262430J0974837J0190194J4274984J7461366J9070570K3820954
40169C03775571L0911666L3742046L1760629L0327743K6232379P859331k3934103
40162D40675262m9463019n4356164m7538288m4052596m2129566l1731585j6279093
40155A55124951q880639j1759894j5161624j4212278j2467477j0350684m469479
40148G7822876J532820o20126q819988j0761655k092750P287688Q678587N143069
40140G8170521J916603k763845r997672j2518104m421213O579497O966823l325260
40132F0607350q631849K100156J9008809K2388746Q761984k792237M570719K1579018
$$ plain form
40184 200431957 185096390 176613815 169444369 162476244 158322609 161213310 173543243 191720236
40176 191720236 207982666 218957503 229147697 243422681 260884047 279954617 303775571
40169 303775571 334687237 368429283 400189912 430517655 456750034 464609365 440675262
40162 440675262 391212243 336856079 289317791 245265195 203135629 171404044 155124951
40155 155124951 146244312 134484418 119322794 105110516 92643039 82292355 77822876
40148 77822876 79355696 78735570 69915582 59153927 57061177 64348865 73027452 78170521
40140 78170521 80087124 77323279 67325607 54807503 50386290 56965787 63932610 60607350
40132 60607350 51975501 54075657 73084466 95473212 104235196 101442959 106013678 127592696
40124A27592696K4962529J1010122J868602J3546464L2654092L6619991K5456747
40117B73711243J7026972J7078386J2928608k734337j9562177k6664794k7746956
40110B44036945l0748067l3264371k8646733j9635383j4925560j5126805j2279258
40103H9410768l563883L309648J505864m849095p288441n327411m877348o026981
40095F2293121j839634Q012573J2438952N213930k649476J759333J2427690J4294174
40087A11950663R697144J5322939L2066973M0292603L2008377K4845736L0780494
40080B96964929L2656112J1575639j9847672l5278234l2973347l1123749l4360961
40073A87612717l2236439k5650641k5929347k8475988j6576599N275633J1160504
$$ plain form
40124 127592696 152555225 163565347 165433949 178980413 211634505 248254496 273711243
40117 273711243 290738215 307816601 320745209 318010872 298448695 271783901 244036945
40110 244036945 213288878 180024507 151377774 131742391 116816831 101690026 89410768
40103 89410768 85846885 89156533 90662397 85813302 78524861 73197450 68320102 62293121
40095 62293121 60453487 68466060 80905012 86118942 83469466 85228799 97656489 111950663
40087 111950663 121647807 136970746 169037719 209330322 241338699 266184435 296964929
40080 296964929 329621041 341196680 321349008 286070774 253097427 221973678 187612717
40073 187612717 155376278 129725637 103796290 75320302 58743703 64019336 75179840
40066G5179840n286858j7760282p389431R885887J1907721L117673l83995Q54172
40058G0124727k267022n901060j551429N316160N343988M063807J0233629J4754941
40050A00117741L857892j3243191j4266091Q17447Q717241r24296j1515477q037165
40042F5524101J329840K305768l456613n602464k349330J221520L567224N073018
40034F7613064K912290l271755o595865k604963J986124m48655m452225J173977
40026E6311992J4301711J9545634R140194o303336j2372284q466161m488426n130347
40018F2538977n599202j842248K743270L243745N20583j112122q2672K284883
40010F2695214N051665P038909N495306L71453k286607K465625R154062P384309
$$ plain form
40066 75179840 69892982 52132700 44743269 54629156 66536877 69654550 69270555 70124727
40058 70124727 67857705 61956645 60405216 65721376 71065364 75129171 85362800 100117741
40050 100117741 103975633 90732442 76466351 77283798 86001039 85076743 73561266 65524101
40042 65524101 66853941 69159709 65703096 60100632 57751302 58972822 62540046 67613064
40034 67613064 70525354 67253599 60657734 58052771 60038895 59590240 55138015 56311992
40026 56311992 70613703 90159337 99299531 92996195 80623911 72157750 67669324 62538977
40018 62538977 56939775 55097527 57840797 61084542 61605125 60493003 60410331 62695214
40010 62695214 67746879 74785788 80281094 80652547 78365940 80831565 89985627 97369936
40002I7369936l081535j1210379j0566243p008779o378579m260973M356559J3298073
39994G2518080J3120541N739942R52974J691832K871050K509013L131853K894403
39986A05429688l435659j3312072j6760915j0634784l155314j262610k704892
39979E4163442m134713p055823j0463586p428986L497576J1788713Q448428p05012
39971D8110039m197370j420116k13246k699068m151788l028488j756139L93228
39963C1037052M978180O899878M20876q425078p663502K087556P914567N105066
39955D2354595L063812O680768P117047q95875o992839j749596O828852O776359
39947F3183123K062504L835579R489054P359703k005372o340924k094443J697601
$$ plain form
40002 97369936 94288401 83078022 72511779 65503000 59124421 54863448 59220007 72518080
39994 72518080 85638621 91378563 92331537 94023369 96894419 99403432 102535285 105429688
39986 105429688 101994029 88681957 71921042 61286258 58130944 56868334 54163442
39979 54163442 50028729 42972906 32509320 25080334 28577910 40366623 48815051 48110039
39971 48110039 43912669 42492553 42279307 39580239 35428451 32399963 30643824 31037052
39963 31037052 36015232 42915110 43335986 34910908 27247406 29334962 37249529 42354595
39955 42354595 45418407 52099175 59216222 58320347 51327508 49577912 56406764 63183123
39947 63183123 65245627 69081206 78570260 85929963 83924591 77583667 75489224 77186825
39939G7186825M40019k97346K099609K707649K58584l70603P17698j659751m477699
39930G6604985J859580J4976306J9746765J1753386N125548R357236J4953200
39923A54377006J1994092O369978N194280K178494p487251j2783112n089045K487042
39915A57241484n943041k1527921k3772803j2906679o139245p177470l893619
39908G5880706N568724R052629M474175M031064R844787Q037852n357467j3423206
39900I8109264l737067J2479679J7629267J0019849j173579j0384728j5368019
39893A07574666j3829190r135838r167449j3013555j0527814o98390M021992j104151
39885E4120271l815033L371645Q825656K322143n972628k899686N465871O907103
$$ plain form
39939 77186825 77626844 77329498 79429107 82136756 82395340 82024737 82742435 81082684 76604985
39930 76604985 78464565 93440871 113187636 124941022 130066570 139423806 154377006
39923 154377006 166371098 172741076 177935356 180113850 172626599 159843487 154754442 157241484
39915 157241484 151298443 129770522 105997719 93091040 86951795 79774325 75880706
39908 75880706 81449430 90502059 94976234 99007298 108852085 116889937 111532470 98109264
39900 98109264 94372197 106851876 124481143 134500992 133327413 122942685 107574666
39893 107574666 93745476 84609638 75442189 62428634 51900820 51202430 55224422 54120271
39885 54120271 50305238 53676883 62502539 64824682 58852054 55952368 61418239 68325342
39877F8325342N867567J2899981K1297482J6527123K621584l644451j575859o243455
39869A16075314j9287191k3587033j1990664q4788j758729r667594j0218551l639077
39861C5841687J705103L455112L011125j462813r298260j2091561m321877O540845
39853B3379361R666065N528292K176186J701663K16819j943700n20259K846029
39845D3050456J044691o474077j0619678n282647L512059N893140J061009l507814
39837B8677139l120462k39661J694375K972174M331847L836001O72325j208634
39829C7615104K100420P621621Q335499K696712l192489l556955R30483N959580
39821E8509975Q800044R528868J0052046J2218519J3893303Q455146o267025k0031830
$$ plain form
39877 68325342 74192909 87092890 108390372 124917495 127539079 123894628 122318769 116075314
39869 116075314 96788123 73201090 61210426 61125638 59366909 49699315 39480764 35841687
39861 35841687 37546790 41001902 44013027 42550214 33251954 21160393 16838516 23379361
39853 23379361 33045426 38573718 40749904 42451567 42668386 40724686 40204427 43050456
39845 43050456 44095147 37621070 27001392 21718745 25230804 31123944 32184953 28677139
39837 28677139 25556677 25317016 27011391 29983565 34315412 38151413 38823738 37615104
39829 37615104 39715524 47337145 55672644 58369356 55176867 51619912 52550395 58509975
39821 58509975 67310019 76838887 86890933 99109452 113002755 121457901 115190876 95159046
39813I5159046j9559121o492877L775326L684336K276512O724294Q199861k225378
39805I1541999j4227439j1199945K656431O232150p172600j9710443j5321183
39798C2798970j210760O006264M050156K971678O325348P367455K638714j865949
39790E9081876n66545L678145N540096N700580P920314J0516260P331764j802223
39782I7400267p218155n20807J2852903J7610351N912181j3389419k4733122k2063812
39774F5850387j2676985p020346p720908q820991m413011L270688O131295J055863
39766C5655992n018485m290306J052024K956886k3448k264441k130833l996783
39758B1940606p817239o834379L95973N324188K434724j829360m1425M341876
$$ plain form
39813 95159046 75599925 69107048 72882374 76566710 78843222 85567516 93767377 91541999
39805 91541999 77314560 66114615 68771046 75003196 67830596 48120153 32798970
39798 32798970 31588210 37594474 41644630 44616308 50941656 58309111 60947825 59081876
39790 59081876 58515331 62193476 67733572 73434152 81354466 91870726 99202490 97400267
39782 97400267 90182112 89661305 102514208 120124559 126036740 112647321 87914199 65850387
39774 65850387 53173402 46153056 38432148 29611157 25198146 28468834 34600129 35655992
39766 35655992 30637507 26347201 27399225 30356111 30332663 28068222 25937389 21940606
39758 21940606 14123367 7288988 7684961 13009149 15443873 13614513 13573088 17914964
39750A7914964M073250J16095k023586k041158k320952j216282K394081L276693
39742B0173105k153358p323896m920870N54315P62043j158401L456877J0994481
39734B0384296Q788797l794409j1918983o013008N831143J0133744L575634o773331
39726B0213883j1263170m473668Q564448J3804058M208638q204529p355848K878713
39718A8372525M495997n674852j0869851j922817Q488894P311122L12675j395755
39710A9117938l9339l053242p178438m881670R69738K293953n1093K05338J870128
39701I253313p11472n343069m765233M16474K937320J674173K364876N951766
39693A1778148O626070K281204k360827m210344m882875m128476J099290Q515634
$$ plain form
39750 17914964 21988214 22104309 20080723 18039565 15718613 14502331 16896412 20173105
39742 20173105 18019747 10695851 5774981 6329296 7091339 5932938 9389815 20384296
39734 20384296 29173093 25378684 13459701 7446693 13277836 23411580 26987214 20213883
39726 20213883 8950713 4477045 13041493 26845551 31054189 22849660 15493812 18372525
39718 18372525 22868522 17193670 6323819 4401002 12889896 20201018 20513693 19117938
39710 19117938 19078599 16025357 8846919 3965249 4934987 7228940 7177847 7383185 9253313
39701 9253313 8541841 3198772 -1566461 -1149987 1787333 3461506 5826382 11778148
39693 11778148 18404218 20685422 18324595 14114251 9231376 5102900 6202190 14717824
39685A4717824R542146P44395r517367j0350427r02128R476401J1377302L828886
39677B8917032n434470p348003q15926N736450M087835m020560r935792q925789
39669B260777l430199K890217Q210787R568520L585838p202002j3963112j1177894
39661i257068l217893J911621K275557J637365J902281J074786j411260k262585
39653g347196O30517M121045M026609J381992M69362J527149N15527k995901l588223
39644a259119J054664M615524J257555m386755l952785J353349L624324K498235
39636D804992M904711R742421O205111p284777j5337752o483810Q250018R936212
39628A4737126j797399j0427668p143900K56934L027554K490673K025111l26176
$$ plain form
39685 14717824 24259970 25004365 15486998 5136571 4234443 13710844 25088146 28917032
39677 28917032 23482562 16134559 15318633 21055083 25142918 21122358 11186566 2260777
39669 2260777 -1169422 1720795 9931582 19500102 23085940 15883938 1920826 -9257068
39661 -9257068 -12474961 -10563340 -8287783 -6650418 -4748137 -3673351 -5084611 -7347196
39653 -7347196 -6716679 -2595634 1430975 2812967 3282329 4809478 5325005 2329104 -1259119
39644 -1259119 -204455 4411069 5668624 1281869 -2670916 -1317567 2306757 4804992
39636 4804992 9709703 19452124 25657235 18372458 3034706 -3449104 4800914 14737126
39628 14737126 12939727 2512059 -4631841 -4374907 -1347353 1143320 3168431 2842255
39620B842255n238890o847322j301951N202878M242145k253544m143951K803026
39612d695354J0592899Q798785k070230j0139838o047310N022450R328702K753956
39604A3544060l540133J37954O633738K821571q148437q891496N882220J8434902
39596B6874379J1389898p593447j5838998n686815P507034P728881j899549o617918
39588A5863465r26620N315885J312901r669408j3909212n100946O580436P397660
39580F864161j381618n554795J156462P877797L493500n556716m176198Q837683
39572A1560276J8390710J3563015M85717q232335q619843n155688j960907k14955
39564A9815990n25911k189939j950174K185853P186701Q341634N040146M82922
$$ plain form
39620 2842255 -2396635 -9243957 -10545908 -5343030 -1100885 -3354429 -7498380 -4695354
39612 -4695354 5897545 14696330 12626100 2486262 -3561048 1461402 10790104 13544060
39604 13544060 10003927 10141881 16775619 19597190 11448753 2557257 8439477 26874379
39596 26874379 38264277 30670830 14831832 9145017 16652051 24380932 22481383 15863465
39588 15863465 14936845 20252730 21565631 11896223 -2012989 -7113935 -533499 6864161
39580 6864161 5482543 -72252 1084210 8962007 12455507 6898791 2722593 11560276
39572 11560276 29950986 43514001 43999718 35767383 27147540 21991852 20030945 19815990
39564 19815990 19290079 17100140 15149966 17335819 24522520 32864154 37904300 38387222
39556C8387222k926134n375311p963266j0847124j1828147o906488M247803J3544438
39548A0332993J1410785K98668o243025j863205L733253O97449n369408m092875
39540H904635J314221L34038n206151m041696L484414M760453k601407n398013
39532A550494K287227Q064952K322136n486385l820970J567352j1647m052990
39524B420169j45782P054929M685984n229615q072875m53353N892011M665897
39516A0817365K584065L679429K083587m496942q250448m518048L83427P58918
39508C041353l4890J210377Q13926k575727k550046L471594O948894J248813o697451
39499D876843p190283k574706j064541k213103J70566M869249M676687m37574
$$ plain form
39556 38387222 35461088 30085777 22122511 11275387 -552760 -7459248 -3211445 10332993
39548 10332993 21743778 22042446 15799421 13936216 17669469 18366918 12997510 8904635
39540 8904635 10218856 10552894 5346743 1305047 4789461 9549914 6948507 1550494
39532 1550494 3837721 11902673 14224809 8738424 4917454 6484806 6473159 2420169
39524 2420169 2274387 9329316 14015300 8785685 712810 259457 6151468 10817365
39516 10817365 13401430 17080859 19164446 14667504 6417056 1899008 2282435 3041353
39508 3041353 3006463 4216840 5030766 2455039 -95007 3376587 10325481 11574294 4876843
39499 4876843 -2313440 -4888146 -5952687 -8165790 -7995224 -3125975 1550712 1113138
39491A113138k065492L749142J0439141R881721K286821m678160m199791K225127
39483A8751647M917102l408726j6295766j8697987o467648O769476P963247J959259
39475d509396J366902N932339M922132k747677n274220K680113J0108818N515838
39467A7994849o382314j1779905o304309J517510L159280n13110l272469j901148
39459g481616J762443M724953O194110P022427P234170N278556N2315o637871
39451A8149487j0191517o880819J359907O666335L035824m805545n008319N521201
39443G846554J4069304P891768o841676j2095661l237667M882377P27634p139626
39435F103007m481997O481192J0796765K457189q587163j0684648l346480N211109
$$ plain form
39491 1113138 -952354 2796788 13235929 23117650 25404471 20726311 16526520 18751647
39483 18751647 23668749 20260023 3964257 -14733730 -21201378 -14431902 -6468655 -4509396
39475 -4509396 -3142494 2789845 7711977 4964300 -309920 2370193 12479011 17994849
39467 17994849 11612535 -167370 -6471679 -4954169 -1794889 -2307999 -5580468 -7481616
39459 -7481616 -5719173 -994220 5199890 12222317 19456487 24735043 24787358 18149487
39451 18149487 7957970 1077151 2437058 9103393 12139217 7333672 2325353 7846554
39443 7846554 21915858 29807626 22965950 10870289 7632622 12514999 13242633 6103007
39435 6103007 1621010 8102202 18898967 21356156 12768993 2084345 -1262135 3948974
39427C948974P549683K926949k673360k574293K268075L419129l523930j1403595
39419f2368j0398804j166402O704122O975449J683004m190040o920325m314942
39411a1690306K360957P396111O362549J709995j352330j856386j259770J358920
39403C029740N619711N397542l042059j1221306p400385N139963J0202473J409241
39395I134920q221033m867276O895480J1259315K342743r570589j1436539j640212
39387f103191R570640J1358251L571392l437039j212374O458414Q904925K471709
39379C1582727o125220r669326p611364k807687K468682N214188K352657m082991
39371A1321666p137766l565236J667695K518150k18366j372097J296985N391550
$$ plain form
39427 3948974 11498657 14425606 11752246 9177953 11446028 14865157 11341227 -62368
39419 -62368 -10461172 -11627574 -4923452 2051997 3735001 -455039 -7375364 -11690306
39411 -11690306 -9329349 -1933238 4429311 6139306 4786976 2930590 1670820 3029740
39403 3029740 8649451 14046993 11004934 -216372 -7616757 -2476794 7725679 9134920
39395 9134920 913887 -3953389 2942091 14201406 16544149 6973560 -4462979 -6103191
39387 -6103191 3467449 14825700 18397092 14960053 13747679 20206093 29111018 31582727
39379 31582727 25457507 15788181 8176817 5369130 7837812 13052000 15404657 11321666
39371 11321666 4183900 618664 2286359 4804509 4586143 3214046 4511031 9902581
39363I902581P173679M289402k363658p709292o477248j68581L319331k97556
39355G668658n441962m222229K303023N352041P10349m877301k282055P192844
39347F403368J1811695L942849q797536j1986684l075037N471896L959739j754103
39339E976187j435514L082848K725489k389135l769304k61375L76523k977330
39331A328389j407952P223155J1210121K663015q931273j0730073n034752k587393
39323f266763m661977m372346r09438P18538J490431O466537J1675481O796795
39315A0937258o701005j3374180n077993O913611Q247728O38141l852385o02009
39307b870834M744060O624507L997571k395377r129098r212479k66857Q861226
$$ plain form
39363 9902581 17076260 21365662 19002004 11292712 4815464 4646883 7966214 7668658
39355 7668658 2226696 -1995533 307490 5659531 6369880 1492579 -789476 6403368
39347 6403368 18215063 22157912 13360376 1373692 -1701345 3770551 7730290 5976187
39339 5976187 4540673 7623521 10349010 7959875 4190571 3929196 4305719 1328389
39331 1328389 -79563 7143592 18353713 21016728 12085455 1355382 -3679370 -6266763
39323 -6266763 -10928740 -15301086 -16210524 -15491986 -14001555 -7535018 4140463 10937258
39315 10937258 4236253 -9137927 -14215920 -7302309 945419 1583560 -2268825 -2870834
39307 -2870834 1873226 8497733 12495304 10099927 970829 -8241650 -8508507 352719
39299C52719Q436297K505474K662514Q232878O024226p206911j6141577q766838
39291c901218M961181P754730l63691n515188k607541L51673j042101j453314
39283a815469J632589K684785j69063j50195N409372P850392M57070r513127j0611632
39274d225278k862539M395210N486242J894431k905311n201087j611688N626823
39266E96803Q017749J702388n614140n347159n25359L75444k667730k823826J331278
39257d954552M587241M208084J772795k090392o622576p105049q39755N633914
39249e410290M635792m9329Q69391N940203M694463m860259j2588494j1191590
39241a7960113l853891L980028R512193Q792500R8552p826817l915158P042256
$$ plain form
39299 352719 8789016 11294490 13957004 22189882 28214108 21007197 4865620 -3901218
39291 -3901218 1059963 8814693 8451002 2935814 328273 679946 -362155 -1815469
39283 -1815469 -182880 2501905 2332842 2182647 7592019 15442411 15899481 6386354 -4225278
39274 -4225278 -7087817 -2692607 2793635 4688066 1782755 -3418332 -5030020 596803
39266 596803 8614552 10316940 4702800 -644359 -1169718 -794274 -3462004 -6285830 -4954552
39257 -4954552 -367311 3840773 5613568 3523176 -3099400 -10204449 -11044204 -5410290
39249 -5410290 -774498 -823827 45564 5985767 10680230 5819971 -6768523 -17960113
39241 -17960113 -21814004 -17833976 -8321783 470717 569269 -7257548 -11172706 -4130450
39233d130450Q461419k779553j0646484m895058M281381M865662J065877J772229
39225b004977M252790K009572j859386j686971k04499p14154J676571Q457994
39217I926940Q487997m079455j3191676j810860J7862805J7667639n001685k2099005
39209G762700j5046376J510278N026027l434248o101949M077044J6329747J7842756
39201B7965979O983161p650082j5727971j3797785p698829m581551l380890J652308
39193a6235660R020556R941143J920895o084143n801405J97817M525635M602833
39185B087671J873331k434229n837071m331247J297516L738004j073578o875875
39177a1555478n309135K485246Q141506P094253J999312k462135l121575J121653
$$ plain form
39233 -4130450 4330969 1551416 -9095068 -13990126 -9708745 -4843083 -3777206 -2004977
39225 -2004977 2247813 4257385 2397999 711028 506529 -207625 1468946 9926940
39217 9926940 18414937 14335482 1143806 -667054 17195751 34863390 29861705 7762700
39209 7762700 -7283676 -5773398 -747371 -4181619 -10283568 -6206524 10123223 27965979
39201 27965979 34949140 27299058 11571087 -2226698 -9925527 -14507078 -17887968 -16235660
39193 -16235660 -7215104 2726039 4646934 -1437209 -7238614 -7040797 -2515162 2087671
39185 2087671 3961002 1526773 -4310298 -8641545 -7344029 -3606025 -4679603 -11555478
39177 -11555478 -16864613 -14379367 -6237861 856392 2855704 393569 -2728006 -1606353
39169a606353P154994Q024226Q69817o999184n904660K771558P234388O48229
39161A2193015r865202j2694717n961939K137474N072522M770939N666254O571691
39153G890037L033491l582287n414587O84028O214548J236498j0857741j6107170
39145a6903183p917312N035617J1057572Q414525K202554m359607q930391o480550
39137a7880775M268328J4212150J3106811L969712j221721L86501l03885p261262
39129I275859j1372138n434354L326450M498369K93674k03595L107759K848442
39121F340466j530353l019099k63689K08194l203611l201308L666085R997741
39113H994426Q553386K249778k310747m058786m499958k471397J643822K493626
$$ plain form
39169 -1606353 5548641 13572867 14442684 7443500 1538840 4310398 11544786 12193015
39161 12193015 2327813 -10366904 -16328843 -14191369 -9118847 -4347908 1318346 7890037
39153 7890037 10923528 7341241 1926654 2610682 8825230 10061728 -796013 -16903183
39145 -16903183 -24820495 -19784878 -8727306 -312781 1889773 -2469834 -11400225 -17880775
39137 -17880775 -13612447 599703 13706514 17676226 16454505 16841006 16537121 9275859
39129 9275859 -2096279 -7530633 -4204183 294186 587860 384265 3492024 6340466
39121 6340466 4810113 1791014 1527325 1735519 -1468092 -4669400 -1003315 8994426
39113 8994426 17547812 19797590 17486843 13428057 8928099 6456702 8100524 10594150
39105A0594150k664224q058420p303436k009334L228671P913985J1115336P719327
39097B0536055j913347o563577L35775P393282J292876j0440716r751385K673343
39089C562306P918860r29067r021102m839155L635563N565635L327048K302223
39081A1522311n08526o770492q850463l007338J475293j990306m545355K032751
39073a0642125Q498047L172130o482214n368599L758131N693239j017743l490514
39065e879648J243883J709863n816914r517868k296854O303859O169902J316944
39057f766833k4046P77254j903361o461401o669894j336185M834457O927225L100960
39048g521824m020239p605524l169083M312374N797356R26825k131191L1585K173342
$$ plain form
39105 10594150 7929926 -128494 -7431930 -9441264 -6212593 1701392 12816728 20536055
39097 20536055 18622708 12059131 12394906 19788188 21081064 10640348 888963 3562306
39089 3562306 11481166 10552099 1530997 -3308158 327405 5893040 9220088 11522311
39081 11522311 11013785 4243293 -4607170 -7614508 -6139215 -8129521 -12674876 -10642125
39073 -10642125 -2144078 1028052 -5454162 -10822761 -7064630 -1371391 -2389134 -5879648
39065 -5879648 -4635765 -2925902 -8742816 -18260684 -20557538 -14253679 -8083777 -6766833
39057 -6766833 -6790879 -6013625 -7916986 -14378387 -21048281 -22384466 -17550009 -10622784 -7521824
39048 -7521824 -11542063 -19147587 -22316670 -18004296 -12206940 -11280115 -13411306 -13379721 -11206379
39039a1206379J453692K040149N107776M713427q45165l341451K672333J0028965
39031A0623347R730590M208739J360729J694904N59799j734217j438902L15667
39023B5320656l39517j912837j55932K900301J191812m510470o491724k096665
39015A3905624J779486r83158o890694q169232l138226K711933M349746K544842
39007F110321J280970J844760J378172k335466o651725p126324l907625j544057
38999a0950974k081773k256059Q85694N140163O382766M102924J354711Q92208
38991C469660K876375M828746L276396k380333p575032p075161j648811L253904
38983i74256M805128M065451R26860n323799j0114410o689980K487838O167124
$$ plain form
39039 -11206379 -9752687 -7712538 -2604762 2108665 1263500 -2077951 594382 10623347
39031 10623347 20353937 24562676 25923405 27618309 28178108 26443891 25004989 25320656
39023 25320656 24981139 23068302 22912370 25812671 27004483 22494013 16002289 13905624
39015 13905624 15685110 14701952 7811258 -357974 -3496200 -784267 3565479 6110321
39007 6110321 7391291 9236051 10614223 8278757 1627032 -5499292 -9406917 -10950974
38999 -10950974 -13032747 -15288806 -14403112 -9262949 -2880183 1222741 2577452 3469660
38991 3469660 6346035 11174781 14451177 12070844 4495812 -2579349 -4228160 -974256
38983 -974256 3830872 7896323 8823183 3499384 -6615026 -13305006 -10817168 -4650044
38975d650044L35553m837467l0108R531059J3097891R694238N066489l00117q793006
38966A9114488j5220056j1140589Q37422Q232425N532593J57689n51318J011583
38958G974237k6342k078143j144817J274695K04471m950349q921138o827970J00674
38949a4394682N520172M861572R81455P10940N114662P327204K741401l717325
38941I145399n465261m311722n289826n814521n945Q206741P915492j555368p558084
38932d733095k246033O173698O170697j403055p357415p461104m127143N16403
38924a4467047N520488P792746M818206m91261k873800j405954R63251K465525
38916B322154K973285J963951M50064J953580O453899O914827j215500j0011474
$$ plain form
38975 -4650044 -4314491 -9151958 -9182066 348993 13446884 23141122 28207611 27907494 19114488
38966 19114488 3894432 -7246157 -6408735 1823690 7356283 7513972 6962654 7974237
38958 7974237 7947895 5869752 4724935 5999630 6204101 1253752 -7667386 -14495356 -14394682
38949 -14394682 -8874510 -4012938 -3031483 -2320543 2794119 10121323 12862724 9145399
38941 9145399 3680138 -631584 -5921410 -11735931 -11741876 -3535135 4380357 2824989 -4733095
38932 -4733095 -6979128 -805430 5365267 3962212 -3395203 -10856307 -14983450 -14467047
38924 -14467047 -8946559 -1153813 3664393 3173132 299332 -1106622 -143371 2322154
38916 2322154 5295439 7259390 7709454 9663034 16116933 23031760 21816260 11804786
38908A1804786p749851L072991O905242k815862j2906858q427277O089276J2658613
38900H631060L630158r997861j4123645p274484J725292N608371M109505J230250
38892f461354J033404M379485P308409M705001k264743n479900j61532P247029
38884A0305799O858580r46538o457141n158373l138372n025378m816586M162092
38876d215917J5602872J6071127L550246q705770r119709j686253J287162m268072
38868H515686j0457869r105195k212891J502494j406731m384455k70471P360096
38860a0459336Q158976R00195k464892N895227J5468858J0761286m592467j0336598
38852A3331249J709294J4555999R124234r509233j9726121j1792164K851250R333386
$$ plain form
38908 11804786 4054935 7127926 14033168 11217306 -1689552 -10116829 -4027553 8631060
38900 8631060 12261218 2263357 -11860288 -19134772 -17409480 -11801109 -7691604 -6461354
38892 -6461354 -5427950 -1048465 6259944 10964945 8700202 3220302 3058770 10305799
38884 10305799 17164379 16217841 9760700 4602327 1463955 -3561423 -8378009 -4215917
38876 -4215917 11386955 27458082 31008328 22302558 13182849 11496596 12783758 8515686
38868 8515686 -1942183 -11047378 -13260269 -11757775 -13164506 -17548961 -17819432 -10459336
38860 -10459336 -2300360 -1400165 -3865057 2030170 17499028 28260314 23667847 13331249
38852 13331249 15040543 29596542 38720776 29211543 9485422 -2306742 544508 9877894
38844I877894N595906j285767o274621q776695q645694n103711J257773Q005427
38836e349488J2171333J1460802N458560l362720j0366472j1148925m163138P091453
38828A791405J4238089R879097l810793j4715756j2773594j116495Q296065Q826795
38820A0614813M534849K013629K165328J677504j318357n424623p616998n479175
38812A166970J11953M065382J703007m805515p703125k920051M538860O484139
38804B641620J057599n484915n723049J032882P480777N827542k431392o819871
38796b418807j156659O752510N124895m032092o611231K526966J0751973O019268
38788A6956823n138963p802141r48070K388539m264188j1734423r388260N71084
$$ plain form
38844 9877894 15473800 14188033 7913412 -863283 -9508977 -14612688 -13354915 -5349488
38836 -5349488 6821845 18282647 23741207 20378487 10012015 -1136910 -5300048 1791405
38828 1791405 16029494 25908591 22097798 7382042 -5391552 -6508047 1788018 10614813
38820 10614813 15149662 17163291 19328619 21006123 19687766 14263143 6646145 1166970
38812 1166970 1278923 5344305 7047312 2241797 -5461328 -8381379 -3842519 2641620
38804 2641620 3699219 -1785696 -7508745 -6475863 1004914 6832456 4401064 -2418807
38796 -2418807 -3575466 3177044 8301939 4269847 -2341384 185582 10937555 16956823
38788 16956823 11817860 4015719 3067649 5456188 1192000 -10542423 -19930683 -19359599
38780a9359599P569996N871403p47565m238900L3850Q193614J0353924K118372
38772I795095p707308p428531N01986K487319m700966p770595J439236J0681702
38764b702062N537627o741251p722968K951158P418538q84510o952500K8202Q577290
38755d90476M792600l972574j787853Q728551J0695832O37346p026995m105186
38747G471245O90944j03502o74264L603201M649896l559019j0861621n783854
38739d566974M448414M618036l765181n729410J697591N443418n39484n728112
38731d121702k065808L181184J872185j295668K51359J827638k788507p686362
38723a0825681l914193M334235N804508k6252m027692k977775j212127R24194
$$ plain form
38780 -19359599 -11789603 -5918200 -6665765 -10904665 -10870815 -2677201 7676723 9795095
38772 9795095 2087787 -5340744 -4838758 -2351439 -7052405 -14823000 -13383764 -2702062
38764 -2702062 2835565 -3905686 -11628654 -8677496 -1258958 -2143468 -9095968 -9067766 -490476
38755 -490476 4302124 329550 -1458303 7270248 17966080 18603426 11576431 7471245
38747 7471245 8162189 8058687 7384423 10987624 15637520 12078501 1216880 -4566974
38739 -4566974 -118560 4499476 734295 -4995115 -3297524 2145894 1606410 -4121702
38731 -4121702 -6187510 -3006326 -1134141 -2429809 -2178450 -350812 -3139319 -10825681
38723 -10825681 -14739874 -10405639 -4601131 -4627383 -8655075 -11632850 -12844977 -11920783
38715a1920783O740177J1977735P779544l682363r714603n867752j372652k301496
38707h362193k681017J857545M583173O5358n142588l656748N23909Q80677M95978
38698a1435906M205652O723364J459172n040800j695786P759977Q759575j717256
38690I017992j1015647j0325849m854176j372877J675436O380202Q690093O161409
38682D356583L491317L715436J973968m819148r713797n729549J938997L345541
38674a440652p24981j040295M138488O110562P7735p059725p272436k635979m68018
38665a0315301j794089j032379M237380Q948525P391919Q61061l999177l077894
38657A220045J259138L917544K664345q62510m017460n257986m227147j740003
$$ plain form
38715 -11920783 -5180606 6797129 14576673 10894310 1179707 -4688045 -6060697 -8362193
38707 -8362193 -11043210 -9185665 -4602492 -4537134 -9679722 -13336470 -12812561 -11931884 -11435906
38698 -11435906 -7230254 -506890 952282 -4088518 -5784304 1975673 10735248 9017992
38690 9017992 -1997655 -12323504 -17177680 -18550557 -16875121 -10494919 -1804826 4356583
38682 4356583 7847900 11563336 13537304 8718156 -995641 -6725190 -4786193 -1440652
38674 -1440652 -2165633 -3205928 932560 7043122 7120857 61132 -7211304 -9847283 -10315301
38665 -10315301 -12109390 -13141769 -8904389 44136 7436055 8297116 4297939 1220045
38657 1220045 2479183 6396727 9061072 8198562 4181102 -1076884 -5304031 -7044034
38649g044034L23487O85612K38710N62141J282471Q54231l65348m14491P19205
38640c158016Q29517l43705J26347L561520O462400M774002m87156m552388m648888
38631B563633k156098r9459m28250k517223k812064J759603P978130P555488j704723
38622A0139037r745087o076141M629897P966700R48275l389860L320277J1046363
38614A8839461P345567k535570m776391j43970j799620j1226903j3944513l370982
38606a1612921P702834P725793L254415L617627K872894o818373j5189855p674312
38598a6121898P437429Q625391l596278n740322R825239K0219400Q051081j0282986
38590A8417056j0530016K280936N088221n347530j0242084j354477P312445L742245
$$ plain form
38649 -7044034 -6720547 -6034935 -5796225 -5234084 -3951613 -3097382 -3462730 -3877221 -3158016
38640 -3158016 -2328499 -2672204 -2545857 1015663 7478063 12252065 11764909 7212521 2563633
38631 2563633 407535 308076 -120174 -2637397 -5449461 -3689858 4288272 11843760 10139037
38622 10139037 393950 -5682191 -1052294 6914406 7862681 4472821 7793098 18839461
38614 18839461 26185028 23649458 18873067 18729097 16929477 5702574 -8241939 -11612921
38606 -11612921 -3910087 3815706 7070121 10687748 13560642 6742269 -8447586 -16121898
38598 -16121898 -8684469 -59078 -3655356 -9395678 429561 20648961 28700042 18417056
38590 18417056 7887040 10167976 15256197 9908667 -333417 -1687894 5624551 9366796
38582I366796n071861p389023m003730k904497n844529p749553m404616L596998
38574b4404015J0928042J0726231K359072n259875m316711O60241O70633k286410
38566a0922792K77875N763402K957518o962941r087618Q31047Q047827L165406
38558e930276k231648L596460J1596238P734552k604025m529735O35872n92073
38550G675365q764704j0605461k465116M446877M371975M536080P937751N829035
38542A2961802n051700j2819414p928747J760509M026033L48459m28548J724555
38534e407051O60007k665408k133998J292992J194621j696577l9886O335241Q288661
38525E828602J967225m172061j958005M314750M531926k989072r948631q869489
$$ plain form
38582 9366796 4294935 -3094088 -7097818 -10002315 -15846844 -23596397 -28001013 -24404015
38574 -24404015 -13475973 -2749742 -390670 -5650545 -9967256 -9307015 -8636382 -10922792
38566 -10922792 -10644917 -4881515 -1923997 -8886938 -17974556 -17143509 -9095682 -5930276
38558 -5930276 -8161924 -4565464 7030774 14765326 12161301 7631566 8267438 7675365
38550 7675365 -1089339 -11694800 -14159916 -9713039 -5341064 -804984 7132767 12961802
38542 12961802 7910102 -4909312 -12838059 -11077550 -7051517 -6703058 -7131606 -5407051
38534 -5407051 -4747044 -7412452 -9546450 -8253458 -7058837 -8755414 -8795300 -2460059 5828602
38525 5828602 7795827 3623766 1665761 5980511 10512437 7523365 -2425266 -11294755
38517a1294755j061613N692237N164162j103907n294950k546531K598668K857601
38509d989088l12280Q83803O316456N907328l712896j0709741m949059N086751
38501f478726M466433m764494p052977J677586Q518287N326245K55999J553438
38493C501791M261799K028197n42340J586109K164053m441003r234582j941609
38485b617585Q889317O702582o108587j0805996j556911O770037L318165m245090
38477C45932o267032n576578o453501l911456M723312R845705L908034m035031
38469g420615j511230P184239P956977r80958p944053o357869j632740K53877
38461a0452372l1592j88362M13217K848358O577708O367389q25124p878743n851978
$$ plain form
38517 -11294755 -12356368 -6664131 -1499969 -2603876 -7898826 -10445357 -7846689 -4989088
38509 -4989088 -5301368 -4417565 1898891 7806219 4093323 -6616418 -11565477 -6478726
38501 -6478726 -2012293 -6776787 -13829764 -12152178 -3633891 1692354 1948353 3501791
38493 3501791 7763590 9791787 9249447 10835556 12999609 8558606 -675976 -2617585
38485 -2617585 6271732 12974314 6865727 -3940269 -5497180 1272857 4591022 345932
38477 345932 -5921100 -11497678 -17951179 -21862635 -17139323 -7293618 -3385584 -7420615
38469 -7420615 -8931845 -1747606 6209371 5228413 -2715640 -9073509 -10706249 -10452372
38461 -10452372 -10483964 -10672326 -10259109 -7410751 -833043 5534346 4709222 -3169521 -9021499
38452i021499J323821J627216n585257p380332K376271J2468084J0475569m0489
38444F243384o349438l816958J729809M561843M181062J870777j362259l641726
38436C416494l493977k348826k804150m559187m343443l0608O245478R163016
38428A244797M996973l397919p656169k837006N663364Q203171L528318r2694
38420I652835K362350M856652n78244j1155715j5627883q455793K968171O682213
38412i295414l59579q896587p720383L338247J2709858J0454597r3775p052512
38404f915548m416714K846378P431031P700512N662914K424579r49883j866779
38396A1916490N45140K794958J109678l165965n117067k323740K916006O619325
$$ plain form
38452 -9021499 -7697678 -6070462 -11655719 -19036051 -16659780 -4191696 6283873 6243384
38444 6243384 -106054 -3923012 -2193203 2368640 6549702 8420479 7058220 3416494
38436 3416494 -77483 -2426309 -5230459 -9789646 -14133089 -14163697 -7918219 1244797
38428 1244797 6241770 2843851 -4812318 -7649324 -1985960 6217211 9745529 9652835
38420 9652835 12015185 16871837 16293593 5137878 -10490005 -18945798 -15977627 -9295414
38412 -9295414 -9654993 -18551580 -26271963 -22933716 -10223858 230739 136964 -6915548
38404 -6915548 -11332262 -8485884 -1054853 6645659 12308573 14733152 13783269 11916490
38396 11916490 12461630 15256588 16366266 13200301 8083234 5759494 8675500 15294825
38388A5294825O342147K130910l609269p293161o818592l347330L60254L277579
38380F337363O770564J1419705J3993236R599428j653396j1694134j1633948k130634
38372B1008184P071813Q847606N324226J100473l680911q805775r235004k913368
38364A8717244J773416l335480j1292897q236296M228989R147646n5858q706931
38356B239833l415857P862776R916246L774702J300382L014747j626946j3106968
38348I958915j7639021p974541N141381Q882964N218842L886532O356099O151562
38340A9982733R52451m593244p083977q177223r415908q548385l051086N305820
38332a4628819J0951893R016506q6332r634544j1598643m462182M996279R226114
$$ plain form
38388 15294825 21636972 23767882 20158613 12865452 6046860 2699530 3059784 6337363
38380 6337363 13107927 24527632 38520868 48120296 46466900 34772766 23138818 21008184
38372 21008184 28079997 36927603 42251829 43352302 39671391 30865616 21630612 18717244
38364 18717244 20490660 17155180 5862283 -2374013 1854976 11002622 10946764 2239833
38356 2239833 -1176024 6686752 16602998 20377700 21678082 24692829 23065883 9958915
38348 9958915 -7680106 -15654647 -10513266 -1630302 3588540 7475072 13831171 19982733
38340 19982733 20935184 16341940 9257963 1080740 -8335168 -16883553 -19934639 -14628819
38332 -14628819 -3676926 5339580 5253248 -4381296 -15979939 -20442121 -15445842 -6219728
38324f219728P599513M644147K730115J19808m381556q671005j0148669q617713
38316b2945088n282122q53195M074188P979453Q909266N939279M36368l797653
38308e539504l070610K034013O502734O817060M960695L676101Q52576n754381
38300A0478684j0568624n575003N648676R067057m36241j0134085p056358L603998
38292d971896P425938J917490l065931k525229j087095j326697j24653J997818
38284a760255L49183k670173J199794R498777P941518o633805j6318029o659215
38276a5052205J0773967J4854625M944712k168605J60602K195024j749691m498411
38268I460018j312520J306851j516245l715819M28320N317244K813491m716847
$$ plain form
38324 -6219728 1379785 6023932 8754047 8873855 4492299 -4178706 -14327375 -22945088
38316 -22945088 -28227210 -29080405 -25006217 -17026764 -8117498 -2178219 -1741851 -5539504
38308 -5539504 -8610114 -6576101 -73367 6743693 11704388 15380489 16233065 10478684
38300 10478684 -89940 -5664943 -16267 9050790 8614549 -1519536 -8575894 -4971896
38292 -4971896 2454042 4371532 1305601 -1219628 -2306723 -3633420 -3758073 -1760255
38284 -1760255 -1411072 -4081245 -2881451 6617326 14558844 7925039 -8392990 -15052205
38276 -15052205 -4278238 10576387 15521099 13352494 13513096 15708120 13958429 9460018
38268 9460018 8147498 9454349 7938104 4222285 4650605 9967849 12781340 8064493
38260H064493q136245l999895L170377P699998O580969k58339q405393j0248508
38252e532543k674442P830151J1355942M940963n406033j1487443r766642l031133
38244a3771180K820853M172278K324684M95698L7610J355943N226611R227388
38236A1889885O769862l692394j1871585p388506L231768K821154j1551709k2228990
38228c2020515j4893928K122211J0815233P316924K546009M188908Q565785R213467
38220b145906N241284K97582j666158R00968N585195P605543M814340m27726n156104
38211A5049018q261173q266437l718105K289036L634957O797j670029K088733
38203A152797N578567K996368l106337p227373q395066p151224j937067N416080
$$ plain form
38260 8064493 -71752 -4071647 -901270 6798728 13379697 13121358 4715965 -5532543
38252 -5532543 -8206985 -376834 10979108 15920071 10514038 -973405 -10740047 -13771180
38244 -13771180 -10950327 -6778049 -4453365 -3957667 -3920057 -2564114 2662497 11889885
38236 11889885 18659747 14967353 3095768 -4292738 -1060970 1760184 -9791525 -32020515
38228 -32020515 -46914443 -44792232 -33976999 -26660075 -24114066 -19925158 -11359373 -2145906
38220 -2145906 3095378 3392960 1726802 2627770 8212965 15818508 20632848 20205122 15049018
38211 15049018 6787845 -1478592 -5196697 -2907661 727296 734093 -935936 1152797
38203 1152797 6731364 9727732 6621395 -605978 -9001044 -16152268 -18089335 -12673255
38195a2673255P474321J541578m224232k345453L034363M617447L816172M483472
38187E724413K467882o221853j2900585o253855Q191295J3143777L588022p549820
38179A89276q546654j580383N122023O846918K575300m614139o699092M27447
38171f279304Q339501O671279l13264q67397L321561L59206q124062o590584O887430
38162C404366J3460884K659850j0540457r933732k031610r65551m459320k169843
38154a0575413L576415L610895K00658J788450N656362L014193l383483l624419
38146B63658R92188Q36095l449826k485885L029761K857101k917867k694885N171483
38137A601823P755395j51375o311204j715190M485558J240781o079778n843145
$$ plain form
38195 -12673255 -5198934 -3657356 -7881588 -10227041 -7192678 -2575231 1240941 5724413
38187 5724413 8192295 1970442 -10930143 -17183998 -8992703 4151074 7739096 189276
38179 189276 -8357378 -9937761 -4815738 2031180 4606480 -7659 -6706751 -6279304
38171 -6279304 2060197 8731476 8418212 7550815 10872376 11231582 3107520 -3483064 3404366
38162 3404366 16865250 19525100 8984643 -949089 -2980699 -3946250 -8405570 -10575413
38154 -10575413 -6998998 -3388103 -3187445 -1398995 4257367 7271560 3888077 263658
38146 263658 1255846 2091941 -1357885 -3843770 -814009 2043092 -874775 -3569660 1601823
38137 1601823 9357218 9205843 2894639 1179449 5665007 6905788 826010 -5017135
38129e017135Q84158M176673J980601J111483M335616O184638J358452q525104
38121F489382j6049333j3496960m46562J2563183J3445315L570329l670741j601675
38113H02938J760148j118078m816455j684506M325670M797175P61725j133344
38105C695273n60678p58097Q91007P528140J2088225N108220q455656j3552949
38097E983485o636514j02790k840156q594812q313344l404704j87526Q90432L324802
38088a9881127O860200Q018437N714104K143943j52884J61905K646653M829390
38080A0340621M462965J985598j260223n234922q184910m975761N212118J2583343
38072A4928829P022949o274153j1372055l018643O417498M708284m652931r747616
$$ plain form
38129 -5017135 -4132977 43696 2024297 3135780 7471396 13656034 15014486 6489382
38121 6489382 -9559951 -23056911 -23503473 -10940290 2505025 6075354 2404613 802938
38113 802938 2563086 1445008 -3371447 -5055953 -730283 4066892 4828617 3695273
38105 3695273 3134595 2376498 3267505 10795645 22883870 27992090 19536434 5983485
38097 5983485 -653029 -755819 -3595975 -12190787 -20504131 -23908835 -24096361 -23205929 -19881127
38088 -19881127 -13020927 -5002490 711614 2855557 2702673 2864578 5511231 10340621
38080 10340621 14803586 16789184 15528961 10294039 2109129 -2866632 2345486 14928829
38072 14928829 21951778 15677625 4305570 1286927 7704425 12412709 7759778 -1987838
38064a987838o015335R65228L960981J022321l185041j533255O573633J1547768
38056A1348462N263241n529099p025272J030039M785964j712563p565816l390855
38048b795899M369760N420002O48342l541881n844474o089690o06520Q867828
38040D27468J1442386K696320n619308k945220K855976r69649j0334478j1578820
38032a4025325l622372L224679N493887P458618P800772J959860m651307k185344
38024A453468O135969P808078J268269l511077l595681n368613q372089m643247
38016h824923M348441P756289M478134M232794P129155J968722j0640444j4532345
38008d084177m744711K866768j363959n061046K233303R313970L950385m243712
$$ plain form
38064 -1987838 -8003173 -7037945 -3076964 -2054643 -5239684 -6772939 -199306 11348462
38056 11348462 16611703 11082604 4057332 5087371 9873335 8160772 594956 -2795899
38048 -2795899 1573861 6993863 7642205 4100324 -1744150 -7833840 -8440360 427468
38040 427468 11869854 14566174 8946866 6001646 8857622 7887973 -2446505 -14025325
38032 -14025325 -17647697 -14423018 -8929131 -1470513 6330259 8290119 3638812 1453468
38024 1453468 7589437 15397515 16665784 13154707 9559026 4190413 -4181676 -8824923
38016 -8824923 -4476482 3279807 7757941 11990735 19119890 21088612 10448168 -4084177
38008 -4084177 -8828888 -5962120 -7326079 -12387125 -10153822 -839852 3110533 -1133179
38000a133179n55814R159795R341100N71957m648529l516703k171210r39036K205181
37991H313562J107884p811550j2273024j102552J3086245J0225657m045075o385090
37983A116057N622418R984706j923679j1521564n355416M009230K529023j776483
37975B684292L419351J0981519P420198k693624m995043j8190n93989q677530
37967G526984j2661523p294787n11993J563175K839702O684439Q548041M649811
37959A1343849n42343j494576j64626j602432n262691o247324k785605K192228
37951d563520N645049O847136N982867L416273J33561l146274o525888q782747
37943i93543o596053P09624P212132O121107n60868l639988N47704M935923K483599
$$ plain form
38000 -1133179 -1688993 7470802 16811902 17383859 12735330 9218627 7047417 6108381 8313562
37991 8313562 9421446 1609896 -10663128 -11765680 1320565 11546222 7501147 1116057
37983 1116057 6738475 16723181 14799502 3277938 -2077478 1931752 4460775 2684292
37975 2684292 6103643 17085162 24505360 21811736 16816693 16798503 16204514 7526984
37967 7526984 -5134539 -12429326 -12941319 -11378144 -8538442 -1854003 6694038 11343849
37959 11343849 10801506 9306930 9142304 7539872 2277181 -3970143 -6755748 -4563520
37951 -4563520 1081529 7928665 13911532 17327805 17461366 14315092 7789204 -993543
37943 -993543 -7589596 -6879972 332160 6453267 5892399 2252411 2800115 7736038 10219637
37934A0219637l615817n509321j665437L645715P537503Q422342L109883p604116
37926A4540389j4227341r461517q23075p38604o381476l866248P500640J2228812
37918a228420L851528m627093l290680o40270m683997n808773M976217J5101428
37910C649940Q210094p169246r154220L029631R485366K965990k094671K770778
37902A1693662O124493j305580r910554q069185p50385J185952j255464p85744
37894c072805J473951m65787m662973l598041L188500Q035240N680010j690328
37886D887767q583527j0341142n005620M322348J0495100R262713L757667j08802
37878H686504j92320J801140L426051K541656j354172m873781l501809J573393
$$ plain form
37934 10219637 6603820 1094499 -570938 3074777 10612280 19034622 22144505 14540389
37926 14540389 313048 -9148469 -9971544 -10710148 -17091624 -20957872 -13457232 -1228420
37918 -1228420 2623108 -2003985 -5294665 -5934935 -10618932 -16427705 -11451488 3649940
37910 3649940 11860034 4690788 -4463432 -1433801 8051565 11017555 8922884 11693662
37902 11693662 17818155 16512575 6602021 -1467164 -2217549 -1031597 -2287061 -3072805
37894 -3072805 -1598854 -2064641 -6727614 -10325655 -7137155 898085 6578095 4887767
37886 4887767 -3695760 -14036902 -19042522 -14720174 -4225074 5037639 8795306 8686504
37878 8686504 8494184 10295324 13721375 16263031 14908859 10035078 6533269 8106662
37870H106662L614589m75130n543939n593390j700117Q19281O5668r11040J346298
37861b71118O376485R151009M674369m538102q452501j950478N993486L585488
37853A4568638n525948o234543M963112J3292760P007120n889050j0251402m434990
37845G495697J339559J499769j82689k1239M25691r37888k875828k925206n15250
37836C302616K227958J989242j791756m580879j943887K995564K634195l846292
37828I86761q719626o907201j923056J720709M222115N252618J693840m342413
37820h016253m070267M530680J0204787L887798o763495q320814r26608M558910
37812d915262M249754L685635M645892K211858m006004o921992l077600K467103
$$ plain form
37870 8106662 11721251 11246121 5702182 108792 -1591325 -772044 -706376 -1617416 -271118
37861 -271118 6105367 15256376 19930745 15392643 6940142 4989664 10983150 14568638
37853 14568638 9042690 2808147 7771259 21064019 28071139 22182089 11930687 7495697
37845 7495697 8835256 10335025 10152336 10131097 10556788 9618900 6743072 3817866 3302616
37836 3302616 5530574 7519816 5728060 1147181 -796706 2198858 4833053 986761
37828 986761 -7732865 -14640066 -16563122 -14842413 -10620298 -5367680 -3673840 -8016253
37820 -8016253 -12086520 -7555840 2648947 6536745 -226750 -8547564 -9474172 -4915262
37812 -4915262 -665508 3020127 7666019 9877877 5871873 -1050119 -4127719 -1660616
37804a660616N353643P549361J0010769P897402j093512r698180r324455k096106
37796F938306J932267j365218n120181j814316N721667P588477N6213q698941
37788E238274q396869L14616O762867M015593k773326l970396J901044O739475
37780I831278L222059o190555j1460872n815042O069562J2178716O475828m139372
37772A0171602q601827m648908J162978L709254L297809Q11454l614520o539623
37764d251781l280919M197151Q145229N612245J583624j1835j031245k746206
37756H216263k632023m38739J86937j110790o78436N24070k432973o499745j900913
$$ plain form
37804 -1660616 3693027 11242388 21253157 29150559 28057047 18358867 9034412 6938306
37796 6938306 8870573 7505355 2385174 570858 6292525 13881002 13937215 5238274
37788 5238274 -3158595 -2843979 3918888 7934481 5161155 1190759 3091803 9831278
37780 9831278 13053337 6862782 -4598090 -10413132 -4343570 7835146 14310974 10171602
37772 10171602 1569775 -3079133 -1916155 1793099 5090908 5902362 2287842 -4251781
37764 -4251781 -7532700 -3335549 4809680 10421925 12005549 11993714 10962469 8216263
37756 8216263 5584240 5145501 5332438 4221648 3543212 4067282 1634309 -4865436 -6766349
$$ [...]
##END NTUPLES=NMR SPECTRUM
##END=
