##TITLE=31Pdec_SR143_rm1h
 , 124 sc
 23.9.2022
##JCAMPDX= 6.0         $$ Bruker NMR JCAMP-DX V2.0
##DATA TYPE= NMR SPECTRUM
##DATA CLASS= NTUPLES
##ORIGIN= UXNMR, Bruker Analytische Messtechnik GmbH
##OWNER= root
$$ XWIN-NMR		Version 3.5
$$ Fri Sep 23 15:13:51 2022 Russian Standard Time (UT+4h)  she@DPX200
##.OBSERVE FREQUENCY= 81.013821
##.OBSERVE NUCLEUS= ^31P
##.ACQUISITION MODE= SIMULTANEOUS
##.ACQUISITION SCHEME= undefined
##.AVERAGES= 124
##.DIGITISER RES= 16
##SPECTROMETER/DATA SYSTEM= spect
##.PULSE SEQUENCE= zgpg30
##.SOLVENT NAME= D2O
##.SHIFT REFERENCE= (INTERNAL, D2O, 0, 248.564)
##AUDIT TRAIL= $$ (NUMBER, WHEN, WHO, WHERE, WHAT)
$$ ##TITLE= Audit trail, XWIN-NMR		Version 3.5
$$ ##JCAMPDX= 5.01
$$ ##ORIGIN= Bruker BioSpin GmbH
$$ ##OWNER= she
$$ F:/spectra/data/she/nmr/P31/1/pdata/1/auditp.txt
$$ ##AUDIT TRAIL=  $$ (NUMBER, WHEN, WHO, WHERE, WHAT)
(   1,<2022-09-23 15:04:24.03 +0400>,<she>,<DPX200>,
      <continue with go, POWCHK disabled, PULCHK disabled
       configuration hash MD5:
       00 E9 B6 7A A2 85 ED C7 34 08 36 98 17 FE 4E 26
       data hash MD5: 32K
       DA D1 45 40 A0 C9 84 AA 64 F4 52 2D 1E DB AA C2>)
(   2,<2022-09-23 15:12:25.70 +0400>,<she>,<DPX200>,
      <Start of raw data processing
       efp BC_mod = 2 LB = 1 FT_mod = 6 PKNL = 1 PHC0 = -10314.39 PHC1 = 149.8566 SI = 64K 
       data hash MD5: 64K
       72 30 84 29 65 DF 14 D5 37 AC C6 DE E0 61 B2 3E>)
(   3,<2022-09-23 15:13:03.96 +0400>,<she>,<DPX200>,
      <pk PHC0 = 55.93644 PHC1 = -110.6 
       data hash MD5: 64K
       13 9A C1 EB 32 FC 58 8B CE 44 29 E1 B2 AA 5A AD>)
(   4,<2022-09-23 15:13:08.59 +0400>,<she>,<DPX200>,
      <abs ABSG = 5 
       data hash MD5: 64K
       72 7D CE A9 84 4F D1 CD 65 43 71 97 15 58 9F 9C>)
$$ ##END=
$$ 
$$ hash MD5
$$ 22 13 41 74 46 77 45 71 0E 8A 23 B1 99 65 3A 17
##$RELAX= 
##$RELAX= 
##$RELAX= 
##$RELAX= 
##$RELAX= 
##$RELAX= 
##$RELAX= 
##$RELAX= 
##$RELAX= 
$$ Bruker specific parameters
$$ --------------------------
##$DU= <F:/spectra>
##$EXPNO= 1
##$NAME= <P31>
##$PROCNO= 1
##$TYPE= <nmr>
##$USER= <she>
##$AMP= (0..31)
100 100 100 100 100 100 100 100 100 100 100 100 100 100 100 100 100 100 
100 100 100 100 100 100 100 100 100 100 100 100 100 100 
##$AQSEQ= 0
##$AQ_mod= 1
##$AUNM= <au_zg>
##$AUTOPOS= <>
##$BF1= 81.014009
##$BF2= 200.13
##$BF3= 200.13
##$BF4= 200.13
##$BF5= 200.13
##$BF6= 200.13
##$BF7= 200.13
##$BF8= 200.13
##$BYTORDA= 1
##$CFDGTYP= 0
##$CFRGTYP= 5
##$CHEMSTR= <none>
##$CNST= (0..31)
1 1 145 1 1 1 1 1 1 1 1 1 1 1 1 1 1 1 1 1 1 1 1 1 1 1 1 1 1 1 1 1 
##$CPDPRG= <waltz16>
##$CPDPRG1= <>
##$CPDPRG2= <waltz16>
##$CPDPRG3= <>
##$CPDPRG4= <mlev>
##$CPDPRG5= <mlev>
##$CPDPRG6= <mlev>
##$CPDPRG7= <mlev>
##$CPDPRG8= <mlev>
##$CPDPRGB= <>
##$CPDPRGT= <>
##$D= (0..31)
0 1 0 0 0 0 0 0 0 0 0 0.03 2e-05 3e-06 0 0 0 0 0 0 0 0 0 0 0 0 0 0 0 0 
0 0 
##$DATE= 1663930858
##$DBL= (0..7)
120 120 120 11 120 120 24 19 
##$DBP= (0..7)
150 150 150 150 150 150 150 150 
##$DBP07= 0
##$DBPNAM0= <>
##$DBPNAM1= <>
$$ [...]
##$SUBNAM3= <"">
##$SUBNAM4= <"">
##$SUBNAM5= <"">
##$SUBNAM6= <"">
##$SUBNAM7= <"">
##$SUBNAM8= <"">
##$SUBNAM9= <"">
##$SW= 501.771253377433
##$SWIBOX= (0..15)
0 1 3 0 0 0 0 0 0 0 0 0 0 0 0 0 
##$SW_h= 40650.406504065
##$TD= 32768
##$TD0= 1
##$TE= 0
##$TE2= 300
##$TE3= 300
##$TEG= 300
##$TL= (0..7)
0 120 53 12 22 120 120 120 
##$TP= (0..7)
150 150 150 150 150 150 150 150 
##$TP07= 0
##$TPNAME0= <>
##$TPNAME1= <>
##$TPNAME2= <>
##$TPNAME3= <>
##$TPNAME4= <>
##$TPNAME5= <>
##$TPNAME6= <>
##$TPNAME7= <>
##$TPOAL= (0..7)
0.5 0.5 0.5 0.5 0.5 0.5 0.5 0.5 
##$TPOFFS= (0..7)
0 0 0 0 0 0 0 0 
##$TUNHIN= 0
##$TUNHOUT= 0
##$TUNXOUT= 0
##$USERA1= <user>
##$USERA2= <user>
##$USERA3= <user>
##$USERA4= <user>
##$USERA5= <user>
##$V9= 5
##$VALIST= <valist>
##$VCLIST= <CCCCCCCCCCCCCCC>
##$VD= 0
##$VDLIST= <DDDDDDDDDDDDDDD>
##$VPLIST= <PPPPPPPPPPPPPPP>
##$VTLIST= <TTTTTTTTTTTTTTT>
##$WBST= 1024
##$WBSW= 4
##$XGAIN= (0..3)
0 0 0 0 
##$XL= 0
##$YL= 0
##$YMAX_a= 23863
##$YMIN_a= -34249
##$ZGOPTNS= <>
##$ZL1= 120
##$ZL2= 120
##$ZL3= 120
##$ZL4= 120
##$ABSF1= 248.5645
##$ABSF2= -253.2056
##$ABSG= 5
##$ABSL= 3
##$ALPHA= 0
##$AQORDER= 0
##$ASSFAC= 0
##$ASSFACI= 0
##$ASSFACX= 0
##$ASSWID= 0
##$AUNMP= <proc_1d>
##$AZFE= 0.1
##$AZFW= 0.5
##$BCFW= 0
##$BC_mod= 2
##$BYTORDP= 0
##$COROFFS= 0
##$CY= -3
##$DATMOD= 1
##$DC= 0
##$DFILT= <>
##$DTYPP= 0
##$F1P= 0
##$F2P= 0
##$FCOR= 1
##$FTSIZE= 65536
##$FT_mod= 6
##$GAMMA= 0
##$GB= 0
##$INTBC= 1
##$INTSCL= 6.834604e-11
##$ISEN= 30
##$LB= 1
##$LEV0= 0
##$LPBIN= 0
##$MAXI= 10000
##$MC2= 0
##$MEAN= 0
##$ME_mod= 0
##$MI= 50
##$NCOEF= 0
##$NC_proc= -7
##$NLEV= 6
##$NOISF1= 182.463
##$NOISF2= 159.3651
##$NSP= 0
##$NTH_PI= 0
##$NZP= 0
##$OFFSET= 248.5645
##$PC= 4
##$PHC0= -10258.45
##$PHC1= 39.2566
##$PH_mod= 1
##$PKNL= yes
##$PPARMOD= 0
##$PSCAL= 0
##$PSIGN= 0
##$REVERSE= no
##$SF= 81.0140089999694
##$SI= 65536
##$SIGF1= 159.3651
##$SIGF2= -187.1042
##$SINO= 113.3802
##$SIOLD= 16384
##$SREGLST= <1H.CDCl3>
##$SSB= 0
##$STSI= 65536
##$STSR= 0
##$SW_p= 40650.406504065
##$SYMM= 0
##$S_DEV= 0
##$TDeff= 32768
##$TDoff= 0
##$TI= <>
##$TILT= no
##$TM1= 0
##$TM2= 0
##$TOPLEV= 0
##$USERP1= <user>
##$USERP2= <user>
##$USERP3= <user>
##$USERP4= <user>
##$USERP5= <user>
##$WDW= 1
##$XDIM= 65536
##$YMAX_p= 359343293
##$YMIN_p= -86846130
$$ End of Bruker specific parameters
$$ ---------------------------------
##NTUPLES= NMR SPECTRUM
##VAR_NAME=  FREQUENCY,     SPECTRUM/REAL,   SPECTRUM/IMAG
##SYMBOL=    X,             R,               I
##VAR_TYPE=  INDEPENDENT,   DEPENDENT,       DEPENDENT
##VAR_FORM=  AFFN,          ASDF,            ASDF
##VAR_DIM=   65536,         65536,           65536
##UNITS=     HZ,            ARBITRARY UNITS, ARBITRARY UNITS
##FACTOR=    0.620285442955139, 1,           1
##FIRST=     20137.2065510682, 0,            0
##LAST=      -20513.1999529968, 0,           0
##MIN=       -20513.1999529968, -86846130,   0
##MAX=       20137.2065510682, 359343293,    0
$$ Real data points
##PAGE= N=1
##DATA TABLE= (X++(R..R)), XYDATA
$$ [...]
44423 4265892 7240872 5236489 -3048959 -9515320 -7482533 -980553 1394724 -2086597
44415 -2086597 -6024580 -6497301 -4541290 -1762622 2322633 7272913 10018440 8659784
44407 8659784 5516797 3736958 2733854 320120 -1854737 423321 6599535 10051214
44399 10051214 6617775 413466 -2378239 -1916228 -2255229 -3444285 -2069898 1654086
44391 1654086 3575561 2315572 454332 -1267744 -4822301 -9080976 -9637341 -6382330
44383 -6382330 -4858074 -7306795 -8798613 -6108623 -4199449 -8467227 -15421552 -17164131
44375 -17164131 -11982938 -5013708 -782563 5794 -1614012 -3587171 -3199904 -399945
44367 -399945 1391655 806821 1346799 4917964 6985253 3575397 -1042697 -496539 3089138
44358 3089138 2471974 -2544861 -4689840 -941232 3227006 2706556 -917495 -3890909
44350 -3890909 -5443131 -6322509 -6880634 -8225531 -11127633 -13098291 -11172252 -7790772
44342 -7790772 -8238911 -11610621 -10930249 -4076257 2217638 2310700 -825777 -2019748 -1857377
44333 -1857377 -3204342 -4783682 -3944457 -2122918 -1925068 -1751092 1134174 4706833 5042618
44324 5042618 3034154 2356493 2276944 -997368 -6243026 -7416684 -3270329 -471314 -4287499
44315 -4287499 -11160756 -14073114 -11430050 -6730010 -2434299 1333307 3682576 3235695
44307 3235695 1356525 1102315 2323775 1361971 -3083882 -7057538 -6479073 -2547577 738839
44298 738839 2269020 3351519 2963051 -1629755 -8794843 -11837368 -7096390 531864
44290 531864 3454851 576253 -2762064 -2373403 1106807 5423079 9434716 11960819
44282 11960819 11284177 7384741 2693815 -458273 -1667588 -1318821 484571 3109690
44274 3109690 5104862 5501878 4407561 2374755 669973 1725772 6821104 12902386
44266 12902386 14251320 8542206 -431263 -6922885 -8550989 -6880360 -4629121 -3410296
44258 -3410296 -2970248 -1877727 222743 1361352 -194666 -2868777 -3831351 -3507143 -4459068
44249 -4459068 -5887461 -3941626 1215617 3774697 662799 -3071716 -1540335 3055368
44241 3055368 4039061 232177 -3552773 -4658309 -4998247 -5264394 -3023491 1568898 3593499
44232 3593499 -46186 -5928717 -9201407 -9868465 -10403474 -10232334 -7344060 -3690269 -3726402
44223 -3726402 -7365834 -8983338 -4930068 1519789 4838144 4186820 3155650 4300662
44215 4300662 6752656 8741688 10045099 11333871 12302836 11150853 6095742 -1969063
44207 -1969063 -8468533 -8597943 -2778829 3045067 4056132 1783765 757941 1969021
44199 1969021 2772407 1944572 1000319 812880 655297 671125 1557470 1650567 -1409878 -5539956
44189 -5539956 -5536589 -814788 3363919 4349890 5854860 9795088 10644446 3742621 -5636669
44180 -5636669 -8686574 -5569970 -4206830 -8135179 -12783440 -13542988 -10878747 -6804885
44172 -6804885 -2157545 1618055 2998748 3527802 5964546 9147030 9417205 6956274
44164 6956274 5372679 5100790 3120007 -502468 -2099259 -1081108 -585732 -664611 1910201
44155 1910201 5644525 4206960 -2956977 -7911367 -5769283 -1021622 1908734 5867423
44147 5867423 12665882 15821553 9801760 281924 -3450591 -1557441 -735291 -2560055
44139 -2560055 -3659833 -4235933 -7170703 -10520420 -9610509 -5507242 -3373160 -3461064 -1768012
44130 -1768012 1243584 935144 -2722761 -4844869 -4185042 -3709102 -2414401 4134512 13419235
44121 13419235 15643429 7561410 -1587876 -2730176 1351170 2222170 -2008207 -6488519
44113 -6488519 -7746649 -6661323 -5461318 -5540454 -6714123 -6638189 -3161042 1790804 4058183
44104 4058183 3716689 5033295 8540846 8730846 2632374 -4491891 -6179988 -3554365
44096 -3554365 -2713081 -6072930 -10198455 -10525440 -5628480 1477408 4892884 1340902
44088 1340902 -4940264 -6393236 -1956792 2129045 2301451 1998278 3522918 2947557 -2091600
44079 -2091600 -6295045 -4814866 -1829683 -3676687 -8070937 -8402304 -5352361 -5199778
44071 -5199778 -8207118 -7831212 -1753991 4565661 6709929 6380859 5830737 4062146 1259267
44062 1259267 861506 3651663 4719700 257903 -6324630 -8930104 -6695277 -3769101
44054 -3769101 -3096804 -3945339 -4818098 -5822337 -7664420 -9797665 -10356270 -8057936 -4150890
44045 -4150890 -1590546 -1569489 -2155269 -1713182 -1923859 -4985074 -9444687 -12212986 -13603611
44036 -13603611 -16125647 -18492752 -15867367 -7698197 -914552 -2240889 -9972976 -16281271
44028 -16281271 -15973193 -10497143 -4657485 -2006369 -3062768 -5930333 -8155268 -8698542
44020 -8698542 -8275752 -8018286 -8617290 -10532838 -13529019 -15804417 -15294130 -12431217 -9993455
44011 -9993455 -9472565 -9297490 -7687686 -5494151 -4560869 -4631069 -4003361 -2643786 -2372816
44002 -2372816 -3646071 -4123349 -1664565 2319225 4001458 1430897 -3526929 -7557644
43994 -7557644 -8830455 -7224273 -3502298 311643 1343329 -1041373 -3467364 -2421812
43986 -2421812 750854 1746832 -136311 -1114697 795641 2602442 1056664 -2988515
43978 -2988515 -6719151 -8344991 -6288031 104344 6374491 4682533 -5716675 -14321164
43970 -14321164 -11629968 -1883174 3334276 1366123 -40198 3311936 5856596 2307566
43962 2307566 -3835142 -6045248 -3721652 -1029763 -351402 -791982 -1047475 -871734 -1050823
43953 -1050823 -3218092 -7778441 -11556894 -10567772 -5927849 -3449467 -5938494 -9398476
43945 -9398476 -8671806 -3566669 2560901 7180897 9406271 9205966 7884870 7120537 6290764
43936 6290764 3480254 -69049 -389734 2783853 4280519 685965 -4678050 -6965582
43928 -6965582 -6319181 -5662597 -5159994 -2821373 1483781 5965024 9088865 9384318 5641673
43919 5641673 -50081 -2462841 359336 3722943 2718401 -1030895 -2985430 -2903323
43911 -2903323 -3462536 -4063086 -1685217 3037274 5903685 5260781 3569919 2744374 1940526
43902 1940526 346959 -1275359 -2228838 -2403630 -1479234 -66009 -450564 -3154593 -4397476
43893 -4397476 -1034505 3419752 2753470 -2511777 -5281368 -2266140 1300739 -517962
43885 -517962 -6465903 -11113344 -12387036 -12442909 -12693842 -11342567 -6150590 1865844 8248541
43876 8248541 9015647 5014154 1336366 1509094 3702449 4170481 2566605 1394143 1806452
43867 1806452 2945459 4190897 4949983 3528057 -234940 -2432822 660294 6519909
43859 6519909 8813972 5496464 135712 -4333117 -8102543 -10570268 -9431213 -5093899
43851 -5093899 -1291422 215819 1282738 2710167 2725484 1359088 1127350 1738442 -211618
43842 -211618 -4074474 -3983219 1676380 5896122 3022532 -2431823 -2776880 1703735 5069239
43833 5069239 5470341 5595260 5969248 4882410 3404193 3698841 3576617 -383118 -5202360
43824 -5202360 -4503012 941659 3645062 1434732 561434 4112019 6017204 1724667
43816 1724667 -2833421 -211820 6218829 7367535 2528695 -484807 1811728 4413135
43808 4413135 3523918 2183156 3249700 3999831 2291281 2110559 6933344 11916268 9818122
43799 9818122 2249825 -2620529 -2838172 -4754944 -10623669 -12695003 -5064539 5048493
43791 5048493 5629037 -3641767 -11304737 -10088283 -5222295 -4811192 -8585931 -10483170
43783 -10483170 -8027432 -4076293 -1294437 396284 1237781 375163 -2009810 -3825284
43775 -3825284 -3416324 -1392256 516550 1196340 62792 -3561792 -9471064 -14982612
43767 -14982612 -15879066 -10506483 -2724684 1115879 -969120 -4467701 -4573243 -2539650
43759 -2539650 -2987407 -6222337 -7409016 -3785167 1394643 3763046 3214374 2192782
43751 2192782 1757332 2115554 4257954 7621032 8398943 4214808 -1090629 -1794175 1431322
43742 1431322 2516907 -628826 -3293024 -2246415 -1251414 -4359004 -8189868 -6705889
43734 -6705889 -1314518 473203 -3548272 -6951617 -4989374 -1935601 -3433666 -6405233
43726 -6405233 -3523386 4451170 8537968 4276411 -2713708 -6364393 -8378792 -12201725
43718 -12201725 -14797525 -11376648 -4669230 -1698413 -2746087 -1373101 4253060 7878570
43710 7878570 5294370 868598 -26195 701460 -1651205 -6042050 -7532073 -5284566
43702 -5284566 -2968276 -2153494 -695935 2027863 3084036 661262 -2824953 -4307984
43694 -4307984 -4246045 -5077553 -7134632 -8436997 -8039440 -7388602 -7660465 -7278527 -3820119
43685 -3820119 1824414 5241742 3680260 26116 -455276 3180526 6394537 5039478
43677 5039478 412658 -2596584 -1346407 1585928 1386103 -2898517 -5875447 -1569510
43669 -1569510 7915400 13112240 9025378 2243460 1536707 4990887 3828069 -2690529
43661 -2690529 -5422629 76882 6293741 5584463 1693435 3027813 9671795 14022343
43653 14022343 11397205 4112615 -2855528 -5344586 -1459913 5677781 8965776 5672858
43645 5672858 1928361 3753853 6953653 2890688 -7718136 -14784551 -12735562 -6838569
43637 -6838569 -3901737 -3416987 -1354501 2190340 3378828 266114 -5112704 -9287895
43629 -9287895 -10219901 -8197991 -4722091 -551377 4374210 8867936 10569128 9356527
43621 9356527 7911143 6884180 3140341 -3770998 -7395372 -2166994 7192468 10428669
43613 10428669 4842931 -2361410 -4267347 -813081 4706187 9496002 10794653 7350873
43605 7350873 2856388 2875080 6897284 8200668 3183914 -3643011 -5789393 -2128015
43597 -2128015 3382386 6083794 3881262 -887610 -2873241 -97773 2348956 -803186
43589 -803186 -6387604 -7040983 -2581207 140103 -1709074 -4037580 -4524893 -5799637 -8334373
43580 -8334373 -8608386 -6680471 -7103403 -9536702 -7542276 -496656 2882676 -1789092
43572 -1789092 -6731521 -4440345 1031677 3064215 4019794 8148532 10541242 4629543
43564 4629543 -4540698 -6378775 -795115 3356959 3662117 5946512 10983266 11373781
43556 11373781 4097224 -3911685 -6256015 -4950926 -4193943 -3497104 -1242381 672361
43548 672361 61256 -1759770 -2816402 -3710773 -5298768 -6251119 -5415162 -4083906 -3922491
43539 -3922491 -4701445 -5420929 -5759511 -5581816 -4836056 -4265859 -4423876 -4191475 -2262069
43530 -2262069 431248 1817200 1364493 -281176 -2756736 -4804171 -3881732 66748
43522 66748 2954102 2153021 823579 2320921 3601207 36527 -5876009 -7528866 -4440208
43513 -4440208 -2396639 -4037467 -6311751 -7105098 -7295260 -6019438 -1192157 4503699
43505 4503699 5367115 1460844 -1543868 -2195067 -4828456 -9637570 -10084258 -3648412 3185826
43496 3185826 4998695 4634156 5539753 4936819 840153 -1516086 2147707 6574545 4722569
43487 4722569 -708444 -2109668 228866 -800288 -6959693 -12252848 -12582062 -10232030
43479 -10232030 -7885553 -4809098 -684577 2115389 2182110 1191886 759092 130861 -1744847
43470 -1744847 -4050295 -4816098 -2685775 1479962 3867347 788830 -5679484 -8347431
43462 -8347431 -4405934 -613239 -3901110 -9987021 -8596720 1060727 8279288 5982852
43454 5982852 131813 -214757 3862949 4114488 -1948043 -8035431 -8981947 -7728919 -9830611
43445 -9830611 -14703611 -16266008 -11217613 -3036132 2878818 4947434 4659001 2977297
43437 2977297 581939 -275869 1784525 3793370 1827889 -2090853 -1439492 5248722
43429 5248722 11237378 10419666 4900603 777368 390618 2250333 4950290 7126220
43421 7126220 6592308 3510957 1568309 2231299 1356156 -3875425 -8416976 -5842132 1503134
43412 1503134 5726707 4883107 3775014 4136630 2227214 -2749134 -5756095 -4282274
43404 -4282274 -2933040 -6023020 -11003301 -13161270 -12271466 -10470010 -7466253 -2394309
43396 -2394309 2513433 4669182 5565976 8167887 11190396 10318506 4935290 -202498
43388 -202498 -906168 1534034 2716044 749053 -2070727 -2745556 -1279265 -52076 -142252
43379 -142252 41010 1943282 4507819 6008208 6507587 6517545 4986738 1415279 -1614012
43370 -1614012 -1677557 -1212385 -4510720 -10192430 -11766871 -6980314 -1691336 -1772327 -5150788
43361 -5150788 -5444807 -833532 4421673 6028939 4154079 2186495 2972463 6220189
43353 6220189 8910423 8721813 6769599 5551401 5045113 3657454 2324883 3307172 4491515
43344 4491515 283222 -9503474 -16705194 -14451307 -5663453 2018923 5684587 6586054
43336 6586054 4125273 -2652429 -9395712 -9566969 -3541361 1511123 1560390 -343521 -1191219
43327 -1191219 -2601997 -5378625 -5391984 322597 7399346 9325003 6261433 3412502
43319 3412502 2124589 -1480847 -8542542 -13718480 -12117848 -6304206 -2904274 -4127654
43311 -4127654 -6096537 -4956981 -1307718 2088605 4172589 5376945 5315551 3060642
43303 3060642 -688770 -3707494 -4726506 -4360094 -3489059 -2484476 -2447239 -5009982 -9412138
43294 -9412138 -11567525 -8375636 -2132722 1724680 952342 -1902890 -4227387 -6466629
43286 -6466629 -9141644 -9820723 -6175872 -478629 2555778 2144817 2049871 4123588 5130712
43277 5130712 2343574 -1057319 -205829 3637586 4390782 332890 -2982706 -938061
43269 -938061 3284219 3523059 -583951 -3968194 -3854849 -2446741 -1712001 -31381 3970936
43260 3970936 7617156 7284084 3654153 766223 347967 143937 -1513092 -2442004 -135813
43251 -135813 3415625 3905110 1430413 996228 4667166 7200206 3291711 -3664337 -5429871
43242 -5429871 -468016 4381020 4315049 2257741 1789004 753882 -3521691 -7610033 -6335024
43233 -6335024 -671819 4120197 5923668 6229787 5514958 3649958 2983983 5236383 6873649
43224 6873649 3579166 -2062149 -3809513 -1528733 -529115 -1841153 -1371841 698037
43216 698037 -1404649 -8475599 -12808535 -9157583 -2094101 1792345 2518189 3123260 3677143
43207 3677143 3676849 4796143 6532740 4716935 -932321 -3883044 -842980 1714353 -2203288
43198 -2203288 -7488727 -5757951 1207575 4954495 3766265 3116197 4753269 4755174 2114356
43189 2114356 809672 2637213 4886312 5548565 4735995 1301898 -5525962 -11509893
43181 -11509893 -10997171 -5151513 -493843 298558 -143431 -614665 -2294831 -3557709 -1603913
43172 -1603913 740889 -2067300 -8138916 -9315532 -3587079 2155208 3333119 2868655
43164 2868655 3009090 1168696 -2717972 -3562261 21678 2569797 1781989 3104147 9198190
43155 9198190 13474054 10503587 5008436 3449491 3949144 2180464 481472 2677791
43147 2677791 5636348 4718001 2689437 4377235 6899324 4475297 -673104 -1735174
43139 -1735174 1093694 1865481 -259726 -804180 637212 121472 -2006703 -1276021 1929154
43130 1929154 2310806 -648374 -1338398 2346074 5984227 6815507 7274214 8460945 7595765
43121 7595765 4408932 2990245 4463928 4425451 710359 -2531026 -1909991 -301161 -1638890
43112 -1638890 -4923716 -6671449 -5328010 -949817 5278173 9506722 8083820 3583065
43104 3583065 2533902 5464771 5580376 -165723 -5649869 -5007013 -755572 2288549
43096 2288549 4908344 9444385 13205383 12442555 8975890 6751357 5242282 2224869
43088 2224869 -191483 1258098 4243659 3657845 -360868 -2974883 -1934877 942380
43080 942380 4150261 7019963 7199553 3162338 -1533879 -1781679 1826805 4302850 4110469
43071 4110469 4303679 6064881 6789754 5399655 4453145 5530397 6622617 5502732 2436982
43062 2436982 -1263692 -4414230 -5412600 -3563405 -985355 -365086 -1384278 -2328463 -3765438
43053 -3765438 -6681471 -8661818 -6960947 -4029630 -4253956 -6315676 -5422387 -2313356
43045 -2313356 -1989245 -3184756 1368594 11534667 16469027 10046977 825844 -607912
43037 -607912 3257498 3296100 -544604 -542069 4691589 8150282 6430281 4169888 4770911
43028 4770911 5088244 2526689 493379 2562616 6179597 6368171 2271506 -3468702
43020 -3468702 -8864515 -12765740 -13417702 -10425618 -6807550 -6088994 -7938335 -8736073 -5986155
43011 -5986155 -865511 2861119 1687691 -4503491 -11249403 -13061032 -9304360 -4987436
43003 -4987436 -4716401 -7819041 -10657007 -11297548 -9802289 -6222961 -1358097 1948744
42995 1948744 1596140 -197901 877313 5408829 9268977 8585253 3367351 -3744565
42987 -3744565 -9525749 -10636488 -5481823 2574397 6450700 2400224 -5421682 -9574358
42979 -9574358 -7568333 -3387380 -1575892 -2514394 -3939116 -4580809 -4545974 -3445341 -487172
42970 -487172 3338828 5094768 3323979 705995 1339068 5335937 8285069 7109160
42962 7109160 4287941 4051254 6036002 6100461 3078770 929799 2996057 7304627 9499453
42953 9499453 7965890 4017873 -595288 -3885384 -3614167 -219943 2048944 445546
42945 445546 -1390237 1796318 8014254 9182111 2103064 -6659541 -9275090 -5989823
42937 -5989823 -2742402 -2535813 -3314013 -3099304 -3219741 -5773968 -10078846 -12599175 -10078338
42928 -10078338 -3069221 3632673 5357030 2584573 -135494 -412164 -380594 -2096955
42920 -2096955 -4221087 -5396680 -7251348 -10676516 -12376293 -9545544 -5547807 -5797117
42912 -5797117 -9471948 -10902737 -8704787 -7623872 -10470478 -13793366 -13444076 -9628386
42904 -9628386 -4237678 2271814 8574081 11205485 8942338 5172562 2897436 834461
42896 834461 -2143350 -2566416 2667164 9513880 10651685 5278766 -30856 -313250 2413780
42887 2413780 3424114 1194683 -1927903 -2232677 2495287 9947629 13441835 8571183
42879 8571183 -279572 -4010045 69028 5470615 6023437 3225294 1470594 678263
42871 678263 -1714526 -4460185 -3682469 500251 3391779 2285999 -156964 -115340 2797709
42862 2797709 6321435 8428009 8027909 4843873 214415 -3283292 -4325812 -3988746
42854 -3988746 -3674905 -3429125 -3346561 -4714014 -7692339 -9268662 -6265474 -34980 4498676
42845 4498676 4788322 3210324 2976361 4024170 4438190 3726259 2496814 468793 -2643320
42836 -2643320 -5222129 -5412865 -4230430 -4237416 -5239613 -4363770 -885094 2361784 3702908
42827 3702908 5395800 9354115 13105710 13379760 11543599 11355789 12449595 10750652
42819 10750652 5731006 2545357 4819046 8890920 8366237 2329607 -4141810 -6609422
42811 -6609422 -5403670 -3370540 -2338953 -2533231 -3289588 -3115593 -550064 3609477 5974595
42802 5974595 4094136 -228839 -2919638 -2750328 -2262858 -3006190 -2587279 1252652 5661968
42793 5661968 5432660 300152 -4364346 -4890557 -3397332 -2649391 -844705 4644344 10947102
42784 10947102 11925783 6180219 -1226936 -5217907 -5422642 -4143417 -3038957 -2765675
42776 -2765675 -3050381 -2107399 1608164 6405520 8568025 6952528 3678858 258440
42768 258440 -3149333 -4202325 722592 9668156 14004187 8302429 -2114330 -7812380
42760 -7812380 -6645738 -3850526 -3145032 -3452261 -3664101 -4785083 -6332237 -5454470 -1608227
42751 -1608227 1449833 526112 -2586736 -3463744 -192863 5189782 9078935 9127963 5807217
42742 5807217 1856094 -458658 -1372612 -2073667 -2120120 -232056 3117772 6083847 7777854
42733 7777854 7921177 5124506 -1319676 -8331781 -11256803 -9491221 -6729707 -5450459
42725 -5450459 -4727978 -3926654 -4488395 -6830951 -9287700 -11525395 -15059836 -18694906 -17885324
42716 -17885324 -11451360 -5022843 -4406082 -8665870 -12974479 -15038307 -15087728 -12778740
42708 -12778740 -8585027 -5859945 -7035319 -9629572 -10074611 -9201876 -9379232 -8777695 -4354791
42699 -4354791 1123193 1657745 -2691292 -5542484 -3703704 -596225 887852 2294273
42691 2294273 4131544 2985706 -2235629 -6599492 -5869908 -2372148 95697 2662815
42683 2662815 7453055 11112379 8699809 2004077 -2378004 -2521133 -2650529 -4867272
42675 -4867272 -5447472 -1471059 3708524 4933368 2295189 428626 2129257 5556736
42667 5556736 7695130 8388358 9696167 11880742 11877282 7312049 1137176 -746048 2714276
42658 2714276 5638096 3264256 -1132033 -1395832 1697570 1265356 -5294303 -12327301
42650 -12327301 -13945671 -11282707 -9068193 -8792809 -8748895 -8242032 -8004284 -7755053 -6655513
42641 -6655513 -5578763 -6183810 -7994552 -8642143 -6890313 -3710462 -743640 756958
42633 756958 171600 -1587228 -2265767 -1148939 -519123 -1939579 -2706383 396291 4935295
42624 4935295 5365220 2010543 1731496 7212688 11311069 6986471 -1414443 -3540393
42616 -3540393 2223830 6814389 3821050 -2382317 -4515123 -2097355 1196594 4825606
42608 4825606 9922685 13624434 11715940 6060206 2903425 3444099 2579434 -1442343
42600 -1442343 -3112805 734178 3754418 -1015514 -9244844 -10271032 -2649714 3579911
42592 3579911 1670432 -2543975 -405752 6514733 9575094 6184825 2696335 4264559
42584 4264559 8058690 8710996 5885064 3098364 1979860 1475535 1290827 2347160 3985148
42575 3985148 4042884 2378884 1496129 2603328 3772779 3649195 4231605 7262872 10166496
42566 10166496 9391905 6410600 5655265 6684232 4065834 -3084150 -7288419 -2820723
42558 -2820723 4925183 6400943 1554146 -860073 2895917 6477909 4585818 1740503
42550 1740503 4834526 12106268 15867665 13377110 8709401 5130129 1889642 -1098831
42542 -1098831 -1188061 2445259 6305716 6799571 4122269 591155 -1979011 -2010717 1543806
42533 1543806 7010714 10961658 12746805 14783525 16948379 15139209 8284128 2211079
42525 2211079 2059170 4659289 3975957 890969 651547 2623655 992528 -4040258 -4623451
42516 -4623451 2231410 8585792 7151496 2257425 2489446 7364095 9488266 7349202
42508 7349202 7138751 11626139 15296016 13188590 8389339 7038884 10241610 14723626
42500 14723626 18300460 20637671 20533990 16564988 10217109 5450837 4550776 5795066
42492 5795066 5426482 1292903 -5044868 -9326174 -8444898 -3686577 852674 3163970
42484 3163970 4897335 7605345 9802808 9222328 5968308 1663528 -2575239 -5165705
42476 -5165705 -3203228 4062224 11878871 13717188 8558158 1631062 -2254798 -2951184
42468 -2951184 -1871548 1659850 8384243 15617230 18861344 16462835 10617621 4137085
42460 4137085 -1697408 -5961892 -7030197 -4185239 503406 3356863 2498906 -390894
42452 -390894 -1989863 -694289 2311288 5155275 7575194 10398363 13212973 13946021
42444 13946021 11399111 7236753 4257238 3048742 1730362 -866179 -3319757 -3753147
42436 -3753147 -2424106 -691594 1525016 5140972 9278693 11814270 12707278 13864762
42428 13864762 14763905 11627250 3473276 -3832814 -3396213 4042581 10821160 11182297
42420 11182297 6154377 245403 -2935478 -1691632 3190508 7925767 8895857 6927643
42412 6927643 5449112 4757191 2576283 335586 2832829 9828140 14270890 12228715
42404 12228715 8485939 7809913 6887309 1243802 -5406256 -6832200 -5143800 -6680028
42396 -6680028 -9715111 -6790973 1158456 4150472 -1232234 -6188439 -3908693 442673
42388 442673 256491 -868350 3263223 8742541 7022945 117 -1080530 7724164
42380 7724164 16602293 15173341 5552130 -1848736 -1501273 2539913 3548559 257886
42372 257886 -2623543 -839228 3821470 5675633 2719805 -461411 1176202 6469156
42364 6469156 9975651 8750677 4308190 -757943 -4800849 -6499221 -5527730 -3850105
42356 -3850105 -3647224 -3963603 -1834536 3326279 8693742 11180740 9661207 4845471
42348 4845471 -637328 -2900494 -424388 3484345 4481299 2464993 137595 -2020337
42340 -2020337 -4940787 -6447869 -3466295 1048831 -25929 -7141567 -11483414 -6939530
42332 -6939530 995472 3448116 719630 -258 3161836 4303804 -237502 -5820039
42324 -5820039 -5847131 -68396 6181102 8606759 7394721 5282088 4230156 4070884 3681442
42315 3681442 2971771 2932890 3522678 2992906 474718 -2167989 -2708474 -1530962 -371102
42306 -371102 595056 2090695 3354712 3098773 1870298 637186 -1732364 -5896867 -8080887
42297 -8080887 -3731125 4676968 9054607 6571300 3589285 5775992 9643275 8608015
42289 8608015 3213916 -566664 -572550 202697 214031 1160207 3247612 4323147 4337285
42280 4337285 5443701 6882076 5221366 1009333 -627644 1746953 2997519 200403
42272 200403 -1695336 1958175 6950420 6444888 1950661 491305 2969078 3454555 -213304
42263 -213304 -3147503 -2178027 -500254 -756792 -106488 3709784 6848360 4955405 443566
42254 443566 -922559 1862165 5079476 6552447 7315255 8156533 8657071 9141686 10175277
42245 10175277 10762456 10132065 10267004 13233857 16985794 17580124 14807938 11620577 8686548
42236 8686548 4349487 54438 289308 5417204 9532171 8194464 4180214 2328534
42228 2328534 2333696 751024 -2353284 -3276312 -345678 3825402 5487308 2836222 -3026479
42219 -3026479 -7865371 -6700176 323336 5818475 2844842 -5980538 -11246394 -8383248
42211 -8383248 -1883260 2495755 4295657 5199140 4798491 3260088 3717654 7217037 8791740
42202 8791740 4180202 -2149821 -2257009 3226418 5591751 1174661 -3513347 -2409797
42194 -2409797 1298892 1616483 -591251 -299702 2976705 5316777 4908838 2614353 -2058817
42185 -2058817 -9191033 -13809987 -10235751 -1714060 1368074 -4827276 -12052719 -11630819
42177 -11630819 -6037823 -3906228 -7464353 -10811664 -9163322 -4617281 -2254474 -3716931
42169 -3716931 -5678751 -3710160 2280504 6739516 4553423 -1668711 -3922404 701025
42161 701025 6383285 7720332 7352741 10115803 14197413 14492056 11908706 12023206 15213223
42152 15213223 15340059 9379505 2162141 -685607 448140 1891119 2090374 1604549
42144 1604549 959455 1048955 3135545 6480766 8423616 8376027 8886467 10953524 11437282
42135 11437282 7734371 2460915 556590 3472330 8719835 13427206 15684365 13931603
42127 13931603 8180052 1406794 -2763501 -3780458 -3962492 -4951936 -5944579 -5200747 -2023907
42118 -2023907 2598466 6471009 7661822 6059615 2958907 -870214 -5268526 -8676368
42110 -8676368 -8323432 -3726063 1831814 4852425 5191086 4773915 4568320 4560738 5028273
42101 5028273 5764440 5467505 3939553 3336149 4849008 5782429 3096163 -1210833 -1994315
42092 -1994315 1802847 5552796 5540650 3773082 4237033 6912245 8244329 6449673 3671337
42083 3671337 2600949 2775869 1314438 -3174393 -8383426 -10499853 -8353141 -4637403
42075 -4637403 -2800449 -3637104 -5695308 -8038251 -10872236 -13462046 -13313604 -8739385
42067 -8739385 -1618190 3684849 4549238 2799403 2717102 6363494 11288530 13160714 10280704
42058 10280704 4933330 635843 -937215 -307532 1136421 1995826 1301532 -731113
42050 -731113 -2592126 -2953391 -2195591 -1756817 -1879357 -778457 3153255 8301528 10039467
42041 10039467 5384196 -2477481 -6078866 -1452076 7027259 11206372 7866454 1142638
42033 1142638 -2958078 -2011501 2539858 7508005 9552467 7343818 3551032 2630709
42025 2630709 5412414 7965107 7033929 4039220 1858618 416545 -1615702 -2959525
42017 -2959525 -1341142 2134306 4099050 4207563 5457322 8541930 9622328 5712457
42009 5712457 -438343 -3509470 -2211079 -10527 394479 680886 3794459 8741079
42001 8741079 10592326 6149870 -1773610 -7086869 -6975361 -4247497 -3183384 -4875898
41993 -4875898 -7374632 -8580048 -7472656 -3839018 1217131 5057706 5646104 3864615
41985 3864615 2429671 2726313 3892758 4578197 4137357 2411296 -34043 -1541814 -905742
41976 -905742 657423 825064 -314490 -96840 2561305 4916773 3978558 764669 -1372507
41967 -1372507 -1910311 -3645491 -7336939 -8926665 -4834469 1629560 3125195 -1908927
41959 -1908927 -6314470 -3719835 2217092 2687892 -3424515 -7332660 -2478949 6288621
41951 6288621 9463131 5342696 754650 756053 2970392 2991222 813710 -697116 -769743
41942 -769743 -833605 -910673 827944 4552518 7280562 6243647 2530097 -51421 701428
41933 701428 3453469 5672136 6611253 7403011 9034619 11000497 11709769 10084634 7286871
41924 7286871 6522618 9551621 13261936 12162587 5577362 -208668 590328 5805280
41916 5805280 8510256 5948426 1260258 -2644289 -6056267 -8910560 -8988340 -5301058
41908 -5301058 312349 6168867 11615818 14066540 10212588 2538122 -583401 4648211
41900 4648211 11108853 9765807 1841715 -3523793 -1651342 3572722 7217512 8880575
41892 8880575 9646605 8628539 5279447 2154853 2524016 6277116 10022252 11087160
41884 11087160 10523035 11689291 15769612 19571752 19195538 15237228 11848655 10765713
41876 10765713 9704815 7317095 5504566 5023694 3323060 -268100 -1666318 1606564
41868 1606564 5334601 4852724 2636925 3656294 6175073 4294201 -1861537 -5864783
41860 -5864783 -4845212 -2725993 -2701682 -2871488 -1122637 1185193 2544007 3649433 4495549
41851 4495549 3358036 463304 -1304748 -978982 -914091 -2166995 -2510301 -736516 985687
41842 985687 930714 376419 591171 783912 724043 1824741 3829930 3908251 995592 -2001616
41832 -2001616 -1939134 1386788 6477088 11103239 11764790 6729074 321493 -1087283 1423882
41823 1423882 24681 -7309122 -11764533 -5789817 5494160 10908471 7410116 1704381
41815 1704381 27195 1941484 3582993 2871441 1268170 2051824 5965896 8643569
41807 8643569 5806897 1093262 2755157 10739291 14456096 7846944 -795463 -1052336
41799 -1052336 3986718 3562659 -3462778 -7689650 -4393258 398539 298421 -3414221
41791 -3414221 -6510357 -7617548 -6585950 -2808476 2009422 4089853 3022648 2825856
41783 2825856 5607779 8372091 8183691 6313662 4825323 3026981 296859 -898176
41775 -898176 1825546 6739141 9963858 9859585 7332303 3590725 -38418 -1423522
41767 -1423522 766414 5041935 8064091 7433197 3131384 -2744371 -7044857 -7546069
41759 -7546069 -4865339 -1810233 -252270 816013 3736386 9081694 14349787 15956361
41751 15956361 13046968 8912774 7139037 6725788 3840860 -1217831 -2961948 1195788
41743 1195788 6118788 6185168 3605161 4185480 7718299 9225314 8240251 9273385 12557624
41734 12557624 11940520 4663205 -3036820 -3887397 1382777 6563089 7845072 5826452
41726 5826452 2807048 1353167 3012626 5792270 5555252 2233193 1275983 5878319
41718 5878319 11192593 10350244 3683660 -2418005 -4025195 -2527834 -77524 3088497
41710 3088497 6437234 8060046 6866993 3565802 -818378 -5235825 -7571556 -5942160
41702 -5942160 -1495685 2246457 3330326 2813317 2105730 1166250 116717 401778 2611117
41693 2611117 4391588 2549798 -2693503 -6951955 -6081492 -947306 3318391 3279509 1296762
41684 1296762 2241239 6806953 10463386 9505653 5608186 2801920 2111877 1745507 1277008
41675 1277008 2413376 5478074 8048811 8332577 7784711 8502368 9322795 7089701 2011457
41666 2011457 -745957 3205140 11275180 16089467 14102885 9221511 6477617 5222568
41658 5222568 1999823 -1986220 -1520044 4221497 9211785 8906360 6577008 7470639 10085743
41649 10085743 8678405 3086019 48413 3524552 8732832 8851275 4216896 878084
41641 878084 1729343 3593440 3422263 3115037 5620605 8992401 8287073 3001284 -1208663
41632 -1208663 285276 4947237 6460564 2479294 -3550639 -7054939 -5954575 -534043
41624 -534043 6769153 11383999 10151244 5911480 5086025 9100142 11852832 8345833
41616 8345833 2322750 1184246 5586599 9080221 7431172 3302411 943039 879204
41608 879204 1841879 3965135 6996058 8232285 5946575 3153275 4078509 7662743 8771239
41599 8771239 6286833 5576616 10599170 17101085 17580721 11367350 5463519 5311424 8751914
41590 8751914 10546799 9349854 7460522 6113526 4617383 3265867 3493400 4647876
41582 4647876 3543747 -1372850 -7195561 -9289622 -5944735 477159 6100522 8503984
41574 8503984 7917727 6251972 4835643 3310916 1202134 -414601 -404828 21265 -1170886
41565 -1170886 -3068595 -2519118 795120 3319553 3224234 3498680 6474545 8351855 3856984
41556 3856984 -4935160 -9637120 -6170109 188062 2534634 1458452 2865777 8582083
41548 8582083 13345868 11863562 5868154 1937497 3309399 6356245 6032537 2846200
41540 2846200 1794974 4712905 7182801 5003521 757890 135311 3228367 4406644
41532 4406644 1305425 -1160881 1741315 7295142 9402638 7091771 4539086 4324465
41524 4324465 5386360 6920409 9233944 10279321 6475600 -1088327 -5628510 -2648460
41516 -2648460 4371536 9125943 10241191 10442520 10589707 8921634 5246161 1990180
41508 1990180 1082483 2479571 5363363 8313562 9016893 6483197 2963183 1308775
41500 1308775 1551580 2550510 4865975 8139489 7893255 680602 -8450948 -10180825 -3320495
41491 -3320495 3412034 3650162 790575 291604 1259017 443641 -903051 3060 1608314
41482 1608314 974897 -349662 904489 3508890 3945260 2855003 3508402 5386417 5313833
41473 5313833 4034009 5384757 9068822 10565912 8997686 8858639 12048759 13867840
41465 13867840 10001495 3205300 -405413 986906 3809096 3943177 680951 -3037977
41457 -3037977 -3466960 -207792 2774068 1983100 -914269 -2038038 -1445946 -2046309 -3254729
41448 -3254729 -1241627 3964661 7380103 6895878 6762276 10388574 14518141 14312958 10418029
41439 10418029 7006235 5758300 5646485 6277958 7592214 7968788 6107836 3406286
41431 3406286 1504711 -819661 -4995760 -8401925 -6676063 20947 6432992 8292417
41423 8292417 6409125 4170328 3146518 2248941 113068 -2719352 -4023609 -2173670
41415 -2173670 2031168 6170980 8447884 8549903 7184147 6023239 7031183 9848416
41407 9848416 10912247 7852987 3779762 3644367 6826851 7622474 3504433 -1674425
41399 -1674425 -4034116 -4708935 -6340780 -8480633 -9141915 -7755852 -4212984 1933648
41391 1933648 9001227 13028288 12457700 10045877 8194051 5956077 2839437 1372482
41383 1372482 2884215 4798496 5415303 7004291 10203854 10159805 3776206 -3177412 -2774582
41374 -2774582 3867216 8750223 8588042 7336871 7897645 8358098 7298486 6555767 6884263
41365 6884263 5966336 2877152 419853 881523 2772533 3733083 3905149 4539712 5454536
41356 5454536 5705704 5419924 5563937 6520592 7592014 7881983 7887945 9739925 14223647
41347 14223647 17984915 16957858 13005976 12534931 16644597 18244111 12821372 6302423
41339 6302423 6092187 9349012 8362950 4139640 4766149 11089208 14266874 9631421 3974564
41330 3974564 5071672 11061237 15005309 14800178 13736108 14518329 16573258 17287958 14037232
41321 14037232 7370925 2711599 5108444 11841849 15066223 12561857 9965308 10732574
41313 10732574 10873855 7217860 4106853 6315323 10585529 10602858 6736920 4428465
41305 4428465 5319965 6138625 4962939 2954820 659230 -2226196 -3686391 -765301
41297 -765301 5562296 10691690 11749019 9560960 5922730 2557810 2215623 6516639
41289 6516639 12401877 14758941 13271377 12718130 15408614 17529425 15254495 10831797
41281 10831797 9224467 11019191 12405164 11216931 9377433 9140832 10109272 11141014
41273 11141014 12576502 14547034 14950097 11818216 6860368 3778268 3228750 2606151
41265 2606151 1298698 2351225 6935623 10831273 9921764 6551827 6072479 8602082
41257 8602082 9026393 4930295 -105675 -1885051 -317969 2360594 4660580 5816832
41249 5816832 5609264 5432378 7156035 10266633 12515411 13375785 13920316 13737643 11897500
41240 11897500 10541054 12418595 14715318 11598505 4338886 1882230 8102166 15412019
41232 15412019 15987518 12849722 13008917 15041487 12388486 6210095 5251210 12307477
41224 12307477 19132724 17586174 9731384 3352897 1817148 2351969 1922937 874939
41216 874939 916440 2062447 2886834 3292804 5401600 10239601 14606059 14188097 9875924
41207 9875924 7294852 8957932 11106632 10522751 9765044 11850985 14098002 12437917
41199 12437917 8531764 6867703 7414281 7344684 7887641 12290209 17808723 17247608 9340155
41190 9340155 1046115 -1788975 -87005 3301057 7650692 11497072 11868811 9278740
41182 9278740 8204965 9993202 10775211 9248953 10285436 16508163 22137172 20900984
41174 20900984 15513546 13124278 14889389 16555824 16813017 18116214 20271003 19822493
41166 19822493 16173976 12851363 11937316 11809412 11002421 9997200 8520518 5338959
41158 5338959 1718212 1033313 3686282 6221869 6881514 8171591 12022571 16134254
41150 16134254 17740643 17847937 18675100 19413497 17997755 15452906 14907282 16911722 18913043
41141 18913043 19364074 19545474 20786774 22330456 23118708 23935823 26152434 29134877 30576707
41132 30576707 29665400 28693036 30371789 33850051 34981723 31475574 26486438 25174078
41124 25174078 28183192 30984237 30179501 27864007 28015273 30565562 31713556 29411529
41116 29411529 25957390 24803893 26659435 29383055 30439725 28828439 25557006 22886858
41108 22886858 22594886 24559961 27203411 29025808 29199711 27351545 24171477 22112220
41100 22112220 23753548 28716665 33365791 34488428 32519658 30324410 29574144 29568832 29466396
41091 29466396 30323832 34037895 40612183 47500228 52246140 55206577 58637945 63296191
41083 63296191 67352349 68904318 67820954 64441183 58805767 52933781 51284344 55506328
41075 55506328 60233718 58451214 50919436 45777306 47845446 52921838 54872440 53958619
41067 53958619 54348673 56614746 57599812 56555883 56857361 61073025 67291314 71049164
41059 71049164 69245642 62330137 54297325 50060044 51067095 53908061 54558049 52885763
41051 52885763 51333466 50766060 50099587 48705310 46407178 42303002 36672486 32897088
41043 32897088 33815257 36886822 37031953 34052734 32743511 34976867 36336885 32613323
41035 32613323 25943718 22001228 23595939 29014377 34373439 35871121 32048156 25794055
41027 25794055 22334219 23745262 27195788 29434338 30392030 31159864 31660136 32545836 36361781
41018 36361781 43700230 50462638 52475860 51524333 53260823 59421112 65173367 64817844
41010 64817844 58231612 50937175 48501784 50953311 52661775 48550163 40343514 34890386
41002 34890386 35971258 40303226 42784949 42688811 42208226 41557868 39416031 37168693 38578276
40993 38578276 44436527 50433805 51737002 47990212 42563325 38138533 34676998 31434549
40985 31434549 29120553 28652653 28518842 25802930 20812597 18310464 21665557 27410420
40977 27410420 29003139 25306508 21523669 21624076 24014804 25826241 27306617 29715006
40969 29715006 32307861 34157689 36238302 38893138 39545534 36011239 30637603 28388801
40961 28388801 31480002 37537805 42060807 41636121 36382078 30407751 28230717 30021824
40953 30021824 32377827 33700161 35222446 36307953 33713022 27502223 22616884 21548898
40945 21548898 20585568 17354193 16736487 23334058 32266329 34783689 30871456 28903757
40937 28903757 33229622 38998152 40438872 38587797 38545874 42810453 49506466 55250369
40929 55250369 58437629 60222742 61932575 61820075 57265190 50843672 49484943 55020064
40921 55020064 60781866 61621987 61556737 65510705 69248972 65998511 58824263 56411117
40913 56411117 58872141 58429649 53597438 51512497 54661850 56139736 51547482 45882301
40905 45882301 44052446 43254081 40092794 37439728 38059342 38071728 33393114 27428429 25873477
40896 25873477 28059627 29473829 29192026 29022330 28511805 26518081 25159278 26915819
40888 26915819 29954429 30953968 30230444 29578877 27630952 22321160 15909716 12631596
40880 12631596 12845249 13898504 15180526 17865084 21019380 22379134 22104276 22039739 22426844
40871 22426844 22846753 24735659 28929831 32127046 30050387 23398848 17109182 14738217
40863 14738217 16815966 22903781 31079588 36798579 36860349 33930589 33204770 35484952
40855 35484952 37541363 38092758 38692993 39387729 38492957 36642466 36214755 36466874 34100783
40846 34100783 29398243 26980006 29100673 32544638 33812913 33345855 32704536 31339125
40838 31339125 28475840 25130127 22079808 18622448 15280398 14667360 17156900 18553536
40830 18553536 15352167 10331633 9303855 13221253 17100203 16976033 14647797 14056207
40822 14056207 15357749 15258064 12559434 10393463 11636818 14307859 14176273 10986209
40814 10986209 8764472 9658714 11014873 10093792 8406727 8863241 11238876 13378166
40806 13378166 14762384 15856872 15907068 14671198 14395447 16293282 16869103 12289054 5307425
40797 5307425 2870063 6956672 12521373 14760915 13685845 10923791 7095536 3891647
40789 3891647 3985926 6692292 7816067 5976903 4981576 7532689 10905923 12021721 12576505
40780 12576505 14939391 16505100 13301904 7129150 3913910 5762164 9132728 10540008
40772 10540008 9911452 8338308 6562393 6139101 8249423 10486135 8515324 2353792
40764 2353792 -2399215 -1551192 2388946 4233431 2835113 824987 -366315 -1456330
40756 -1456330 -1905325 573812 6109206 11101456 12194734 10038695 7591591 6196562
40748 6196562 5154412 4118480 3759517 4305917 5286451 6770147 9143994 11485233 12047423
40739 12047423 10982197 10653096 12051097 12670599 9856602 5076704 2431082 3163162
40731 3163162 4216363 3149147 2352665 6278658 15165616 23752450 26852868 24562928
40723 24562928 20693564 17490729 14305169 10986514 9256718 9433414 8836299 6011955
40715 6011955 4144976 6810425 11963651 14239108 12418792 10178190 9610808 9041800
40707 9041800 8039989 9105135 12172469 12683031 8546333 4489369 5333370 8862553
40699 8862553 10147720 9664977 11617388 16333617 19927054 20433941 19236807 17179456
40691 17179456 14196867 12366407 14478313 19437237 23215150 24200736 23701776 22044556
40683 22044556 18957714 17126550 19802732 24744136 26145590 23231549 21292207 23271323
40675 23271323 26392392 28793051 33105543 40423411 46480104 47813086 47213987 49205243
40667 49205243 54082504 60223565 68565749 80598123 94562583 107103577 116351578 120924638
40659 120924638 119078846 111589849 102273129 93160022 82748211 71199631 62462765 58210381
40651 58210381 54966495 51028577 50354397 54594900 57465986 53618483 47285376 44292653
40643 44292653 41209536 32405794 23288694 24177948 32687560 35230097 27344316 19970223
40635 19970223 21746036 26702314 25759166 20758107 19175073 21856784 24058195 24000592
40627 24000592 23235387 21894529 19682055 18624369 19538602 18922398 14522965 10662107
40619 10662107 12494737 18118981 22254361 24721421 28541048 31868431 29415954 21471562
40611 21471562 14447632 11779442 10607917 8821802 9348822 14699965 21679531 24757101
40603 24757101 22428542 18201596 16635812 19108027 22359876 21840127 17833282 16043637
40595 16043637 19317984 21985472 17622600 9896624 8345500 13941636 17187617 12407644
40587 12407644 5764864 4990039 8188343 8650177 5666334 4174628 6787362 11901550
40579 11901550 17508830 21818217 22137594 18081091 14074801 13827666 14287583 10587922
40571 10587922 5256728 5709477 12624686 17864509 15988539 11781636 12845153 19165700
40563 19165700 24267462 24182514 21255968 19801559 20818803 21315567 17907278 11227473
40555 11227473 6453602 7958966 13662613 17026149 14897764 10511210 7874034 6663900
40547 6663900 5030797 4459492 7899040 13947068 16718496 12652880 5386045 2309630
40539 2309630 6813587 14922896 19771937 18740765 15226356 13420184 13151340 11425922
40531 11425922 7694846 4928422 5572889 8941514 13047554 16730831 19289875 20205706
40523 20205706 20172919 20552801 21198396 20987779 20967976 23848342 28908630 30693619 25525216
40514 25525216 17004622 12040293 13002153 16627702 19165704 19366631 17387995 14244423
40506 14244423 12249500 13020325 14900194 14930521 13294002 12986430 15027120 17194267 18081402
40497 18081402 18912309 19918282 18550039 14137297 11518177 16006152 25845218 33708820
40489 33708820 35847207 35884262 38323577 42134470 43693352 43180745 43611270 44501266 41469786
40480 41469786 33307359 25219852 22604976 24819886 27902224 30395180 32749068 33539426
40472 33539426 31095795 27507394 26024422 25287453 21596880 16659798 16646353 22366280
40464 22366280 27213676 27702051 29264915 36898049 46056237 49363055 48189377 50383172
40456 50383172 58883569 69568523 79042416 87450111 93493487 93289679 85695139 73951010
40448 73951010 61231913 49137353 40701906 39036167 41472818 40635689 33839814 26780282
40440 26780282 25272087 27646076 28288138 24861296 18839212 12258291 7258693 6009261
40432 6009261 7899033 9274420 8748022 9894359 15404019 21391313 21634489 15733651
40424 15733651 9201485 6680241 8527626 12843933 17130891 18639266 16628958 14065328
40416 14065328 14157425 15783411 15346372 12396237 9896202 9343121 9516436 10205219 12947114
40407 12947114 16872377 17771425 13579137 7946087 5956609 8363173 12158373 14752322
40399 14752322 15055501 12317433 7374266 4440181 7935714 16394127 22182503 19297986
40391 19297986 10186469 3009116 2832766 7354995 11042185 11173329 8934953 6668452
40383 6668452 6112923 8265862 12448561 15581788 14839322 11621705 10541636 13247998
40375 13247998 15554850 12862475 6746935 3197123 4740636 7380504 6306491 2346754
40367 2346754 789895 4598999 10682520 13463325 11210990 7689499 7401486 10441931
40359 10441931 13324521 14120821 14444432 15821812 16616756 14524910 10489696 7608995
40351 7608995 6886601 6675110 6247160 7239467 10772240 15358539 18966500 21499662 23664047
40342 23664047 24468945 21737832 15237740 8296277 5673673 9357441 16029530 19381643
40334 19381643 16350076 10839788 9398258 13065986 16129368 14119565 10075760 10032252
40326 10032252 14414082 17912216 17243296 14675434 13031171 11396974 8133598 4895237
40318 4895237 4432791 6399902 8550259 10664191 13889355 17147802 18051046 17340594 18501970
40309 18501970 22086307 24103225 21740638 17465674 15266270 15655139 16956158 18804383
40301 18804383 20950436 20809425 16651944 12385698 14392528 22846244 30342463 30921155
40293 30921155 27004054 24972699 26810642 29521837 31009742 32441867 34877306 37329490
40285 37329490 39439582 43028905 48794828 53691433 54572405 53203309 54083138 57348516
40277 57348516 57861946 52895270 46893828 45387748 46977086 45685297 39821102 33758732
40269 33758732 31140058 31039183 31539080 32429638 32895248 31049562 27847218 27114834 29290168
40260 29290168 29734901 26273250 23285731 24060590 24467757 20407308 16785634 20880018
40252 20880018 29710898 33292370 29547596 26402967 28223972 30105714 28654290 28702571
40244 28702571 33699179 37655785 34129999 27187068 25269636 28398947 30038786 29117462
40236 29117462 31181321 37880873 43793614 45473548 46591059 51220576 57819993 63460055
40228 63460055 69352496 77843390 87111134 93493794 97556185 103601461 113317183 123215046
40220 123215046 128883158 129317848 126280669 121302808 114486232 105201976 93023190 78545335
40212 78545335 63834725 51515263 43054791 38522707 37890812 40881779 44762854 44476957
40204 44476957 37485610 27597211 21294493 20535131 22008401 23368641 26251641 31685290
40196 31685290 36425839 36922392 34365042 32616826 33041992 34465909 36436771 39043861
40188 39043861 40821477 40322594 38778980 37966268 36754553 33461653 30305662 31162371
40180 31162371 35598633 39468856 40868472 41038251 40119984 37354212 35382976 38527754
40172 38527754 45918910 51837733 53947237 55613527 58961472 61906257 63932152 68100176
40164 68100176 74343433 77376556 75181131 73262747 75786163 78512225 76144121 71173164
40156 71173164 68876407 68114013 64308724 58180896 54129056 52159595 48603937 43555658
40148 43555658 40840166 41181079 41539401 40988714 41610982 43685077 45294803 46687118 49970789
40139 49970789 54462614 57196493 58068258 59583606 61308557 59596221 53719253 47829304
40131 47829304 45565697 46220863 47212411 47505852 48071080 50981897 57240124 63436663 63164721
40122 63164721 55524260 49391735 53860312 66517029 77286678 82151306 85767479 91185600
40114 91185600 95479693 97382905 101592916 111980372 126126130 139640900 150794665
40107 150794665 157963661 157720225 149410774 137844621 127866571 119185333 109327047 98704289
40099 98704289 89997510 84922983 83647875 84902761 85077214 80078816 69935501 59240722
40091 59240722 51951181 48210311 46589500 45981748 44707023 41493217 37973959 36431816
40083 36431816 35104543 30643451 25310604 25435312 31379125 35758071 34248731 31653364
40075 31653364 33760712 39371901 44470161 48284013 50479661 48269487 42208090 39812043
40067 39812043 46756796 58129046 64795110 65374175 65517081 67836838 69201160 66808535
40059 66808535 61230066 54142721 47633122 44581976 45590722 47080614 46079817 44290701
40051 44290701 43575745 41474116 36812967 35539905 43192535 54267728 57734615 52025587
40043 52025587 45850226 44242288 43009286 38589232 34302318 33257666 32883383 31170385
40035 31170385 31938368 38623504 47646610 52993436 53645779 52113441 49419239 46409908
40027 46409908 46841495 53686884 63950186 71696559 75048863 76272211 76474195 74866012
40019 74866012 72653369 72818379 75266477 76279943 74406053 73560796 77737866 84619853
40011 84619853 87532449 83729803 78319276 78426583 84399042 88958596 85772796 76889575
40003 76889575 69606948 67274868 66497033 63594894 60006001 59014953 59847341 58468796
39995 58468796 53534068 48610571 47989563 51901711 56282233 56500470 51669383 46097978
39987 46097978 45698940 51834950 59714177 64224306 65830569 68480224 73475656 79280667
39979 79280667 86436141 97299752 109917970 118073939 120725340 126002475 140657174 160147374
39971 160147374 176227152 190761518 212344257 239893852 260579289 267011210 266007222
39964 266007222 264541115 257053839 236163067 208384294 187270838 175020979 163257965
39957 163257965 150151803 143225907 143641301 141083829 129580586 117408320 114337208 118119740
39949 118119740 121677146 126074909 136702837 151253513 160998223 161930307 156949326 148664152
39941 148664152 137195631 124186166 112569493 102703412 93857760 88429914 89414670 94765525
39933 94765525 99501085 102464918 106062276 110623480 114342002 117651074 122310160 127254680
39925 127254680 130556274 133826271 138906345 142341898 140211164 136588548 138723244 144526549
39917 144526549 144293040 135723252 127505714 125618567 125867401 124012933 123826119 129304720
39909 129304720 137208494 144091610 153268278 166779073 176618664 173208860 158891133 144407043
39901 144407043 134640449 126196839 117217541 110811329 108678938 108874298 110604216 114721751
39893 114721751 118917682 119084036 116681090 118381576 126600404 136432996 144202887 152843955
39885 152843955 165443242 179224077 190434989 200070240 208846626 210490466 197803137
39878 197803137 174667222 154673202 145861078 142387949 134350962 121326594 111642947
39871 111642947 110922261 116808657 124856657 134489226 147011344 161334913 175001716 187921862
39863 187921862 202291757 219514581 239481996 262300297 288286256 315956384 341206857
39856 341206857 357994986 359343293 340763191 306311298 269427004 242933335 228306113
39849 228306113 218886188 212499533 214106779 224738137 235509395 237418418 231767760 225664004
39841 225664004 221850480 219324489 220256871 228290505 241187286 253080168 264801560 284476788
39833 284476788 314683902 344345207 357342664 346513170 317087775 279946446 244698007
39826 244698007 216627738 195936933 179337455 164034433 150692825 142715297 143227650
39819 143227650 151808257 162334416 165328491 156134267 141011003 131426030 131514795 135077968
39811 135077968 136003725 136380290 140818075 147232451 148760524 142830672 133145165 123425936
39803 123425936 114141959 105780949 100673224 99565849 99274248 95817886 88612343 80791719
39795 80791719 76801537 79883745 89890207 102872808 114612541 125258498 138856629
39788 138856629 157794708 179515662 199154374 213293848 220830199 223566027 227713664
39781 227713664 240834915 262660298 280532599 279360186 257386564 228507950 207692310
39774 207692310 198008305 194399546 195224653 202888407 213493506 213954012 194846924 162860931
39766 162860931 134823256 120065451 113638819 106998040 99326202 95307958 96558752 100312817
39758 100312817 104234643 107637916 109215335 108505127 109356097 117403975 134161423 157975068
39750 157975068 189499872 228499670 264047907 278156435 266629706 249588310 251055316
39743 251055316 270190813 282090640 266895135 228956885 185856225 148638147 118420397
39736 118420397 94441902 76591200 62895587 51725971 45430102 46216588 49649125
39729 49649125 48201985 41211034 35575659 35765533 38658612 39962279 40108027 40473421
39721 40473421 38749707 33136153 27881501 28668161 33717358 35526121 31898312 29329281
39713 29329281 33199707 39973450 43161137 42826324 43605206 45758601 44840078 40196930
39705 40196930 37315051 39686443 43711578 44682316 43346821 43040785 44349031 46668086
39697 46668086 51258452 57901961 62059978 61208885 60884171 67175212 75294779 74330762
39689 74330762 63329666 53444352 52080731 54087340 52706033 50401409 52296708 56005830
39681 56005830 56085258 53787993 54112912 56256714 55108519 50506806 47363419 47345620 47460505
39672 47460505 46531010 46260875 45885827 42647843 38104907 36980008 38549204 36426167
39664 36426167 29339038 25111091 30020089 40038904 47206356 49811639 51087953 51674586
39656 51674586 49423806 44980298 42111364 42514047 44126724 44831186 44920443 45509508 46674667
39647 46674667 47732592 48137495 47830203 47274674 47010326 46999530 46889068 46630597 45857248
39638 45857248 43325428 38835219 35174114 35536706 38897011 40674309 38499437 34636530
39630 34636530 32099547 31345850 31899409 34313657 38793302 43906310 47925749 49813460
39622 49813460 48696087 44887763 41471153 41512554 43353038 42522946 38851400 36901014
39614 36901014 38034521 37623564 33033493 29014454 30772892 35879147 37909683 34975360
39606 34975360 30015050 25569358 23151795 25183304 32119077 39266225 41557822 40343541
39598 40343541 40796089 43954977 46381038 46636070 46652700 46939760 45748278 43356998 42214071
39589 42214071 42121243 40013147 35560203 32472042 32761595 33800140 32787796 30479321
39581 30479321 28584555 26773949 24452490 22913717 23563596 25742112 27855000 29293893
39573 29293893 30356899 31649085 34010469 37709367 41793903 45542382 49531763 53366207
39565 53366207 54241372 51087540 48248621 50177843 53407270 49687889 37829954 26670098
39557 26670098 24375553 29920337 37479650 44129502 49678487 53076760 53377679 52103774
39549 52103774 51490952 51983332 53266250 55502609 58145264 60312000 63296768 68910459
39541 68910459 74335378 73827096 67676393 63649044 66028105 69105722 66174278 59107852
39533 59107852 53188370 48235268 42333444 39129453 42064903 45016521 39344122 28674783
39525 28674783 25444957 32254295 38120276 36034916 33024325 37275201 44897738 47022195
39517 47022195 43046922 38919151 37184742 36276976 36022990 36685680 35235165 29348549
39509 29348549 23178413 22888349 27992127 32891180 35274286 36863163 37330161 34375996
39501 34375996 29665671 28183141 31063943 34756434 37667526 41676624 46384620 48281287
39493 48281287 47249873 47621730 50378326 50405710 44797441 38264472 36080623 36286933 33517076
39484 33517076 27001499 20339338 16187465 15178279 17419379 21264831 23211298 22581536
39476 22581536 23380013 27842384 31721687 30613728 27368797 27409528 29674485 29006121 25509770
39467 25509770 23957446 24573014 22375631 16591437 13010394 14713410 17515764 17776530
39459 17776530 18022742 20458905 20985526 15630850 8655709 7729515 13334315 18961106
39451 18961106 20553839 19922274 18989350 16524164 12304560 9922236 12400609 17518217
39443 17518217 20440344 19955194 19550927 22277031 26665195 28911402 27882525 26066305
39435 26066305 25696673 26156991 26186138 26488273 28236818 30867341 33971018 39639991 49220047
39426 49220047 58636239 61368584 56463876 49468301 44589125 40249445 33982889 27338323
39418 27338323 23136352 21203561 19724501 18212593 16703728 14703157 13303960 15372215
39410 15372215 20857783 24821592 23219164 18026079 13651946 11272742 10162458 11261199
39402 11261199 14702030 16500898 13307597 8949147 10430730 17705448 22947371 20788062
39394 20788062 14506749 10654502 11511418 14707767 17334267 18413911 18852339 20089807
39386 20089807 22156852 23445225 23274042 23132740 23730890 23032909 19866909 17127189 17899360
39377 17899360 20639998 22210252 23190642 25138941 25134001 19778208 13151610 12911627 18379364
39368 18379364 20833164 17215139 14811791 18760059 23367255 21658370 16574839 15421782
39360 15421782 18235384 19587614 18859352 20710276 26323151 31183398 31822793 29109606
39352 29109606 24448895 17967657 11441095 8414730 9905228 13399016 17036513 21372631
39344 21372631 26131759 29032078 29672199 31401978 36850428 43704230 47422581 46913344
39336 46913344 45178592 44723662 44361714 41181636 34617252 27520656 23163033 22037765
39328 22037765 22388614 23190313 24968625 27675541 29805478 30467118 30505434 30450531 29198625
39319 29198625 26135626 22676421 20017362 17457724 15148382 16169426 22476660 30252310
39311 30252310 33149602 29752988 24399435 20954039 19506202 19368320 21278123 25293787
39303 25293787 29581913 32500905 33293997 30369138 22653829 13744791 10362146 14213058
39295 14213058 19139292 19255503 16272430 15137976 16022752 15551723 13337597 11551977
39287 11551977 9473907 4635293 -835234 -1313122 3788934 8424822 8631571 7120224
39279 7120224 6708645 5299618 1568778 56215 4645578 10908555 11546104 7024070
39271 7024070 4109068 5209043 6086895 4081007 1886118 2055906 3682030 6018161
39263 6018161 9829859 13446029 13084910 9300639 7562759 9892443 11768733 10578711
39255 10578711 10761911 15645134 20119572 18119261 12944049 12526125 17004599 18658863
39247 18658863 13333824 5114006 -342682 -1154364 2225948 8076178 12332779 11417242
39239 11417242 6891794 3243811 1398343 -864431 -2832116 -1274737 2830655 4397149
39231 4397149 2316828 1284638 3719671 6043524 5642853 5548581 8531310 11719807 11362632
39222 11362632 8924351 8325680 10278807 12824622 14470700 13861913 9818867 4786026
39214 4786026 4416768 10031077 15086743 13257812 6812784 2745353 3672491 7121594
39206 7121594 10887095 13809181 13402558 8416214 2898920 2633063 7705681 12819191
39198 12819191 14583436 14359751 14135119 13863640 13423521 13567837 14006116 13191727 10648721
39189 10648721 7585037 5289440 4715152 6862941 11259076 14701488 13888929 8967932
39181 8967932 2837369 -2000755 -4269687 -3469268 -950755 333103 -393631 -174958 2939103
39172 2939103 6238420 6725991 6242460 7904466 10098971 9338878 7093152 7714830 10658609
39163 10658609 11278672 9346294 9999286 14790602 18059098 14930875 8077273 3673029
39155 3673029 4452816 9139349 15059350 18755445 17190636 11075902 4919780 2104796
39147 2104796 2017278 2839653 4154725 5635219 6310565 6518501 7619130 8655604 6606869
39138 6606869 1240258 -3682627 -5355190 -4605008 -2588235 929247 4472397 4889101
39130 4889101 2872586 3458609 7826188 9852033 5424781 397300 3162198 12587515
39122 12587515 19949368 20994250 19343956 18401867 16535984 11696351 5628421 1332729
39114 1332729 -301345 69394 1329302 1638487 -31204 -1536557 168481 3874977
39106 3874977 4812635 1641865 -986148 1037197 5445018 7171122 5384652 3682058
39098 3682058 4545416 6771450 8104117 7817114 6476987 5137641 5051931 6482452 7511228
39089 7511228 5751946 1808929 -660842 688010 3985062 5964054 6261522 6819097
39081 6819097 7924495 7688601 5637669 3845555 3350527 2427248 579037 1260621 6781121
39072 6781121 12399723 10737059 2303324 -3686697 -1150326 4943398 6306548 3277698
39064 3277698 3413598 9511141 15318200 14799269 10587495 9584901 13275607 17009058
39056 17009058 17846417 18160200 20136395 21005828 17293708 11438928 9550328 12703088
39048 12703088 15072557 12498939 8865610 10400404 16260862 19412795 16130806 10041231
39040 10041231 6055923 4540695 3446320 2680814 3248561 4116871 3245819 995263 -268807
39031 -268807 144925 342174 -1006218 -2620070 -2653723 -1364250 -396521 -11782 1507529
39022 1507529 5284482 9603922 11199725 8668555 3870358 -29725 -1084164 772334
39014 772334 4161285 6837553 7246817 6378192 6679542 8200744 7731622 3475847 -1423761
39005 -1423761 -2689668 -783407 170556 -1599042 -4048651 -5377866 -5602772 -3873122
38997 -3873122 1359907 7992746 10258830 5921312 490020 897583 6718529 10966206
38989 10966206 8872017 2903994 -1076712 -193721 3966174 8769468 13474550 18117210
38981 18117210 20780329 18463218 11516683 4870970 2696514 3569402 3563860 2413169 2896058
38972 2896058 5123205 5905709 4063248 2178469 2163751 2738679 2204274 241631 -3622237
38963 -3622237 -9363825 -13536849 -11475916 -3850477 3162854 5504824 4590405 2213001
38955 2213001 -2020841 -6269210 -6086896 -1861043 -183055 -3575153 -5480764 -990010
38947 -990010 4046438 1829118 -5082070 -8571021 -7549238 -6646974 -5859330 -1570383 4029224
38938 4029224 5031763 2959321 5324022 11987796 13499363 5934710 -2468186 -3857726
38930 -3857726 -1022858 390950 1771744 6465638 11027873 9641360 3660900 -536360
38922 -536360 -854302 22191 1633369 6205381 12076864 13166953 7127094 -444190 -2676501
38913 -2676501 418626 3311904 3026991 2483684 4984268 8293597 7615298 3626645 2664239
38904 2664239 6996918 10026941 5887156 -347449 886364 9135218 14245407 11297707
38896 11297707 6467640 5714644 6288722 4115152 2165820 5120128 11043824 14851104
38888 14851104 16014943 16716220 16017884 12422992 9295524 10846421 14580539 14458350
38880 14458350 10467754 8438436 10641102 12991789 12303803 10648670 11125255 13739696
38872 13739696 16632531 17813579 15431648 10071102 6539537 9075569 14986459 17744601
38864 17744601 16218514 15395675 17626383 19357364 18100854 16424626 16357661 15639655 12934669
38855 12934669 11278642 12198552 11693355 7303895 4363520 8455451 15047979 14530151
38847 14530151 6337992 43781 1552132 5861578 6481072 5376741 8427015 15271830
38839 15271830 19688170 18519238 15041728 13470513 14294762 15782248 16612764 15738780
38831 15738780 12502295 8517154 7066864 8845100 10510964 9627186 8750008 11421064
38823 11421064 15773462 16411729 12508212 9611442 12064367 17403801 20451117 19815184
38815 19815184 17667802 15770443 15046213 17125436 22435007 27438212 27318294 21708055
38807 21708055 15326356 12872523 15231681 20150456 24283778 25055143 22975872 21631495
38799 21631495 22899445 23312879 18776936 12017096 10287204 14864002 18095751 13547090
38791 13547090 4743312 111036 2363580 7161414 10403733 12303820 14446091 16588914
38783 16588914 17460955 16671971 14946780 13363836 12535282 12226904 12398945 14438945 19209176
38774 19209176 23352527 20982317 11504892 2611275 1537408 5510134 5716179 -247765
38766 -247765 -5358977 -3218403 4001388 9523327 9595742 4804733 -2338305 -8012646 -8389435
38757 -8389435 -3751212 949360 2681181 4822363 11184087 18108958 18077206 10578004
38749 10578004 3717572 3798063 8069809 9969641 7588373 4063107 2488170 3618669
38741 3618669 6787717 10108110 10750220 7513086 2736282 118652 1223208 4921886
38733 4921886 8749721 9831887 6790890 2492242 2386394 7632253 12338401 10809681
38725 10809681 5166746 1798289 2392247 3568402 4066295 6115172 9302014 9377417 5308439
38716 5308439 2223673 4394248 9538183 13044276 13894847 13192416 10638810 6427718
38708 6427718 3662644 4801072 7710593 8579899 6628431 3102701 -1398388 -5205549
38700 -5205549 -4762766 -70505 2495673 -1527703 -6565555 -4073285 4187827 7927274
38692 7927274 3218907 -2681141 -3143190 -810374 -778183 -1959438 -464218 3203063 5798888
38683 5798888 7114533 9114609 11316131 11445222 9492897 7494660 6265269 5468561
38675 5468561 5913002 8642289 12249746 13842279 12619172 10523755 9505588 9640040
38667 9640040 9664970 8238840 5048606 1367331 -999799 -1354918 261132 4224682 9770694
38658 9770694 13129444 11087297 6533602 5830698 9617686 11553651 8416483 5478644
38650 5478644 7749252 11612266 11172393 8224503 8392265 10470443 8244625 1993637
38642 1993637 -623125 3551984 8393703 8457736 6794711 8659312 12969032 15106672
38634 15106672 14446948 13892291 14171003 13506746 11973336 11769562 13004942 12830379 9881330
38625 9881330 7083602 8244203 12836652 15959325 13979934 9101867 6721967 8425674
38617 8425674 10111212 8356599 5766158 6747566 10069258 10487307 7555840 7516909 14522070
38608 14522070 24223905 29020901 26726216 21073296 15955887 12425477 10025677 8009970
38600 8009970 5624912 3277682 2890701 5372178 8517649 9287439 7619770 6271532
38592 6271532 7276811 10029184 12415437 12452640 9294936 4103370 -314246 -1940412
38584 -1940412 -1345869 -44403 2237075 6920776 13234679 17331443 15876455 9909488
38576 9909488 4094117 1949737 2552496 2626898 1227539 572031 1928547 3117022 1990005
38567 1990005 385978 1587956 4955913 6647171 5464240 4312494 5385254 7561058
38559 7561058 9555319 12029747 15158996 17614705 19541870 22788658 26274148 25443220
38551 25443220 19278609 13524835 12865184 13871511 10926594 5802732 4777624 7944525
38543 7944525 8621032 3887031 -839271 80397 4816769 7339226 5045167 598398
38535 598398 -1776203 -216004 3109348 3905733 979221 -1406495 680213 4188301
38527 4188301 3106322 -1484992 -1855989 4439731 9857919 7701615 1742355 -138977
38519 -138977 2663720 4504096 2776568 -191342 -2777017 -5205916 -5623520 -1316385
38511 -1316385 5312794 7541098 2875642 -3647709 -6539213 -6032020 -4914061 -3301803
38503 -3301803 -207856 2372801 1214030 -2842655 -4628144 -481131 7199956 12035952
38495 12035952 10084698 4019586 356458 1972667 4638977 2860178 -2099480 -3537713
38487 -3537713 1298215 7298762 8572833 5590568 2593428 1307335 953778 1946848
38479 1946848 5036235 7900827 6971768 2591203 -1211464 -2078008 -1177099 52692 1311955
38470 1311955 1493623 -633927 -3043334 -1764588 3131748 6760235 6272225 4566929
38462 4566929 5061022 6719261 6992679 5791274 3285602 -2118911 -9249668 -11613723
38454 -11613723 -5398845 2684932 2607171 -4941337 -9073576 -3949618 3845842 5741529
38446 5741529 2389423 49256 718211 1392241 595703 379146 2288308 5024912 6334919
38437 6334919 5190777 2410826 342841 834408 2513063 2048721 -556219 -737939 4124305
38428 4124305 9784140 10374998 6577090 4184416 5513755 7003000 5670200 3291189
38420 3291189 2380168 1782647 -914371 -4845408 -6682687 -5110442 -2131737 -41707
38412 -41707 1094601 2521823 4603023 6519846 7845551 9384034 11875827 14558225
38404 14558225 16098090 16537464 16666616 15507546 10851087 3395122 -2118184 -2163100 902893
38395 902893 2136211 705138 1985 1573319 2831240 1833287 820685 2587894 5668648
38386 5668648 6255915 3977415 2468351 3666580 4555024 1705322 -2929126 -4172222
38378 -4172222 -1285852 510938 -2140660 -5218288 -3281049 1852844 3611866 646999
38370 646999 -1732503 -533614 899717 -57707 -541433 1770051 3491736 1344561 -1649003
38361 -1649003 -1410941 10128 -1061672 -2024267 1817776 7855964 9348944 6556477
38353 6556477 5872424 8114712 7082072 1217246 -2601913 -26356 4421664 5845469
38345 5845469 5983409 7329781 7949980 7392076 10176461 17011398 19851969 13612279 6333140
38336 6333140 8293390 16050309 17957452 12446916 9369770 13773059 19616760 21391361
38328 21391361 21766853 24133849 26339270 26678215 28918141 35620594 41751744 40944144
38320 40944144 34906161 31407671 34833489 42805706 50657591 55734279 58116033 59644044
38312 59644044 61704514 62870061 60305856 54402349 49503135 48429750 48719556 46318835
38304 46318835 41035967 36362052 35396255 38421876 43121972 46398078 47656626 50286084
38296 50286084 57101879 64480858 65186156 57676201 47705856 39372492 30639879 20659956
38288 20659956 14673117 15881642 17999847 13420290 5292757 3372544 9482480 15122748
38280 15122748 13557597 7044597 1174643 -1412845 -290965 3734713 7065971 6036665
38272 6036665 2716185 2883030 7130457 9805406 8123416 5638334 4404423 1116245
38264 1116245 -5040140 -7978575 -3739902 2284318 3479705 1854675 2765514 4892198
38256 4892198 3726990 1127962 2228194 5260230 4008891 -637098 -1266394 3652608
38248 3652608 7528448 7230718 7418227 10630802 12365908 10093094 8489010 10575074
38240 10575074 11732058 8584399 6147393 8783401 11010477 6164771 -1326866 -2237440
38232 -2237440 2743748 5081157 2996653 2917518 6352080 6510451 726305 -3636354 -333863
38223 -333863 6533116 9698264 8786222 7606432 6610029 4185797 1885227 2348302 4171290
38214 4171290 4053787 2493583 2614505 4539126 5455220 4478962 3116568 1440687 -1646445
38205 -1646445 -4208080 -2035467 4940508 10827701 10446155 5022494 -707957 -4336990
38197 -4336990 -6124394 -5802444 -2749311 1134910 2062832 -1296820 -6136666 -8672616
38189 -8672616 -7049219 -901309 8889984 18333799 21286970 15705876 7425716 4139439
38181 4139439 6424041 8449335 6965274 4877774 5339773 7361734 9162918 11038139
38173 11038139 12173047 9433788 3141833 -413051 2953257 8499955 9144093 5440143
38165 5440143 2983809 3062145 3087020 3918814 8335385 13137210 11804370 5751144 3973455
38156 3973455 9508611 15153934 15806582 15963102 19921512 23027824 19686144 13407948
38148 13407948 11108807 12304097 11666537 8574556 6650672 6737277 7364931 9392856 13064445
38139 13064445 13391175 6611979 -951586 412848 9067334 13476395 9082735 3991072
38131 3991072 5323069 9612576 11678964 14367699 21983162 29997120 29968402 22229854
38123 22229854 16086373 17839726 24645028 30410666 32317052 30377755 25400538 19759143
38115 19759143 16851777 17216316 17402686 14978429 12534943 13752188 16979149 16706721
38107 16706721 11603002 7040892 7806462 11715908 13476901 12125180 10455211 8879384
38099 8879384 5244901 736924 233490 4799686 8723381 7173010 3005986 2374124
38091 2374124 6471064 11264360 13061164 10845084 5368171 -304188 -1392204 3299237
38083 3299237 8225663 7549298 3574538 4053655 11371060 19152167 20579210 16216582
38075 16216582 11938676 11630162 13513798 12607680 6393875 -1466999 -4266379 -250719
38067 -250719 4598647 4011123 -642967 -3109882 -962733 2486363 3793843 2675340
38059 2675340 151100 -2620684 -3668605 -1837250 894856 1661044 739010 389601 770411
38050 770411 539740 438471 2319789 5451642 7694830 9317277 11551031 12862844 11547186
38041 11547186 10509906 13652467 18574199 19438543 16619711 16181971 19307672 20196918
38033 20196918 16439573 13605040 15995761 19757977 19627355 16863750 15877970 17559379
38025 17559379 20151684 22690664 23894295 21750433 17744677 17287808 22321805 27650778
38017 27650778 28140343 25135796 22025133 18335675 12917157 8505600 7831684 8814735
38009 8814735 8599139 8695763 10930274 12048219 8337184 2625327 558042 2257580 3620181
38000 3620181 3743094 4946930 7166467 8477791 9782954 12774088 14548143 11036999
37992 11036999 5270721 5086634 11862661 18223934 18593316 15873876 15183061 16355259
37984 16355259 16029431 13284756 9869317 7342529 6506296 7747798 10151621 11926211
37976 11926211 12780302 14030507 15637483 15358542 11850521 6724971 2695208 1368333
37968 1368333 3262120 7869972 12854250 14998255 13122597 9254973 6673929 7565465
37960 7565465 11999907 17660494 20961336 20144425 17217537 15635409 16606497 18890520
37952 18890520 21218982 23309371 25485505 28862227 34578580 41142668 44379325 42393938
37944 42393938 38774010 38020868 39533406 39342071 36050240 31194892 25289160 18263086
37936 18263086 13093711 13667598 18395267 20870605 18346911 15139657 15570046 17658711
37928 17658711 16958160 13686571 12265263 14858884 18581704 19449113 17141325 14802734
37920 14802734 14649182 14945698 12359787 6938501 2855469 3461022 7421988 10968722
37912 10968722 12020080 10499644 6824769 2570860 868948 3292684 7328363 9100149
37904 9100149 7410167 3493251 -920658 -3250502 -998901 3778765 4390239 -1770468
37896 -1770468 -7670454 -5240490 3177435 8335070 7088522 4736528 5174702 6440647
37888 6440647 6908377 8609834 12229143 14802695 14542581 12712090 9409340 3496956
37880 3496956 -1772034 -97965 7890542 12761577 8547312 928682 -1531669 1178662
37872 1178662 3363978 3199686 3164425 4059181 4750749 5955661 8782805 10837011 8809083
37863 8809083 4153939 1715693 3136292 5498933 6180797 5574746 5130100 5616799 7247637
37854 7247637 9311940 10206433 9674113 9898485 12425277 15411298 16023058 14015442 10873127
37845 10873127 7450862 5029533 6451721 12698807 19760063 22374304 20037366 16406751
37837 16406751 14031197 13012835 13791382 17305015 22313642 25775736 26342068 25343833
37829 25343833 24684988 25958677 30720342 38670083 46039128 48884037 48045917 48200446
37821 48200446 52098383 58370519 64674214 69758310 72151601 70208570 64698375 58820857
37813 58820857 54411569 50156499 44574820 38733505 34665210 32540115 30572507 26788962
37805 26788962 20397535 12664204 6852636 5767496 8598010 11441827 11592588 10033547
37797 10033547 9070800 9034335 8483898 6507773 3411734 -166331 -3413667 -4972748 -3913697
37788 -3913697 -1325455 300129 -44927 -523573 1005972 3749092 4884770 3743116
37780 3743116 3012765 4608218 6288819 4841251 1518028 931524 4188645 6630625
37772 6630625 4301016 -139887 -1019305 2345502 4813377 2570818 -2281088 -5634495
37764 -5634495 -7026447 -8597595 -9875000 -7429885 -613582 5718263 6955529 5241747
37756 5241747 6583438 12030129 15870231 13621978 7959500 4481578 4738619 6212041
37748 6212041 6587104 4992561 1299563 -2533354 -2574054 2060854 6362852 5481374 1466514
37739 1466514 -510888 -447108 -2316985 -5970357 -6684326 -2849650 1990750 5340436 8098890
37730 8098890 10001434 8880381 5813243 4985835 6801904 7067887 4626226 3405391
37722 3405391 4931910 5627904 4001695 3277893 3855496 1045814 -5530172 -8461154 -3937472
37713 -3937472 1275362 728828 -1613183 138460 2728059 489920 -3292286 -2289168
37705 -2289168 636758 -1716925 -7491264 -8780300 -5529895 -4500784 -5723488 -2509434
37697 -2509434 4633114 6654859 857779 -4572720 -4422362 -3693668 -6183195 -6311290 878740
37688 878740 9897506 12378133 8542963 4680550 4045243 5865216 9035044 11764083
37680 11764083 11434993 8800380 7995368 9105095 6528151 -1056373 -5753399 -1634321
37672 -1634321 5077554 4587172 -2211070 -6320579 -4422773 -1330308 49086 2428646
37664 2428646 6812817 8934225 5732617 242227 -2739202 -2345957 -787704 523600
37656 523600 1852062 3527810 4866578 4467983 1834936 -950587 -686301 2590574 4663952
37647 4663952 2622393 -673322 -383538 3672255 7458447 8685130 8614718 8148379 5863485
37638 5863485 993810 -4280569 -6886246 -5774018 -2094174 2280921 5766006 7465013
37630 7465013 7286579 5835828 4416574 4596742 6390982 7089970 4142907 -335714 -754122
37621 -754122 4775924 11143356 12344800 8529136 4250609 1828038 -34648 -2146465
37613 -2146465 -3105521 -1887390 644072 3396979 6311051 9531690 12665479 15018949
37605 15018949 15759825 14339665 11627990 9711830 9458943 9318041 7731379 5483331
37597 5483331 4206258 3853309 3366874 2713645 2453507 2247410 1545364 972094 1536422
37588 1536422 3250402 5596845 8107547 9523581 8316410 5429709 4278896 6232834
37580 6232834 8526260 8857356 9266178 12307636 15937037 16275806 13811575 12546683 13792243
37571 13792243 14916982 14063628 12443003 11793685 12464324 13740349 13527460 8981928 821261
37562 821261 -4513827 -1467077 6722719 11564438 10275688 7728457 7347901 6616987 3754901
37553 3754901 2668412 7129109 14206966 17773101 15916965 11554922 8183371 8132502
37545 8132502 12450835 19029651 22874626 21650565 19219699 20364840 23794912 24241662
37537 24241662 20283496 15881095 14354787 14732229 14537058 12753087 9168706 3974556
37529 3974556 -571877 -841987 3754841 8875195 9826931 6910089 4232845 4002458 4278424
37520 4278424 2562984 -501136 -2245671 -1531453 493493 2809483 5846299 9806271
37512 9806271 13208721 14414586 13742551 12670551 11498865 9393250 6538474 4528861
37504 4528861 4315397 5193240 6196939 7128795 7792401 7748083 7619005 9181703 12915535
37495 12915535 16438965 16724324 13428889 9018925 5964624 4793222 4759890 5436698 7101108
37486 7101108 9702823 11964708 12337417 11244389 11377130 14401430 17848670 17152775 11182346
37477 11182346 4191299 1527742 4531726 10162490 14193613 13862497 8910788 1836439
37469 1836439 -3311789 -3968931 -1312076 1047191 775592 -919235 -611261 3766472 10461229
37460 10461229 15281818 15813530 13644184 11702597 10572403 9267446 8659079 10914788
37452 10914788 14986817 16017109 11413021 5259184 3883697 8083090 12419207 11986752
37444 11986752 7472403 3086219 1552461 2385082 3935782 5423554 6719695 7344586
37436 7344586 6829258 5803175 5446868 5715024 5678342 6092244 9238523 14635187 17682666
37427 17682666 15704265 12895472 14707390 18982741 18638801 12862647 8587083 9178993
37419 9178993 9176296 4304532 -277973 1916197 7638970 8545099 3637509 -685115 -1160541
37410 -1160541 -446391 -18209 1994356 5225878 6383749 5392555 5747306 7487113 6624211
37401 6624211 3347152 3437507 8427551 11601238 8300425 3666595 4489508 8835092 10143558
37392 10143558 7399923 4703104 3999099 4681581 7674900 13262541 16884802 13869464
37384 13869464 7161430 3895699 5212910 6091567 4708955 4687385 7319419 8702764
37376 8702764 6692018 4606213 5475890 7777420 9363643 10904687 12977977 14124011
37368 14124011 14056754 14536791 15175307 13254255 9852588 10500401 16473231 21084421 19022594
37359 19022594 14214321 13181098 15176977 15005380 11972916 9434794 8025527 6061069
37351 6061069 4975454 7644271 12166651 13816200 12847898 13914807 17544221 18831476
37343 18831476 15700647 11977863 10275081 8049340 3777851 1454906 4743278 10715178
37335 10715178 13796901 13299361 13140829 15816159 19893622 22467718 21797296 18338585
37327 18338585 14476989 12246545 11181976 10432990 12261380 19210455 27537136 29218715
37319 29218715 22912131 17265882 19339214 24881985 25455339 20776113 17209792 16948456
37311 16948456 16414664 14602534 15460728 20806085 26968240 30181145 30311409 27939322
37303 27939322 22999873 18098365 17692394 21107988 21404866 14965908 7817798 7702748
37295 7702748 13234077 16426898 14146204 11241365 12291041 15488498 16565212 15151688
37287 15151688 14477290 16284490 18501978 18218330 15744306 14485385 16300401 18207673
37279 18207673 15780245 9510454 4790000 4684632 6202095 5949204 5864324 9290052 14034715
37270 14034715 14753705 11245578 8620989 8806026 7826911 3575651 577974 3146661
37262 3146661 8219064 10031113 9010215 10366730 15073268 18070438 16161331 12655069
37254 12655069 11958506 13256143 12706890 9949248 9016296 12599612 17658734 18357015 13182812
37245 13182812 7459671 7012829 10192095 9647293 3009248 -2613520 -439054 5559572
37237 5559572 6210603 1205456 -209178 6479132 14046620 14547480 10522486 9521895
37229 9521895 12543206 14810439 14896219 15685367 17407435 16672755 12817852 9266780 7682292
37220 7682292 6117937 4126464 4405478 7487504 9640503 8500290 6610855 6755800
37212 6755800 7599403 6894109 5691349 6227699 8277281 10457076 12709857 14801725 14783823
37203 14783823 11716114 7761864 5171181 3649779 2989778 4955061 9305833 11467899
37195 11467899 8643572 5412943 8036901 15163018 19806170 19366118 17643482 17069941
37187 17069941 15265652 10770915 6643251 5819984 7111170 8308120 9704562 11961160
37179 11961160 13501436 12726502 10630524 9056013 8308454 8201519 9320977 11547595
37171 11547595 13403975 14362756 15509965 16540287 15064645 11021211 8686432 11186377
37163 11186377 15443565 16193063 13333689 11399251 12521083 13804407 12023375 7828779
37155 7828779 4442294 4212994 6980818 10239851 10791044 7793146 4092549 2922881
37147 2922881 3600207 2521863 -1609540 -5865832 -6954765 -4918730 -1987887 466199
37139 466199 2338919 3331462 2960560 2009441 2542077 5631313 9511854 10944501 8737698
37130 8737698 5135914 2947491 2107729 631143 -1485753 -1704535 1059044 4243131
37122 4243131 5058529 4341608 4991967 7699703 10248437 10457163 8115693 4481212 1333260
37113 1333260 127656 921332 2556796 4424180 6748312 8553507 7626843 4029466
37105 4029466 1285699 1982060 4509808 6496625 8617277 11833221 13982215 13446585
37097 13446585 13254090 16115498 18151026 14479755 9044929 10226250 16888642 18556464
37089 18556464 11636369 5498282 7791139 13075966 12922144 9184874 8541798 10217449
37081 10217449 9193093 7350315 10651111 17114700 18094155 11641756 5174335 3783008
37073 3783008 4613581 4513461 4770059 5673526 4362792 1433114 2269952 7862861 11278288
37064 11278288 7971585 3247381 4011333 8512746 10172489 7277192 3024202 -567494
37056 -567494 -3205416 -3761159 -2335210 -2075806 -4176926 -4427350 -5162 4060103 1839523
37047 1839523 -3194749 -2659316 3583873 7196463 4562543 2005519 5527161 12208787
37039 12208787 15371951 13272952 8957467 5045208 2239849 932216 1421805 3260894
37031 3260894 5454702 6621716 5469478 2840661 2222853 5541229 9590469 10094034
37023 10094034 8170897 8381295 11037895 11767008 9141935 7196330 8646152 10601113
37015 10601113 9462593 6000922 3181808 2639089 5476099 12605816 21484367 26100750
37007 26100750 23687950 19074897 19386871 26165879 34972079 41063263 43630636 45932057
36999 45932057 52266399 63040962 72716633 75384298 72014751 67994493 63685914 53644980
36991 53644980 37073143 22480716 17803306 20799582 23536209 22055560 17257695 10522881
36983 10522881 3566503 -731811 -2101931 -4241336 -8141395 -8400637 -1689894 5582922
36975 5582922 5230539 -483042 -2682503 151354 926098 -3551189 -7635786 -6409091
36967 -6409091 -2811384 -2092604 -4641312 -7427578 -8483935 -7494020 -5241619 -4119363
36959 -4119363 -6112573 -9386952 -10120480 -8013529 -6162267 -5388199 -3359329 49814
36951 49814 1558451 -37177 -1945460 -2464048 -3271635 -4990420 -5350284 -3800421 -2982920
36942 -2982920 -3232795 -816428 5262247 9905474 9269377 6517974 5603521 4204931 -932627
36933 -932627 -5456277 -2018161 7709215 13155842 8218808 -1383694 -6233703 -4021245
36925 -4021245 489310 2693086 1842419 -653731 -3209890 -4370611 -3339101 -891379
36917 -891379 1149389 1707494 1192471 448042 -110846 77700 1932831 5011390 6507169
36908 6507169 4314611 1033417 1944602 7884508 13173760 12720344 8227680 4388291
36900 4388291 1894837 -1371867 -4373643 -3784320 -498494 181757 -4111366 -9745078
36892 -9745078 -12490451 -11795395 -8400491 -2102438 5783344 11118359 10648886 5147518
36884 5147518 -2122616 -7823595 -9334998 -6470261 -2813061 -1921993 -2267459 -135174
36876 -135174 2907918 1435624 -4300062 -7262850 -4395624 -1405478 -3062313 -5644753
36868 -5644753 -4331935 -1941811 -3617853 -7448753 -7595378 -3763902 -735307 -466276
36860 -466276 -994705 -1869561 -4764858 -9205905 -12442174 -13077419 -11340130 -7419427 -2967027
36851 -2967027 -1629891 -4148785 -6006444 -4181604 -2297986 -3926718 -5575765 -3313409
36843 -3313409 -1556569 -6055943 -11740947 -8660477 1273159 5321274 -1098427 -7872082
36835 -7872082 -5815446 1649166 7062634 9660990 11543509 11124467 7271900 3974135
36827 3974135 4494031 5805338 4427954 2791809 4087460 5678884 3838671 757940
36819 757940 531532 2031036 2201386 2730526 6362779 9672938 7244724 1094221 -1903150
36810 -1903150 -965666 -1785218 -5809973 -7263529 -2934271 2058635 1693651 -2894193 -6268697
36801 -6268697 -5784029 -2590005 1476111 4834817 5882505 4392277 2232825 1172530
36793 1172530 964092 596215 344370 1642840 5405007 10494757 13461348 11044541 4415538
36784 4415538 -581948 234040 4161864 5551915 3479459 1708159 2075461 2610089 2159928
36775 2159928 1951167 1852708 166373 -1585903 836370 6812143 9477258 5554442 1083017
36766 1083017 2247303 5385158 2914082 -4249743 -8238366 -6737571 -5338177 -6655646
36758 -6655646 -5813189 -174971 4063314 729935 -6297132 -8602065 -5367074 -2913231
36750 -2913231 -3742365 -3484931 553199 4638544 5051483 3852935 4423773 5241366 2693364
36741 2693364 -2179282 -4404711 -1910216 2171243 4079782 3224510 1125763 -715733
36733 -715733 -1345669 -927384 -1114717 -2892296 -4302159 -3014224 -993998 -2904750 -8943593
36724 -8943593 -13266647 -11719765 -7491580 -5968341 -7140543 -7138077 -4902677 -2613784 -909216
36715 -909216 1242729 2466632 170999 -3773082 -4121769 -440414 1573626 -452799
36707 -452799 -882154 4473278 9623274 6187036 -3218349 -7511494 -2644052 3315630
36699 3315630 2362367 -3217871 -6379565 -5436001 -3781067 -3233265 -2838166 -2407170 -2747022
36690 -2747022 -3271149 -2886288 -2312423 -2450711 -1830973 886588 3377325 2724815 765333
36681 765333 1457820 3574149 1885136 -3663770 -6349423 -2791866 1343786 25658
36673 25658 -3868896 -3723227 30804 1284156 -1110943 -1490002 2811395 6379125 3635523
36664 3635523 -2776438 -5568116 -2214498 2985732 5077548 3456714 926895 220745
36656 220745 1836529 3804977 3298830 -462905 -4739385 -5606320 -2076879 2698776 4636696
36647 4636696 2769919 -167491 -1006859 486817 1920523 1695250 1087898 2277891 5109070
36638 5109070 6974775 5684352 1523142 -3168412 -5454932 -3533980 1274922 4612713
36630 4612713 3308270 -351059 -1034181 2364414 4885213 2647544 -1281373 -1493871
36622 -1493871 1440841 1902726 -1784512 -4144495 -268908 6812708 9421203 3956997
36614 3956997 -6177940 -14784889 -17367914 -12901949 -4576337 1462702 1392555 -1668843
36606 -1668843 -1030822 5002073 10921723 11519570 8322498 6201204 6373013 6243666 4578913
36597 4578913 2900453 1985585 626239 -1312429 -1576668 1183795 4733700 5498007 2570016
36588 2570016 -1587724 -3893670 -3479409 -2063600 -1653505 -1991118 -1277126 308763 4531
36579 4531 -2973414 -4737673 -1767277 3294950 5112543 3634906 3298024 4537108 2612818
36570 2612818 -3267507 -6269781 -1562134 5564140 6629182 1550005 -2407875 -1180404
36562 -1180404 2176878 3274128 1128984 -2806974 -6299977 -6969758 -4594309 -2363212
36554 -2363212 -2726387 -3225345 -461057 3064886 1466398 -5046095 -8952171 -5631158
36546 -5631158 61137 550271 -4494184 -8514472 -6715962 -1215112 2352637 1467868
36538 1467868 -935423 -819171 1131862 278966 -4606816 -8049771 -4960370 1720578
36530 1720578 4870185 2847732 184144 -229862 381001 1954166 6564153 12314257
36522 12314257 12660221 5279205 -3423178 -6503342 -5010359 -4260465 -5146178 -3953140
36514 -3953140 992037 6687314 9038197 6711561 2071086 -631754 480601 2006216
36506 2006216 -790755 -6870652 -10082674 -7632013 -3125443 46297 2456085 3491018
36498 3491018 -457698 -8180768 -11026654 -4582200 3194419 3420014 212270 3100236
36490 3100236 9600155 7808880 -4056122 -13354071 -11354740 -4793927 -3730839 -7117485
36482 -7117485 -7649248 -4192093 -1384877 -983203 -1034740 -1331458 -3152243 -4861959 -3464132
36473 -3464132 79581 2008293 1848100 2681195 5205279 5920850 2315997 -3395652 -6865174
36464 -6865174 -5762302 -1017296 3868157 4755498 655742 -4237976 -4817729 -1451112
36456 -1451112 739677 -837775 -3266575 -3471147 -2594797 -2646868 -2420739 -468688 643766
36447 643766 -2070037 -5585953 -3673874 3417751 7719004 4198937 -2452568 -5490993
36439 -5490993 -6116835 -9978238 -16116881 -16570241 -7869329 3110524 7570383 4817118
36431 4817118 657076 -954984 -697632 -61777 1135104 3121402 4623959 3889993 572497
36422 572497 -3388087 -4807656 -2403244 952058 1113915 -1661164 -2668069 303181
36414 303181 3293179 2197988 -520234 749908 6436561 11493248 12780779 11850062
36406 11850062 9746396 4093274 -5854933 -14733821 -15686999 -8650145 -890772 1248695
36398 1248695 -952999 -1463239 2157150 5675729 4301501 -233248 -1433950 3609069
36390 3609069 10720989 14123086 12417080 7814805 2465106 -2273317 -5402382 -7461038
36382 -7461038 -9931475 -11587445 -8628417 -1170803 4260262 3135293 437535 3928044
36374 3928044 12088720 15582969 10260437 1935935 -2621228 -2974125 -1361400 2070157
36366 2070157 6799181 9213428 6539299 1201870 -1639556 533163 5944165 10197174
36358 10197174 9082244 2666603 -2880826 -1152035 6021662 10027538 6527924 471791
36350 471791 -1666791 375091 3439985 6497559 9377705 9916263 6844243 2834196
36342 2834196 923120 496506 91874 934473 3783661 5462936 3045825 -1154942 -3247638
36333 -3247638 -3663183 -4499301 -3786603 1563784 8901461 12358460 11405989 10415553 9857297
36324 9857297 5093596 -4374851 -11184416 -9362752 -2741063 -22858 -4062133 -9511322
36316 -9511322 -9825785 -4168277 2112116 2838668 -2449771 -7343361 -5413917 2210735
36308 2210735 8338896 8289112 3980779 -378944 -2919624 -3522580 -2338230 -792587 -1193983
36299 -1193983 -3318745 -3776892 -743810 2854439 2954955 -713761 -5390449 -9202823
36291 -9202823 -11826031 -12306596 -8971299 -1883532 5987881 10542833 9488273 4287788
36283 4287788 -475266 -780817 2988896 6582791 6684241 4284693 2834217 4086873
36275 4086873 6533226 7349273 5433015 2884834 3337403 8045747 13856546 16015322
36267 16015322 12759340 6320856 280069 -2589180 -984768 3779653 7525859 6860213
36259 6860213 3552651 2832039 6591035 10639656 9912202 4559680 -499718 -995921 2637900
36250 2637900 5933257 4905561 495552 -2281278 -788023 1217239 -1455400 -7796559
36242 -7796559 -11581854 -9646621 -5345214 -3361356 -4721213 -7713228 -10291959 -10614076
36234 -10614076 -8268185 -5525371 -4350914 -2702226 1847027 5672620 2922669 -3599221
36226 -3599221 -3490452 6097167 14367948 11413137 1855155 -3036028 -1128478 864047
36218 864047 -711553 -3698662 -6883638 -10770524 -12704833 -9493115 -4549458 -4515149 -8738604
36209 -8738604 -10115615 -6751904 -4106812 -4138748 -1727511 4594199 7356497 1332801
36201 1332801 -7157626 -8863017 -4314802 -1172811 -2698332 -5587382 -6777260 -6043030
36193 -6043030 -3212957 1407032 4330624 1652188 -5244244 -10540285 -10655757 -7061343
36185 -7061343 -2904168 13161 1110287 766556 263696 64636 -1159248 -3970337 -6133869
36176 -6133869 -5608033 -3987457 -3981794 -4869658 -3882657 -1096463 723719 653377 417517
36167 417517 903075 1341196 1887790 3476786 4928927 3777149 414825 -2116938 -3020672
36158 -3020672 -4568327 -7043450 -7070532 -3080989 1359560 2580031 1999174 2838511 4214893
36149 4214893 2870931 -364350 -557565 4045077 8390143 6401821 -1527955 -8913483
36141 -8913483 -10189701 -5533233 1075716 6513148 9908945 10513691 6746296 -1298847
36133 -1298847 -9743804 -13551308 -11567557 -7530672 -5630103 -6385469 -7549133 -7534921 -6386952
36124 -6386952 -4218400 -841574 2585090 3232626 -589310 -6670084 -10203508 -8249610
36116 -8249610 -2376452 3218039 5459122 4065765 662681 -2633575 -4246998 -3956365
36108 -3956365 -2711422 -1117795 1237782 4090369 5298578 3283813 50985 -594165
36100 -594165 2195070 5699760 7802505 8831440 8701198 5730249 155948 -4173560
36092 -4173560 -4167229 -1375158 872262 2025106 3289453 4093612 2961892 742251 -302971
36083 -302971 -16292 -53994 -523517 315289 3035639 5935647 6908566 4971785 721859
36074 721859 -3342684 -4414100 -2921838 -2496593 -4525205 -5605094 -3215793 -465466
36066 -465466 -886235 -1737767 1749527 7728109 9908551 7189812 4244069 2969593 770022
36057 770022 -2162354 -1739712 1987055 3365151 542139 -1136426 1252867 2797624
36049 2797624 -90453 -2466645 585477 4589368 2988260 -968477 1177405 9223120
36041 9223120 14358236 12576385 9166118 8414150 6945674 1012703 -5538354 -5631823 1408602
36032 1408602 8726830 9773928 4756483 -829046 -2556263 -966166 738000 1224181
36024 1224181 1259674 384430 -2990510 -7506681 -8892903 -6032850 -3289809 -4203275 -6423311
36015 -6423311 -5948306 -2910354 264335 2872786 4214498 1620066 -4967620 -9753940
36007 -9753940 -7831527 -2451921 -149925 -1335382 -1630523 65050 1447800 2513620
35999 2513620 4289530 3766787 -2076059 -8458925 -7519186 -526358 3461918 1623551
35991 1623551 638236 4185190 6874874 4227425 -155158 -1961795 -2784908 -4430634
35983 -4430634 -4151277 -1046262 -62664 -3516768 -5497828 -1643537 2064768 -1459117
35975 -1459117 -7790377 -6970790 1424046 8630185 10129851 9505400 9434481 7742010 3589379
35966 3589379 60110 -1315236 -2462496 -3574140 -1938310 1946038 2634875 -2786111
35958 -2786111 -9664318 -11470721 -7724349 -3452720 -2651631 -4616887 -5864088 -4262789
35950 -4262789 -1414556 -799503 -3160077 -5172795 -4129881 -1940355 -1922299 -3550919 -3871985
35941 -3871985 -2631260 -1904397 -1612322 -4814 1686164 82544 -4049400 -5153878
35933 -5153878 -454065 5676936 7206189 3425287 -1647421 -4478869 -4591304 -3558289
35925 -3558289 -3023861 -2824346 -886831 3409044 6241321 2712020 -6284741 -13582542
35917 -13582542 -13362342 -6961156 -224219 2505578 856320 -2563465 -4322339 -3209127
35909 -3209127 -1817442 -3216976 -6166128 -6507406 -3309709 100284 1708629 2976823
35901 2976823 4145939 2485789 -1890021 -3308561 1928119 8939966 10339195 6406830
35893 6406830 3709622 5053333 6846250 6600532 7037645 10445701 13479680 11114540
35885 11114540 3536869 -3967011 -7061357 -6029823 -3810192 -2308283 -1188388 538974
35877 538974 2506819 3004857 1117907 -1816982 -3727685 -4355872 -5032747 -5945069 -5268383
35868 -5268383 -1959955 1762732 2344948 -835613 -4542662 -5511837 -4029551 -2672902
35860 -2672902 -2411595 -1754742 262330 2239837 2473877 1284607 7436 -1021879 -1910051
35851 -1910051 -1766999 263638 3203584 5213392 5665672 4575715 1206218 -4243549
35843 -4243549 -8582821 -8505766 -5211127 -2858225 -2541507 -1536265 1188362 3088418 2970726
35834 2970726 3396811 5910157 7918850 7282574 6317135 7588785 8790025 5970703 -213962
35825 -213962 -5388280 -6924610 -5092354 -831772 3745049 4806938 1372954 -1396871
35817 -1396871 1270610 5354910 2394540 -7943956 -16349596 -16315314 -11723263 -9341018
35809 -9341018 -9674616 -9433187 -8406441 -8674756 -9619177 -8574128 -5262494 -1875541 293179
35800 293179 1237975 519207 -1597633 -2280329 1072059 6366556 8335608 4944114 -188744
35791 -188744 -2257091 -140817 3622294 5907651 5341338 2773259 54976 -1987882
35783 -1987882 -3964842 -5817672 -5632266 -2238590 1874024 2550315 -958756 -4784418
35775 -4784418 -4920733 -1695754 852265 -596902 -5158375 -8386997 -6593341 -775628
35767 -775628 4326009 5323886 3184194 658552 -1381865 -3388912 -4494964 -3002991
35759 -3002991 833150 4609199 6322245 5566497 2631833 -1635577 -5195953 -6063582
35751 -6063582 -4645369 -3493777 -4486062 -7199011 -9811373 -10561904 -8814021 -5721828
35743 -5721828 -3010695 -200443 5060024 12091324 15203640 10238263 1402384 -2889630
35735 -2889630 -297134 4039781 6095974 7262172 8798085 7905786 2662180 -3565052
35727 -3565052 -6466358 -6323527 -5694954 -4628573 -1975552 1160938 3265245 5413474
35719 5413474 8384817 9111701 4921313 -348018 -160097 5080538 7898343 4250258
35711 4250258 -1159055 -2267858 217394 1407342 -366645 -2691691 -3850046 -4454877
35703 -4454877 -4557948 -2679964 1064094 3335654 1230557 -3395415 -5539181 -3208693
35695 -3208693 100690 104467 -3095515 -6407500 -8341755 -9055929 -7242645 -1526007 4967378
35686 4967378 6506766 2819159 365166 2987741 6203720 4635868 458695 -858740
35678 -858740 447843 -2582 -2475947 -3055257 -926363 486498 -486311 -2259496 -4250329
35669 -4250329 -6840913 -7300773 -2334052 4656334 5856315 391602 -3548598 -759697
35661 -759697 3671313 3327432 508266 1515475 6242520 8712410 5834978 512919
35653 512919 -2725035 -1362221 4334778 10690640 12233224 7277132 874292 -418184
35645 -418184 4377185 10605406 13147407 9928177 2756974 -3284576 -3823722 -350209
35637 -350209 1671754 1250075 3663130 11132065 17459982 16909787 13201282 12992789 14490810
35628 14490810 10691721 1923314 -3396779 -803425 4831596 7361708 6635612 5861092
35620 5861092 6718730 8830882 10111262 6992292 -1334852 -8760425 -7766418 50665
35612 50665 4847925 1672575 -3371304 -3044728 891553 2079070 -560362 -2982927 -3249987
35603 -3249987 -2906145 -2307687 126148 3637218 4492739 1222683 -2470528 -2194264 1353607
35594 1353607 3496465 2191220 942881 3559801 7904129 8146773 3008176 -2219250
35586 -2219250 -3195387 -1880114 -1611492 -1182174 1540466 3761731 1907538 -601971 2734788
35577 2734788 10117169 11942460 4611124 -3439884 -3137222 3649757 8328710 6877575
35569 6877575 2230589 -1418297 -2127948 63056 3151253 3991378 1564809 -1790358
35561 -1790358 -3820930 -4949675 -6217540 -7356321 -8198951 -8945769 -7992341 -3463823 1869896
35552 1869896 2350874 -1750466 -3154047 1205873 4450550 751782 -4273522 -1986701
35544 -1986701 5183583 7379202 2451042 -2384759 -3444025 -5013204 -9009139 -9640327
35536 -9640327 -2891691 5696899 8102211 4019508 -810718 -2952961 -3348931 -3375641 -3033643
35527 -3033643 -2163071 -794794 984472 2221071 1691606 211883 91015 1334078 1199132
35518 1199132 -1207544 -3058765 -2186033 4009 1977729 4744950 8399003 9856339
35510 9856339 7737738 5931764 7736692 9668815 6770551 1621666 1054825 4623485
35502 4623485 4117482 -3634209 -10649859 -8503627 271943 6654993 7380809 6915340 8793558
35493 8793558 10841360 9907480 7091149 6054382 8088327 10658846 10417793 6968244
35485 6968244 3459251 2949743 4414579 4122610 1413270 271551 3223107 6640249
35477 6640249 5691907 1785563 432391 2768925 4490165 3400129 2445300 3675254
35469 3675254 4560803 3131823 2011072 3580895 5059546 2697514 -2129091 -5317239
35461 -5317239 -5930783 -5396030 -3487883 -148362 980506 -3239179 -8920628 -9014053 -3473359
35452 -3473359 590088 -478659 -2291532 -153846 4327878 7095593 7467504 7102131
35444 7102131 6626026 5853908 4639852 2112613 -1780026 -3435588 1044980 8533880
35436 8533880 10471120 4085345 -3484192 -5031444 -1319692 4083827 11012218 18217084
35428 18217084 19381323 11497750 2593897 2650317 9956242 14912079 14722611 14816710 16883003
35419 16883003 15818304 9816882 4003668 1325372 -1703273 -6763712 -9312205 -6956452
35411 -6956452 -5054001 -8344955 -12968005 -13003170 -10104957 -9821605 -11719581 -10222648 -3779242
35402 -3779242 2959260 5727056 4614110 1894318 119800 1823586 6938687 10773391
35394 10773391 8501519 1631886 -3653100 -4525355 -4014360 -5081384 -6084218 -3654690
35386 -3654690 2523719 9158908 11971997 8678818 1357260 -4214478 -3910518 63864
35378 63864 2150271 553448 -1787296 -2900631 -4067220 -5565674 -4878726 -1535758 405504
35369 405504 -1868156 -4975695 -4199705 -816358 -28415 -3078221 -6230602 -7126451 -7244584
35360 -7244584 -7418952 -5629442 -1111723 3150200 4367581 3348088 1723153 -1076079
35352 -1076079 -5115065 -7106852 -4237309 975117 3913023 4898578 8259702 14320920
35344 14320920 17424214 13750391 6834174 2431123 1199041 -63995 -2392111 -3963304
35336 -3963304 -4121517 -3837592 -2448298 1691475 6437176 6163201 -531583 -6816260 -5211998
35327 -5211998 2561121 7521478 4740540 -1718845 -6013363 -7849999 -9541667 -9757486
35319 -9757486 -5578444 735396 2924040 -550842 -4137334 -3387922 -562278 933301
35311 933301 2752962 7387009 11561619 10175410 4878410 2171521 3603233 4450153
35303 4450153 2370376 342533 -469458 -3447912 -9012287 -11379792 -7502674 -3082294
$$ [...]
##END NTUPLES=NMR SPECTRUM
##END=
