##TITLE=31Pdec_SR143_oil
 DMSO-d6, 24 sc
 27.9.2022
##JCAMPDX= 6.0         $$ Bruker NMR JCAMP-DX V2.0
##DATA TYPE= NMR SPECTRUM
##DATA CLASS= NTUPLES
##ORIGIN= UXNMR, Bruker Analytische Messtechnik GmbH
##OWNER= root
$$ XWIN-NMR		Version 3.5
$$ Tue Sep 27 16:37:20 2022 Russian Standard Time (UT+4h)  she@DPX200
##.OBSERVE FREQUENCY= 81.013821
##.OBSERVE NUCLEUS= ^31P
##.ACQUISITION MODE= SIMULTANEOUS
##.ACQUISITION SCHEME= undefined
##.AVERAGES= 24
##.DIGITISER RES= 16
##SPECTROMETER/DATA SYSTEM= spect
##.PULSE SEQUENCE= zgpg30
##.SOLVENT NAME= DMSO
##.SHIFT REFERENCE= (INTERNAL, DMSO, 0, 248.564)
##AUDIT TRAIL= $$ (NUMBER, WHEN, WHO, WHERE, WHAT)
$$ ##TITLE= Audit trail, XWIN-NMR		Version 3.5
$$ ##JCAMPDX= 5.01
$$ ##ORIGIN= Bruker BioSpin GmbH
$$ ##OWNER= she
$$ F:/spectra/data/she/nmr/P31/1/pdata/1/auditp.txt
$$ ##AUDIT TRAIL=  $$ (NUMBER, WHEN, WHO, WHERE, WHAT)
(   1,<2022-09-27 16:36:13.56 +0400>,<she>,<DPX200>,
      <created by zg, POWCHK disabled, PULCHK disabled
       configuration hash MD5:
       00 E9 B6 7A A2 85 ED C7 34 08 36 98 17 FE 4E 26
       data hash MD5: 32K
       11 44 7C 55 94 AF 8E AB 46 6D 7F 49 09 85 0A AC>)
(   2,<2022-09-27 16:36:16.15 +0400>,<she>,<DPX200>,
      <Start of raw data processing
       efp BC_mod = 2 LB = 1 FT_mod = 6 PKNL = 1 PHC0 = -10242.98 PHC1 = 13.25659 SI = 64K 
       data hash MD5: 64K
       73 C9 C3 A7 7F 23 09 15 79 85 21 3A 12 E9 F1 35>)
(   3,<2022-09-27 16:36:33.71 +0400>,<she>,<DPX200>,
      <pk PHC0 = -38.22404 PHC1 = 66.99999 
       data hash MD5: 64K
       5F A4 5D A7 89 20 AC E8 72 26 67 77 EE E4 D5 50>)
(   4,<2022-09-27 16:36:37.45 +0400>,<she>,<DPX200>,
      <abs ABSG = 5 
       data hash MD5: 64K
       F8 21 10 F2 E4 3E A1 33 96 FD 08 20 62 D0 AA 10>)
$$ ##END=
$$ 
$$ hash MD5
$$ 0F 12 2B 86 00 8E A3 4D E5 23 9B 33 90 BA 03 D7
##$RELAX= 
##$RELAX= 
##$RELAX= 
##$RELAX= 
##$RELAX= 
##$RELAX= 
##$RELAX= 
##$RELAX= 
##$RELAX= 
$$ Bruker specific parameters
$$ --------------------------
##$DU= <F:/spectra>
##$EXPNO= 1
##$NAME= <P31>
##$PROCNO= 1
##$TYPE= <nmr>
##$USER= <she>
##$AMP= (0..31)
100 100 100 100 100 100 100 100 100 100 100 100 100 100 100 100 100 100 
100 100 100 100 100 100 100 100 100 100 100 100 100 100 
##$AQSEQ= 0
##$AQ_mod= 1
##$AUNM= <au_zg>
##$AUTOPOS= <>
##$BF1= 81.014009
##$BF2= 200.13
##$BF3= 200.13
##$BF4= 200.13
##$BF5= 200.13
##$BF6= 200.13
##$BF7= 200.13
##$BF8= 200.13
##$BYTORDA= 1
##$CFDGTYP= 0
##$CFRGTYP= 5
##$CHEMSTR= <none>
##$CNST= (0..31)
1 1 145 1 1 1 1 1 1 1 1 1 1 1 1 1 1 1 1 1 1 1 1 1 1 1 1 1 1 1 1 1 
##$CPDPRG= <waltz16>
##$CPDPRG1= <>
##$CPDPRG2= <waltz16>
##$CPDPRG3= <>
##$CPDPRG4= <mlev>
##$CPDPRG5= <mlev>
##$CPDPRG6= <mlev>
##$CPDPRG7= <mlev>
##$CPDPRG8= <mlev>
##$CPDPRGB= <>
##$CPDPRGT= <>
##$D= (0..31)
0 1 0 0 0 0 0 0 0 0 0 0.03 2e-05 3e-06 0 0 0 0 0 0 0 0 0 0 0 0 0 0 0 0 
0 0 
##$DATE= 1664282173
##$DBL= (0..7)
120 120 120 11 120 120 24 19 
##$DBP= (0..7)
150 150 150 150 150 150 150 150 
##$DBP07= 0
##$DBPNAM0= <>
##$DBPNAM1= <>
$$ [...]
##$SUBNAM3= <"">
##$SUBNAM4= <"">
##$SUBNAM5= <"">
##$SUBNAM6= <"">
##$SUBNAM7= <"">
##$SUBNAM8= <"">
##$SUBNAM9= <"">
##$SW= 501.771253377433
##$SWIBOX= (0..15)
0 1 3 0 0 0 0 0 0 0 0 0 0 0 0 0 
##$SW_h= 40650.406504065
##$TD= 32768
##$TD0= 1
##$TE= 0
##$TE2= 300
##$TE3= 300
##$TEG= 300
##$TL= (0..7)
0 120 53 12 22 120 120 120 
##$TP= (0..7)
150 150 150 150 150 150 150 150 
##$TP07= 0
##$TPNAME0= <>
##$TPNAME1= <>
##$TPNAME2= <>
##$TPNAME3= <>
##$TPNAME4= <>
##$TPNAME5= <>
##$TPNAME6= <>
##$TPNAME7= <>
##$TPOAL= (0..7)
0.5 0.5 0.5 0.5 0.5 0.5 0.5 0.5 
##$TPOFFS= (0..7)
0 0 0 0 0 0 0 0 
##$TUNHIN= 0
##$TUNHOUT= 0
##$TUNXOUT= 0
##$USERA1= <user>
##$USERA2= <user>
##$USERA3= <user>
##$USERA4= <user>
##$USERA5= <user>
##$V9= 5
##$VALIST= <valist>
##$VCLIST= <CCCCCCCCCCCCCCC>
##$VD= 0
##$VDLIST= <DDDDDDDDDDDDDDD>
##$VPLIST= <PPPPPPPPPPPPPPP>
##$VTLIST= <TTTTTTTTTTTTTTT>
##$WBST= 1024
##$WBSW= 4
##$XGAIN= (0..3)
0 0 0 0 
##$XL= 0
##$YL= 0
##$YMAX_a= 1379
##$YMIN_a= -1363
##$ZGOPTNS= <>
##$ZL1= 120
##$ZL2= 120
##$ZL3= 120
##$ZL4= 120
##$ABSF1= 248.5645
##$ABSF2= -253.2056
##$ABSG= 5
##$ABSL= 3
##$ALPHA= 0
##$AQORDER= 0
##$ASSFAC= 0
##$ASSFACI= 0
##$ASSFACX= 0
##$ASSWID= 0
##$AUNMP= <proc_1d>
##$AZFE= 0.1
##$AZFW= 0.5
##$BCFW= 0
##$BC_mod= 2
##$BYTORDP= 0
##$COROFFS= 0
##$CY= -3
##$DATMOD= 1
##$DC= 0
##$DFILT= <>
##$DTYPP= 0
##$F1P= 0
##$F2P= 0
##$FCOR= 1
##$FTSIZE= 65536
##$FT_mod= 6
##$GAMMA= 0
##$GB= 0
##$INTBC= 1
##$INTSCL= 6.834604e-11
##$ISEN= 30
##$LB= 1
##$LEV0= 0
##$LPBIN= 0
##$MAXI= 10000
##$MC2= 0
##$MEAN= 0
##$ME_mod= 0
##$MI= 50
##$NCOEF= 0
##$NC_proc= -10
##$NLEV= 6
##$NOISF1= 182.463
##$NOISF2= 159.3651
##$NSP= 0
##$NTH_PI= 0
##$NZP= 0
##$OFFSET= 248.5645
##$PC= 4
##$PHC0= -10281.2
##$PHC1= 80.25658
##$PH_mod= 1
##$PKNL= yes
##$PPARMOD= 0
##$PSCAL= 0
##$PSIGN= 0
##$REVERSE= no
##$SF= 81.0140089999694
##$SI= 65536
##$SIGF1= 159.3651
##$SIGF2= -187.1042
##$SINO= 113.3802
##$SIOLD= 16384
##$SREGLST= <1H.CDCl3>
##$SSB= 0
##$STSI= 65536
##$STSR= 0
##$SW_p= 40650.406504065
##$SYMM= 0
##$S_DEV= 0
##$TDeff= 32768
##$TDoff= 0
##$TI= <>
##$TILT= no
##$TM1= 0
##$TM2= 0
##$TOPLEV= 0
##$USERP1= <user>
##$USERP2= <user>
##$USERP3= <user>
##$USERP4= <user>
##$USERP5= <user>
##$WDW= 1
##$XDIM= 65536
##$YMAX_p= 301392243
##$YMIN_p= -285900691
$$ End of Bruker specific parameters
$$ ---------------------------------
##NTUPLES= NMR SPECTRUM
##VAR_NAME=  FREQUENCY,     SPECTRUM/REAL,   SPECTRUM/IMAG
##SYMBOL=    X,             R,               I
##VAR_TYPE=  INDEPENDENT,   DEPENDENT,       DEPENDENT
##VAR_FORM=  AFFN,          ASDF,            ASDF
##VAR_DIM=   65536,         65536,           65536
##UNITS=     HZ,            ARBITRARY UNITS, ARBITRARY UNITS
##FACTOR=    0.620285442955139, 1,           1
##FIRST=     20137.2065510682, 0,            0
##LAST=      -20513.1999529968, 0,           0
##MIN=       -20513.1999529968, -285900691,  0
##MAX=       20137.2065510682, 301392243,    0
$$ Real data points
##PAGE= N=1
##DATA TABLE= (X++(R..R)), XYDATA
$$ [...]
41242d232927L916733k597978o275279l088053K147705L844054N040767J0159775
41234H914797J3716137O649557q890972k0284070j8907599p648337M291380R349298
41226a2809809O500669J558384P15214L502897N630121O147150M995158k081926
41218A4157858j4833592j9229354l360182J9185134K1869241L188399r819034
41211A1158470k049492Q865390L435474r994496j2456324l361092N338903R824873
41203A0761706J2116453R057332k56191o593047m314246j544130l624324j080249
41195A4523304J0442978J4959115J146396j3143799o245381J0134938P685167
41188C9502718j2589889k2247393j1177790j25131l085464o794575J518977J0990646
$$ y = [-4232927, -316194, -2914172, -9189451, -12277504, -10129799, -6285745, -1244978, 8914797, 22630934, 29280491, 20389519, 105449, -18802150, -26450487, -22159107, -12809809, -6309140, -4750756, -4035542, -532645, 5097476, 11244626, 16239784, 14157858, -675734, -19905088, -23265270, -4080136, 17789105, 20977504, 11158470, 9108978, 17974368, 21409842, 11415346, -1040978, -4402070, 936833, 10761706, 22878159, 31935491, 31679300, 25086253, 20772007, 19227877, 15603553, 14523304, 24966282, 39925397, 41071793, 27927994, 21682613, 31817551, 39502718, 26912829, 4665436, -6512354, -6637485, -9722949, -16517524, -14998547, -4007901]
41180d007901P006034m316202q017473l999950k964929o535045o075137J643986
41172b7266617R211818R585314M868348J648599J042224k593808j1024967j3909274
41164b8438363p2257K1747079K6527417O076390j4600142r727776R108567R814457
41156B0435372j0063597j8114166K389296K4469623J6461091j1954751k5452390
41149a829522j2483841N537497R803701M454938j038543o906993j1029269j409419
41141a4901451K2887091L6502311J5035462k6435601m4171893j9813659J5585485
41134a5312255K2396747J443236j4648847q773179M057371O601255L678110P176938
41126F619376J2558246N599781j3302186k5841842j8769170j099898P509603K350108
$$ y = [-4007901, 2998133, -1318069, -9335542, -13335492, -16300421, -22835466, -28910603, -27266617, -18054799, -8469485, -3601137, -1952538, -910314, -3504122, -14529089, -28438363, -28510620, -6763541, 19763876, 25840266, 11240124, 1512348, 10620915, 20435372, 10371775, -7742391, -5353095, 19116528, 35577619, 23622868, -1829522, -14313363, -8775866, 1027835, 5482773, 4444230, -2462763, -13492032, -14901451, 7985640, 44487951, 59523413, 33087812, -11084081, -30897740, -15312255, 7084492, 8527728, -6121119, -14894298, -10836927, -4235672, -557562, 6619376, 19177622, 24777403, 11475217, -14366625, -33135795, -34235693, -26726090, -24375982]
41118b4375982l78293J2535654K8324336K2097148n929786k4270068j1216946
41111c213937J3709272J6815126k902363j6401859p922895Q962512J7460177J5074221
41103D1580254L138460j6309370k9013188j9287697J780126N846622p608584o933493
41095b6806870J8236778L3764787J3556272j6851732j9390936L38320J0208426
41088A3055045L560442k819490n967641j3121950j3298498P020131K8114369J8878177
41080C5420585r932651j7938469l36679N823646j2860442k3109267m195023J5673658
41072a1454642Q274726q588294o178524N805353J479010j2601852r502316J0512525
41064b2254014K0692879J1113806j64015M81098M944247K721747k736798l587670
$$ y = [-24375982, -24754275, -12218621, 16105715, 38202863, 32273077, 8003009, -3213937, 10495335, 27310461, 24408098, 8006239, 83344, 9045856, 26506033, 41580254, 44718714, 28409344, -603844, -19891541, -18111415, -12264793, -19873377, -26806870, -8570092, 25194695, 38750967, 21899235, 2508299, 2846619, 13055045, 16615487, 13795997, 7828356, -5293594, -18592092, -11571961, 16542408, 35420585, 25487934, 7549465, 7212786, 13036432, 175990, -22933277, -27128300, -11454642, -3179916, -11768210, -17946734, -12141381, -10662371, -23264223, -32766539, -22254014, -1561135, 9552671, 9388656, 9869754, 14814001, 17535748, 14798950, 11211280]
41056A1211280p31367j593330r964067j9071537j4955043O094404K4188211J5609903
41048A0788454j0542883j7400179P080243K7553668J1929879j8777347k1599607
41041a0967772L627573J7270756J804408j6797177j4054700M2791M990482K21534
41033a3862105l596868m158031l162363L231874J5449867K2323653J4287469j989121
41025B8524375j1424488q123620P98274M754757N0785n649851p79669J2740312
41017B0890875J6049997j416494k1295453j9130598j662164L248843p940943r371523
41009b0627460P980350J7823875K099087j7131074j2734879N373273J0961879
41002f254949M387379L537360O717614j170956j3756189r657882Q132943J3226609
$$ y = [11211280, 10479913, 8886583, -1077484, -20149021, -35104064, -29009660, -4821449, 10788454, 245571, -17154608, -10074365, 17479303, 29409182, 10631835, -10967772, -7340199, 9930557, 11734965, -5062212, -19116912, -19074121, -14083639, -13862105, -17458973, -21617004, -24779367, -21547493, -6097626, 16226027, 30513496, 28524375, 17099887, 8976267, 9774541, 14529298, 14580083, 8930232, 8150563, 20890875, 36940872, 35524378, 14228925, -4901673, -6563837, -3314994, -11255937, -20627460, -12647110, 5176765, 7275852, -9855222, -22590101, -17216828, -6254949, -1867570, 1669790, 8387404, 7216448, -6539741, -16197623, -8064680, 5161929]
40994E161929j026130j1783470o699557k003607r179595j3404028k101376J0462186
40986c0573648P455947k022320m88250P778885O721078k454519m427924L985738
40978a4025013R990890M652309p917444j8421000j8382334l601064J7696687K6863440
40970c143529J5957162n47552n799271k595439k799057n865867m211398n41314
40962i546265j744105l091395K958711R156274M145680n620852n447153J758681
40954g430424J575803m683213l319376M045423K651222n740055l403051J0163812
40946f139859J4377717L202125m233763J781889N087700m791223j2133381l489010
40938f337805P744136N047467l542422j797640Q015878J3965742J4360686J1597497
$$ y = [5161929, 4135799, -7647671, -14347228, -16350835, -25530430, -38934458, -41035834, -30573648, -23117701, -25140021, -25628271, -17849386, -11128308, -13582827, -18010751, -14025013, -4034123, 618186, -7299258, -25720258, -44102592, -47703656, -30006969, -3143529, 12813633, 12266081, 6466810, 3871371, 1072314, -4793553, -9004951, -9546265, -11290370, -14381765, -11423054, -2266780, 1878900, -3741952, -9189105, -7430424, -5854621, -10537834, -13857210, -9811787, -7160565, -12900620, -16303671, -6139859, 8237858, 11439983, 7206220, 8988109, 14075809, 9284586, -2848795, -6337805, 1406331, 6453798, 2911376, 1113736, 9129614, 23095356, 37456042, 49053539]
40930D9053539K106216j1323340j4626947n970221m120154j5832670j8655673
40923a9369250J066486J8291948P232020j3555382r932479J1818117J7804801
40916A3356261L564911l869476M201501Q105503K93503l717869N69191j305418
40908B1198107r955036o999957Q632066J3616130j57061j2069657j0151346q243898
40900d130652j2519830o107394J4531383K2235213K081562j8770333j1600735
40893a4280786R567743J3697640P87950p185064o183314q431968j2020357l554084
40885b7602240J3937663K2500950J6199578N039139m299584j1988152j3846525
40878e9171n705841M829080P654228N754259O007919L282367p980476j5862639
$$ y = [49053539, 51159755, 39836415, 25209468, 19239247, 15119093, -713577, -19369250, -18302764, -10816, 7221204, -6334178, -16266657, -4448540, 13356261, 16921172, 13051696, 17253197, 25358700, 25652203, 21934334, 22503525, 21198107, 11243071, 4243114, 12875180, 26491310, 26334249, 14264592, 4113246, -4130652, -16650482, -22757876, -8226493, 14008720, 16090282, -2680051, -14280786, -4713043, 8984597, 9772547, 2587483, -3595831, -12027799, -24048156, -27602240, -13664577, 8836373, 25035951, 30075090, 25775506, 13787354, -59171, -5765012, -935932, 6718296, 12472555, 18480474, 21762841, 13782365, -2080274]
40870b080274o493776J0006590J2561041K632891p2170P820576R397110j236764
40862C2535224r715709q086236o616358j1454732j2073343r20199J2064273J4652843
40854A0385763Q038115m40557p098813q356219j219885O884631L157320r946015
40846A404340j4685670n124041L233480J23180j860209R374474K1306207J5274144
40838B9045905k835769j1742273p878170p242243j5470760j7815490m323852J2770032
40830b5492620J6551596Q224147J568580K211959L522390m682n167844o341057
40822d927531k401867M070810R487037R713220K557991p851986j3076088r706668
40814a2135082l664076k151238m351979l880974J993457R603933J3370323R590608
$$ y = [-2080274, -8574050, 1432540, 13993581, 16626472, 16554302, 24374878, 33771988, 32535224, 22819515, 14733279, 8116921, -3337811, -15411154, -16331353, -4267080, 10385763, 18423878, 17983321, 10884508, 2528289, 1308404, 8193035, 11350355, 1404340, -13281330, -18405371, -15171891, -15048711, -16908920, -7534446, 13771761, 29045905, 26210136, 14467863, 6589693, -652550, -16123310, -33938800, -38262652, -25492620, -8941024, -716877, 851703, 3063662, 6586052, 6581370, 1413526, -4927531, -7329398, -3258588, 6228449, 15941669, 18499660, 10647674, -2428414, -12135082, -15799158, -17950396, -22302375, -26183349, -24189892, -14585959, -1215636, 8374972]
40806H374972j240251j1927251j2588066k612461O219539N361917J914297N498940
40798i98364R799727K278845j1971741j4612879k230504Q956658Q849746M003332
40790D074820j155618j0679697j7750551n218871K1362290K8425975K433147k2387433
40782h95938j1544792J6764881K0349238j639563j2182375J503591J1514235p50413
40774B3118864j6816389j6128978o819624m292736m175613M188030J5158194J5731897
40766I963645N464994n728402j0307369n433346O514873J3886761N265552j1856384
40758G770324j7076409o891992m59005q271381j5359141p448458N708232Q928778
40750c3099052O825865J2025034K0612088J8501308N033578o333234o938943n71565
$$ y = [8374972, 7134721, -4792530, -17380596, -19993057, -13773518, -8411601, -6497304, -998364, 8801363, 11080208, -891533, -15504412, -17734916, -8778258, 71488, 4074820, 2919202, -7760495, -25511046, -30729917, -9367627, 19058348, 21491495, -895938, -12440730, 4324151, 24673389, 23033826, 10851451, 12355042, 23869277, 23118864, 6302475, -9826503, -16646127, -20938863, -25114476, -20926446, -5768252, 9963645, 15428639, 9700237, -607132, -6040478, 474395, 14361156, 19626708, 7770324, -9306085, -16198077, -16657082, -24928463, -40287604, -47736062, -42027830, -33099052, -26273187, -14248153, 6363935, 24865243, 29898821, 23565587, 16626644, 16055079]
40742A6055079L982551K23067j0595290j6829272q492064N814763Q588510K110559
40734H57903N736489J8703429J4390767j3440323k9978410j0632078J5580798
40727A218575Q942153j7500004k0314575K662716J1806308n451360j5175971K942414
40719c0869744K1388030J2161289q202602q638704P379161J1992917l341191j9987427
40711a8118271j9821035k315969J9206656K5916384Q052734j8037978k0998523
40704b6116002N220995K8274618K0230536m024796j2294504k858202R59612o352495
40696C039762p151311L333422P292029k801085r548992p71614R284663M680210
40688G357084n101308j555996J2285063J7219992O500890q617665j7795759j9879957
$$ y = [16055079, 20037630, 20260697, 9665407, -7163865, -15655929, -9841166, -1252656, 857903, 6594392, 25297821, 39688588, 26248265, -3730145, -14362223, 1218575, 10160728, -7339276, -27653851, -24991135, -13184827, -18636187, -33812158, -30869744, -9481714, 2679575, -5523027, -14161731, -6782570, 5210347, 1869156, -18118271, -37939306, -40255275, -21048619, 4867765, 12920499, -5117479, -26116002, -20895007, 7379611, 27610147, 23585351, 11290847, 8432645, 9392257, 3039762, -4111549, -778127, 6513902, 3712817, -5836175, -6607789, 2676874, 7357084, 2255776, 699780, 12984843, 30204835, 36705725, 28088060, 10292301, -9587656]
40680i587656j4668592k579027P012611K602224j0735688j3195395L420655K2940123
40672a4790745K5790473J2802307q88583p600136j1471299j5181544j4123746
40665b5463273n281372N711365R676829L690274m955727m672323P491670J8886615
40657E084058J3929052m436352j5821815j0408958l535972j0568009j9066329
40650d4824325n777642K3842395L6582853J5871768j5345666k5291348j0837765
40643b5779730O657925J0338473Q91054j0302564j0667344L854765K1060779K2628825
40635A8682183P902322l880445k100775k84123j1109451k1823353j3405563P047241
40627a8971964J5058972M443515o902521n163387M734666J2903555J5389720R997548
$$ y = [-9587656, -24256248, -26835275, -19822664, -17220440, -27956128, -41151523, -37730868, -14790745, 10999728, 23802035, 22913452, 15313316, 3842017, -11339527, -25463273, -30744645, -25033280, -15356451, -11666177, -16621904, -21294227, -13802557, 5084058, 19013110, 14576758, -1245057, -11654015, -15189987, -25757996, -44824325, -50601967, -26759572, 9823281, 25695049, 10349383, -14941965, -25779730, -19121805, -8783332, -7892278, -18194842, -28862186, -25007421, -3946642, 18682183, 26584505, 22704060, 20603285, 20319162, 9209711, -12613642, -26019205, -18971964, -3912992, 530523, -6371998, -11535385, -6800719, 6102836, 21492556, 31490104]
40619C1490104k881150j3878039j3474782o997718o118817p997894j392564Q553951
40611a2696909M840195j0104324j3276290J592269J1710383K756822o625283L465318
40603a8337819J9888176J7684251l43673j1098259p841812l238126j610594N350065
40595D52209J5613007J4613209O01974r416728o264426k011540p272718j2254011
40587e939024m033293R881900J1500855n14710r620312o427250m46562k278274
40579g876670n837966J118945J4111678J3750573n477533k0717255p971340K1798910
40571B899342L1438119N855009k5907679k8448737o077569P276040k588984j3476032
40563b9030491l274072J7080516K0344466J174897j8417671j9019568n232674
$$ y = [31490104, 28608954, 14730915, 1256133, -5741585, -11860402, -19858296, -21250860, -12696909, -7856714, -17961038, -31237328, -29645059, -17934676, -15177854, -21803137, -18337819, 1550357, 19234608, 18890935, 7792676, -49136, -3287262, -4897856, 452209, 16065216, 30678425, 31280399, 21863671, 15599245, 13587705, 6314987, -5939024, -9972317, -90417, 11410438, 10895728, 1275416, -5151834, -5598396, -7876670, -13714636, -12595691, 1515987, 15266560, 9789027, -10928228, -18899568, 2899342, 34337461, 40192470, 14284791, -14163946, -20241515, -12965475, -15554459, -29030491, -32304563, -15224047, 5120419, 6295316, -12122355, -31141923, -36374597]
40556c6374597N878501P128157M585659M227069M628197L150133J412631R11535
40548d452715r72225n303119o627941o88412O414571N787325Q31425L676993J4795564
40539A3461466J8061191K654869j9275072k5913541j1860899P212950J3590142
40532b068894M735228p597938j1165930n653479j140550k874330k540072P461946
40524b0844019J6533383Q156246j1264538j6058851O21321J4303933O748853o236791
40516h040463l433097O028515J959788p807408k96445J9165890K2060400M556348
40508C4193528n872182K233661O676212n159943j0732618P076072K3947673R925232
40500F2287635j9507295k3477068L028667K2800281J1254481j3176017k1118288
$$ y = [-36374597, -30496096, -23367939, -18782280, -14555211, -9927014, -6776881, -5364250, -4452715, -5424940, -10728059, -17356000, -18044412, -11629841, -5842516, -5011091, -1334098, 13461466, 31522657, 34177526, 14902454, -11011087, -22871986, -15659036, -2068894, 2666334, -4931604, -16097534, -21751013, -22891563, -25765893, -28305965, -20844019, -4310636, 3845610, -7418928, -23477779, -22856458, -8552525, -1803672, -8040463, -11473560, -5445045, -3485257, -11292665, -11589110, 7576780, 29637180, 34193528, 28321346, 30555007, 37231219, 32071276, 21338658, 28414730, 52362403, 62287635, 42780340, 19303272, 22331939, 45132220, 56386701, 43210684, 22092396]
40493B2092396j0224883J639031M660496L983194N944130Q995123P451271n54697
40485D3986061r132908r452068o05008P430695O000554j065822m620126l951009
40477B8590369m786301p105328n505367o93396l7063n531845j0462053r927382
40469a5458366o505111l350123O21103N906599R456534R535744Q179395O414437
40461A4800212K143300m512092q048253l339524O727923J1561200K773055j3949106
40453H156715j9754565l525387J8565016J7792102p786631k5340193j1094039
40446b2986982J4786545J8076788J371112m320092P680012J0972879n108874j4452471
40438F018917J174939J7950604O649162j9441078k4366123m031949J1181666M247371
$$ y = [22092396, 11867513, 13506544, 18167040, 22150234, 28094364, 37089487, 44540758, 43986061, 34853153, 25401085, 24796077, 32226772, 38227326, 37161504, 32541378, 28590369, 23804068, 16698740, 11193373, 10499977, 10462914, 4931069, -5530984, -15458366, -21963477, -25313600, -24692497, -18785898, -9329364, 206380, 8385775, 14800212, 16943512, 12431420, 4383167, 1043643, 7771566, 19332766, 22105821, 8156715, -11597850, -15123237, 3441779, 21233881, 13447250, -11892943, -22986982, -8200437, 9876351, 11247463, 6927371, 14607383, 25580262, 20471388, 6018917, 7193856, 25144460, 31793622, 12352544, -12013579, -16045528, -4863862, -616491]
40430f16491p817069m934169Q394935J5110651R100024j750469o358463l7377
40422A1091572R674827P759500q975430k1684663j1688824J1204462J9622248
40415A7003692O332217q508086r631310m848998m404970l628788J609154J092063
40407d985026j1224864j9501971o826175J5308869J9508994J428580j4009208
40400b0300801p883290Q803258J4024825M588403m253645k957063O93324l924382
40392a1209371j2416261r944746O847035K0941821J4664323o210164j8144789
40385a5472152r761042M846819P323686j46849l39982J3424629K6793614K0642181
40377D7310904o539114l4169521l8057042j5283157J1064072J6773754M026648
$$ y = [-616491, -8433560, -13367729, -4972794, 10137857, 19237881, 17487412, 11128949, 11091572, 20766399, 28525899, 19550469, -2134194, -13823018, -2618556, 17003692, 23335909, 14827823, 5196513, 347515, -4057455, -7686243, -6077089, -4985026, -16209890, -35711861, -42538036, -27229167, -7720173, -6291593, -20300801, -28184091, -19380833, -5356008, -767605, -5021250, -7978313, -7284989, -11209371, -23625632, -33570378, -26723343, -5781522, 8882801, 2672637, -15472152, -25233194, -20386375, -13062689, -13209538, -13549520, -124891, 26668723, 47310904, 40771790, 6602269, -31454773, -46737930, -35673858, -18900104, -14873456]
40370a4873456m103759M390907J6110819J3562608j394736j3504447j4409926
40363a4221990p735912j80831L708366K016544k453473l916447j161782J940359
40355b2005166N221991J2013673J7365117R834851q258348j6806516m611395J3335591
40347F089798J7516851R357193Q65569o693468j5278421j4401542L992912K3733182
40339B5182074K1775266K395655r511389n715598j002638m090325p322992o305829
40331A5404224n451878k096462J0295989K0828959J0034964j4922808k2316391
40324A1776597k325626J6476861J0047472q206894j3733509o074625R93383L984260
40316A2937919M818181j113662j3180039j7259265o360610N776199P101366N808194
$$ y = [-14873456, -18977215, -14586308, 1524511, 15087119, 13692383, 187936, -14221990, -21957902, -22138733, -18430367, -16413823, -18867296, -22783743, -23945525, -22005166, -16783175, -4769502, 12595615, 22430466, 14172118, -2634398, -7245793, 6089798, 23606649, 32963842, 33829411, 27135943, 11857522, -2544020, 1448892, 25182074, 46957340, 49352995, 39841606, 34126008, 33123370, 29033045, 21710053, 15404224, 9952346, 7855884, 18151873, 38980832, 49015796, 34092988, 11776597, 9450971, 25927832, 35975304, 27768410, 14034901, 7960276, 8953659, 12937919, 17756100, 16642438, 3462399, -13796866, -20157476, -14381277, -7279911, -1471717]
40308a471717J0477346J1620440J982257n402740j162801j30664j2599457j7525433
40300a4212769L523346K5649947J2891860k2048325l3049941j0105066J0095993
40293b7254955N351651l396188M361393J5053094R400952n229511j0825436n520695
40285a8059695K435020R662785J2957706O430025m821421m904011P988073J4155787
40277B5844269J630758j4183673j3427250P50106J1314525J0839639K727206r142631
40269A6352949j8863201j6686790j224131J4229984J7147648R882362J467046
40262B2305867m614224p285436l795849K850518L236672l311569m185783O605954
40254A1806150J5451588P752422r346698j5638645m865382P753957M857935j1856088
$$ y = [-1471717, 9005629, 20626069, 22608326, 17205586, 16042785, 15912121, 3312664, -14212769, -10689423, 14960524, 27852384, 5804059, -27245882, -37350948, -27254955, -21903304, -25299492, -20938099, -5885005, 3515947, -1713564, -12539000, -18059695, -15624675, -5961890, 6995816, 13425841, 8604420, 3700409, 11688482, 25844269, 27475027, 13291354, -135896, 614210, 11928735, 22768374, 25495580, 16352949, -2510252, -19197042, -20421173, -6191189, 10956459, 20838821, 22305867, 17691643, 10406207, 6610358, 9460876, 12697548, 9385979, 5200196, 11806150, 27257738, 35010160, 25663462, 10024817, 5159435, 12913392, 17771327, 5915239]
40246E915239k1828265r074522J4752027K0723892K243611j1564700J606106J8947395
40238B1720783N792518k5399727k8903827L326624K8510436J9836330K348604
40231B7231741L460268R422838r41666j4524046r237601O219826J0688522N781037
40223C8100919K158215o276755k2556320k4475847K151081K9166420K2866017
40216D1133730l787874j5121210j0276596j2919070j9553553p579189J4366109
40209a3737653J5220669k392722n091352J1604323J7030411L092697l305940N321191
40201B7741624K183422j9302376k7017313o666179J1385685O176172N41604J2727622
40193G770261J8691332k027028k3070961j3970962P617915Q139719n703471n590811
$$ y = [5915239, -15913026, -24987548, -10235521, 10488371, 12731982, 1167282, 2773388, 21720783, 27513301, 2113574, -26790253, -23463629, 5046807, 24883137, 27231741, 30692009, 40114847, 39173181, 24649135, 15411534, 21631360, 32319882, 38100919, 40259134, 33982379, 11426059, -13049788, -10898707, 18267713, 41133730, 37345856, 22224646, 11948050, -971020, -20524573, -28103762, -13737653, 1483016, -909706, -6001058, 5603265, 22633676, 25726373, 22420433, 27741624, 29925046, 10622670, -16394643, -23060822, -11675137, -5498965, -4957361, 7770261, 26461593, 24434565, 1363604, -12607358, -4989443, 3150276, -2553195, -8144006]
40185h144006P141284J1519617Q749560J1837795J0370873j1113593l2979297
40178b617767k2881149J0364076K8128337K1029305J3754539J4594839N390259
40171F7762439j5137271k1893170p077112M964042j122300r452687m999748K589725
40163A5633918J460255k812809l467620m666923o049853J617500J5301309J7707584
40155C4723361N831010k674744l37462n43244p776299o774466N461607Q015744
40147C5925507o093458j2153780L542734J4711308j853591k2668331j3360331
40140a949942J3718251J8611792k527996j5039306l377917Q681754M69179j5957922
40132B627893j8138511j191357K3736871M0039218L2428833K549247k2646324
$$ y = [-8144006, -1002722, 10516895, 19266455, 31104250, 41475123, 30361530, -2617767, -25498916, -15134840, 12993497, 34022802, 47777341, 62372180, 67762439, 52625168, 30731998, 23654886, 28618928, 27496628, 18043941, 13044193, 15633918, 17094173, 14281364, 10813744, 6146821, 96968, 1714468, 17015777, 34723361, 40554371, 37879627, 37542165, 36998921, 29222622, 22448156, 27909763, 35925507, 29832049, 17678269, 21221003, 35932311, 34078720, 11410389, -1949942, 11768309, 30380101, 27852105, 12812799, 9434882, 18116636, 18585815, 2627893, -15510618, -16701975, 7034896, 47074114, 79502947, 82052194, 59405870]
40125E9405870j9274426p65517J222534j3343326j4518471M683992J5365762L700999
40117C6477417m722208P428176J4659350o610701k9908439j6432127J9105318
40110A9996786K6456952l318759k5063843r235113J7414946J7858761j775097
40103D2334633r793692J334929J0297504L189213r290307j1381121k722038N502296
40095B9471417O329912L593444M405196Q072034O036298n265420j6716180j7864443
40087A8062258j0839080l715235M329153J7090554K4688096J2780594r805253
40080E2591087j5127667L422606J6511148j03702k8713860l4377019j2819982
40073a8617389R753561J6296271J3433752R281275J993356n872744l682364Q449989
$$ y = [59405870, 40131444, 39365927, 40588461, 27245135, 12726664, 17410656, 32776418, 36477417, 31755209, 39183385, 53842735, 47232034, 17323595, 891468, 19996786, 46453738, 43134979, 18071136, 8836023, 26250969, 44109730, 42334633, 32540941, 33875870, 44173374, 47362587, 38072280, 26691159, 23969121, 29471417, 35801329, 39394773, 43799969, 51872003, 57908301, 52642881, 35926701, 18062258, 7223178, 3507943, 7837096, 24927650, 49615746, 62396340, 52591087, 37463420, 40886026, 57397174, 57293472, 28579612, -5797407, -18617389, -8863828, 7432443, 20866195, 30147470, 32140826, 26268082, 22585718, 31035707]
40065C1035707J4384502M676015r263252j2925980q580480o912048q089802l110386
40057A214276R766459J9616871J4936650k377861j6670594j4649447k799854j201165
40049G835335j4369426j9960570n60135K4940491K5311014N779223J463848J9414888
40041D9854668K3455667p300505l9080340l0833818M860842K3575100J5254392
40034C9786006R226349J9048087K3318468Q259033o418537n34436J4000826J3654421
40026A20340217p22993q031816J953336J7592745K1880677R865521q104177j5911089
40018A38862421q550952n10415r344293l0597406m1170538l0222516j2243963
40011F222338l294519L83202Q992150J7555433J3419408p74194o751717O134553
$$ y = [31035707, 45420209, 50096224, 40832972, 27906992, 19326512, 12414464, 4324662, 1214276, 10980735, 30597606, 45534256, 43156395, 26485801, 11836354, 9036500, 7835335, -6534091, -26494661, -27054796, -2114305, 23196709, 28975932, 30439780, 49854668, 73310335, 66009830, 26929490, -3904328, 956514, 24531614, 39786006, 49012355, 68060442, 91378910, 99637943, 93219406, 92684970, 106685796, 120340217, 119617224, 111585408, 113538744, 131131489, 153012166, 162877687, 154773510, 138862421, 130311469, 129801054, 120456761, 89859355, 48688817, 18466301, 6222338, 2927819, 3311021, 12303171, 29858604, 43278012, 42503818, 35752101, 41886654]
40003D1886654K6522674L2509869J4828852j1998856k3600370j3574966j350574
39996F5223283m116357j0510299m25682J6358805R919952j9654071l5095712j7139867
39988D560052O456042P800868K089301J3812566K9509385K4378383J2937393K4516506
39980A26060496M2024118K0640659l3145727n8580631k9611706P136477O812249
39973H1335935j0839565o824678J1755920J5242325Q896618J8155280L4678710
39966A52400545K5404546j0799101l7843900l3911991j2845963O828394K1124669
39959A10357199K5921763J4373688m880257j3348002j1127400j4857961k5284694
39952H1154336k4912697j1793583n384099j1270705j0688173L865638J3100907
$$ y = [41886654, 68409328, 100919197, 115748049, 103749193, 80148823, 66573857, 65223283, 61106926, 50596627, 50170945, 66529750, 76449702, 56795631, 21699919, 4560052, 11016094, 18816962, 20906263, 34718829, 64228214, 88606597, 101543990, 126060496, 168084614, 188725273, 155579546, 96998915, 67387209, 74523686, 81335935, 70496370, 63671692, 75427612, 90669937, 99566555, 117721835, 152400545, 177805091, 167005990, 129162090, 95250099, 82404136, 89232530, 110357199, 136278962, 150652650, 145772393, 132424391, 121296991, 106439030, 81154336, 56241639, 44448056, 39063957, 27793252, 17105079, 20970717, 34071624]
39945C4071624N634114j598638L856416N539163j0013218k2830000r800688J4487166
39937A9345939J8453140J613304r452342n436345l474001j2537273j7102929j966199
39929a0556706K4360784L7886843K3155123j0267353l1269802j6710420J6584312
39922C3182781K5932677l15605k2761023p914384J9629375J4666254j7720438
39915D4699637l0697514p768076J7731104J8404707O426476L65923m235926j4056046
39907C0870285j8416769r505502J891571O755092J1080227J5273886O210772j3887132
39899C0272430j7823690O082138K8979920K1861615j310083q842055o56001p45323
39891E7818951j3328550j9387213j1323862j672238J113615P63411j450951p231992
$$ y = [34071624, 39705738, 38107100, 41963516, 47502679, 37489461, 14659461, 4858773, 19345939, 37799079, 39412383, 29960041, 24523696, 21049695, 8512422, -8590507, -10556706, 13804078, 51690921, 74846044, 64578691, 33308889, 16598469, 33182781, 59115458, 58799853, 36038830, 28124446, 47753821, 62420075, 44699637, 14002123, 6234047, 23965151, 42369858, 48796334, 49162257, 44926331, 30870285, 12453516, 2948014, 4839585, 11594677, 22674904, 37948790, 44159562, 30272430, 12448740, 18530878, 47510798, 69372413, 68062330, 59220275, 58564274, 57818951, 44490401, 25103188, 13779326, 12107088, 13220703, 13984114, 12533163, 5301171]
39883E301171r444412j215263O546604p02250j2909237o559176J6617371K8554023
39875B6188831J5868882l349697r883991o488697k294720K971486P974171L530559
39867C4516824r482325j3866776j737229R771563L942178q714744p235734O600807
39859A3794564J1820180O40219j1477608r690780J035723N998650Q34272n267591
39851G687629l109141N402475J1239229J0538951P897754O413347J674612q434683
39843C9310173j5047913r775283L08845K441810l84730N431464J7258733J4578291
39835E4121390q556824k8142235k0789340M039390J8265690J2569713K575562
39828C4083346K000537O423599N310229k685087j0789036j2529044n560063P151564
$$ y = [5301171, -4143241, -5358504, 1188100, 485850, -12423387, -18982563, -2365192, 26188831, 42057713, 38708016, 28824025, 22335328, 20040608, 23012094, 30986265, 34516824, 25034499, 11167723, 9430494, 19202057, 23144235, 14429491, 7193757, 13794564, 25614744, 26254963, 14777355, 5086575, 6122298, 12120948, 12955220, 7687629, 4578488, 9980963, 21220192, 31759143, 39656897, 46070244, 47744856, 39310173, 24262260, 14486977, 14795822, 17237632, 16852902, 22284366, 39543099, 54121390, 45564566, 17422331, -3367009, 672381, 18938071, 31507784, 34083346, 36083883, 42507482, 47817711, 45132624, 34343588, 21814544, 16254481, 23406045]
39820B3406045J6920899J4801399J362000j1283410j1055213N65571R977647P964811
39812E2659749N23895j931887j459458o573553r983759Q323224M5520186O3438223
39804A50516620L3848158j6744481l5842526j2482522J5865788K3515841K5447701
39797A84124579L4509756K9774901m529103l9210579l6722634r938233m893898
39790A53114789l1754647n1782293l6181488k866850J6616240J7894385J4846641
39783G9886777J1635176L899179m517189n086563j08987k98898q078005j3940664
39775F3390826j0638494l492075k810271q990993j0294551J733223J8342852K2617913
39767F9858430J1657559r09861o302833r873286j3168086n715271J1282199J2933746
$$ y = [23406045, 40326944, 55128343, 56490343, 45206933, 34151720, 34717291, 44694938, 52659749, 53183644, 51251757, 49792299, 43218746, 33234987, 41558211, 87078397, 150516620, 184364778, 167620297, 131777771, 119295249, 135161037, 158676878, 184124579, 218634335, 248409236, 243880133, 204669554, 167946920, 158008687, 153114789, 121360142, 69577849, 33396361, 30529511, 47145751, 65040136, 79886777, 91521953, 95421132, 90903943, 85817380, 85708393, 85409495, 77331490, 63390826, 52752332, 49260257, 46449986, 37458993, 27164442, 28897665, 47240517, 69858430, 81515989, 80606128, 74303295, 64430009, 51261923, 45546652, 56828851, 69762597]
39759F9762597j3984888l9653585k6879783J0939341K4774811K207182j6280753
39752A0884922l086482J6173667J0444169n485784p46616J7263972J7282081k178157
39744F0551772j2896017n223084N80463o611070j1504713k484467Q315250O743370
39736C7471504k495814q151501q617407n618982K792093J2636783J1456843l678801
39728C5794718j7377052j5565546l589784N021961P695754J0190684J3582522
39721C5753257J4648362J2701425P241598m072967j6869117j8322527m462752
39714B6617279R015909N710935q130277j2760446l021066P224313P292408K079069
39706C4028124L51953K535156L980896J860181m526198j3782867k0522622j8801124
$$ y = [69762597, 55777709, 16124124, -10755659, 183682, 24958493, 27165675, 10884922, 7798440, 23972107, 34416276, 28930492, 28183876, 45447848, 62729929, 60551772, 47655755, 42432671, 43013134, 36402064, 24897351, 22412884, 30728134, 37471504, 34975690, 26824189, 18206782, 12587800, 15379893, 28016676, 39473519, 35794718, 18417666, 2852120, -737664, 4284297, 11980051, 22170735, 35753257, 50401619, 63103044, 70344642, 66271675, 49402558, 31080031, 26617279, 35633188, 41344123, 33213846, 20453400, 17432334, 24656647, 31949055, 34028124, 34380077, 36915233, 40896129, 42756310, 38230112, 24447245, 3924623, -14876501]
39698a4876501q678467M561907J6186177K2353631J8900324P473420j558429k320768
39690D2041294m596239j7922684k8739725j3579450K2409978M2333572K3821499
39683F5768245j0415738k4103375j4047666m770371p065300p243647L331982J2531792
39675A3985922R049851R79083Q23125M874653J467993p684067r054836J235846
39667A5677570J0216294N856020o475402j1372016l331010O842405N732807o996189
39659A6150479j9149057k0142455j1199130j409064L093037M145903P459422J5275458
39651e775407K2616644K0929931P516132q826499j5327563r585859k063117k044301
39643G439961o336553o288422r35998L762899N517910P231740Q962083P054293
$$ y = [-14876501, -23554968, -18993061, -2806884, 19546747, 38447071, 45920491, 44362062, 42041294, 37445055, 19522371, -9217354, -22796804, -386826, 41946746, 65768245, 55352507, 31249132, 17201466, 12431095, 5365795, -1877852, 1454130, 13985922, 23035773, 24014856, 24837981, 29712634, 31180627, 23496560, 14441724, 15677570, 25893864, 31749884, 25274482, 13902466, 10571456, 17413861, 23146668, 16150479, -2998578, -23141033, -34340163, -35749227, -32656190, -28510287, -21050865, -5775407, 16841237, 37771168, 45287300, 36460801, 21133238, 11547379, 9484262, 7439961, 1103408, -5185014, -6121012, -2358113, 3159797, 10391537, 19353620, 26407913]
39635B6407913K501716J647732N122346M013633o786846j7460508j4223441P28541
39627A951086R736107K691263q476494n404049J0650095J8513614N196093j5330951
39619A9526764j9925555p095866K456592l902002j3616643q612046Q825097K0622989
39611a720670J7321506O485145r70521k530810j983979l702456r733108j6575499
39603a3410392j5783077m116149Q733581J0148157P77762p540592q514815o272741
39595c5978266l979017J250116R803200J5949155J6150150J2836843P721854J5248
39587B3769283o866954o610857p08024J931269j343042m014565l297197l516503
39579f56590l735167L146857J3857267J3919116J195372p580597m476560m487940
$$ y = [26407913, 28909629, 30557361, 35679707, 39693340, 32906494, 15445986, 1222545, 1951086, 11687193, 14378456, 5901962, 497913, 11148008, 29661622, 34857715, 19526764, -398791, -7494657, -5038065, -8940067, -22556710, -31168756, -22343659, -1720670, 15600836, 22085981, 21115460, 18584650, 16600671, 12898215, 3165107, -13410392, -29193469, -33309618, -24576037, -14427880, -13650118, -21190710, -29705525, -35978266, -39957283, -38707167, -28903967, -12954812, 3195338, 16032181, 23754035, 23769283, 16902329, 10291472, 9583448, 11514717, 10171675, 6157110, 2859913, -656590, -4391757, -1244900, 12612367, 26531483, 27726855, 20146258, 15669698, 11181758]
39571A1181758j6136709j9527996J604312K4193739J5255693j3201677j6769007
39564a3399887J3731743L6175031J9458122j3752614k5944295j6295442p498341
39557g525683m512628K720229J0155509N358697m736690k607301N842436k421292
39549B273277k4250755k6503121K257018K7400368J7466838p697419q433419J2060919
39541e426294J4630114r748270k1722785N162319L9903370L7642615M600053j4727065
39533E0314057m634375N043352p568994k2262805j3497472O348215P065608j1699486
39525I108100k1883039j0945296L302361M758558J143733M162291P539003K39311
39517b574978j1127286j0246381M041566J5815206J3847089L226777n415068p841107
$$ y = [11181758, -4954951, -24482947, -22878635, 1315104, 16570797, 3369120, -13399887, 331856, 36506887, 55965009, 42212395, 16268100, -27342, -7525683, -12038311, -9318082, 837427, 6196124, 1459434, -1147867, 4694569, 2273277, -21977478, -48480599, -46223581, -18823213, -1356375, -9053794, -17487213, -5426294, 9203820, -544450, -22267235, -17104916, 22798454, 60441069, 65041122, 50314057, 45679682, 50723034, 43154040, 20891235, 7393763, 13741978, 20807586, 9108100, -12774939, -23720235, -20417874, -15659316, -14515583, -10353292, -2814289, -2574978, -13702264, -23948645, -19907079, -4091873, 9755216, 12981993, 7566925, -274182]
39509b74182n139269J15664K773713k127656j0412251r334526N672367J9871787
39501A145647J4809759o241255j9663468j1652495L944232O142547l942927p832407
39493b3290367P63814Q166506N020527J128600O632869J2903671P069918m244556
39485A4150982m074887O311980Q150120l548069r583295L289701J8435431J1200097
39477D4332060j4447828k8906453j5807595P269807J2310182m856292k2062809
39470b2168928j8581531K678844K1635619K3766567J1981198j719277r900114
39463G692378j2332898r862975k243749P620558J2604025P968419k424326q959331
39455F2101n701748L713653J0150171Q904017M322102L309243O100337O754843
$$ y = [-274182, -5413451, -5297787, -2524074, -4651730, -15063981, -24398507, -18726140, 1145647, 15955406, 9714151, -9949317, -21601812, -17657580, -11515033, -15457960, -23290367, -22526553, -14360047, -9339520, -8210920, -1578051, 11325620, 18395538, 14150982, 10076095, 16388075, 24538195, 20990126, 11406831, 14696532, 33131963, 44332060, 29884232, 977779, -14829816, -7560009, 4750173, -106119, -22168928, -40750459, -38071615, -16435996, 7330571, 19311769, 17592492, 7692378, -4640520, -14503495, -16747244, -9126686, 3477339, 11445758, 9021432, 62101, -5639647, -1925994, 8224177, 17128194, 21450296, 24759539, 30859876, 37614719]
39447C7614719J727557o397757j3147533j5090214r588208J227305P002334k59515
39439C088688j1264753p981880R075541J7539993N418975j0015614r312568o98968
39431d150586k917909j1020488m692959J5296222K5410976J4183009m862594j6732355
39423A0513316j8996239j0877682P382045K0935270J2028557q856847j0949546
39416A178874R232829J8466652q06730j9993619q628282J8308015K5666818R731051
39408E3155608n756984r808493j0358355j1213729j0854259j4910230k3856357
39401c3602799j9520621Q069419L2676221K3567655n032222j3735158l63409P26240
39393g214674j8000583k2252777L541105K6145182J6686810m645424n870406O430607
$$ y = [37614719, 39342276, 32944519, 19796986, 4706772, -4881436, -3654131, 3348203, 3088688, -8176065, -16157945, -7082404, 10457589, 15876564, 5860950, -3451618, -4150586, -7068495, -18088983, -22781942, -7485720, 17925256, 32108265, 27245671, 10513316, -8482923, -19360605, -11978560, 8956710, 20985267, 12128420, 1178874, 10411703, 28878355, 28071625, 8078006, -550276, 17757739, 43424557, 53155608, 47398624, 37590131, 27231776, 16018047, 5163788, -9746442, -33602799, -53123420, -45054001, -12377780, 11189875, 6157653, -7577505, -7940914, -7214674, -25215257, -47468034, -43926929, -17781747, -1094937, -5740361, -11610767, -5180160]
39385e180160P182056r52639K225742J3117036R676533p922869j5337645l928130
39377a120076O069411r89786j2467130q727226O781977J2272642k606026k2184167
39369b2970381k2786499j540473J9379693K0257367P590408O73256K170397n14604
39361B259164p896017n356385Q764543J5649855O002210m551487k551015K080685
39353A4401553k846243r856919q650509n396432n801790J213823K0138702K8942734
39345C2144919J0326625j4129131j2817484O238807R592847o724170j4597864
39338A0034549l650110N086274k30248m497370J697924M641274m055891j0605488
39330a579086n569230j198461o289082p842163M134667J4848949P692575q129001
$$ y = [-5180160, 2001896, 1049257, 3274999, 16392035, 26068568, 18145699, 2808054, -1120076, 4949335, 3959549, -8507581, -17234807, -10452830, 1819812, -786214, -22970381, -45756880, -47297353, -27917660, -7660293, -69885, 603371, 2773768, 2259164, -5636853, -10993238, -2228695, 13421160, 19423370, 14871883, 12320868, 14401553, 11555310, 1698391, -6952118, -12348550, -18150340, -16936517, 3202185, 32144919, 42471544, 28342413, 15524929, 21763736, 31356583, 24632413, 10034549, 6384439, 11470713, 11240465, 6743095, 8441019, 13082293, 9026402, -1579086, -7148316, -8346777, -14635859, -22478022, -18343355, -3494406, 4198169, -3930832]
39322c930832j2760268m863842L083832P177435J1314299J2583692M974430o965267
39314A0613479j2069663p280407Q44932N290661K883982m640576r253068l953443
39306a7564103N640515P304883J531819P47223O782614P072311j436319m918245
39298E160698K008727M778633n056100j3132800o845051L281265L980984J753568
39290d070076N737688O913942l625848j2968089o847811M089953L792184P82050
39282f196007J0137089K0145967J0112432r075069q384779J0494667J6854086
39275D4088386J427528j1849883r115223n174963r367963p818657N452420J1272194
39267A8913839k013931j5602533j0796996O17990r31874r194051n763240O705879
$$ y = [-3930832, -16691100, -21554942, -18471110, -11293675, 20624, 12604316, 17578746, 10613479, -1456184, -8736591, -7891659, -2600998, 282984, -4357592, -13610660, -17564103, -11923588, -4618705, -3086886, -2339663, 4442951, 11515262, 10078943, 5160698, 7169425, 11948058, 6891958, -6240842, -13085893, -9804628, -5823644, -4070076, 1667612, 8581554, 4955706, -8012383, -14860194, -10770241, -6978057, -6196007, 3941082, 24087049, 34199481, 25124412, 16739633, 27234300, 44088386, 45515914, 33666031, 24550808, 19375845, 10007882, 2189225, 7641645, 18913839, 16899908, 1297375, -9499621, -8881631, -9813505, -19007556, -24770796, -18064917]
39259a8064917R976547R49341n816914k979356J477892J048777M58925O050183
39251f899522J5759582K0873758J4107098k393898j5804342j4963047m924007
39244E755622o05252n089868o729952o03530L117004p94163j288331Q476814J5210651
39235A7448995O020031q111922q338869J812209L297713n985456q009704M192874
39227B325871J2860616J850125j7973027k1918039k998763K0942274K9838515
39220B4927572K1759281Q442787j642460q027720r293202j173512J2152682J5972099
39212F3117527M000713r217340p655893J979517J949441o578899o870753J899310
39204D2623623K139973q713118r784170O365924J5379074p89006k0634919j4322676
$$ y = [-18064917, -8088370, -7139029, -12955943, -15935299, -14457407, -13408630, -12949705, -6899522, 8860060, 29733818, 43840916, 41447018, 25642676, 10679629, 5755622, 5150370, 60502, -6669450, -7272980, -4155976, -4950139, -6238470, 2238344, 17448995, 23469026, 15357104, 7018235, 8830444, 12128157, 6142701, -1867003, 2325871, 15186487, 17036612, -936415, -22854454, -25853217, -4910943, 24927572, 46686853, 55129640, 53487180, 45459460, 36166258, 34992746, 47145428, 63117527, 67118240, 57900900, 50245007, 52224524, 54173965, 47595066, 40724313, 42623623, 44763596, 36050478, 26266308, 32632232, 48011306, 47222300, 26587381, 12264705]
39196A2264705Q512066J2851981p854821k3503886j4054409M276362Q713190L333141
39188D538329P426130K2760204K8879707J0578615j9492483l1806255j4233861
39181H650386J0530037J0819926j2695096k6411013q984803K0073628K8838444
39174C0821509J4485924j080824n599651n537728o772942p146841p308595j1114219
39166G46633j4590133r525975J801037Q865475Q376934M421283k944569j3486448
39158a6335763j5637906O99349K1793589K2227325J511716j3147596n677820Q821320
39150D254214J1052189L829845n16883j108619k318548o98496O542316J0444270
39142C1480288K566897r195369j0791399k527124L141296O33895l155346n80768
$$ y = [12264705, 20776771, 33628752, 25773931, 2270045, -11784364, -7508002, 1205188, 4538329, 11964459, 34724663, 63604370, 74182985, 54690502, 22884247, 8650386, 19180423, 30000349, 17305253, -9105760, -18090563, 1983065, 30821509, 45307433, 44226609, 38626958, 33089230, 26316288, 19169447, 11860852, 746633, -13843500, -23369475, -21568438, -12702963, -4326029, 95254, -2849315, -16335763, -31973669, -31274320, -9480731, 12746594, 14258310, 1110714, -4567106, 4254214, 15306403, 19136248, 18619365, 17510746, 15192198, 14493702, 21036018, 31480288, 34047185, 24851816, 14060417, 11533293, 14674589, 15308484, 12153138, 11572370]
39134A1572370P935253J5525372J3894674J17256j6711836k0841540p842959Q196816
39126A1845406J1940297N289792O13809J267953l38452p648156j3999300j3172239
39118d200890p366766j691816L038259Q063122J1129397P850246j723721j0887984
39110D209847j2313505n564377L248624R174423J2438244J3195873P250717p095264
39102B4544582k0572757j9648310l513844J2096067J1855100k198997j4194098
39095a1632257j2542840j081254P424618O209273Q99838N93262N290885O764968
39087A926493J795066j905210L473982J4130588J8859680J2184373o36012r478125
39079D0350835q101980k77590K330385o070094j4655283r095167M524460M632006
$$ y = [11572370, 19507623, 35032995, 48927669, 49044925, 32333089, 11491549, 3648590, 11845406, 23785703, 29075495, 29689304, 30957257, 30618805, 22970649, 8971349, -4200890, -11567656, -13259472, -10221213, -2158091, 8971306, 16821552, 15097831, 4209847, -8103658, -13668035, -10419411, -1244988, 11193256, 24389129, 31639846, 24544582, 3971825, -15676485, -19190329, -7094262, 4760838, 2561841, -11632257, -24175097, -25256351, -17831733, -11622460, -10722622, -10129360, -4838475, 1926493, 3721559, 1816349, 5290331, 19420919, 38280599, 50464972, 49828960, 40350835, 32248855, 31971265, 34301650, 28231556, 13576273, 4481106, 9005566, 13637572]
39071A3637572j1824725j9426343j204899K2478595K1480595j558396j9328356
39064D254043k0506781j6086395j0585761L865852K2651649K5688088Q090078
39057A7370773q418672n501022P932249J2283049L237338q560123j2371244m552531
39049A419817R149878J4419479K438522j5038387j7820189n188861M469445K848048
39041c302248O14759L395497J330470q737148j2426422j825715Q790400N775144
39033f385263k138386o21815O293503N915765r73507m433136l302781l459069
39025i104689m451633j435714M103249O650650O132686O855970J0177475J3053437
39017C1981431J0295914j796394j7099138j8778590N4579J9224159J4547397m682987
$$ y = [13637572, 1812847, -17613496, -18818395, 3660200, 25140795, 23582399, 4254043, -16252738, -32339133, -42924894, -39059042, -16407393, 9280695, 17370773, 8952101, 3451079, 11383328, 23666377, 26903715, 18343592, 5972348, 1419817, 10569695, 24989174, 27427696, 12389309, -5430880, -10619741, -6150296, -3302248, -2687489, 708008, 2038478, -6698670, -19125092, -20950807, -12160407, -6385263, -8523649, -9145464, -2851961, 3063804, 2090297, -2342839, -5645620, -9104689, -13556322, -14992036, -10888787, -4238137, 1894549, 8750519, 18927994, 31981431, 42277345, 40480951, 23381813, 4603223, 4657802, 23881961, 38429358, 33746371]
39009C3746371o773811J2655535K2815012P432414j0757212j0350560l668339
39002D5099410p319468j0561892j61226R161437k44048j4685791j1565479J552534
38994A1275477K269393p473194r906453n710224o571442n243824J1953376L1345407
38986B1938516K6403370J160304j5229332j3754499j1046184j2239784m805493
38979g573102Q806364Q415647p627976j5897575n370047Q071872J1829671J2218302
38971A2873156J2085010J915850j6427807k3785571j2361576L521562J3506237
38964h673139K2715817K9318073J8927329o524515k1475547j3079578k81710j305112
38956A9621618o109589Q55898J1828643R789471m358833j6344542j8077217r709842
$$ y = [33746371, 26972560, 39628095, 62443107, 69875521, 59118309, 48767749, 45099410, 37779942, 27218050, 27056824, 36218261, 35974213, 21288422, 9722943, 11275477, 13544870, 6071676, -3834777, -9545001, -16116443, -21360267, -9406891, 21938516, 48341886, 49502190, 34272858, 20518359, 9472175, -2767609, -7573102, 1233262, 9648909, 2020933, -13876642, -19246689, -11174817, 654854, 12873156, 24958166, 26874016, 10446209, -13339362, -25700938, -22179376, -8673139, 14042678, 43360751, 62288080, 55763565, 34288018, 21208440, 20926730, 19621618, 13512029, 14367927, 26196570, 35986041, 31627208, 15282666, -2794551, -12504393]
38948a2504393N108020J6069255J2695072J984688K665239J4997051J7623092
38941E8638024L489143n872120M196567J6576438J1511096j515311k379999P621838
38933I2265676J4062875J4522449J5250618J6608538J9799389L2421823M8876196
38926B53807564M3249867M334812l8415922m8702127k9574730j0958184m680811
38919A69060469m39434M018315Q24238l336249Q936616L4531152M7682976L3705305
38911B94983388M862858k0353527l5465963m1410262m1167825m1362758m4194191
38904G5891720l8209449j3488587J5390290K1149408N29639j9903546j9030319
38897B2329156m450339N559543O523339M942111L783243J120811l831709r996562
$$ y = [-12504393, -7396373, 8672882, 21367954, 23352642, 26017881, 41014932, 58638024, 62127167, 56255047, 60451614, 77028052, 88539148, 87023837, 84643838, 92265676, 106328551, 120851000, 136101618, 152710156, 172509545, 204931368, 253807564, 297057431, 301392243, 262976321, 214274194, 184699464, 173741280, 169060469, 168621035, 172639350, 173463588, 170127339, 179063955, 213595107, 261278083, 294983388, 299846246, 279492719, 244026756, 202616494, 161448669, 120085911, 75891720, 37682271, 24193684, 39583974, 60733382, 61263021, 41359475, 22329156, 17878817, 23438360, 29961699, 34903810, 38687053, 39807864, 35976155, 25979593]
38889B5979593j4615227j1896802J068463J5238781J5672287M89035j4304259
38882A7631871j3710674j043555Q684203P802142K571609K266905O756103P599463
38874C8558067J38384j0024485j5069812j4390776j0383787j126447J2305233
38867F377J7312939M870723j0115856m714229J4779545J6787127p271980k6221951
38859E432695j5075350R011288J7207179J0579896N431265l58406j4577217k2020003
38851d368653m734527K0139452J9893018k405419j3391295l802271J697572p648434
38843E379443j0763918M266668J7223121J0424541l447407o470432l417439o047843
38835G146734j0311517o855161K492195J2212582K0356693J9154217Q0894k1993608
$$ y = [25979593, 11364366, -532436, 536027, 15774808, 31447095, 31936130, 17631871, 3921197, 2877642, 11561845, 19363987, 21935596, 24202501, 30958604, 38558067, 38696451, 28671966, 13602154, -788622, -11172409, -12298856, 6377, 17319316, 22190039, 12074183, 7359954, 22139499, 38926626, 31654646, 5432695, -9642655, -631367, 16575812, 27155708, 32586973, 32228567, 17651350, -4368653, -9103180, 11036272, 30929290, 28523871, 15132576, 11330305, 13027877, 5379443, -5384475, -1117807, 16105314, 26529855, 23082448, 16612016, 13194577, 7146734, -3164783, -10019944, -7527749, 4684833, 25041526, 44195743, 44276637, 22283029]
38827B2283029j6923684J3699104K7828586L146168k4867257j6036478J1238312
38820B0367780J1075478j4866590k2623765m37169J3095822n347295k6380701
38813b5116440j7697554N887352J1512032L71302l028027L235093k55583j3110805
38805c8202630j1445034R633273K2458425R929683n408432K321780J8463023J1009870
38797A8759958j4050851j7756814R259102K7099520O291477k5371357k4431445
38790b0200410K706837J2789153o142626j9810857m467973J8351281J8974352
38783B199757K853920m739531J684344O541250J604276m774099m041968J627158
38775B955107M839240J058754p762858j3456750r158622J451186Q525887R748062
$$ y = [22283029, 5359345, 19058449, 46887035, 50033203, 25165946, 9129468, 20367780, 31443258, 16576668, -6047097, -6484266, 6611556, 1264261, -25116440, -42813994, -36926642, -25414610, -25043308, -28071335, -24836242, -25091825, -38202630, -49647664, -40014391, -17555966, -7626283, -13034715, -10712935, 7750088, 18759958, 4709107, -13047707, -3788605, 23310915, 29602392, 4231035, -20200410, -17493573, -4704420, -10847046, -30657903, -35125876, -16774595, 2199757, 5053677, 314146, 1998490, 8539740, 10144016, 5369917, 1327949, 2955107, 7794347, 8853101, 1090243, -12366507, -21525129, -20073943, -11548056, -1799994]
38767a799994R975689Q174138k57407p163816K147910K0434724J9429032q158938
38759D2781338l0544072j9684545Q284583J8996430Q528549j974564o285943j4448976
38751E652800k1353223r704965J4393587K2602314P683557n571712k312620R92066
38743A2381804p848132j0924428O397721K2145407Q527603k0555202k6200739
38736a6075966j568646K0294267J6469925J700069k263379J547356n76922o334099
38728A3192605m089052M331842O436550P24420j347020M100870N640472n151948
38720B3838739j8798707k0192127r337870K73675J719652K203523Q145822J3012337
38712H65044P864917k722266o515303k817067k386949n994688J396625K4764952
$$ y = [-1799994, 8175695, 16349833, 16092426, 8928610, 11076520, 31511244, 50940276, 42781338, 12237266, -7447279, 837304, 19833734, 28362283, 26387719, 20101776, 5652800, -15700423, -25405388, -11011801, 11590513, 19274070, 13702358, 11389738, 12381804, 4533672, -6390756, 6965, 22152372, 30679975, 10124773, -16075966, -17644612, 2649655, 19119580, 20819649, 18556270, 20103626, 19526704, 13192605, 9103553, 13435395, 19871945, 20596365, 19249345, 23350215, 28990687, 23838739, 5040032, -15152095, -24489965, -24216290, -22496638, -20293115, -12147293, 865044, 8729961, 6007695, -507608, -3324675, -5711624, -11706312, -10309687, 14455265]
38704A4455265M0555851K2616127j8137410m0874931k5383181L575594J1808570
38697H615885j334993j0915957n071743M212595M452151k402885r254401j2305888
38689b4005236q258808K709275R577503J356237j2430521r674246J1102321K4892841
38681d730634J6222081M84164m030353m143246j1593497j4202284M196107K6928041
38673I130379K0941138j1556190l0225154j2181147J7437479K2698872K408730
38666A8654107j6632992j6000253o63672J2119243Q544066q761717j8601484l811062
38658b5153764K1454546K4890955J742561j5482470m716774J2873137Q080505
38651B3688696j0336589j3284933j40845L361963r373882j6213970n661645N317748
$$ y = [14455265, 55011116, 77627243, 59489833, 18614902, -6768279, -3192685, 8615885, 7280892, -3635065, -8706808, -4494213, -42062, -2444947, -11699348, -24005236, -32264044, -29554769, -19977266, -18621029, -31051550, -40725796, -29623475, -4730634, 11491447, 11975611, 7945258, 3802012, -7791485, -21993769, -17797662, 9130379, 30071517, 18515327, -11709827, -23890974, -6453495, 16245377, 18654107, 2021115, -13979138, -14642810, -2523567, 6020499, -2741218, -21342702, -25153764, -3699218, 21191737, 22934298, 7451828, 2735054, 15608191, 23688696, 13352107, 67174, -73671, 3288292, -6085590, -22299560, -27961205, -22643457]
38643b2643457L492492K228144J4950230K6824274J5633559j0878724k2533487
38636G073031r185460N902438O55390j4836529j4339182O617519K4559120K0032736
38628B6479063J649718r024464o044757n01398L75459N8921l18330n263175j1672093
38619d261056r000974J48188k981581k3402096l6027478j7741322J6353787L1112600
38611d5799932J9019464N519727Q074438J5138170J1631927K290148k209197m385213
38603I279532j0315282j3679588n679145O821171R133931J549657o59959R017833
38595E468150J7742819J1700775m410457j4507996j2973699r666644j2463848
38588a9110900j4302756m586880J2013676J8834162R390047m297826r314591p775210
$$ y = [-22643457, -19150965, -16922821, -1972591, 24851683, 40485242, 29606518, 7073031, -2112429, 3790009, 4445399, -10391130, -24730312, -18112793, 6446327, 26479063, 28128781, 19104317, 13059560, 12558162, 12933621, 12992542, 12674212, 7411037, -4261056, -13262030, -13113842, -16095423, -39497519, -75524997, -93266319, -76912532, -45799932, -26780468, -21260741, -13186303, 1951867, 13583794, 15873942, 13664745, 9279532, -1035750, -14715338, -20394483, -13573312, -4439381, -2889724, -3549683, 5468150, 23210969, 34911744, 30501287, 15993291, 3019592, -6647052, -19110900, -33413656, -38000536, -25986860, -7152698, 2237349, -2060477, -11375068, -19150278]
38580a9150278q239985j0166780p210911l12283L757349M086618N327245P227707
38572b4681318M753872j408136m088756o83226L053513J978273j836995k629099
38564b5541872L042025J2640286J6873376P648205q178533j1405126L804065J6298943
38556A5181369M797145j9358447k5822079q065358R705514R884809K373394J191412
38548a0112241K652892m59478j674157N903307J2649653N764632r352431j6461329
38540a1089152j0721713m0898R623362J6538766J5697648L589197j1020616j3692139
38532a115545k546630R092739Q749460k941638j5007332j6180654m766162P766555
38524a6949207Q108933q37280k519594P335657J0973756l495085j8532863j0869618
$$ y = [-19150278, -27390263, -37557043, -44767954, -45080237, -41322888, -37236270, -31909025, -24681318, -19927446, -21335582, -25424338, -26107564, -23054051, -21075778, -22912773, -25541872, -22499847, -9859561, 7013815, 14662020, 6483487, -4921639, -1117574, 15181369, 19978514, 620067, -25202012, -33267370, -23561856, -13677047, -11303653, -10112241, -7459349, -7918827, -9592984, -3689677, 8959976, 14724608, 5372177, -11089152, -21810865, -21851763, -12228401, 4310365, 20008013, 23597210, 12576594, -1115545, -3662175, 5430564, 14180024, 11238386, -3768946, -19949600, -24715762, -16949207, -8840274, -9677554, -12197148, -4861491, 6112265, 2617180, -15915683, -26785301]
38516b6785301J0798596J6217303j000744j4613894p047019O238526N788023r04288
38508a1308798L313105J2954261Q841102p492015j2857107J776383J5536373P145171
38500A7908475j4641034k3306831r384467J0785551J8735861J3134582K879743
38493A6111880p024059j4557778j3693154n77147J4692210J4774723k097822j5736511
38485h107658q449386J0513942J5627491j657355k1721865k2091800m284988J2060755
38477b8110864J5449701J2028726J0010679P018877j006221p765398m640486L485800
38469F470814L489245m831368p128055J375242N348337o381607j9611519j4289622
38461c5558533M158026J3181758P890592M710266J0317524J1849968M285480K174007
$$ y = [-26785301, -15986705, 230598, -770146, -15384040, -22431059, -16192533, -10404510, -11308798, -7995693, 4958568, 13799670, 6307655, -6549452, -4773069, 10763304, 17908475, 3267441, -20039390, -29423857, -18638306, 97555, 13232137, 16111880, 9087821, -5469957, -19163111, -19740258, -5048048, 9726675, 7628853, -8107658, -16557044, -6043102, 9584389, 7927034, -13794831, -35886631, -40171619, -28110864, -12661163, -632437, 9378242, 16397119, 15390898, 7625500, 2985014, 6470814, 9960059, 5128691, -1999364, -624122, 4724215, -1657392, -21268911, -35558533, -31400507, -18218749, -10328157, -5617891, 4699633, 16549601, 20835081, 23009088]
38453B3009088J0997812J0605480j2636796l6290027k9883753k58788J8369393
38446a6087591J3213012L512889K982244P04320j2480627k3127920j4990100O354229
38438c9919544K2154188K2963185J2139858l019233j3797485j2593379k320572
38431a4392982M154993J313879j293040L608241P024169j168488j2397346r717640
38423b2868214O742745J9348281J6790738N657260k200007k682593J532890N254805
38415B7575905K264963q932445j9303367j7438822n051889M059358K440462k529623
38407a6915458j625063L823178P231296O187673R99888q050253j5104353q735114
38399c2188206J2425722L0320726K5987427M561054j0737368q846604j655973
$$ y = [23009088, 34006900, 44612380, 31975584, -4314443, -34198196, -34456984, -16087591, -2874579, 638310, 3620554, 4324874, -8155753, -31283673, -46273773, -39919544, -17765356, 5197829, 17337687, 14318454, 520969, -12072410, -14392982, -10237989, -8924110, -10217150, -6608909, 415260, -753228, -13150574, -22868214, -16125469, 3222812, 20013550, 25670810, 23470803, 20788210, 22321100, 27575905, 29840868, 20908423, 1605056, -15833766, -20885655, -16826297, -14385835, -16915458, -18540521, -14717343, -7486047, -1298374, -298486, -8348739, -23453092, -32188206, -19762484, 10558242, 36545669, 41106723, 30369355, 21522751, 19866778]
38392A9866778k374277p441447p265199l081414k298640m697337m507349j587575
38384a3386460l20144j186658l187241r874013k0993349k2786304k979719K5251866
38376d9462022L2949405J3609667o484474m955698P487231Q426260j619287n515947
38368e564865J63688L868825L573348R044749J8448942J5686334j901004j3592416
38360B9727601m754258J0210725R212520n138917j1306247o51591J2801585J3210145
38352E3311563L54813j4894188k2383969j8022612n328005N781582O983706j51965
38344E650925p225205r265501p505082l733004K074282Q695188J3239605J3651844
38336A5583052Q339931l786186j8025589k3186227j4393025k978411k995600j0173705
$$ y = [19866778, 17492501, 10051054, 2785855, -295559, -2594199, -7291536, -11798885, -13386460, -13706604, -14893262, -18080503, -27954516, -48947865, -71734169, -74713888, -49462022, -16512617, -2902950, -9387424, -14343122, -6855891, 1570369, -48918, -5564865, -5401177, -1532352, 2040996, 11085745, 29534687, 45221021, 43320017, 29727601, 24973343, 35184068, 44396588, 39257671, 27951424, 27299833, 40101418, 53311563, 53666376, 38772188, 16388219, -1634393, -6962398, -1180816, 5802890, 5650925, -1574280, -10839781, -18344863, -22077867, -20003585, -11308397, 1931208, 15583052, 23922983, 20136797, 2111208, -21075019, -35468044, -38446455, -41442055, -51615760]
38328e1615760p594583P410813J7993307J4369306Q971100J4224784K0055561
38321B3814528J0173789r000303j5546987m820102M642777k33106j0474899j2660227
38313a4104530p326149j531252L561400P545469M588635n798208j1014530j671941
38305b5751106J1208112R761629m306627j2417353o841016N80387j30163k886765
38297c0782902N34584O169403P440368Q240247J4030038J7320548O755397j1752054
38289A7955629j8149782n807570P164956K383406j2366728j3558217M306431J9387463
38281A315588J1740103r171478j6708005j495280J8916706K4767569J5730589
38274D5095792L247995o873250j4406027j5218363m708872J0921074J7428740
$$ y = [-51615760, -59210343, -51799530, -33806223, -19436917, -10465817, 3758967, 23814528, 33988317, 24988014, 9441027, 4620925, 9263702, 9030596, -1444303, -14104530, -21430679, -22961931, -19400531, -11855062, -7266427, -13064635, -24079165, -25751106, -14542994, -4781365, -9087992, -21505345, -28346361, -27765974, -27896137, -30782902, -30248318, -24078915, -16638547, -8398300, 5631738, 22952286, 29707683, 17955629, -194153, -6001723, 1163233, 3546639, -8820089, -22378306, -18071875, 1315588, 13055691, 3884213, -12823792, -14319072, 4597634, 29365203, 45095792, 48343787, 41470537, 27064510, 11846147, 7137275, 18058349, 35487089]
38267C5487089Q254353q616282j9650751j7143498l861314Q317655P562993m147087
38259F203158j0660091j855338J1838210J4477418P068885J753119k44239p383850
38251B1197272j7173976j6212012k720976Q953454R669865M445494k112435j0167026
38243d120340j1708035L842095K4872779K3724561j672397j8651630p734569P577969
38235A6130433Q13671j4029120r005623Q625874R420419q388547j8458913j0725751
38227b5617557j902006j975215j847366K923661M642898L248911P207165J2188083
38219a131426N614115n741796k130849J2190771J1254737o709043j1792195O163204
38211G717518J6080505k997222k4219750j6375552M435496L289415j4253289j2677850
$$ y = [35487089, 43741442, 35125160, 15474409, -1669089, -5530403, 2787252, 10350245, 6203158, -4456933, -6312271, 5525939, 20003357, 27072242, 28825361, 28581122, 21197272, 4023296, -12188716, -14909692, -5956238, 3713627, 8159121, 6046686, -4120340, -15828375, -11986280, 12886499, 36611060, 34938663, 16287033, 8552464, 16130433, 16944104, 2914984, -6090639, 2535235, 11955654, 3567107, -14891806, -25617557, -27519563, -29494778, -31342144, -28418483, -23775585, -20526674, -13319509, -1131426, 4482689, -1259107, -3389956, 8800815, 20055552, 13346509, 1554314, 7717518, 23798023, 20800801, -3418949, -19794501, -15359005, -12069590, -26322879, -39000729]
38203c9000729J2709074K6428837P594668j9809255k2813254k096112J4885167
38196b2101604R557010j0509026k3597976j6402620L614919J7997118J9584808
38189b1857371J7895565J8855387J2269349q393481k5274792j4733814J6696078
38182d543079L4438710J7578162j6302528l4151942k4735842n117344M156513
38175b8677350J159156j931241M05860P7264p527340j0532115J960501J6482736
38167b8582529R842732j3081318k0433052J88029K1074864J5311168l950699o890252
38159b6521057P148757J3298707J803155j0594028q596989K565828Q215966J398287
38151a1281374j1658480j6187430l606330J4108113J6270917M355338J699419
$$ y = [-39000729, -26291655, 137182, 7731850, -12077405, -34890659, -36986771, -22101604, -12544594, -23053620, -46651596, -63054216, -59439297, -41442179, -21857371, -3961806, 14893581, 27162930, 18769449, -6505343, -21239157, -4543079, 29895631, 47473793, 31171265, -2980677, -27716519, -32833863, -28677350, -27518194, -29449435, -29043575, -28966311, -36493651, -47025766, -45065265, -28582529, -18739797, -31821115, -52254167, -52066138, -30991274, -15680106, -19630805, -26521057, -19372300, -6073593, -4270438, -14864466, -23461455, -20895627, -12679661, -11281374, -22939854, -39127284, -42733614, -28625501, -12354584, -7999246, -6299827]
38144f299827J3520223J4130520p581725k0269387J627185K9235284K0199398
38137D4561671j2266998k0336379J47447O866746j4220348k7714222j3390260
38130c6352343J852612k545206m496798J4634884L0050162J4803445j2303397
38123E643359j7046557k310538N606596K187326O71999k25093r245370j5689379
38115c0407657l475038J6735569K0756639Q649560m16740k835124q574434j1767842
38107a1335067J346322J7528684P470217k3461059l2917905l129558K9280448
38100a5217918K5723899k72127r005131M773651J0350353n891077j9177245p146279
38092a5861874J3595880J1961736r709219j7983509P93615J8153605O472567j7068105
$$ y = [-6299827, 7220396, 21350916, 13769191, -6500196, -4873011, 24362273, 44561671, 32294673, 11958294, 12105741, 18972487, 4752139, -22962083, -36352343, -34499731, -37044937, -41541735, -26906851, 3143311, 17946756, 5643359, -11403198, -13713736, -8107140, -5919814, -5247815, -5472908, -14718278, -30407657, -33882695, -17147126, 3609513, 12259073, 11842333, 9007209, 432775, -11335067, -9988745, 7539939, 15010156, -8450903, -41368808, -44498366, -15217918, 10505981, 10233854, 1228723, 6002374, 16352727, 10461650, -8715595, -15861874, -2265994, 9695742, -13477, -17996986, -17203371, 950234, 7422801, -9645304]
38084i645304j5745342R328683K1021160N654768o050419R142349K8003435J8308952
38076F0018282j0540258k4773131j7015253p950865p235222m268111N148231J0747782
38068D131455P141707o87920j0031411j8809528j6146034L039051J9684915J2629834
38060I52069n733074n273522J2870070J6996926k402945j7066442q735350L236199
38052e156069M971l869774R081826K2579951J1316765j4896945k3365034o693827
38044a0998136R845134P350852m850931r835394o381276l868541m929745j766242
38036b5434279J1745284K7641248K7874669N679699k1022344k7875314j3501377
38029a4892414K612094R368746J2669482J4545676P546345l916552k416537J0762783
$$ y = [-9645304, -25390646, -16061963, 4959197, 10613965, 4563546, 13705895, 41709330, 60018282, 49478024, 24704893, 7689640, -261225, -7496447, -11764558, -6616327, 4131455, 11273162, 10585242, 553831, -18255697, -34401731, -31362680, -11677765, 952069, -4781005, -10054527, 2815543, 19812469, 17409524, 343082, -8392268, -5156069, -5151098, -9020872, 60954, 22640905, 33957670, 19060725, -4304309, -10998136, -1153002, 6197850, 1346919, -8488475, -14869751, -18738292, -23668037, -25434279, -13688995, 13952253, 41826922, 47506621, 26484277, -1391037, -14892414, -12280320, -2911574, 9757908, 24303584, 31849929, 27933377, 25516840, 36279623]
38021C6279623R355218j5550546l3937946k1220540J236480O57036j3305058o656798
38013d3142531K0495345L4235697K1034510K458439n543182j0674407j6210698
38006B653173j0973290L046808O784360q20311K251548J7295444J3166681j9519995
37998A3884418l9127205j1234560L2827011L6299412k351659l1888579k2974724
37991b4565886K064729J4633875J4493403R699697k330493j7285939j5967760
37984a9258374O420537K4492784J6114438n613959j3793310o236217m20001j373097
37976C32801L74703M043260k419540j6722241j8880200j189261J7099640J5859594
37968a501244P17288q409414m718321K566185N448710L840276j440227r715333
$$ y = [36279623, 45634841, 30084295, -3853651, -25074191, -23837711, -23180675, -36485733, -43142531, -22647186, 11588511, 32623021, 35081460, 29538278, 18863871, 2653173, -8320117, -5273309, 1511051, 690740, 2942288, 20237732, 33404413, 13884418, -25242787, -36477347, -3650336, 32649076, 30297417, -1591162, -24565886, -22501157, -7867282, 6626121, 16325818, 13995325, -3290614, -19258374, -12837837, 11654947, 27769385, 22155426, 8362116, 2125899, 1705898, 332801, 707504, 4750764, 2331224, -14391017, -33271217, -34460478, -17360838, -1501244, -783956, -9193370, -13911691, -11345506, -5896796, -2056520, -3496747, -13212080]
37960a3212080j5184354j1366971j323488N790555Q346177J2057672J5297216
37953D04727P542168j1521988k2972217r814098J8632373L4614826K2891308m442885
37945C5334214k3468013k1589223m996772J0468662J3899481Q028393L903843
37938B1580585O039122P094773Q11581o566119o197528k318331n636697j3707755
37930A099631j3010251k199516L132549m339671r417671K529742K0416311K1328383
37922A9539507K868895j4728356j6580426q162800j585538l39713j018276J60900
37914a9845807N793098J4021919J5794529M697543j0143422j2640671k748573
37907e071384K799661l380224q109332p50599Q183248M839835m593750n252652
$$ y = [-13212080, -28396434, -39763405, -41086893, -35296338, -26950161, -14892489, 404727, 7946895, -3575093, -26547310, -36361408, -17729035, 16885791, 39777099, 35334214, 11866201, -9723022, -14719794, -4251132, 9648349, 17676742, 21580585, 27619707, 34714480, 35526061, 28959942, 22762414, 20444083, 14807386, 1099631, -11910620, -14110136, -10977587, -15317258, -24734929, -22205187, -1788876, 19539507, 22408402, 7680046, -8900380, -17063180, -18648718, -18988431, -20006707, -19845807, -14052709, -30790, 15763739, 20461282, 10317860, -2322811, -5071384, -2271723, -5651947, -13761279, -14511878, -6328630, -1488795, -6082545, -11335197]
37899a1335197J097733J332738m235683l419223L041461O38388j1160274j2492367
37891c6532424N854336K4259843K1267882L597298p340104p078318p116362r814131
37883a2901980n545747O155819J2435959P709855J670109J283574L26672n258350
37875E875911o209888M074524J3805051P686613q975721j5978639n787413Q159748
37867B650186J1346573M491028k875232n484700m745711m410838o782899q981506
37859a4793099l671274J0236775K0193918J3629679k374916q358820n961Q069123
37851B2925425R258851J4357340K3855375J5121830k1079397n1446323l8822805
37844b5829704J217485J8547623P41087j2562992M188433K3031437J1725690j2679260
$$ y = [-11335197, -10237464, -8904726, -13140409, -16559632, -13518171, -12879783, -24040057, -36532424, -30678088, -6418245, 14849637, 18446935, 11106831, 4028513, -3087849, -12901980, -18447727, -12291908, 144051, 7853906, 9524015, 10807589, 11134261, 5875911, -333977, 3740547, 17545598, 25232211, 16256490, 277851, -5509562, 2650186, 13996759, 18487787, 15612555, 10127855, 5382144, 971306, -5811593, -14793099, -18464373, -8227598, 11966320, 25595999, 23221083, 14862263, 14856302, 22925425, 32184276, 46541616, 70396991, 85518821, 64439424, 12993101, -25829704, -24612219, -6064596, -5323509, -17886501, -13698068, 9333369, 21059059, 8379799]
37836H379799j3963237K960209K464961k0697263l1471515r343216K1387924K8511115
37828a1771223J3480449K84836K47790M733122L909245j241950l702295k70303
37820E669671L547139p63624j1588556j5415929n442760N887411N151010K67904
37812a2687734O670801J7985825J4086473l783635j2803759o463881m009706j3649507
37804a4655123j6149676m81879J2498189L954244r593748l387039J4431719J8280128
37796D896815P375539J157082K073193m062996j4518130j0072372Q272319J4577804
37788I699254j568082j7379993j1723326N500334J2794461O723390k801787j1145907
37780i901656j7226170j5173799l000808Q691535R595702M217462K345546K740648
$$ y = [8379799, -5583438, -2623229, -158268, -20855531, -52327046, -61670262, -40282338, -11771223, 1709226, 1994062, 2241852, 6974974, 10884219, 9642269, 5939974, 5669671, 9216810, 8453186, -3135370, -18551299, -23994059, -18106648, -12955638, -12687734, -6016933, 11968892, 26055365, 22271730, 9467971, 3004090, -1005616, -14655123, -30804799, -31286678, -18788489, -14834245, -24427993, -27815032, -13383313, 4896815, 12272354, 13429436, 15502629, 11439633, -3078497, -13150869, -4878550, 9699254, 8131172, -9248821, -20972147, -15471813, -2677352, 4046038, 1244251, -9901656, -27127826, -42301625, -45302433, -36610898, -27015196, -22797734, -20452188, -17711540]
37772a7711540j287490o396421l102236P557425J3785219R535090J342566k386989
37764A335624j020863R23140J16157l336107n978319l177079N133826J1655009
37756E651388R046903l24024o612106m788143J15638J529603K33482R99253L605374
37747I457368K654286l822557j0579607j1760105p248507j4490Q333243J4965194
37739A984825J3335227P34446j3522281j5693262m145633Q349203R536016p72361
37731a93820j2831774j4003896K673398K6738246L2050123O250796k4786884k3935092
37723h038903M817002J8733958n88860j8921181m637260J9057362J1262808j9222397
37715B462529k6344765J629073K6369604J9157259k586289j0514039m645224j89779
$$ y = [-17711540, -18999030, -25395451, -28497687, -20940262, -7155043, 2380047, 3722613, 1335624, 314761, 1237901, 1354058, -1982049, -7960368, -11137447, -6003621, 5651388, 14698291, 14374267, 7762161, 2974018, 3089656, 4619259, 4852741, 5851994, 9457368, 12111654, 8289097, -2290510, -14050615, -21299122, -21313612, -12980369, 1984825, 15320052, 16054498, 2532217, -13161045, -17306678, -8957475, 578541, -193820, -13025594, -27029490, -24356092, 2382154, 34432277, 40683073, 15896189, -8038903, -3221901, 15512057, 14923197, -3997984, -8635244, 10422118, 21684926, 2462529, -23882236, -22253163, 4116441, 23273700, 20687411, 10173372, 5528148, 5338369]
37707E338369J66518J810316K767180q94304n438309o297826m769270k127864
37699i445190J189137j508408j4761161k4287454j0674424J6189301K2654729
37692b0643470Q39577j5556363j389251K1088535J7322576p465881j9897898q202685
37684c3904860Q383492J2994668Q124579J629256k879916j916820N144246J0282573
37676G857218O521981o38498l048867l681018p512769q197379J63688P455396
37668a080248K198369p042385n554962K73473o268212j9451694j6556318L645280
37660d9836697J5852056P755229j893562L854675J2849726O450384q268803r498133
37652b2735125N597115J8016683J5323729O079586L033813M829115K192009m566345
$$ y = [5338369, 5504887, 7315203, 10082383, 9188079, 3749770, -2548056, -7317326, -9445190, -8256053, -9764461, -24525622, -48813076, -59487500, -43298199, -20643470, -19803893, -35360256, -36749507, -15660972, 1661604, -5804277, -25702175, -33904860, -25521368, -12526700, -4402121, -2772865, -5652781, -7569601, -2425355, 7857218, 14379199, 13740701, 10691834, 7010816, -501953, -8699332, -8535644, -1080248, 1118121, -5924264, -11479226, -11205753, -17473965, -36925659, -53481977, -49836697, -33984641, -26229412, -28122974, -24268299, -11418573, -4968189, -13236992, -22735125, -17138010, 878673, 16202402, 22281988, 25315801, 30144916, 32336925, 27770580]
37644B7770580m965044L669201P494374n879689k5743073k7724116o156597J6658230
37636a4876134J9445322P039281l060219o560021j0507223j4647457j1600641
37629c4767092j944827N896944R130397J1099970J0644158M030691m350991o455061
37621f715811m331341o142954r907747n794692N466670J1822178R344628P197811
37613I38742R702628Q812558N55719n403836j494314M379116J795179m889539
37605A4396253m206538K899429M012089m689066j0669843k034543J4842388K2023870
37597C6574039J1955028n046053j5861173j8132679j4512691m115947R864613
37590G25137J3660123K90018j3116561n845102J2208749J2325816o170355j1544298
$$ y = [27770580, 22805536, 26474737, 33969111, 28089422, 2346349, -25377767, -31534364, -14876134, 4569188, 11608469, 8548250, 1988229, -8518994, -23166451, -34767092, -36711919, -30814975, -21684578, -10584608, 59550, 4090241, -260750, -6715811, -11047152, -17190106, -27097853, -32892545, -27425875, -15603697, -6259069, 938742, 10641370, 19453928, 20009647, 14605811, 13111497, 17490613, 19285792, 14396253, 10189715, 13089144, 17101233, 12412167, 1742324, -292219, 14550169, 36574039, 48529067, 43483014, 27621841, 9489162, -5023529, -9139476, 725137, 14385260, 14675278, 1558717, -4286385, 7922364, 20248180, 14077825, 2533527]
37582B533527Q867033K5459330J2814439j1134854j7476350j0740028j0522449
37575a99352j2199382j455047J0266508L199110j1299507q262440M587715K80813
37567a5081582j5140920j0252448J3347234J9582708J016560o749703J1617301
37560a660850K2354950R80757k4176711j8267705N419158J1822493j435041j0635278
37552a5598227p709987k834136J277360Q999102J5290452J2757658N966655M13633
37544A8562510r793483k5128879k7719442o989603J6634451J7482336J867482
37537a5084628m479163M052230J0419497M866112n533893j2860691j4403103p059711
37529d0083350P567893J7757207J5627585Q775467N114351j524035j4926554k0368496
$$ y = [2533527, 11400560, 36859890, 49674329, 38539475, 21063125, 10323097, -199352, -12398734, -13853781, -3587273, -388163, -11687670, -19950110, -15362395, -15081582, -30222502, -40474950, -27127716, -7545008, -6528448, -13278151, -1660850, 20694100, 21674857, -2501854, -20769559, -15350401, -3527908, -4962949, -15598227, -23308214, -26142350, -24864990, -15865888, -575436, 12182222, 18148877, 18562510, 8769027, -16359852, -44079294, -51068897, -34434446, -16952110, -15084628, -19563791, -15511561, -5092064, -225952, -5759845, -18620536, -33023639, -40083350, -32515457, -14758250, 869335, 9644802, 14759153, 13235118, -1691436, -22059932]
37521b2059932n739202J3561452J3832412j939222j0707795l552183Q059925J3464923
37513D920378J0465897r38628j4042653j3909883J482580J1000447J030798r696049
37505i687113m93534J3939028P948449r202945r276989M667121N421388p316473
37497d001068p346136P108605Q623063p693825j3444770P59227P371229o569100
37489a5192775j3784131L701308J9960695R931658o677821r18515J5015594J1021545
37481B3057558q513776j4387789j412691Q789711O312794J594711l18110m629434
37473A0492974p791689l48147J1543925J1616980Q40623l563261K396832L609946
37465B8798183o573004j3958319o368355P532689J1290457J749615j0090033j2630124
$$ y = [-22059932, -27799134, -14237682, -405270, -2344492, -13052287, -16604470, -8544545, 4920378, 15386275, 14447647, 404994, -13504889, -12022309, -1021862, 8936, -9687113, -10180647, 3758381, 11706830, 2503885, -6773104, -2105983, 3315405, -4001068, -11347204, -4238599, 4384464, -3309361, -16754131, -15994904, -8623675, -15192775, -28976906, -25275598, -5314903, 4616755, -2061066, -2979581, 12036013, 23057558, 14543782, 155993, -1256698, 7533013, 13845807, 15440518, 15122408, 10492974, 2701285, 2353138, 13897063, 25514043, 26354666, 22791405, 25188237, 28798183, 22225179, 8266860, 1898505, 9431194, 20721651, 22471266, 12381233, -248891]
37457b48891m320719M919679L490292o614102r544096K569129J5531178J2099837
37449A7882307k592573r478692l744077K485440K492961J705030K372944j28831
37441A0994509l654855J23531P822640N094376r049988j6898002r303800k7140
37433a4898729r60438q04211J4020726L0819554K5029070k695035k5102940k3862018
37425A545979p861825O164935J2950662J2234485L94004j8922323k7904184j3989401
37417c5387668R484899J7088665M097146q920443n802032N416338Q517975K271742
37409c233378k845241k510114p70334J030575M783134O372673j356477j4287661
37401a2816823j7255834l834572J2839335J5496397L163461r735337j0484210
$$ y = [-248891, -4569610, 350069, 3840361, -2773741, -12317837, -9748708, 5782470, 17882307, 15289734, 5811042, 2066965, 4552405, 7045366, 8750396, 11123340, 10994509, 7339654, 7463185, 15285825, 20380201, 11330213, -5567789, -14871589, -14898729, -15859167, -16663378, -2642652, 28176902, 53205972, 50510937, 25407997, 1545979, -6315846, -150911, 12799751, 25034236, 25428240, 6505917, -21398267, -35387668, -25902769, -8814104, -4716958, -13637401, -19439433, -14023095, -5505120, -3233378, -6078619, -8588733, -9359067, -8328492, -3545358, 2827315, 1470838, -12816823, -30072657, -33907229, -21067894, -5571497, -2408036, -12143373, -22627583]
37394b2627583Q61770J4289620J9228676J3114875L053343l071544o597040j3465211
37386D786906j9943301j3403131P481398K3415034J5824439p586077j9804890
37379i229622o581056J7321272K5957506J0672882j2114413j9761591q188009
37372a923031M602194K353215o787922j857883J7427760K5040622M947916k2012903
37364B1789968k3704479J19421J9580414J6470773M107184K130627R366314J0763503
37356F0623725p3989j4588264j9790659j0251794N504245R972257l948606j9191305
37348H255610j2504863J2428127K5677616J0778490j3062239j9481364r855370
37341B236007l477802n538567n788027k365536m190795r757699n181062J1246015
$$ y = [-22627583, -21765813, -7476193, 11752483, 24867358, 27920701, 24849157, 18252117, 4786906, -15156395, -28559526, -21078128, 2336906, 18161345, 10575268, -9229622, -15810678, 1510594, 27468100, 38140982, 26026569, 6264978, -1923031, 2679163, 5032378, -1755544, -3613427, 13814333, 38854955, 43802871, 21789968, -1914511, -1795090, 17785324, 34256097, 38363281, 40493908, 49860222, 60623725, 60549736, 45961472, 26170813, 15919019, 21423264, 31395521, 27446915, 8255610, -4249253, 8178874, 33856490, 44634980, 31572741, 12091377, 2236007, -1241795, -6780362, -12568389, -14933925, -19124720, -28882419, -34063481, -22817466]
37333b2817466K1136202J1769854m869877r804367k567704L321368K611684K323142
37325A102836N918498N941210m229583j8271984k1840157r151843Q152747J2466688
37317a9911588J785973o038418L172133J8198982J6352964l500617j7937764j1740310
37309a9618645L417590J0568299J0697694J1802171J0019746p72906j1526167
37302A4587782r826913j969502l013455r839164o290596O589780R625183j869527
37294b006412q495006J589305J3040860Q058599p051287j4660004j1004095l639718
37286b4167758M486996J3021148J5510034P651506k887344p576730r562082j2425726
37278a5949956p589883R733686K2193152J0538884j2785532j5308049Q822766
$$ y = [-22817466, -1681264, 10088590, 5218713, -4585654, -7153358, -3831990, -1220306, 1102836, 7021334, 12962544, 8732961, -9539023, -31379180, -40531023, -32378276, -19911588, -18125615, -24164033, -20991900, -2792918, 13560046, 10059429, -7878335, -19618645, -16201055, -5632756, 5064938, 16867109, 26886855, 26113949, 14587782, 4760869, 2791367, -222088, -10061252, -16351848, -9762068, -136885, -2006412, -10501418, -8912113, 4128747, 12187346, 5136059, -9523945, -20528040, -24167758, -19680762, -6659614, 8850420, 16501926, 13614582, 6037852, -3524230, -15949956, -23539839, -13806153, 8386999, 18925883, 6140351, -9167698, -344932]
37271c44932K8342295J8470486o640416j7382500p516078N963741J0295256P639439
37263C8827291L385359j597289o776837r413767p638385j875675N294786P923062
37255B8128545L14586j2996986j6608118j982298J7546305J9544107M18744j8973425
37247A5391460j8853417l500875P199244L340509o298873r415942n220647j440447
37239a8798988k493300n728046o695212l741640J642879O250656P882159P737372
37231a3944120P447286L818874o799194j7210612j3128549N066137J6402751P314633
37223a1032794o316855k942981R490723O947779q642517j1945989N94157L603907
37215b0244570j0041232j2445515R940530K6947115J3431254n950841J539698
$$ y = [-344932, 27997363, 46467849, 39827433, 22444933, 14928855, 20892596, 31187852, 38827291, 42212650, 40615361, 33838524, 24424757, 16786372, 14910697, 20205483, 28128545, 28443131, 15446145, -1161973, -3144271, 14402034, 33946141, 34364885, 15391460, -3461957, -6962832, 236412, 3576921, -2721952, -12137894, -17358541, -18798988, -21292288, -27020334, -33715546, -37457186, -35814307, -29563651, -21681492, -13944120, -6496834, -2677960, -9477154, -26687766, -39816315, -34750178, -18347427, -11032794, -17349649, -20292630, -10801907, -3854128, -12496645, -24442634, -23848477, -20244570, -30285802, -42731317, -32790787, -5843672, 7587582, 1636741, 3176439]
37208C176439J8460501P572226j9095665j6073608J7458979L2239282Q031093
37201E1769247j5936119p165995J1811059P407740j2777752k2021594j7020033
37194c933447p996458O683358K5579721K8168515N664063j3233916n72043K5143811
37186F5503604K6372624M186071r562177p068528j0472242k5494699k9785492
37179A3679161j3732166K337269K497467k657272l92762L148936l88202n588682
37171a096251p226621j1126870j8007319j4386285N673504K4857345K4204752
37164B892255Q900451k055154k225655O60091J813794L140373L635553p59755
37156A6001953q001880j0080592l266884P140324J2268400P404862l422044r269512
$$ y = [3176439, 21636940, 29209166, 10113501, -5960107, 11498872, 43738154, 51769247, 35833128, 28667133, 40478192, 47885932, 35108180, 13086586, -3933447, -11929905, -5246547, 20333174, 48501689, 54165752, 40931836, 40359793, 65503604, 91876228, 96062299, 86500122, 79431594, 68959352, 43464653, 13679161, -53005, 2284264, 4781731, 2124459, 1731697, 4880633, 4492431, -1096251, -8322872, -19449742, -37457061, -51843346, -46169842, -21312497, 2892255, 11792706, 9737552, 7511897, 8171988, 9985782, 13126155, 16761708, 16001953, 8000073, -2080519, -5347403, 1792921, 14061321, 21466183, 18044139, 8774627]
37148H774627l173346P496610P968757m539218j6282832j5578280p057875j043367
37140b3434924K655159J0378015J9372674J8557047M594676j1606705j7023224
37133C492718j0085869j16994L304285j563350q996873j1866943p089604L426964
37125b9495666J4733534K0729812J7043671N550165n143043p150324q25714P220609
37117B2663044J1197976Q262843k053371j4401945j7475045o286182P123973N742554
37109A4773847q876991j6449165n411303J0155344Q948529r373311k3835499j7606110
37101d7674659L445767J8090153J2214732o347189j5326948k276838K0115188
37094a7759794K7925752J4100309n050372j2044641o998754k87476L231608M674428
$$ y = [8774627, 5601281, 13097891, 21066648, 16527430, 244598, -15333682, -22391557, -23434924, -20779765, -10401750, 8970924, 27527971, 32122647, 20515942, 3492718, -6593151, -6710145, -3405860, -4969210, -13966083, -25833026, -32922630, -29495666, -14762132, 5967680, 23011351, 28561516, 23418473, 16268149, 15442435, 22663044, 33861020, 42123863, 40070492, 25668547, 8193502, 1907320, 9031293, 14773847, 5896856, -10552309, -15963612, -5808268, 3140261, -6233050, -30068549, -47674659, -44228892, -26138739, -13924007, -20271196, -35598144, -37874982, -17759794, 10165958, 24266267, 19215895, 7171254, 172500, -114976, 3116632, 7791060]
37086G791060L551089m21518k351565J798079P055049N643014j087685n129651
37078A6847872l978265j656926M09706L552607L836057m215624j3962537r711248
37070h878358J0149269K4618057J5238828q112829j9198360q919505O816958J1816878
37062B3530938P132130J4259r317301j9438382j8382571J346892K3862839K3821224
37054C2570028M89562j8476880j2966746M570358R643119j071803j0615301q136533
37046c994196O12071O388500O619741K649384k002667r64302O771191R444991
37038B5524713l622524k1331269k0242443J793549J8933387J2616602l229576
37031A0442439n515429L943818N967299l633039j0223064o339902j506425l379468
$$ y = [7791060, 11342149, 10920631, 8569066, 10367145, 17422194, 23065208, 21977523, 16847872, 12869607, 11212681, 11622387, 15174994, 19011051, 14795427, 832890, -8878358, 1270911, 25888968, 41127796, 33014967, 13816607, 4897102, 11714060, 23530938, 30663068, 30677327, 21360026, 1921644, -16460927, -15114035, 8748804, 32570028, 33059590, 14582710, 1615964, 6186322, 15829441, 14757638, 4142337, -3994196, -3382125, 3006375, 9626116, 12275500, 10272833, 9308531, 16079722, 25524713, 21902189, 570920, -19671523, -17877974, 1055413, 13672015, 10442439, 4927010, 8870828, 14838127, 11205088, 982024, -5357878, -6864303, -10243771]
37023a0243771o151520l344191J721523M601403O855845Q127358L090471n932115
37015a274997n496301R150253K1778680J6517344K885411K540653J5504750J8908889
37007H0514682J342668j9702422k2396132q742227K117870m57089j0120817j5153459
36999G403074r836128K014492Q711232P90445j5205979k0195831o536991J0487866
36991b2367820J4733888J2084935J6260725K1383876J0650219j1374508k0874512
36984B0496803j2732072r463399k1247784k3981835J887464L2613702L0590635
36977A8163514L55510j7136769l513697J5840993J5358747L764814M07137K013011
36969C5253260n170556j6109765j4273161j232274L893875n467127j3291337n769796
$$ y = [-10243771, -16395291, -19739482, -18017959, -13416556, -6560711, 1566647, 4657118, -1274997, -6771298, 2378955, 24157635, 40674979, 43560390, 46101043, 61605793, 80514682, 81857350, 62154928, 39758796, 31016569, 33134439, 32677350, 22556533, 7403074, -2433054, -418562, 8292670, 9083115, -6122864, -26318695, -32855686, -22367820, -7633932, 4451003, 20711728, 42095604, 52745823, 41371315, 20496803, 7764731, -1698668, -22946452, -46928287, -45040823, -12427121, 18163514, 18519024, 1382255, -2131442, 13709551, 29068298, 32833112, 33240249, 35253260, 30082704, 13972939, -300222, -1532496, 2361379, -3105748, -16397085, -22166881]
36961b2166881R104950J4701019Q117316L09180n31434K689921K760100k554502
36953A2429669q819750j0251370o346594l097863n890006j1424121j0291802Q52231
36945d2839606J3385389J6532519J0798748O714905J0079430J3748771P771261
36938C6191417n419516j2015240m074656R724537J4739646P978716j368321p223008
36930C8533575j3222383k1103761k1998930q270322J1081854J8138665Q928938
36923A2087636k008678k239390L930412O526348N177606M471727K785825k243513
36915B8487973l520469N333456J3139036K680244j9478576k4817574k747524K0209546
36907A9286112J5474366q680364k1777498j3423106N56729P332622Q616012M814625
$$ y = [-22166881, -13061931, 1639088, 9756404, 10065584, 9534150, 12224071, 14984171, 12429669, 3609919, -6641451, -12988045, -16085908, -21975914, -33400035, -43691837, -42839606, -29454217, -12921698, -2122950, 4591955, 14671385, 28420156, 36191417, 30771901, 18756661, 14682005, 24406542, 39146188, 47124904, 45756583, 38533575, 25311192, 4207431, -17791499, -26061821, -14979967, 3158698, 12087636, 10078958, 7839568, 11769980, 18296328, 23473934, 27945661, 30731486, 28487973, 24967504, 30300960, 43439996, 46120240, 26641664, 1824090, -923434, 19286112, 34760478, 26080114, 4302616, -9120490, -8563761, -1231139, 7384873, 12199498]
36899A2199498p658925j9755175j4227902N749123J4781020K460877r688184k545775
36891a8685443J1147084J1016626K992620L923728P634453l394862k0787255j7753742
36883b3906791N996263J9040525N634973j0994734o562265Q608804J1384058L371930
36875A2572763K465153Q979471O631727n656136q051403P889676K0854873O983690
36867E2669814k5003008m1200123k3909790P245171K0979556J1530357j171758
36860A140219l945160n513651j3674914j5535306K122313K3960768K1558524l830184
36852F282609j8968162n666440J3430192J0019412q748052j4718988j209568J2562608
36844g016389J4041574J0711036R501971M505437o789067j1936677p67436J5731899
$$ y = [12199498, 4540573, -15214602, -29442504, -23693381, -8912361, -6451484, -16139668, -18685443, -7538359, 3478267, 6470887, 10394615, 18029068, 14634206, -6153049, -23906791, -17910528, 1129997, 6764970, -4229764, -10792029, -2183225, 9200833, 12572763, 15037916, 24017387, 30649114, 24992978, 16941575, 24831251, 45686124, 52669814, 27666806, -13533317, -37443107, -30197936, -9218380, 2311977, 1140219, -2804941, -8318592, -21993506, -37528812, -35406499, -11445731, 10112793, 6282609, -12685553, -18351993, -4921801, 5097611, -3650441, -18369429, -19578997, -7016389, 7025185, 17736221, 27238192, 31743629, 24954562, 13017885, 12250449, 27982348]
36836B7982348J6996826k2530j6216577j3830620K637082J2692678M017906j3838054
36828B0419059k1219705j1125508M264308J0110848N810260R46593l15884k459768
36820F430203p728423j1253311r600734o671134o387910n253884J290764Q504253
36812c0670176O606244l836690q738982J747649J7015638J6432219l341443k0837308
36804b5622849j5926607L605175J2552966K524947q337630l162854J0411857J4733438
36796i221557Q817760N702429Q620237O656386n004375j5692623j4920004n279843
36788b0321590N799303J5487191J9892618J1545432o582026j5672906m426243
36781E721779J0510633N520408j3410774j7010479K861608J8877289Q342074j3803182
$$ y = [27982348, 44979174, 44956644, 28740067, 14909447, 17546529, 30239207, 34257113, 20419059, -800646, -11926154, -7661846, 2449002, 8259262, 9205855, 8889971, 6430203, -1298220, -12551531, -22152265, -28823399, -35211309, -40465193, -39174429, -30670176, -24063932, -27900622, -36639604, -34891955, -17876317, -1444098, -4785541, -25622849, -41549456, -37944281, -25391315, -22866368, -31203998, -34366852, -23954995, -9221557, -403797, 5298632, 13918869, 20575255, 15570880, -121743, -15041747, -20321590, -14522287, 964904, 20857522, 32402954, 25820928, 10148022, 5721779, 16232412, 21752820, 8342046, -8668433, -5806825, 13070464, 21412538, 7609356]
36773G609356j9446891q268205j304841l524494J66934J2585773J5443734J059132
36765D320498j0906927l397575R885504O061477r640912j1709645M855035J5942712
36757E410167N288526j1053659r439589O902367J4886409N851861n679622q155127
36749D011333r694059j9204027k4842366q902273K0484057L2586916J4109408
36742H548989j1261578j4490946J547356J2264279Q471375K808491L242406K444258
36734A3574630l625050o452213p16658P141899J2008590J5456727J2998148m149654
36726D6236419k6340578k6926489j98343K3738861J9936849L537312J468770R252813
36718E0705614M602295j1321830j8600872j4524504j1906142q849058M744426
$$ y = [7609356, -11837535, -20105740, -21410581, -24935075, -24768141, -12182368, 3261366, 4320498, -6586429, -9984004, -98500, 5962977, -3677935, -15387580, -10532545, 5410167, 10698693, -354966, -9794555, -2892188, 11994221, 17846082, 12166460, 4011333, -5682726, -24886753, -49729119, -58631392, -38147335, -5560419, 8548989, -2712589, -17203535, -15656179, -3391900, 5079475, 7887966, 11130372, 13574630, 9949580, 3497367, 2780709, 9922608, 21931198, 37387925, 50386073, 46236419, 19895841, -7030648, -7228991, 16509870, 36446719, 39984031, 41452801, 50705614, 55307909, 43986079, 25385207, 10860703, -1045439, -9894497, -5150071]
36711e150071J5746045K516934j9519221j1479886K2620553L1267181m485311
36704C1516224l4671958j5728308K0948600J9828183j1879938k1426354L120680
36697h292871K0254962O973921j0052915o808000Q96174o006251j3375651k168474
36689a8579105J3948435J0899894l260388j178635J6121377J7479557q882427
36682B6548708l2719137k2370762J1164317K9244639J5515493q011401j4212805
36675E159052l432291M482847j39016o922717l009905R372062J6375632R472055
36667C1357719m618738j1291091m866221M137624K173785q470005j1875547j481673
36659d934147R417404P123384k347506m124219J837204K743986m507958q496045
$$ y = [-5150071, 10595974, 13112908, -6406313, -17886199, 4734354, 36001535, 31516224, -3155734, -18884042, 2064558, 21892741, 10012803, -11413551, -8292871, 11962091, 18936012, 8883097, 2075097, 2971271, -3034980, -16410631, -18579105, -4630670, 6269224, 3008836, 1830201, 17951578, 35431135, 26548708, -6170429, -28541191, -17376874, 11867765, 27383258, 19371857, 5159052, 1726761, 6209608, 6070592, -852125, -3862030, 5510032, 21885664, 31357719, 26738981, 15447890, 10581669, 14719293, 16893078, 8423073, -3452474, -4934147, 4483257, 11606641, 9259135, 5134916, 6972120, 9716106, 5208148, -3287897]
36651c287897k148971P313215J0701895P971779L443759r46280m669689p819678
36643A0558133j1661267j3921306p605330O771427J4867308P705727p48970O537364
36635A2503086J9399474J3904404p508710j7141635n142498P397621M976315j331584
36627B7056473M7291J343280m775253j0112607r397150j0628209j4765862j0062679
36619c1294716J578937J378207r858063n676407J7700958K5038861k5372k0207480
36611b1365075k888214K4213619J9602156k687445k181528J5312165J1583495
36604D1589173j3678534k5215470j6137108j1626434j2985358K947682K7492843
36597g613206K3733866o015163j6454231L966849J3145629q281541k2025674k881074
$$ y = [-3287897, -5436868, 1876347, 12578242, 20550021, 23993780, 23047500, 18377811, 10558133, -1103134, -15024440, -22629770, -15858343, -991035, 6714692, 5965722, 12503086, 31902560, 45806964, 38298254, 21156619, 16014121, 23411742, 28388057, 27056473, 27103764, 28447044, 23671791, 13559184, 4162034, -6466175, -21232037, -31294716, -29715779, -28337572, -38195635, -43872042, -26171084, -1132223, -1157595, -21365075, -24253289, -39670, 19562486, 16875041, 14693513, 30005678, 41589173, 27910639, 2695169, -13441939, -25068373, -38053731, -35106049, -7613206, 16120660, 10105497, -6348734, -2381885, 10763744, 2482203, -19543471, -22424545]
36589b2424545J4322169j903145k1155405m000880K8146001K8666267J417155
36582B3067617j1936164p77388P966693J051103p813942j0358732j1351411p404273
36574a7556497Q403666K3454963J7106007o492552k2910995k1929135j4229529
$$ y = [-22424545, -8102376, -10005521, -31160926, -35161806, -7015805, 21650462, 23067617, 11131453, 10354065, 18320758, 19371861, 11557919, 1199187, -10152224, -17556497, -9152831, 14302132, 31408139, 24915587, 2004592, -19924543, -34154072]
$$ [...]
##END NTUPLES=NMR SPECTRUM
##END=
