##TITLE=31Pdec_SR141rek
 CDCl3, 124 sc
 17.10.2022
##JCAMPDX= 6.0         $$ Bruker NMR JCAMP-DX V2.0
##DATA TYPE= NMR SPECTRUM
##DATA CLASS= NTUPLES
##ORIGIN= UXNMR, Bruker Analytische Messtechnik GmbH
##OWNER= root
$$ XWIN-NMR		Version 3.5
$$ Mon Oct 17 16:56:28 2022 Russian Standard Time (UT+4h)  she@DPX200
##.OBSERVE FREQUENCY= 81.013821
##.OBSERVE NUCLEUS= ^31P
##.ACQUISITION MODE= SIMULTANEOUS
##.ACQUISITION SCHEME= undefined
##.AVERAGES= 124
##.DIGITISER RES= 16
##SPECTROMETER/DATA SYSTEM= spect
##.PULSE SEQUENCE= zgpg30
##.SOLVENT NAME= DMSO
##.SHIFT REFERENCE= (INTERNAL, DMSO, 0, 248.564)
##AUDIT TRAIL= $$ (NUMBER, WHEN, WHO, WHERE, WHAT)
$$ ##TITLE= Audit trail, XWIN-NMR		Version 3.5
$$ ##JCAMPDX= 5.01
$$ ##ORIGIN= Bruker BioSpin GmbH
$$ ##OWNER= she
$$ F:/spectra/data/she/nmr/P31/1/pdata/1/auditp.txt
$$ ##AUDIT TRAIL=  $$ (NUMBER, WHEN, WHO, WHERE, WHAT)
(   1,<2022-10-17 16:55:23.67 +0400>,<she>,<DPX200>,
      <continue with go, POWCHK disabled, PULCHK disabled
       configuration hash MD5:
       00 E9 B6 7A A2 85 ED C7 34 08 36 98 17 FE 4E 26
       data hash MD5: 32K
       C4 D8 6A 60 EF A0 5A 79 1C FB 6C 3A 02 0B 53 7E>)
(   2,<2022-10-17 16:55:28.64 +0400>,<she>,<DPX200>,
      <Start of raw data processing
       efp BC_mod = 2 LB = 1 FT_mod = 6 PKNL = 1 PHC0 = -10262.82 PHC1 = 93.65658 SI = 64K 
       data hash MD5: 64K
       D8 D9 02 B0 87 B2 D4 6C 0C 50 EA 9D 38 42 27 ED>)
(   3,<2022-10-17 16:55:52.42 +0400>,<she>,<DPX200>,
      <pk PHC0 = -0.02411387 PHC1 = 0 
       data hash MD5: 64K
       D2 59 17 EA A2 16 72 8D 88 BC 50 AE 63 55 2D E7>)
(   4,<2022-10-17 16:55:57.18 +0400>,<she>,<DPX200>,
      <abs ABSG = 5 
       data hash MD5: 64K
       E2 A6 86 19 A0 00 B5 8B 93 99 94 78 0F DA A1 65>)
$$ ##END=
$$ 
$$ hash MD5
$$ 03 91 57 27 CE DF D2 C0 C0 5C 90 37 FE 8E B0 7C
##$RELAX= 
##$RELAX= 
##$RELAX= 
##$RELAX= 
##$RELAX= 
##$RELAX= 
##$RELAX= 
##$RELAX= 
##$RELAX= 
$$ Bruker specific parameters
$$ --------------------------
##$DU= <F:/spectra>
##$EXPNO= 1
##$NAME= <P31>
##$PROCNO= 1
##$TYPE= <nmr>
##$USER= <she>
##$AMP= (0..31)
100 100 100 100 100 100 100 100 100 100 100 100 100 100 100 100 100 100 
100 100 100 100 100 100 100 100 100 100 100 100 100 100 
##$AQSEQ= 0
##$AQ_mod= 1
##$AUNM= <au_zg>
##$AUTOPOS= <>
##$BF1= 81.014009
##$BF2= 200.13
##$BF3= 200.13
##$BF4= 200.13
##$BF5= 200.13
##$BF6= 200.13
##$BF7= 200.13
##$BF8= 200.13
##$BYTORDA= 1
##$CFDGTYP= 0
##$CFRGTYP= 5
##$CHEMSTR= <none>
##$CNST= (0..31)
1 1 145 1 1 1 1 1 1 1 1 1 1 1 1 1 1 1 1 1 1 1 1 1 1 1 1 1 1 1 1 1 
##$CPDPRG= <waltz16>
##$CPDPRG1= <>
##$CPDPRG2= <waltz16>
##$CPDPRG3= <>
##$CPDPRG4= <mlev>
##$CPDPRG5= <mlev>
##$CPDPRG6= <mlev>
##$CPDPRG7= <mlev>
##$CPDPRG8= <mlev>
##$CPDPRGB= <>
##$CPDPRGT= <>
##$D= (0..31)
0 1 0 0 0 0 0 0 0 0 0 0.03 2e-05 3e-06 0 0 0 0 0 0 0 0 0 0 0 0 0 0 0 0 
0 0 
##$DATE= 1666011157
##$DBL= (0..7)
120 120 120 11 120 120 24 19 
##$DBP= (0..7)
150 150 150 150 150 150 150 150 
##$DBP07= 0
##$DBPNAM0= <>
##$DBPNAM1= <>
$$ [...]
##$SUBNAM3= <"">
##$SUBNAM4= <"">
##$SUBNAM5= <"">
##$SUBNAM6= <"">
##$SUBNAM7= <"">
##$SUBNAM8= <"">
##$SUBNAM9= <"">
##$SW= 501.771253377433
##$SWIBOX= (0..15)
0 1 3 0 0 0 0 0 0 0 0 0 0 0 0 0 
##$SW_h= 40650.406504065
##$TD= 32768
##$TD0= 1
##$TE= 0
##$TE2= 300
##$TE3= 300
##$TEG= 300
##$TL= (0..7)
0 120 53 12 22 120 120 120 
##$TP= (0..7)
150 150 150 150 150 150 150 150 
##$TP07= 0
##$TPNAME0= <>
##$TPNAME1= <>
##$TPNAME2= <>
##$TPNAME3= <>
##$TPNAME4= <>
##$TPNAME5= <>
##$TPNAME6= <>
##$TPNAME7= <>
##$TPOAL= (0..7)
0.5 0.5 0.5 0.5 0.5 0.5 0.5 0.5 
##$TPOFFS= (0..7)
0 0 0 0 0 0 0 0 
##$TUNHIN= 0
##$TUNHOUT= 0
##$TUNXOUT= 0
##$USERA1= <user>
##$USERA2= <user>
##$USERA3= <user>
##$USERA4= <user>
##$USERA5= <user>
##$V9= 5
##$VALIST= <valist>
##$VCLIST= <CCCCCCCCCCCCCCC>
##$VD= 0
##$VDLIST= <DDDDDDDDDDDDDDD>
##$VPLIST= <PPPPPPPPPPPPPPP>
##$VTLIST= <TTTTTTTTTTTTTTT>
##$WBST= 1024
##$WBSW= 4
##$XGAIN= (0..3)
0 0 0 0 
##$XL= 0
##$YL= 0
##$YMAX_a= 2847
##$YMIN_a= -12624
##$ZGOPTNS= <>
##$ZL1= 120
##$ZL2= 120
##$ZL3= 120
##$ZL4= 120
##$ABSF1= 248.5645
##$ABSF2= -253.2056
##$ABSG= 5
##$ABSL= 3
##$ALPHA= 0
##$AQORDER= 0
##$ASSFAC= 0
##$ASSFACI= 0
##$ASSFACX= 0
##$ASSWID= 0
##$AUNMP= <proc_1d>
##$AZFE= 0.1
##$AZFW= 0.5
##$BCFW= 0
##$BC_mod= 2
##$BYTORDP= 0
##$COROFFS= 0
##$CY= -3
##$DATMOD= 1
##$DC= 0
##$DFILT= <>
##$DTYPP= 0
##$F1P= 0
##$F2P= 0
##$FCOR= 1
##$FTSIZE= 65536
##$FT_mod= 6
##$GAMMA= 0
##$GB= 0
##$INTBC= 1
##$INTSCL= 6.834604e-11
##$ISEN= 30
##$LB= 1
##$LEV0= 0
##$LPBIN= 0
##$MAXI= 10000
##$MC2= 0
##$MEAN= 0
##$ME_mod= 0
##$MI= 50
##$NCOEF= 0
##$NC_proc= -10
##$NLEV= 6
##$NOISF1= 182.463
##$NOISF2= 159.3651
##$NSP= 0
##$NTH_PI= 0
##$NZP= 0
##$OFFSET= 248.5645
##$PC= 4
##$PHC0= -10262.84
##$PHC1= 93.65658
##$PH_mod= 1
##$PKNL= yes
##$PPARMOD= 0
##$PSCAL= 0
##$PSIGN= 0
##$REVERSE= no
##$SF= 81.0140089999694
##$SI= 65536
##$SIGF1= 159.3651
##$SIGF2= -187.1042
##$SINO= 113.3802
##$SIOLD= 16384
##$SREGLST= <1H.CDCl3>
##$SSB= 0
##$STSI= 65536
##$STSR= 0
##$SW_p= 40650.406504065
##$SYMM= 0
##$S_DEV= 0
##$TDeff= 32768
##$TDoff= 0
##$TI= <>
##$TILT= no
##$TM1= 0
##$TM2= 0
##$TOPLEV= 0
##$USERP1= <user>
##$USERP2= <user>
##$USERP3= <user>
##$USERP4= <user>
##$USERP5= <user>
##$WDW= 1
##$XDIM= 65536
##$YMAX_p= 509813601
##$YMIN_p= -389064758
$$ End of Bruker specific parameters
$$ ---------------------------------
##NTUPLES= NMR SPECTRUM
##VAR_NAME=  FREQUENCY,     SPECTRUM/REAL,   SPECTRUM/IMAG
##SYMBOL=    X,             R,               I
##VAR_TYPE=  INDEPENDENT,   DEPENDENT,       DEPENDENT
##VAR_FORM=  AFFN,          ASDF,            ASDF
##VAR_DIM=   65536,         65536,           65536
##UNITS=     HZ,            ARBITRARY UNITS, ARBITRARY UNITS
##FACTOR=    0.620285442955139, 1,           1
##FIRST=     20137.2065510682, 0,            0
##LAST=      -20513.1999529968, 0,           0
##MIN=       -20513.1999529968, -389064758,  0
##MAX=       20137.2065510682, 509813601,    0
$$ Real data points
##PAGE= N=1
##DATA TABLE= (X++(R..R)), XYDATA
$$ [...]
##PAGE= N=2
##DATA TABLE= (X++(I..I)), XYDATA
$$ plain form
12089 -80682070 -45584717 -202704 17422467 11170456 2727071 -9075545 -36892660
12082 -36892660 -69861174 -80464516 -62963313 -41772095 -38707191 -47484022 -46326389
12075 -46326389 -27679165 -8878357 -11799215 -32515118 -38610463 -6436706 44299923
12068 44299923 70437246 60043987 44814510 48894266 49895428 13997203 -45139003
12061 -45139003 -73468527 -43825168 9291280 32348208 12880076 -16581961 -23546314
12054 -23546314 -7672467 9979109 14178404 5983379 -4186991 -4890618 9354867 28611531
12046 28611531 27679718 -10105384 -65697230 -94977691 -75645237 -32548535 -5770785
12039 -5770785 -4818283 -9229132 -4615930 1891680 -2284330 -22937079 -59406926 -96851487
$$ packed form
12089h0682070L5097353M5382013J7625171o252011q443385j1802616k7817115
12082c6892660l2968514j0603342J7501203K1191218L064904q776831J157633
12075d6326389J8647224J8800808k920858k0715903o095345L2173757N0736629
12068D4299923K6137323j0393259j5229477M079756J001162l5898225n9136206
12061d5139003k8329524K9643359N3116448K3056928j9468132k9462037o964353
12054b3546314J5873847J7651576M199295q195025j0170370p03627J4245485J9256664
12046B8611531r31813l7785102n5591846k9280461J9332454M3096702K6777750
12039e770785R52502m410849M613202O507610m176010k0652749l6469847l7444561
$$ plain form
12031 -96851487 -102741021 -57919173 8009867 41778147 32323957 19673220 28786610
12024 28786610 33619573 9473980 -18353138 -16641597 -4649837 -22879537 -58009736
12017 -58009736 -54483766 -1411865 45015335 39859430 4461544 -18802771 -26583659
12010 -26583659 -37716068 -46498642 -32458794 -4252119 1726823 -32527282 -84788435
12003 -84788435 -118914877 -117943089 -91430582 -62719464 -49596813 -50214121 -49825793 -43352483
11995 -43352483 -41123701 -47421952 -47872306 -28483952 5732233 41277005 69744343 79410454
11987 79410454 54518497 3654275 -30603590 -18349808 15263601 24599671 8370755
11980 8370755 3656773 22165020 35595756 29367490 27844025 49319227 71881086 66863891
$$ packed form
12031i6851487n889534M4821848O5929040L3768280r454190j2650737R113390
12024B8786610M832963k4145593k7827118J711541J1991760j8229700l5130199
12017e8009736L525970N3071901M6427200n155905l5397886k3264315p780888
12010b6583659j1132409q782574J4039848K8206675N978942l4254105n2261153
12003h4788435l4126442R71788K6512507K8711118J3122651o17308L88328O473310
11995d3352483K228782o298251m50354J9388354L4216185L5544772K8467338R666111
11987G9410454k4891957n0864222l4257865J2253782L3613409R336070j6228916
11980H370755m713982J8508247J3430736o228266j523465K1475202K2561859n017195
$$ plain form
11972 66863891 39009775 11615133 -4052874 -3698152 19913964 56235733 69614698
11965 69614698 42902598 10328012 15187635 49369597 68995959 59541496 47812440
11958 47812440 52182589 58708017 52774604 42089170 36757054 30959802 15935454 -6305554
11950 -6305554 -28627693 -42598308 -36833894 -11709220 6321607 -8486500 -39445053
11943 -39445053 -43092132 -10938161 18653238 19412342 9471482 7367358 -2872846 -31731340
11935 -31731340 -45734417 -12641421 37834838 45707552 3097418 -38973015 -42678384
11928 -42678384 -19759586 6762653 34452790 61573117 70879983 53733103 26779331
11921 26779331 7277706 -9067519 -30775927 -49395889 -52282145 -43110671 -34483304
$$ packed form
11972F6863891k7854116k7394642j5668007L54722K3612116L6321769J3378965
11965F9614698k6712100l2574586M859623L4181962J9626362r454463j1729056
11958D7812440M370149O525428n933413j0685434n332116n797252j5024348k2241008
11950f305554k2322139j3970615N764414K5124674J8030827j4808107l0958553
11943c9445053l647079L2153971K9591399P59104r940860k104124j0240204k8858494
11935c1731340j4003077L3092996N0476259P872714m2610134m2070433l705369
11928d2678384K2918798K6522239K7690137K7120327R306866j7146880k6953772
11921B6779331j9501625j6345225k1708408j8619962k886256R171474Q627367
$$ plain form
11914 -34483304 -29771496 -24453368 -17682939 -13203202 -14423570 -22018797 -28853178 -19919580
11906 -19919580 7660118 28185646 14482423 -17874394 -23321958 8594226 33667099
11899 33667099 15056147 -27633634 -55096914 -62285592 -62606912 -46372345 749063
11892 749063 53266766 65909573 34049735 -5660403 -30714967 -46505548 -47222558 -14184787
11884 -14184787 35288123 46792936 749584 -54546450 -69061317 -54808849 -52397208
11877 -52397208 -65856444 -69111670 -55019201 -38574362 -25055663 -10479698 -2525956
11870 -2525956 -7303503 -6539385 16661468 40154045 30993412 4026058 6514083 43872013
11862 43872013 69774821 60174080 46785846 55288459 58465710 26106260 -17498294
$$ packed form
11914c4483304M711808N318128O770429M479737j220368p595227o834381Q933598
11906a9919580K7579698K0525528j3703223l2356817n447564L1916184K5072873
11899C3667099j8610952m2689781k7463280p188678l21320J6234567M7121408
11892G49063N2517703J2642807l1859838l9710138k5054564j5790581p17010L3037771
11884a4184787M9472910J1504813m6043352n5296034j4514867J4252468K411641
11877e2397208j3459236l255226J4092469J6444839J3518699J4575965P953742
11870b525956m777547P64118K3200853K3492577r160633k6967354K488025L7357930
11862D3872013K5902808r600741j3388234Q502613L177251l2359450m3604554
$$ plain form
11855 -17498294 -30404902 -20697504 -28918321 -57666051 -68806268 -49001748 -30455627
11848 -30455627 -36576319 -48301212 -42736944 -31132120 -33191464 -38968671 -26734722 -4822401
11840 -4822401 -4375671 -32493445 -59345999 -58120270 -37425908 -23038306 -22437274 -23635683
11832 -23635683 -22494162 -32349394 -61573516 -94586705 -105827082 -87638575 -55961031
11825 -55961031 -32720380 -31607992 -55711069 -93969844 -119914483 -111001971 -75932976
11818 -75932976 -49254826 -51354077 -67084215 -72271369 -65173253 -57733462 -50977159 -38957800
11810 -38957800 -26400847 -19850861 -7678823 26526615 71351734 92180797 73138868
11803 73138868 34858274 4498597 -14715456 -36518599 -67149874 -94231276 -93131284
$$ packed form
11855a7498294j2906608R707398q220817k8747730j1140217J9804520J8546121
11848c0455627o120692j1724893N564268J1604824k059344n777207J2233949K1912321
11840d822401M46730k8117774k6852554J225729K0694362J4387602O01032j198409
11832b3635683J141521r855232k9224122l3013189j1240377J8188507L1677544
11825e5961031K3240651J112388k4103077l8258775k5944639Q912512L5068995
11818g5932976K6678150k099251j5730138n187154P098116P439791O756303J2019359
11810c8957800J2556953O549986J2172038L4205438M4825119K0829063j9041929
11803G3138868l8280594l0359677j9214053k1803143l0631275k7081402J099992
$$ plain form
11796 -93131284 -48355352 19020313 55348388 30246231 -17849981 -24492407 12822434
11789 12822434 30150402 -8416703 -56581668 -53895750 -9475464 22480393 23982715
11782 23982715 23329540 36999476 48320119 44419298 35243410 29730668 24375361 20968421
11774 20968421 27241929 34853699 24775733 636720 -11011714 -1013103 9590415
11767 9590415 6253288 2243236 10484299 20447624 18160653 5223983 -16523923 -52698792
11759 -52698792 -90285892 -92213781 -45669350 5991821 11368915 -23210725 -47363216
11752 -47363216 -35886920 -11441429 -1918242 -7825608 -16487805 -21877083 -22168656 -17329651
11744 -17329651 -16146190 -30287693 -57234702 -81938516 -94293746 -89980306 -60523568
$$ packed form
11796i3131284M4775932O7375665L6328075k5102157m8096212o642426L7314841
11789A2822434J7327968l8567105m8164965K685918M4420286L1955857J502322
11782B3982715o53175J3669936J1320643l900821r175888n512742n355307l406940
11774B0968421O273508P611770j0077966k4139013j1648434R998611J0603518
11767I590415l337127m010052Q241063R963325k286971j2936670k1747906l6174869
11759e2698792l7587100j927889M6544431N1661171N377094l4579640k4152491
11752d7363216J1476296K4445491R523187n907366q662197n389278k91573M839005
11744a7329651J183461j4141503k6947009k4703814j2355230M313440K9456738
$$ plain form
11737 -60523568 -7675546 34478562 24911654 -26793381 -59083090 -32861360 18465888
11730 18465888 35843878 8936731 -24360575 -35128559 -26028750 -5633732 22269487
11723 22269487 40934319 27443885 -9823303 -28802003 -6619107 27508990 32739446
11716 32739446 11127931 -3856368 -879480 -2667044 -25639784 -54995474 -66973003
11709 -66973003 -55369382 -27879244 5270358 28346453 23019865 -9701650 -40346132
11702 -40346132 -38550803 -4680178 35252090 57286639 51552204 19004364 -24967754
11695 -24967754 -49596593 -32453363 13297393 49934357 55526478 41101011 27835693
11688 27835693 22226835 17588559 7421698 -8245793 -21862346 -21801229 -4147381 20083661
$$ packed form
11737f0523568N2848022M2154108r566908n1705035l2289709K6221730N1327248
11730A8465888J7377990k6907147l3297306j0767984R099809K0395018K7903219
11723B2269487J8664832j3490434l7267188j8978700K2182896L4128097N230456
11716C2739446k1611515j4984299K976888j787564k2972740k9355690j1977529
11709f6973003J1603621K7490138L3149602K3076095n326588l2721515l0644482
11702d0346132J795329L3870625L9932268K2034549n734435l2547840m3972118
11695b4967754k4628839J7143230M5750756L6636964N592121j4425467j3265318
11688B7835693n608858m638276j0166861j5667491j3616553O1117J7653848K4231042
$$ plain form
11680 20083661 36665453 41201446 31210693 -1415617 -50073138 -79101597 -61442997
11673 -61442997 -23918797 -16247186 -35028207 -25974370 26102279 63465795 43123584
11666 43123584 8271907 21233517 61235672 53797699 -12214364 -63256998 -43983294
11659 -43983294 14268598 46472910 31741121 -5184953 -36800731 -51219745 -48612182
11652 -48612182 -40021833 -37085347 -33500586 -12511672 23077664 50137704 58477675 58697774
11644 58697774 51974886 25023389 -12919129 -23887578 6249203 40135182 39856662
11637 39856662 17696994 6207305 2938149 -18123885 -56018496 -81262470 -78118492
11630 -78118492 -57064865 -30031654 -1456071 19946631 25931597 20994826 8973711
$$ packed form
11680B0083661J6581792M535993r990753l2626310m8657521k9028459J7658600
11673f1442997L7524200P671611j8781021R053837N2076649L7363516k0342211
11666D3123584l4851677J2961610M0002155p437973o6012063n1042634J9273704
11659d3983294N8251892L2204312j4731789l6926074l1615778j4419014K607563
11652d8612182Q590349K936486L584761K0988914L5589336K7060040Q339971K20099
11644E8697774o722888k6951497l7942518j0968449L0136781L3885979k78520
11637C9856662k2159668j1489689l269156k1062034l7894611k5243974L143978
11630g8118492K1053627K7033211K8575583K1402702N984966m936771j2021115
$$ plain form
11623 8973711 -19884167 -61067272 -72350974 -20770306 54094812 73538066 23375164
11616 23375164 -24510331 -11999578 30940920 43000111 22855733 18474103 46673153
11609 46673153 71569463 60658074 22490522 -18631605 -53802528 -82219217 -96692824
11602 -96692824 -94611523 -90199899 -98694983 -113660432 -113555822 -89275573 -54356425 -27734201
11594 -27734201 -16758762 -19448446 -30978173 -38920088 -23703150 17561648 51202474
11587 51202474 34883448 -26507859 -75625164 -70941344 -41271884 -45643749 -90607266
11580 -90607266 -121596659 -97755037 -41870180 -3705299 -1607013 -19434805 -39866381
11573 -39866381 -56595349 -65211826 -64626851 -62678133 -63046305 -51793977 -14684289 34252725
$$ packed form
11623H973711k8857878m1183105j1283702N1580668P4865118J9443254n0162902
11616B3375164m7885495J2510753M2940498J2059191k0144378m381630K8199050
11609D6673153K4896310j0911389l8167552m1122127l5170923k8416689j4473607
11602i6692824K081301M411624q495084j4965449J04610K4280249L4919148K6622224
11594b7734201J0975439k689684j1529727p941915J5216938M1264798L3640826
11587E1202474j6319026o1391307m9117305M683820K9669460m371865m4963517
11580i0607266l0989393K3841622N5884857L8164881K098286j7827792k0431576
11573c9866381j6728968q616477N84975J948718l68172J1252328L7109688M8937014
$$ plain form
11565 34252725 58346688 34938724 -23933931 -86334820 -124998719 -129134613 -105665239
11558 -105665239 -73109485 -47534955 -33273399 -30447465 -44309098 -76005080 -108499579
11551 -108499579 -115812706 -87916690 -38268604 10972045 42537417 49686662 42950794
11544 42950794 46067770 67473334 80801734 57083712 13582657 -1376141 21261915
11537 21261915 33282550 2129867 -33859245 -19298669 34786605 67951169 59104662
11530 59104662 46772656 57187492 64214594 41528809 10483350 3160760 9479865
11523 9479865 -1441765 -28025810 -42083617 -35191358 -23405788 -14151154 -3827951
11516 -3827951 -2900841 -26146499 -58972788 -71768156 -70183999 -88930985 -126342483 -131962940
$$ packed form
11565C4252725K4093963k3407964n8872655o2400889l8663899m135894K3469374
11558a05665239L2555754K5574530J4261556K825934j3861633l1695982l2494499
11551a08499579p313127K7896016M9648086M9240649L1565372P149245o735868
11544D2950794L116976K1405564J3328400k3718022m3501055j4958798K2638056
11537B1261915J2020635l1152683l5989112J4560576N4085274L3164564q846507
11530E9104662j2332006J0414836P027102k2685785l1045459p322590O319105
11523I479865j0921630k6584045j4057807O892259J1785570R254634J0323203
11516c827951R27110k3245658l2826289j2795368J584157j8746986l7411498n620457
$$ plain form
11508 -131962940 -82427834 -26523982 -18937288 -42738108 -41365691 -5185537 22474006
11501 22474006 16825246 1152288 45860 4245356 -3088413 -15142154 -14868967 -835229
11493 -835229 16142035 30709723 45313672 60278869 67577882 54133539 17205750
11486 17205750 -19485852 -21370450 9051530 18168183 -35064095 -112770851 -134196093
11479 -134196093 -78261403 -9666939 7594887 -17010658 -34707963 -28609032 -19000214
11472 -19000214 -19758685 -22476331 -14861679 8493974 45149303 76423009 73033037 30322017
11464 30322017 -14294372 -22160215 -1115833 11829094 4623634 -3583556 -5076007 -16376450
11456 -16376450 -40717584 -49815501 -21578634 25283737 55231224 61490004 66331664
$$ packed form
11508a31962940M9535106N5903852P586694k3800820J372417L6180154K7659543
11501B2474006n648760j5672958j106428M199496p333769j2053741K73187J4033738
11493h35229J6977264J4567688J4603949J4965197P299013j3444343l6927789
11486A7205750l6691602j884598L0421980R116653n3232278p7706756k1425242
11479a34196093N5934690O8594464J7261826k4605545j7697305O098931R608818
11472a9000214p58471k717646P614652K3355653L6655329L1273706l389972m2711020
11464C0322017m4616389p865843K1044382J2944927p205460q207190j492451j1300443
11456a6376450k4341134r097917K8236867M6862371K9947487O258780M841660
$$ plain form
11449 66331664 81467262 90078333 73575267 41080876 20524992 25169235 38995537
11442 38995537 36141619 8364806 -28413113 -49333666 -40685537 -11138689 14783314
11435 14783314 21516057 21748974 39175157 70121527 82411305 62005121 35288281
11428 35288281 24252702 7839321 -35432272 -70218772 -43794308 24848052 56072447
11421 56072447 18624074 -32478209 -46350682 -41823621 -48610379 -45364464 -10281204
11414 -10281204 17217020 -7878489 -53654260 -54863345 -15577466 4942210 -5442416
11407 -5442416 -2478396 22289766 22143151 -14770814 -33106258 -862663 34401454 23196066
11399 23196066 -7258091 -3484020 26207780 30300892 -2097449 -27576639 -11719480
$$ packed form
11449F6331664J5135598Q611071j6503066l2494391k0555884M644243J3826302
11442C8995537k853918k7776813l6777919k0920553Q648129K9546848K5922003
11435A4783314O732743K32917J7426183L0946370J2289778k0406184k6716840
11428C5288281j1035579j6413381m3271593l4786500K6424464O8642360L1224395
11421E6072447l7448373n1102283j3872473M527061o786758L245915L5083260
11414a0281204K7498224k5095509m5775771j209085L9285879K0519676j0384626
11407e442416K964020K4768162j46615l6913965j8335444L2243595L5264117j1205388
11399B3196066l0454157L774071K9691800M093112l2398341k5479190J5857159
$$ plain form
11392 -11719480 31506442 62304310 53863222 13334277 -22195453 -21747069 -126769
11385 -126769 -935952 -33593885 -59570753 -53927276 -39884020 -38698115 -29510661 3196022
11377 3196022 22205289 -12436700 -73674780 -99304637 -74759485 -35836413 -7556263
11370 -7556263 7599587 -3303308 -49380927 -95432669 -94630942 -61166856 -52234170 -75852068
11362 -75852068 -80562774 -47742048 -25710188 -45013579 -63336676 -36080336 9412250
11355 9412250 18481298 -9257761 -30809107 -25356565 -5354681 14988635 20701926 -12519503
11347 -12519503 -82777022 -134368433 -113244795 -41918437 6076589 2383820 -11187954
11340 -11187954 4680425 37348962 59550859 73251378 89665766 95083164 69003148
$$ packed form
11392a1719480M3225922L0797868q441088m0528945l5529730M48384K1620300
11385a26769q09183l2657933k5976868N643477J4043256J185905R187454L2706683
11377C196022J9009267l4641989o1238080k5629857K4545152L8923072K8280150
11370g556263J5155850j0902895m6077619m6051742Q01727L3464086Q932686k3617898
11362g5852068m710706L2820726K2031860j9303391j8323097K7256340M5492586
11355I412250R069048k7739059k1551346N452542K0001884K0343316N713291l3221429
11347a2519503p0257519n1591411K1123638P1326358M7995026l692769j3571774
11340a1187954J5868379L2668537K2201897J3700519J6414388N417398k6080016
$$ plain form
11333 69003148 24010873 -767467 12271676 34796371 24479849 -23519398 -66759389
11326 -66759389 -64583016 -30400854 -15318743 -36305612 -49090368 -13068474 43129477
11319 43129477 57257443 20391710 -14704090 -10662901 12249251 19060962 3295123
11312 3295123 -28995406 -77793683 -125820266 -132523227 -86364423 -36701168 -35342278
11305 -35342278 -65739041 -70327784 -32649577 13784034 49549901 87586090 121071774
11298 121071774 110458058 50158486 1363577 16876910 64787382 73384896 31655437
11291 31655437 -6652117 -11175269 -10279755 -27895061 -39306536 -19718784 4698340
11284 4698340 -4645124 -35492502 -44358255 -25161132 -13199802 -25246159 -41497992
$$ packed form
11333F9003148m4992275k4778340J3039143K2524695j0316522m7999247m3239991
11326f6759389K176373L4182162J5082111k0986869j2784756L6021894N6197951
11319D3129477J4127966l6865733l5095800M041189K2912152O811711j5765839
11312C295123l2290529m8798277m8026583o702961M6158804M9663255J358890
11305c5342278l0396763m588743L7678207M6433611L5765867L8036189L3485684
11298A21071774j0613716o0299572m8794909J5513333M7910472Q597514m1729459
11291C1655437l8307554m523152Q95514j7615306j1411475J9587752K4417124
11284D698340r343464l0847378q865753J9197123J1961330j2046357j6251833
$$ plain form
11277 -41497992 -52193445 -75558360 -111826179 -122348149 -84819320 -37065006 -29832768
11270 -29832768 -58058894 -76254169 -66340910 -49691399 -39021638 -20760449 9395903
11263 9395903 28877638 18257152 -15386872 -52256682 -74288431 -63156381 -12870671
11256 -12870671 47498328 72730887 55467234 34821092 39401590 52605753 52214781
11249 52214781 50664712 65893849 78990786 58978377 14981409 -14089217 -15948228
11242 -15948228 -16547063 -35509988 -60851663 -73146919 -70338517 -62214225 -58261224 -63522232
11234 -63522232 -70651852 -58889929 -20615975 14959262 9662028 -31622947 -63115696
11227 -63115696 -57220100 -36096217 -35681159 -60798472 -86417716 -85164371 -47205697 6301371
$$ packed form
11277d1497992j0695453k3364915l6267819j0521970L7528829M7754314P232238
11270b9832768k8226126j8195275R913259J6649511J0669761J8261189L0156352
11263I395903J9481735j0620486l3644024l6869810k2031749J1132050N0285710
11256a2870671O0368999K5232559j7263653k0646142M580498J3204163l90972
11249E2214781j550069J5229137J3096937k0012409m3996968k9070626j859011
11242a5948228n98835j8962925k5341675j2295256K808402Q124292L953001n261008
11234f3522232p129620J1761923L8273954L5575237n297234m1284975l1492749
11227f3115696N895596K1123883M15058k5117313k5619244J253345L7958674N3507068
$$ plain form
11219 6301371 25506743 -22270349 -96308063 -106004102 -17619865 88962189 106209395
11212 106209395 26856567 -52935949 -54456426 -496301 32104429 9982224 -31694812
11205 -31694812 -44880283 -22013163 6785615 11663963 -10395315 -39812211 -56454658
11198 -56454658 -56438543 -50778330 -50225265 -52496853 -46255690 -28913084 -15863892 -24236318
11190 -24236318 -49138844 -68308550 -72927514 -77217576 -87440804 -80399431 -34920358
11183 -34920358 27159906 59508343 47954284 21409846 5513094 -4708071 -18463831
11176 -18463831 -26155036 -19722511 -12317518 -17351687 -24855654 -18162855 -1345121 7541872
11168 7541872 681031 -15528415 -29597842 -27130840 598954 36795901 45477742 15692340
$$ packed form
11219F301371J9205372m7777092p4037714r696039Q8384237J06582054J7247206
11212A06209395p9352828p9792516j520477N3960125L2600730k2122205m1677036
11205c1694812j3185471K2867120K8798778M878348k2059278k9416896j6642447
11198e6454658J6115N660213N53065k271588O241163J7342606J3049192q372426
11190b4236318k4902526j9169706m618964m290062j0223228P041373M5479073
11183c4920358O2080264L2348437j1554059k6544438j5896752j0221165j3755760
11176a8463831p691205O432525P404993n034169p503967O692799J6817734Q886993
11168G541872o860841j6209446j4069427K467002K7729794L6196947Q681841k9785402
$$ plain form
11160 15692340 -16497198 -10742478 26704248 56585941 58157177 42068368 21144465
11153 21144465 -3668039 -29056578 -44506377 -45950722 -40232005 -35219968 -34768646 -38918081
11145 -38918081 -40976683 -33600632 -25677442 -38106210 -71667459 -97748245 -95677876 -78053329
11137 -78053329 -61735611 -40401767 -10652392 4031252 -9898211 -22587064 -6688123
11130 -6688123 7733357 -24191603 -82506033 -104353051 -77496354 -50444136 -49166959
11123 -49166959 -47536212 -29966427 -19337896 -23647851 -15745553 8488223 9869898 -25572809
11115 -25572809 -53438946 -41877615 -21870471 -25713514 -28631260 -2282665 21950964
11108 21950964 3126566 -34291039 -39830120 -22494155 -30832553 -67319364 -88111172
$$ packed form
11160A5692340l2189538N754720L7446726K9881693J571236j6088809k0923903
11153B1144465k4812504k5388539j5449799j444345N718717N012037M51322m149435
11145c8918081k058602P376051P923190j2428768l3561249k6080786K070369J7624547
11137g8053329J6317718K1333844K9749375J4683644j3929463j2688853J5898941
11130f688123J4421480l1924960n8314430k1847018K6856697K7052218J277177
11123d9166959J630747J7569785J0628531m309955P902298K4233776J381675l5442707
11115b5572809k7866137J1561331K0007144l843043k917746K6348595K4233629
11108B1950964j8824398l7417605n539081J7335965q338398l6486811k0791808
$$ plain form
11101 -88111172 -76348810 -53226902 -25070948 16746805 47821107 29770829 -18915002
11094 -18915002 -37410930 -17925358 -18674036 -62488285 -92394994 -63979038 -19697693
11087 -19697693 -21049817 -54080710 -60138639 -30451175 -10930897 -25577701 -48554874
11080 -48554874 -53442802 -46556528 -41442923 -33108456 -13170868 9505300 19537694 18260911
11072 18260911 23713072 45797606 67758514 62284384 29990063 7946385 23224687
11065 23224687 49895795 41434023 2074728 -13224733 19250764 51954275 36547988
11058 36547988 -150746 5531065 56983667 86884031 46756681 -33285994 -88540887
11051 -88540887 -93272767 -69699863 -44280132 -22876248 -6007039 -4074404 -23976775
$$ packed form
11101h8111172J1762362K3121908K8155954M1817753L1074302j8050278m8685831
11094a8915002j8495928J9485572p48678m3814249k9906709K8415956M4281345
11087a9697693j352124l3030893o057929K9687464J9520278j4646804k2977173
11080d8554874m887928O886274N113605Q334467J9937588K2676168J0032394j276783
11072A8260911N452161K2084534K1960908n474130l2294321k2043678J5278302
11065B3224687K6671108q461772l9359295j5299461L2475497L2703511j5406287
11058C6547988l6698734N681811N1452602K9900364m0127350q0042675n5254893
11051h8540887m731880K3572904K5419731K1403884J6869209J932635j9902371
$$ plain form
11044 -23976775 -49574476 -52081932 -24229700 8113396 18567025 14142199 19515666
11037 19515666 34558813 33725435 11543319 -41820 23655159 60833592 72648807
11030 72648807 57404236 48570246 65044062 89633189 97615325 82997178 50829312
11023 50829312 5264818 -41427673 -62657334 -39729605 10164150 42613294 31318270
11016 31318270 -1213216 -10529620 12178611 27680847 6016836 -23742798 -10173776
11009 -10173776 44100302 82542178 75386918 56273780 60050325 68797898 54297145
11002 54297145 35342368 44387899 64851867 58256455 36996510 46454183 78330124
10995 78330124 70355305 5749630 -53285374 -59329654 -46523007 -63608165 -93602203
$$ packed form
11044b3976775k5597701k507456K7852232L2343096J0453629m424826N373467
11037A9515666J5043147q33378k2182116j1585139K3696979L7178433J1815215
11030G2648807j5244571q833990J6473816K4589127P982136j4618147l2167866
11023E0829312m5564494m6692491k1229661K2927729M9893755L2449144j1295024
11016C1318270l2531486r316404K2708231J5502236k1664011k9759634J3569022
11009a0173776N4274078L8441876p155260j9113138L776545Q747573j4500753
11002E4297145j8954777R045531K0463968o595412k1259945R457673L1875941
10995G8330124p974819o4605675n9035004o044280J2806647j7085158k9994038
$$ plain form
10988 -93602203 -92880612 -69578001 -62671428 -69106259 -53915561 -19448711 -3729125 -12872843
10980 -12872843 -12559477 8721334 22519132 17085492 18152349 34446299 32271140 -7524702
10972 -7524702 -49222678 -52669159 -31467598 -25236883 -38070687 -40603418 -18857541 9424734
10964 9424734 18632715 -4211811 -48989621 -77034111 -49407294 18070531 55000861
10957 55000861 20410804 -40556840 -60151401 -41404508 -39821168 -70053045 -88542773
10950 -88542773 -67606367 -31723228 -10223104 -1946449 -1290645 -15250435 -35909480
10943 -35909480 -35757216 -11939931 2334 -21487890 -50558839 -54752400 -36959780
10936 -36959780 -14011009 12373757 35850134 31027710 -6644335 -35889247 -22318391
$$ packed form
10988i3602203P21591K3302611O906573o434831J5190698L4466850J5719586r143718
10980a2872843L13366K1280811J3797798n433640J066857J6293950k175159l9795842
10972g524702m1697976l446481K1201561O230715j2833804k532731K1745877K8282275
10964I424734R207981k2844526m4777810k8044490K7626817O7477825L6930330
10957E5000861l4590057o0967644j9594561J8746893J583340l0231877j8489728
10950h8542773K0936406L5883139K1500124Q276655O55804j3959790k0659045
10943c5909480J52264K3817285J1942265k1490224k9070949m193561J7792620
10936c6959780K2948771K6384766K3476377m822424l7672045k9244912J3570856
$$ plain form
10929 -22318391 9173938 14954810 2345950 12259387 48172133 72706290 69209117
10922 69209117 58141369 50546851 31346022 -1968252 -24420654 -21242322 -8753632
10915 -8753632 -5641525 -10796629 -18303123 -27042749 -28093383 -10833106 11764643 14070900
10907 14070900 505751 3092621 27085023 38238886 21116661 8506754 24780767
10900 24780767 38417034 10937327 -34778237 -42351284 -5764434 19696623 -8903235
10893 -8903235 -73417653 -124716405 -132451041 -98134048 -44344921 -2172952 8352004
10886 8352004 -3659095 -11068979 -1640085 10913948 9946039 -3957806 -19790610 -30047470
10878 -30047470 -31429403 -21967203 -5297496 8206392 11110051 7139886 6579877 15245582
$$ packed form
10929b2318391L1492329N780872j2608860R913437L5912746K4534157l497173
10922F9209117j1067748p594518j9200829l3314274k2452402L178332J2488690
10915h753632L112107n155104p506494q739626j050634J7260277K2597749K306257
10907A4070900j3565149K586870K3992402J1153863j7122225j2609907J6274013
10900B4780767J3636267k7479707m5715564p573047L6586850K5461057k8599858
10893h903235o4514418n1298752p734636L4316993N3789127M2171969J0524956
10886H352004j2011099p409884R428894J2554033r67909j3903845j5832804j0256860
10878c0047470j381933R462200J6669707J3503888K903659l970165n60009Q665705
$$ plain form
10870 15245582 28100583 30743432 8762771 -38232008 -90321384 -119325686 -109670908
10863 -109670908 -66850409 -8206586 48490313 86807320 91274834 57097590 3649521
10856 3649521 -31094362 -22541188 13500351 37938836 36227603 33685000 52996256 75152669
10848 75152669 66318061 32184790 12952882 22465621 25581454 -9610302 -63609720
10841 -63609720 -90540854 -74040460 -37216922 -8621604 1623001 -933958 -3394318
10834 -3394318 5873199 23679091 30127243 10031563 -28124996 -61454507 -73521757
10827 -73521757 -60851204 -31433307 -5278052 -2028253 -16340381 -19603923 1288737
10820 1288737 22400561 15015456 -16341260 -45585449 -59259867 -59714208 -49315620 -32102694
$$ packed form
10870A5245582J2855001K642849k1980661m6994779n2089376k9004302R654778
10863a09670908M2820499N8643823N6696899L8317007M467514l4177244n3448069
10856C649521l4743883Q553174L6041539K4438485j711233k542603J9311256K2156413
10848G5152669q834608l4133271j9231908R512739L115833l5191756n3999418
10841f3609720k6931134J6500394L6823538K8595318J0244605k556959k460360
10834c394318R267517J7805892O448152k0095680l8156559l3329511j2067250
10827g3521757J2670553K9417897K6155255L249799j4312128l263542K0892660
10820A288737K1111824p385105l1356716k9244189j3674418m54341J0398588J7212926
$$ plain form
10812 -32102694 -16267927 3953466 47059079 100850825 110167685 48408029 -24873852
10805 -24873852 -32272156 12108084 26368731 -10958754 -32760505 -503097 28630158
10798 28630158 -4806165 -66041375 -82604882 -52067624 -28102269 -28517847 -24824757
10791 -24824757 -8963085 -4175498 -10220233 1754359 31410481 40521043 16142940
10784 16142940 -6383219 -1723359 9381782 4191887 -5325265 -7602767 -22215535 -59517498
10776 -59517498 -84841944 -66963197 -35915712 -42130449 -72698034 -63324608 4454837
10769 4454837 69846992 74346260 36466921 17802709 40236292 67264891 57891677
10762 57891677 14461407 -24838002 -28811932 -5004589 9983706 -7206285 -39564189
$$ packed form
10812c2102694J5834767K0221393M3105613N3791746R316860o1759656p3281881
10805b4873852p398304M4380240J4260647l7327485k1801751L2257408K9133255
10798B8630158l3436323o1235210j6563507L0537258K3965355m15578L693090
10791b4824757J5861672M787587o044735J1974592K9656122R110562k4378103
10784A6142940k2526159M659860J1105141n189895r517152k277502j4612768l7301963
10776e9517498k5324446J7878747L1047485o214737l0567585R373426O7779445
10769D454837O5392155M499268l7879339j8664212K2433583K7028599r373214
10762E7891677m3430270l9299409l973930K3807343J4988295j7189991l2357904
$$ plain form
10755 -39564189 -53396992 -41001833 -21328424 -2905610 25921219 62777428 75818311
10748 75818311 42063661 -16630752 -55989434 -57035375 -36591701 -22096305 -30359750
10741 -30359750 -58433731 -80397977 -66887329 -23436369 6988205 -1994507 -23238712
10734 -23238712 -17601506 8361935 19647685 10432507 2925462 -743371 -17509685 -35615571
10726 -35615571 -19818140 25023346 45979937 18148991 -17643133 -20731232 -10935442
10719 -10935442 -26870225 -60729148 -78200562 -77007885 -80137918 -88278857 -83670726 -70543399
10711 -70543399 -68709153 -72370414 -56569665 -23985771 -6132373 -13542047 -19780763 -2957242
10703 -2957242 25994722 43941470 39724000 13536852 -23454016 -46403566 -38957540
$$ packed form
10755c9564189j3832803J2395159J9673409J8422814K8826829L6856209J3040883
10748G5818311l3754650n8694413l9358682j045941K0443674J4495396q263445
10741c0359750k8073981k1964246J3510648M3450960L0424574q982712k1244205
10734b3238712N637206K5963441J1285750r215178p507045l668833j6766314j8105886
10726c5615571J5797431M4841486K0956591k7830946l5792124l088099R795790
10719a0935442j5934783l3858923j7471414J192677l130033q140939M608131J3127327
10711g0543399J834246l661261J5800749L2583894J7853398p409674o238716J6823521
10703b957242K8951964J7946748m217470k6187148l6990868k2949550P446026
$$ plain form
10696 -38957540 -20090647 -22871913 -45928636 -55696033 -39211699 -21364026 -22192803 -30027604
10688 -30027604 -28575814 -20136603 -9421530 5934877 16322810 3466965 -22384915
10681 -22384915 -22472746 13530195 44243507 34752835 5508427 -6056227 -1069065 -148422
10673 -148422 3617525 28678126 59360161 61315172 35132053 14550576 16011542 27231753
10665 27231753 40243238 55064213 53523584 15628135 -32731852 -36943049 5437303
10658 5437303 27898042 -13292960 -72424242 -79234194 -38777264 -15422649 -31889362
10651 -31889362 -41567506 -10315461 26289745 19284063 -14346985 -14696750 27888417 50402173
10643 50402173 4420867 -70049478 -91979367 -44623844 5378785 -3780176 -57686864
$$ packed form
10696c8957540J8866893k781266k3056723r767397J6484334J7847673q28777p834801
10688c0027604J451790Q439211J0715073J5356407J0387933j2855845k5851880
10681b2384915q7831L6002941L0713312r490672k9244408j1564654M987162R20643
10673a48422L765947K5060601L0682035J955011k6183119k0581477J460966J1220211
10665B7231753J3011485J4820975j540629l7895449m8359987m211197M2380352
10658E437303K2460739m1191002n9131282o809952M0456930K3354615j6466713
10651c1889362r678144L1252045L6605206p005682l3631048l49765M2585167K2513756
10643E0402173m5981306p4470345k1929889M7355523N0002629r158961n3906688
$$ plain form
10636 -57686864 -98415463 -99428666 -80230483 -62516623 -43947411 -15834015 16895009
10629 16895009 40395674 43887723 24133056 -11648613 -46440078 -66687354 -75659969
10622 -75659969 -86273083 -102279194 -113787055 -108791927 -83594860 -47602990 -22551338
10615 -22551338 -25415344 -43923515 -44557356 -17652346 5095140 -1019918 -9486151 19217927
10607 19217927 69330500 83266902 43229627 -3897986 -13930206 1447847 7013292
10600 7013292 -4415277 -17783517 -29258329 -48038747 -77188652 -108856376 -128176498
10593 -128176498 -117420097 -76588960 -42064960 -52722007 -89560503 -89407902 -35926278
10586 -35926278 9049196 -5075746 -44504733 -52322434 -39135089 -51105741 -79479587
$$ packed form
10636e7686864m0728599j013203J9198183J7713860J8569212K8113396L2729024
10629A6895009K3500665L492049j9754667l5781669l4791465k0247276q972615
10622g5659969j0613114j6006111j1507861M995128K5197067L5991870K5051652
10615b2551338k864006j8508171o33841K6905010K2747486o115058q466233K8704078
10607A9217927N0112573J3936402m0037275m7127613j0032220J5378053N565445
10600G013292j1428569j3368240j1474812j8780418k9149905l1667724j9320122
10593a28176498J0756401M0831137L4524000j0657047l6838496J52601N3481624
10586c5926278M4975474j4124942l9428987p817701J3187345j1970652k8373846
$$ plain form
10579 -79479587 -75846616 -43687069 -37448409 -67801511 -83200878 -61154833 -44663861
10572 -44663861 -59842428 -67088034 -36372344 -9268306 -30820379 -68039448 -59078389
10565 -59078389 -10926200 15048528 -5522228 -43041076 -74236960 -99113741 -103821861
10558 -103821861 -67809639 -13784961 5027796 -19294860 -35376082 -11030569 20388612
10551 20388612 15634385 -15885440 -33916208 -22634262 3347508 26564266 36306841
10544 36306841 27100210 5893241 -13234950 -30663165 -56538080 -78488223 -66334546
10537 -66334546 -22798775 7230501 811701 -6918680 18272563 51636433 52718265
10530 52718265 35488471 42788913 71105781 78431849 58574961 48920236 61768238
$$ packed form
10579g9479587L632971L2159547O238660l0353102j5399367K2046045J6490972
10572d4663861j5178567p245606L0715690K7104038k1552073l7219069Q961059
10565e9078389M8152189K5974728k0570756l7518848l1195884k4876781m708120
10558a03821861L6012222N4024678J8812757k4322656j6081222K4345513L1419181
10551B0388612m754227l1519825j8030768J1281946K5981770K3216758R742575
10544C6306841r206631k1206969j9128191j7428215k5874915k1950143J2153677
10537f6334546M3535771L0029276o418800p730381K5191243L3363870J081832
10530E2718265j7229794P300442K8316868P326068j9856888r654725J2848002
$$ plain form
10523 61768238 65014029 43375127 25930445 33165531 44279489 40916504 39013586 49293640
10515 49293640 48259029 21550895 -3006134 -3227677 -5800294 -37174631 -66536163 -53415775
10507 -53415775 -25326309 -41966347 -93870628 -106538702 -50617230 17365718 40270845
10500 40270845 26422108 7201279 -14822163 -43313386 -63024606 -71778008 -91541636
10493 -91541636 -114585744 -95118180 -40412907 -42452461 -139425836 -202786733 -77610380
10486 -77610380 182648408 346335828 288142097 126925664 36230111 33988124 40799853
10479 40799853 45203121 88665453 141204844 123596951 43969724 -1378339 26404136
10472 26404136 62316304 56281918 42103695 53167176 59085937 37632088 32698768
$$ packed form
10523F1768238L245791k1638902j7444682P235086J1113958l362985j902918J0280054
10515D9293640j034611k6708134k4557029k21543k572617l1374337k9361532J3120388
10507e3415775K8089466j6640038n1904281j2668074N5921472O7982948K2905127
10500D0270845j3848737j9220829k2023442k8491223j9711220q753402j9763628
10493i1541636k3044108J9467564N4705273k039554r6973375o3360897J25176353
10486g7610380K60258788J63687420n8193731j61216433r0695553k241987O811729
10479D0799853M403268M3462332N2539391j7607893p9627227m5348063K7782475
10472B6404136L5912168o034386j4178223J1063481N918761k1453849m933320
$$ plain form
10465 32698768 77410555 121249535 102695759 46508130 18175744 20214514 8280220
10458 8280220 -17271698 -14078820 20731979 45186845 45072555 43513735 37711467 -3256498
10450 -3256498 -65862214 -85202588 -35476785 27864832 43838618 17408817 -10686606
10443 -10686606 -21775525 -17712343 657615 22940323 26633736 9654181 -3112782
10436 -3112782 -4461282 -20336672 -58095273 -79376339 -57058473 -23292323 -21940861
10429 -21940861 -42597079 -43820221 -18898786 5300416 18846214 34281764 50411427
10422 50411427 51685590 41841255 42721822 57747122 65673011 53374730 30960882 11754648
10414 11754648 -3793628 -21973135 -44987119 -63666347 -57394159 -17061072 26262682
$$ packed form
10465C2698768M4711787M3838980j8553776n6187629k8332386K038770j1934294
10458H280220k5551918L192878L4810799K4454866j14290j558820n802268m0967965
10450c256498o2605716j9340374M9725803O3341617J5973786k6429801k8095423
10443a0686606j1088919M063182J8369958K2282708L693413j6979555j2766963
10436c112782j348500j5875390l7758601k1281066K2317866L3766150J351462
10429b1940861k0656218j223142K4921435K4199202J3545798J5435550J6129663
10422E0411427J274163r844335Q80567J5025300P925889j2298281k2413848j9206234
10414A1754648j5548276j8179507k3013984j8679228O272188M0333087M3323754
$$ plain form
10407 26262682 23118630 -28760108 -72747688 -70661820 -55951090 -75096459 -111965973
10400 -111965973 -117933032 -87294306 -46974727 3220499 72519566 117185432 76518535
10393 76518535 -23428678 -80433839 -53004181 -14631031 -36091200 -80936925 -72172295
10386 -72172295 -12669420 26524031 12970576 -13913718 -11717928 12078530 23855762
10379 23855762 7948049 -23895792 -49932414 -58432461 -56730295 -59945282 -70940943
10372 -70940943 -81084745 -88503568 -96578344 -94636845 -67393669 -29572670 -19376261
10365 -19376261 -43097220 -57325215 -27195246 25710427 58745707 66859734 76463892
10358 76463892 98038780 114359335 107630291 77525332 39802874 18693290 25873759
$$ packed form
10407B6262682l144052n1878738m3987580K085868J4710730j9145369l6869514
10400a11965973n967059L0638726M0319579N0195226O9299067M4665866m0666897
10393G6518535r9947213n7005161K7429658L8373150k1460169m4845725Q764630
10386g2172295N9502875L9193451j3553455k6884294K195790K3796458J1777232
10379B3855762j5907713l1843841k6036622q500047J702166l214987j0995661
10372g0940943j0143802p418823q074776J941499K7243176L7820999J0196409
10365a9376261k3720959j4227995L0129969N2905673L3035280Q114027R604158
10358G6463892K1574888J6320555o729044l0104959l7722458k1109584P180469
$$ plain form
10351 25873759 38244020 20204964 -21339910 -36962849 -8050066 18079344 -3353575
10344 -3353575 -48012282 -65015181 -53922190 -49456902 -52687178 -33295178 9353537
10337 9353537 39662657 38340501 16791377 -17397497 -63926242 -100636475 -97922209
10330 -97922209 -65598311 -42240284 -36045255 -21574518 3006217 7844823 -9529012
10323 -9529012 -10467365 20740608 49197864 49922156 47716597 64803721 72397681 35075739
10315 35075739 -28627064 -71160550 -78883065 -72534078 -63308766 -45845171 -24172406
10308 -24172406 -11947047 -11972140 -18680611 -32397754 -51046425 -60339495 -53997975 -50251093
10300 -50251093 -64018195 -74740943 -49236435 8859899 56313188 55696224 7983861
$$ packed form
10351B5873759J2370261j8039056m1544874j5622939K8912783K6129410k1432919
10344c353575m4658707j7002899J1092991M465288l230276J9392000M2648715
10337I353537L0309120j322156k1549124l4188874m6528745l6710233K714266
10330i7922209L2323898K3358027O195029J4470737K4580735M838606j7373835
10323i529012r38353L1207973K8457256P24292k205559J7087124P593960l7321942
10315C5075739o3702803m2533486p722515O348987R225312J7463595K1672765
10308b4172406J2225359k5093o708471j3717143j8648671r293070O341520L746882
10300e0251093j3767102j0722748K5504508N8096334M7453289o16964m7712363
$$ plain form
10293 7983861 -54288205 -91646184 -83750076 -46834093 -19084228 -18241840 -25270743 -19390568
10285 -19390568 -9161102 -11474843 -20481249 -21774391 -20652695 -28966440 -37242682 -29267063
10277 -29267063 -14983586 -18459422 -37643487 -45346705 -30223384 -10948387 -6831353
10270 -6831353 -15264283 -21726381 -17182558 -5347091 -2571434 -22621783 -51043255 -51200297
10262 -51200297 -13578809 20908772 12768468 -20798970 -36143773 -30399834 -34807560
10255 -34807560 -52128706 -53336967 -39088912 -49327595 -92865911 -116388802 -76205061
10248 -76205061 -5755571 26641243 6831332 -16549590 -5686113 18981615 14517961
10241 14517961 -22316896 -48454153 -30727052 7549748 14467255 -20767510 -54803911
$$ packed form
10293G983861o2272066l7357979P896108L6915983K7749865Q42388p028903N880175
10285a9390568J0229466k313741r006406j293142J121696q313745q276242P975619
10277b9267063J4283477l475836j9184065p703218J5123321J9274997M117034
10270f831353q432930o462098M543823J1835467K775657k0050349k8421472j57042
10262e1200297L7621488L4487581q140304l3567438j5344803N743939m407726
10255c4807560j7321146j208261J4248055j0238683m3538316k3522891M0183741
10248g6205061P0449490L2396814j9809911k3380922J0863477K4667728m463654
10241A4517961l6834857k6137257J7727101L8276800O917507l5234765l4036401
$$ plain form
10234 -54803911 -55139462 -41876281 -39689908 -27413141 18328939 60863749 48728987
10227 48728987 6545932 6380762 48978521 55771895 -1193777 -46144009 -19512552
10220 -19512552 25966666 13085942 -37167030 -49314407 -19023422 -9752225 -42231132
10213 -42231132 -70227325 -67023596 -60907121 -69943428 -66478620 -32385191 1412855 1141658
10205 1141658 -20884013 -32074735 -27067173 -23578146 -30259647 -41198767 -51075630 -60390828
10197 -60390828 -71642861 -84935624 -90220803 -69774829 -24362470 12332874 10906138
10190 10906138 -9656054 -8764801 7913848 -8965573 -70546522 -114393414 -79520642
10183 -79520642 12772043 84803467 91498590 54980858 22287799 16518275 27386994
$$ packed form
10234e4803911l35551J3263181K186373J2276767M5742080M2534810j2134762
10227D8728987m2183055j65170M2597759O793374n6965672m4950232K6631457
10220a9512552M5479218j2880724n0252972j2147377L0290985R271197l2478907
10213d2231132k7996193L203729O116475r036307L464808L4093429L3798046k71197
10205A141658k2025671j1190722N007562L489027o681501j0939120r876863r315198
10197f0390828j1252033j3292763n285179K0445974M5412359L6695344j426736
10190A0906138k0562192Q91253J6678649j6879421o1580949m3846892L4872772
10183g9520642R2292685P2031424O695123l6517732l2693059n769524J0868719
$$ plain form
10176 27386994 29516192 7718676 -26111455 -43485511 -32188378 -10934679 -4606165
10169 -4606165 -14966031 -25391880 -26053498 -23562782 -29492261 -45782956 -59739961 -55250510
10161 -55250510 -35976464 -30574430 -58421037 -96019067 -102820962 -79565614 -67623870
10154 -67623870 -81564360 -80954618 -33901877 25188222 39733562 12284620 -1805050
10147 -1805050 24830887 60342264 69258218 60631856 62194432 73536965 69607583 38681642
10139 38681642 -3715738 -35624615 -50171961 -56824411 -68693435 -87756366 -99159647
10132 -99159647 -84480420 -45417325 -8767081 837081 -9126076 -7061120 21692614
10125 21692614 51997208 46698279 2017755 -47317126 -67716287 -57184710 -32432723
$$ packed form
10176B7386994K129198k1797516l3830131j7374056J1297133K1253699O328514
10169d606165j0359866j0425849o61618K490716n929479j6290695j3957005M489451
10161e5250510J9274046N402034k7846607l7598030o801895K3255348J1941744
10154f7623870j3940490O09742M7052741N9090099J4545340k7448942j4089670
10147a805050K6635937L5511377Q915954q626362J562576J1342533l929382l0925941
10139C8681642m2397380l1908877j4547346o652450j1869024j9062931j1403281
10132i9159647J4679227L9063095L6650244R604162r963157K064956K8753734
10125B1692614L0304594n298929m4680524m9334881k0399161J0531577K4751987
$$ plain form
10118 -32432723 -3140141 27265025 48319524 50310158 41241138 37939938 41332076 37011636
10110 37011636 19679842 -227369 -14999945 -27296670 -37810662 -43321201 -48858120
10103 -48858120 -61355456 -67137028 -38753467 25913508 91301433 121935094 115150697
10096 115150697 87771608 52015810 17710134 -3099363 -11023326 -21163939 -34883063
10089 -34883063 -30249355 1244786 31496911 34856739 30173210 51440517 89180818
10082 89180818 96954031 55028422 -2650983 -29680102 -14277602 17327086 28216949
10075 28216949 2355197 -38031185 -53201196 -36310131 -26552382 -50959303 -74933587
10068 -74933587 -47863799 16244285 51460307 32802496 6499625 14670317 37646615
$$ packed form
10118c2432723K9292582L0405166K1054499J990634r069020l301200L392138m320440
10110C7011636j7331794j9907211j4772576j2296725j0513992n510539n536919
10103d8858120j2497336n781572K8383561O4666975O5387925L0633661o784397
10096A15150697k7379089l5755798l4305676k0809497p923963j0140613j3719124
10089c4883063M633708L1494141L0252125L359828m683529K1267307L7740301
10082H9180818P773213m1925609n7679405k7029119J5402500L1604688J0889863
10075B8216949k5861752m0386382j5170011J6891065R757749k4406921k3974284
10068g4933587K7069788O4108084L5216022j8657811k6302871Q170692K2976298
$$ plain form
10061 37646615 37873960 21838867 20954536 35073559 34029814 5771426 -29613627 -52376224
10053 -52376224 -64739263 -77318333 -90504536 -93120879 -72330102 -27269205 22234417
10046 22234417 48281244 43151356 26616606 19361852 20878008 20601227 15552211 5962083
10038 5962083 -10099851 -22744322 -8067593 38917074 83220937 88046050 65532899
10031 65532899 59866369 81177025 87754384 43726103 -30789853 -82459610 -81007570
10024 -81007570 -38943938 10325575 37676233 31396580 3231566 -20400263 -24840531
10017 -24840531 -22391339 -31716980 -48156826 -49565366 -29451280 -6116844 5488055
10010 5488055 13077127 27473041 39374019 33327060 15646387 7260273 11109918 8846284
$$ packed form
10061C7646615K27345j6035093q84331J4119023j043745k8258388l5385053k2762597
10053e2376224j2363039j2579070j3186203k616343K0790777M5060897M9503622
10046B2234417K6046827n129888j6534750p254754J516156k76781n049016r590128
10038E962083j6061934j2644471J4676729M6984667M4303863M825113k2513151
10031F5532899n666530K1310656O577359m4028281p4515956n1669757J452040
10024h1007570M2063632M9269513K7350658o279653k8165014k3631829m440268
10017b4840531K449192r325641j6439846j408540K0114086K3334436J1604899
10010E488055P589072J4395914J1900978o046959j7680673q386114L849645k263634
$$ plain form
10002 8846284 -5989941 -13601428 2013432 26980212 37352182 31519450 25682405 27605914
9994 27605914 33030430 38846124 39448720 18951283 -26339115 -61194142 -39252499 34051570
9986 34051570 94251771 88842629 33918001 -16592872 -37203805 -42619716 -47550844 -44661182
9978 -44661182 -23754066 8356153 34034545 40697425 28620518 10846822 3881504
9971 3881504 10131961 12805758 -2205384 -24359908 -31895472 -23947891 -21833646 -35886728
9963 -35886728 -48352890 -37382539 -4645413 30488122 52843699 56928889 42362968
9956 42362968 19683641 12952413 36683114 70573976 76220285 43557368 3542756
9949 3542756 -12709406 -10165007 -13387248 -29960062 -47972981 -58556969 -60925154 -52464316
$$ packed form
10002H846284j4836225p611487J5614860K4966780J0371970n832732n837045J923509
9994B7605914N424516N815694O02596k0497437m5290398l4855027K1941643P3304069
9986C4051570O0200201n409142n4924628n0510873k0610933n415911m931128K889662
9978d4661182K0907116L2110219K5678392O662880j2076907j7773696o965318
9971C881504O250457K673797j5011142k2154524p535564P947581K114245j4053082
9963c5886728j2466162J0970351L2737126L5133535K2355577M085190j4565921
9956D2362968k2679327o731228K3730701L3890862N646309l2662917m0014612
9949C542756j6252162K544399l222241j6572814j8012919j0583988k368185Q460838
$$ plain form
9941 -52464316 -34636060 -23389416 -31384467 -43249502 -32316766 302678 29263556
9934 29263556 44658000 55993441 57492044 31160410 -7367647 -13520465 16404968
9927 16404968 30036359 3723748 -10753074 28596424 72664427 52402869 -5422181
9920 -5422181 -14388383 37182092 73115470 51077289 13954397 5263186 12955969 23182505
9912 23182505 54130783 99610523 108334437 64428438 26928509 39804476 59704186
9905 59704186 28344625 -33997196 -66410770 -55178534 -25673979 11334069 45598652
9898 45598652 42265235 -4804774 -36204153 -10721033 20262415 -1608268 -34429647
9891 -34429647 -11321180 27958686 3833967 -41916665 -715515 100513144 124035384
$$ packed form
9941e2464316J7828256J1246644p995051j1865035J0932736L2619444K8960878
9934B9263556J5394444J1335441J498603k6331634l8528057o152818K9925433
9927A6404968J3631391k6312611j4476822L9349498M4068003k0261558n7825050
9920e422181q966202N1570475L5933378k2038181l7122892q691211P692783J0226536
9912B3182505L0948278M5479740Q723914m3905999l7499929J2875967J9899710
9905E9704186l1359561o2341821l2413574J1232236K9504555L7008048L4264583
9898D5598652l333417m7070009l1399379K5483120L0983448k1870683l2821379
9891c4429647K3108467L9279866k4124719m5750632M1201150J01228659K3522240
$$ plain form
9884 124035384 69349778 101727587 254101174 295694054 51612574 -293593309 -408981724
9877 -408981724 -251239869 -80240624 -72734971 -130844131 -104877787 -15874392 30882458
9870 30882458 16857332 -10291387 -39523871 -79875214 -98943432 -65824554 -19011271
9863 -19011271 -18767903 -59133862 -87571313 -83960530 -61577770 -17977014 49645238 98824341
9855 98824341 80225514 17792410 -12094561 13871604 39202619 18243023 -21892090
9848 -21892090 -34327431 -21890699 -19642278 -37621118 -56271110 -64394234 -71490379 -85018164
9840 -85018164 -94933329 -83523904 -44657130 3975933 28365579 9844223 -28747352
9833 -28747352 -44318785 -25842100 -6355526 -12797492 -25694573 -9725070 30949832
$$ packed form
9884A24035384n4685606L2377809J52373587M1592880k44081480l45205883j15388415
9877d08981724J57741855J70999245P505653n8109160K5966344Q9003395M6756850
9870C0882458j4025126k7148719k9232484m0351343j9068218L3118878M6813283
9863a9011271K43368m0365959k8437451L610783K2382760M3600756O7622252M9179103
9855I8824341j8598827o2433104k9886971K5966165K5331015k0959596m0135113
9848b1892090j2435341J2436732K248421j7978840j8649992q123124p096145j3527785
9840h5018164r915165J1409425L8866774M8633063K4389646j8521356l8591575
9833b8747352j5571433J8476685J9486574o441966j2897081J5969503M0674902
$$ plain form
9826 30949832 55838623 42866525 13196071 -3832794 -7468975 -14311599 -26232121
9819 -26232121 -27659294 -10705982 11105898 16913662 641545 -21905417 -26904831 -7488311
9811 -7488311 13664390 5805645 -29660315 -52590035 -32153943 9268810 23879534
9804 23879534 4936028 -8315435 560303 -7008308 -58429371 -108078293 -93761246
9797 -93761246 -37189930 -22649923 -69038002 -93465518 -38005604 29228264 3232555
9790 3232555 -104773679 -179690778 -158000993 -93715385 -56202838 -37194859 669632
9783 669632 41925966 44515552 15624057 375131 7210183 892480 -29259718 -46584722
9775 -46584722 -27022258 1102939 622393 -22517931 -36755955 -31236197 -17075680 1466115
$$ packed form
9826C0949832K4888791j2972098k9670454j7028865l636181o842624j1920522
9819b6232121j427173J6953312K1811880N807764j6272117k2546962m999414J9416520
9811g488311K1152701p858745l5465960k2929720K0436092M1422753J4610724
9804B3879534j8943506j3251463Q875738p568611n1421063m9648922J4317047
9797i3761246N6571316J4540007m6388079k4427516N5459914O7233868k5995709
9790C232555j08006234p4917099K1689785O4285608L7512547J9007979L7864491
9783F69632M1256334K589586k8891495j5248926O835052o317703l0152198j7325004
9775d6584722J9562464K8125197m80546k3140324j4238024N519758J4160517J8541795
$$ plain form
9767 1466115 26824236 45109075 32059528 -12617219 -56162683 -66617942 -45438042
9760 -45438042 -20774459 -15704269 -27556853 -33888671 -15873561 21800528 53991050
9753 53991050 59643475 40411357 12499827 -12613598 -31004423 -36957727 -26281786
9746 -26281786 -9721178 -8103989 -27307835 -48408026 -50481769 -35277488 -20852788
9739 -20852788 -16652877 -14066286 461360 28750300 55058363 55225149 20187809 -24793733
9731 -24793733 -36994974 -4451245 33370684 29778200 -12903779 -52156619 -63028021
9724 -63028021 -57988183 -49178214 -27430221 6006002 21282188 2378281 -16876397
9717 -16876397 5269284 54914690 78568121 56669142 22072693 2769045 -14291998
$$ packed form
9767A466115K5358121J8284839j3049547m4676747m3545464j0455259K1179900
9760d5438042K4663583N070190j1852584o331818J8015110L7674089L2190522
9753E3991050N652425j9232118k7911530k5113425j8390825n953304J0675941
9746b6281786J6560608J617189j9203846k1100191k073743J5204281J4424700
9739b0852788M199911K586591J4527646K8288940K6308063J66786l5037340m4981542
9731b4793733j2201241L2543729L7821929l592484m2681979l9252840j0871402
9724f3028021N039838Q809969K1747993L3436223J5276186j8903907j9254678
9717a6876397K2145681M9645406K3653431k1898979l4596449j9303648j7061043
$$ plain form
9710 -14291998 -48056683 -84615105 -95216906 -73207009 -35867408 -4605378 5783921
9703 5783921 -4057705 -10902483 7510161 32719607 18701106 -39179667 -82894082 -68814081
9695 -68814081 -34554296 -46093594 -98615840 -121410175 -78323371 -13985369 11108612
9688 11108612 -8917325 -38354722 -52382672 -53028806 -50846035 -51178839 -51127572 -40412655
9680 -40412655 -13138411 18040235 31338007 21468123 2577403 -14033024 -27629515
9673 -27629515 -33248986 -21243160 2394187 15160774 5501165 -14997228 -30925652
9666 -30925652 -35759895 -22606863 12439928 48624134 48230530 2748044 -47848902 -58753761
9658 -58753761 -28829788 7144374 18614351 -1210518 -38958374 -68890291 -70663202
$$ packed form
9710a4291998l3764685l6558422j0601801K2009897L7339601L1262030J0389299
9703E783921r841626o844778J8412644K5209446j4018501n7880773m3714415J4080001
9695f8814081L4259785j1539298n2522246k2794335M3086804O4338002K5093981
9688A1108612k0025937k9437397j4027950o46134K182771l32804N1267J0714917
9680d0412655K7274244L1178646J3297772r869884j8890720j6610427j3596491
9673b7629515n619471J2005826K3637347J2766587r659609k0498393j5928424
9666c0925652m834243J3153032L5046791L6184206l93604m5482486n0596946j0904859
9658e8753761K9923973L5974162J1469977j9824869l7747856k9931917j772911
$$ plain form
9651 -70663202 -52172878 -41507773 -47533924 -48079189 -29319703 -13483195 -27206742 -61067165
9643 -61067165 -83094559 -78870227 -57884365 -32946856 -13278205 -6604169 -9600806 -7105024
9635 -7105024 3894631 4295371 -16671841 -38540732 -36900359 -16817595 804604 7417871
9627 7417871 399820 -28069995 -67830526 -80000998 -44609191 552150 7731173 -10816451
9619 -10816451 -4923541 32646381 56106086 35925091 -7317368 -41467887 -53301230
9612 -53301230 -37245701 3587867 39037971 36809746 13119063 15476650 47516083
9605 47516083 59952676 30239170 -2109221 -4242133 -791264 -18630062 -28090333 9949805
9597 9949805 69499104 85598115 40357800 -22743294 -61966165 -74317116 -74374952 -73433633
$$ packed form
9651g0663202J8490324J0665105o026151n45265J8759486J5836508j3723547l3860423
9643f1067165k2027394M224332K0985862K4937509J9668651O674036k996637K495782
9635g105024J0999655M00740k0967212k1868891J640373K0082764J7622199O613267
9627G417871p018051k8469815l9760531j2170472L5391807M5161341P179023j8547624
9619a0816451N892910L7569922K3459705k0180995m3242459l4150519j1833343
9612e3301230J6055529M0833568L5450104k228225k3690683K357587L2039433
9605D7516083J2436593k9713506l2348391k132912L450869j7838798r460271L8040138
9597I949805N9549299J6099011m5240315o3101094l9222871j2350951n7836R41319
$$ plain form
9589 -73433633 -80274856 -92644159 -88228999 -51272599 -6438755 2842740 -27620263 -53853343
9581 -53853343 -40497083 -4011677 12443742 -7588127 -38208178 -43771243 -18758150
9574 -18758150 8706981 14877915 13808605 35692876 72898140 76070319 19847421 -52909204
9566 -52909204 -80013177 -57560260 -37765850 -56012249 -91416820 -103283379 -80760259
9559 -80760259 -45822862 -22532808 -14126195 -5920384 12417438 28399361 18807583 -16144836
9551 -16144836 -44702364 -40092401 -12525389 7058814 1981424 -23314972 -54421842
9544 -54421842 -69429151 -49094454 -4451878 24486601 19168440 8784425 18852072
9537 18852072 22131857 -15906778 -65504888 -64263362 -13619417 17474014 -7020000
$$ packed form
9589g3433633o841223j2369303M415160L6956400M4833844R281495l0463003k6233080
9581e3853343J3356260L6485406J6455419k0031869l0620051n563065K5013093
9574a8758150K7465131O170934j069310K1884271L7205264L172179n6222898p2756625
9566e2909204k7103973K2452917J9794410j8246399l5404571j1866559K2523120
9559h0760259L4937397K3290054Q406613Q205811J8337822J5981923r591778l4952419
9551a6144836k8557528M609963K7567012J9584203n077390k5296396l1106870
9544e4421842j5007309K0334697M4642576K8938479n318161j0384015J0067647
9537A8852072L279785l8038635m9598110J241526N0643945L1093431k4494014
$$ plain form
9530 -7020000 -45674635 -54471653 -48284916 -54271183 -53820642 -17348403 36228643 62818232
9522 62818232 56822264 48747481 51449443 47972093 27155984 -2013517 -28523041 -44770228
9514 -44770228 -39729287 -13022693 10683911 7260134 -14698938 -33181677 -51217964
9507 -51217964 -81196532 -102319959 -80785892 -33843935 -22900647 -65989887 -103356989
9500 -103356989 -78703137 -16513710 18246746 8823386 -7403006 -4144961 8002131
9493 8002131 16749120 26550130 34902491 25577602 -1216819 -19665969 -14657562 -4446934
9485 -4446934 -10111467 -21924862 -16878776 3428016 14214671 1145248 -25478100 -47605215
9477 -47605215 -55832746 -50428371 -38597889 -30134151 -26256300 -15901786 7020803 28614144
$$ packed form
9530g020000l8654635q797018O186737n986267M50541L6472239N3577046K6589589
9522F2818232n995968q074783K701962l477350k0816109k9169501k6509524j6247187
9514d4770228N040941K6706594K3706604l423777k1959072j8482739j8036287
9507e1217964k9978568k1123427K1534067M6941957J0943288m3089240l7367102
9500a03356989K4653852O2189427L4760456r423360j6226392L258045J2147092
9493H002131Q746989R801010Q352361r324889k6794421j8449150N008407J0210628
9485d446934n664533j1813395N046086K0306792J0786655j3069423k6623348k2127115
9477d7605215q227531N404375J1830482Q463738L877851J0354514K2922589K1593341
$$ plain form
9469 28614144 31655519 22971507 25352476 41073585 44146453 18138394 -15230116 -20902469
9461 -20902469 4423165 27934496 20956367 -8695126 -29598087 -25339206 -11422538
9454 -11422538 -11283326 -23190869 -23209291 -1847241 18090784 11119740 -16275269 -37653993
9446 -37653993 -44619445 -51002329 -61736915 -61965206 -43164222 -19897858 -10606084 -15836710
9438 -15836710 -23288965 -22207482 -7992086 13900633 25505435 14047207 -5248373
9431 -5248373 -4017152 17680188 28872716 14193922 -4810585 -7936347 -6511054 -14950838
9423 -14950838 -19438573 -1890929 25796957 38759253 33247220 19692068 2141724
9416 2141724 -9699551 6911959 49587855 70577359 37050409 -10234843 -9321127 27313822
$$ packed form
9469B8614144L041375q684012K380969J5721109L072868k6008059l3368510n672353
9461b0902469K5325634K3511331o978129k9651493k0902961M258881J3916668
9454a1422538J39212j1907543j8422K1362050J9938025o971044k7395009k1378724
9446c7653993o965452o382884j0734586k28291J8800984K3266364R291774n230626
9438a5836710p452255J081483J4215396K1892719J1604802j1458228j9295580
9431e248373J231221K1697340J1192528j4678794j9004507l125762J425293q439784
9423a4950838m487735J7547644K7687886J2962296n512033j3555152j7550344
9416B141724j1841275J6611510M2675896K0989504l3526950m7285252R13716L6634949
$$ plain form
9408 27313822 28197180 -30209394 -92968658 -109497758 -87524477 -51254569 -6627343
9401 -6627343 28422218 18835868 -27128573 -44578373 -731772 48994706 39648246 -11235236
9393 -11235236 -44120471 -52366919 -71250611 -96371885 -85763979 -39119494 -6815704
9386 -6815704 -10658970 -16284175 -1781061 3249747 -23493451 -47388481 -26937760 18433147
9378 18433147 34858954 12946898 -1273773 25939577 70057185 81035808 44013324
9371 44013324 -5914966 -24731773 -6540174 14182018 5906847 -22205293 -33083203
9364 -33083203 -6325203 42098524 81528376 92356593 69786517 21531103 -28744389
9357 -28744389 -51020629 -36926692 -11680220 -6600282 -24346129 -41956512 -44288873
$$ packed form
9408B7313822Q83358n8406574o2759264j6529100K1973281L6269908M4627226
9401f627343L5049561r586350m5964441j7449800M3846601M9726478r346460n0883482
9393a1235236l2885235q246448j8883692k5121274J0607906M6644485L2303790
9386f815704l843266n625205J4503114N030808k6743198k3895030K0450721M5370907
9378A8433147J6425807k1912056j4220671K7213350M4117608J0978623l7022484
9371D4013324m9928290j8816807J8191599K0722192q275171k8112140j0877910
9364c3083203K6758000M8423727L9429852J0828217k2570076m8255414n0275492
9357b8744389k2276240J4093937K5246472N079938j7745847j7610383k332361
$$ plain form
9350 -44288873 -40482208 -43938997 -48019731 -33897861 -704131 26319821 27015969 15748909
9342 15748909 21818667 42732816 41249454 -931258 -49795662 -59819762 -30780830
9335 -30780830 1598502 17454401 22630451 15519324 -14690004 -52321545 -59718385 -33473018
9327 -33473018 -18196244 -40987904 -68461108 -61419101 -38869154 -42583339 -61787366
9320 -61787366 -48702531 -1396031 26746563 7731852 -25261363 -40211616 -51086597
9313 -51086597 -70434616 -67269484 -18352944 36194335 43830849 21742883 28215747 65317842
9305 65317842 76214345 41630484 10623216 14929970 16418949 -23299800 -73951610
9298 -73951610 -84888438 -61715056 -41790708 -24327896 15544455 61207170 65693912
$$ packed form
9350d4288873L806665l456789m080734J4121870L3193730K7023952O96148j1267060
9342A5748909O069758K0914149j483362m2180712m8864404j0024100K9038932
9335c0780830L2379332J5855899N176050p111127l0209328l7631541p396840K6245367
9327c3473018J5276774k2791660k7473204P042007K2549947l714185j9204027
9320f1787366J3084835M7306500K8142594j9014711l2993215j4950253j0874981
9313e1086597j9348019L165132M8916540N4547279P636514k2087966O472864L7102095
9305F5317842J0896503l4583861l1007268M306754J488979l9718749n0651810
9298g3951610j0936828K3173382J9924348J7462812L9872351M5662715M486742
$$ plain form
9291 65693912 25513925 -13486474 -28014694 -40724276 -61933556 -63355894 -32069327
9284 -32069327 -1632132 1944221 5917621 46220735 105520664 133123434 110284727
9277 110284727 64495585 29367221 15434118 13634599 9326794 -2529888 -9861529
9270 -9861529 -3429670 -2385738 -31383347 -69506698 -63600642 -8502581 31349497 9340775
9262 9340775 -37677311 -49969957 -30755981 -22226932 -29525621 -27232013 -19756756 -33985525
9254 -33985525 -62630157 -73136958 -66790143 -71688673 -80843253 -58492522 -11741046 6168225
9246 6168225 -23250975 -57302243 -62987752 -57990838 -59620130 -48572981 -13420575 17777774
9238 17777774 23853249 26580230 47335865 66008621 56417596 28671235 6101171 -6075796
$$ packed form
9291F5693912m0179987l9000399j4528220j2709582k1209280j422338L1286567
9284c2069327L0437195L576353L973400M0303114N9299929K7602770k2838707
9277A10284727m5789142l5128364j3933103j799519m307805j1856682p331641
9270i861529O431859J043932k8997609l8123351N906056N5098061L9852078k2008722
9262I340775m7018086j2292646J9213976Q529049p298689K293608P475257j4228769
9254c3985525k8644632j0506801O346815m898530r154580K2350731M6751476J7909271
9246F168225k9419200l4051268n685509M996914j629292J1047149L5152406L1198349
9238A7777774O075475K726981K0755635J8672756r591025k7746361k2570064j2176967
$$ plain form
9230 -6075796 -2918313 27841329 64653595 50952176 -22156710 -77600865 -50203296
9223 -50203296 16534549 33157781 -8265184 -39706597 -29924880 -14578272 -15891310
9216 -15891310 -7410548 24795810 48567025 39105609 17828536 11085584 8561723 -10331599
9208 -10331599 -38234078 -53205199 -49527950 -35750330 -17887207 1733530 20947231
9201 20947231 38410611 45717631 24437158 -26647807 -68316541 -57432638 -6328332
9194 -6328332 29381511 25735412 14218674 20750433 23532799 -3844856 -40752197 -43469016
9186 -43469016 -3907631 41536403 53296214 23118863 -23831420 -51283606 -45301235
9179 -45301235 -28466894 -28332519 -36809026 -25031729 5590925 22022686 12318616 -193028
$$ packed form
9230f075796L157483L0759642L6812266j3701419p3108886n5444155K7397569
9223e0203296O6737845J6623232m1422965l1441413R781717J5346608j313038
9216a5891310Q480762L2206358K3771215r461416k1277073o742952k523861j8893322
9208a0331599k7902479j4971121L677249J3777620J7863123J9620737J9213701
9201B0947231J7463380P307020k1280473n1084965m1668734J0883903N1104306
9194f328332L5709843l646099j1516738O531759K782366k7377655l6907341k716819
9186d3469016L9561385M5444034J1759811l0177351m6950283k7452186N982371
9179d5301235J6834341J34375q476507J1777297L0622654J6431761r704070j2511644
$$ plain form
9171 -193028 -5108534 -21943784 -48781740 -42520243 13049562 61128044 43634314 -8662859
9163 -8662859 -13844107 44317557 92408815 66625130 -8595586 -58348475 -44774777
9156 -44774777 2046956 26548242 6902118 -27168503 -34578815 -15782077 -8296751
9149 -8296751 -27491861 -42879020 -31798669 -22679759 -48480963 -83502539 -76209992 -33178587
9141 -33178587 -15649233 -47811598 -79806567 -60342836 -4673862 34665624 33515829
9134 33515829 5937648 -27757364 -54625702 -64388145 -55081531 -37192043 -18053908
9127 -18053908 8025888 41647021 63823583 57434809 35033301 27408323 46398907
9120 46398907 72081349 77372345 57719435 35730391 37748606 62501490 75676186
$$ packed form
9171a93028m915506j6835250k6837956O261497N5569805M8078482j7493730n2297173
9163h662859n181248N8161664M8091258k5783685p5220716m9752889J3573698
9156d4774777M6821733K4501286j9646124l4070621p410312J8796738P485326
9149h296751j9195110j5387159J1080351R118910k5801204l5021576P292547M3031405
9141c3178587J7529354l2162365l1994969J9463731N5668974L9339486j149795
9134C3515829k7578181l3695012k6868338r762443R306614J7889488J9138135
9127a8053908K6079796L3621133K2176562o388774k2401508p624978J8990584
9120D6398907K5682442N290996j9652910k1989044K018215K4752884J3174696
$$ plain form
9113 75676186 46656405 -9734426 -44359196 -31831608 -436892 6070629 -19548309
9106 -19548309 -48811495 -56367959 -38625003 -2563591 40359792 68572945 60813635
9099 60813635 22886095 -8687214 -2704703 31181958 53556200 41996489 16662768
9092 16662768 12632893 33720644 47979460 32004153 4649043 3087936 33257948
9085 33257948 61650602 56375305 20878969 -16479067 -32306939 -21954885 3482471
9078 3482471 24643734 26815770 14278981 7328517 19924445 44798225 62949622 61379277
9070 61379277 40552974 13774391 444058 7823495 17043013 2363159 -30745978
9063 -30745978 -45730039 -24395091 3781704 2168077 -18667926 -15847724 21378775
$$ packed form
9113G5676186k9019781n6390831l4624770J2527588L1394716O507521k5618938
9106a9548309k9263186p556464J7742956L6061412M2923383K8213153p759310
9099F0813635l7927540l1573309N982511L3886661K2374242j1559711k5333721
9092A6662768m029875K1087751J4258816j5975307k7355110j561107L0170012
9085C3257948K8392654n275297l5496336l7358036j5827872J0352054K5437356
9078C482471K1161263K172036j2536789o950464J2595928K4873780J8151397j570345
9070F1379277k0826303k6778583j3330333P379437R219518j4679854l3109137
9063c0745978j4984061K1334948K8176795j613627k0836003K820202L7226499
$$ plain form
9056 21378775 53907983 48762221 26148905 29008917 59151332 70663378 30791191
9049 30791191 -33454242 -65651748 -48396361 -20731582 -23230032 -46227600 -50489294
9042 -50489294 -27107805 -10428466 -29714282 -71561380 -99610208 -93501981 -58276443
9035 -58276443 -12767031 18275906 16155043 -12922553 -43241090 -63470708 -85315017
9028 -85315017 -105926373 -93109882 -38595100 2604519 -25514384 -92190093 -110446171
9021 -110446171 -56284427 2386217 12130337 6914030 36335489 74934607 63472181
9014 63472181 10260674 -15418773 15614864 57366410 61243567 33356820 6397723
9007 6397723 -2187116 11429903 40196884 50067025 3653974 -75918801 -108296584 -58157738
$$ packed form
9056B1378775L2529208n145762k2613316K860012L0142415J1512046l9872187
9049C0791191o4245433l2197506J7255387K7664779k498450k2997568m261694
9042e0489294K3381489J6679339j9285816m1847098k8048828O108227L5225538
9035e8276443M5509412L1042937k120863k9077596l0318537k0229618k1844309
9028h5315017k0611356J2816491N4514782M1199619k8118903o6675709j8256078
9021a10446171N4161744N8670644R744120n216307K9421459L8599118j1462426
9014F3472181n3211507k5679447L1033637M1751546L877157k7886747k6959097
9007F397723q584839J3617019K8766981R870141m6413051p9572775l2377783N0138846
$$ plain form
8999 -58157738 5744093 663513 -53406620 -65720494 -4583807 70965670 106966802
8992 106966802 113364576 111397337 88431507 40846169 8535414 19767527 40806008
8985 40806008 30697260 14061754 40282846 91125664 97809330 49319834 14742610
8978 14742610 38702206 76541294 68741784 28322918 5247366 1110522 -21021640
8971 -21021640 -59937134 -73101025 -52286029 -42043027 -62515915 -67452500 -17785293
8964 -17785293 42336272 36500311 -33065154 -81094236 -51881546 11344752 31010553
8957 31010553 -6874849 -50565515 -56530943 -31162610 -5887246 -87693 -10585118
8950 -10585118 -18279781 -4289022 26453615 43248758 28373319 8545141 22679501
$$ packed form
8999e8157738O3901831n080580n4070133j2313874O1136687P5549477L6001132
8992A06966802O397774j967239k2965830m7585338l2310755J1232113K1038481
8985D0806008j0108748j6635506K6221092N0842818O683666m8489496l4577224
8978A4742610K3959596L7839088p799510m0418866k3075552m136844k2132162
8971b1021640l8915494j3163891K0814996J0243002k0472888m936585M9667207
8964a7785293O0121565n835961o9565465m8029082K9212690O3226298J9665801
8957C1010553l7885402m3690666n965428K5368333K5275364N799553j0497425
8950a0585118p694663J3990759L0742637J6795143j4875439j9828178J4134360
$$ plain form
8943 22679501 64804237 90699342 80587356 58905080 45089672 24968501 -10337920
8936 -10337920 -34564045 -24549430 -671538 1409251 -22292457 -53129294 -81901156
8929 -81901156 -100248014 -85104945 -32353240 13178976 6920135 -28507846 -32933357
8922 -32933357 2660110 28784939 18630711 2057488 7511040 21021846 21862302 13797628
8914 13797628 -756861 -34601983 -77950855 -87405407 -44385636 9201040 25374265
8907 25374265 8867962 -10913630 -34163135 -75598962 -119144272 -132034462 -111731204
8900 -111731204 -81840087 -53592732 -26927118 -16603539 -36985837 -67495105 -72554583
8893 -72554583 -54406073 -49309572 -69302060 -82649862 -59435738 -8450293 38418267
$$ packed form
8943B2679501M2124736K5895105j0111986k1682276j3815408k0121171l5306421
8936a0337920k4226125J0014615K3877892K080789k3701708l0836837k8771862
8929h1901156j8346858J5143069N2751705M5532216o258841l5427981m425511
8922c2933357L5593467K6124829j0154228j6573223N453552J3510806Q40456q064674
8914A3797628j4554489l3845122m3348872r454552M3019771N3586676J6173225
8907B5374265j6506303j9781592k3249505m1435827m3545310j2890190K0303258
8900a11731204K9891117K8247355K6665614J0323579k0382298l0509268n059478
8893g2554583J8148510N096501j9992488j3347802K3214124N0985445M6868560
$$ plain form
8886 38418267 56186131 38760258 3476433 -15883171 -3653186 11767180 -7909190
8879 -7909190 -53875276 -79616492 -68941726 -57614714 -75228955 -101061394 -100584523 -78838619
8871 -78838619 -67954030 -76255583 -80295141 -66546844 -55917515 -74913762 -113904319
8864 -113904319 -131051016 -102410504 -54942899 -33099208 -39238157 -34735369 -5162854
8857 -5162854 10917726 -18511602 -61330977 -60310840 -10951096 39894395 61437301
8850 61437301 62658607 55351683 39491874 26711454 32627707 39237123 10772191 -42595521
8842 -42595521 -66140907 -44270027 -31954819 -71475967 -124157534 -128386276 -90193690
8835 -90193690 -65793680 -76446464 -93118457 -96150940 -98876861 -108024321 -104987518 -80490600
$$ packed form
8886C8418267J7767864j7425873l5283825j9359604J2229985J5420366j9676370
8879g909190m5966086k5741216J0674766J1327012j7614241k5832439M76871K1745904
8871g8838619J0884589q301553m039558J3748297J0629329j8996247l8990557
8864a13904319j7146697K8640512M7467605K1843691o138949M502788K9572515
8857e162854J6080580k9429328m2819375J020137M9359744N0845491K1542906
8850F1437301J221306p306924j5859809j2780420N916253O609416k8464932n3367712
8842d2595521k3545386K1870880J2315208l9521148n2681567m228742L8192586
8835i0193690K4400010j0652784j6671993l032483k725921r147460L036803K4496918
$$ plain form
8827 -80490600 -54217996 -42005798 -29070572 2162890 34063741 29736842 -14692087
8820 -14692087 -55857041 -52294155 -15370812 6775591 -7090966 -27340775 -21517821
8813 -21517821 251149 10599780 11818407 20652612 21682829 -15754737 -74977562 -98109356
8805 -98109356 -67487357 -31383428 -27558586 -31313696 -12015901 6826710 -9336885
8798 -9336885 -40324797 -42796072 -22181679 -16195840 -22419265 -2860875 41380118 58826137
8790 58826137 24013903 -22106014 -28322257 3829214 31934829 23868157 -16075092
8783 -16075092 -53508577 -49947420 -509970 53460413 69111161 54457446 49536709
8776 49536709 61729127 57297197 20692633 -16829885 -21457423 2088350 28552561
$$ packed form
8827h0490600K6272604J2212198J2935226L1233462L1900851m326899m4428929
8820a4692087m1164954L562886L6923343K2146403j3866557k0249809N822954
8813b1517821K1768970J0348631J218627Q834205J030217l7437566n9222825k3131794
8805i8109356L0621999L6103929L824842l755110J9297795J8842611j6163595
8798i336885l0987912k471275K0614393N985839o223425J9558390M4240993J7446019
8790E8826137l4812234m6119917o216243L2151471K8105615q066672l9943249
8783a6075092l7433485L561157M9437450N3970383J5650748j4653715m920737
8776D9536709J2192418m431930l6604564l7522518m627538K3545773K6464211
$$ plain form
8769 28552561 43829375 44575487 31592776 17344544 17311773 24021485 14953696 -5894161
8761 -5894161 -6443410 20408913 37056532 15373322 -21570964 -37679184 -34977935 -37405788
8753 -37405788 -48017216 -53668919 -52637061 -47173825 -27206748 6823037 22849325 -4856272
8745 -4856272 -49307436 -60167706 -32501692 -9061731 -16468636 -35910344 -40798024 -29751034
8737 -29751034 -13597802 2513866 13976199 15017882 8619417 -147725 -20229245 -59537599
8729 -59537599 -93696046 -81748093 -23225036 29850558 35179167 11732918 9414543
8722 9414543 43075286 77128478 69298453 15671427 -45996917 -73208079 -61980995
8715 -61980995 -49506427 -65443825 -92182559 -93678160 -70765674 -53082806 -42093616
$$ packed form
8769B8552561J5276814P46112j2982711j4248232l2771O709712r067789k0847857
8761e894161n49249K6852323J6647619k1683210l6944286j6108220K701249k427853
8753c7405788j0611428n651703J031858N463236J9967077L4029785J6026288k7705597
8745d856272m4451164j0860270K7666014K3439961p406905j9441708m887680J1046990
8737b9751034J6153232J6111668J1462333J041683o398465q767142k0081520l9308354
8729e9537599l4158447J1947953N8523057N3075594N328609k3446249k318375
8722I414543L3660743L4053192p830025n3627026o1668344k7211162J1227084
8715f1980995J2474568j5937398k6738734j495601K2912486J7682868J0989190
$$ plain form
8708 -42093616 -9658058 37256737 42631313 -19177172 -93890262 -115740306 -90120845
8701 -90120845 -64710226 -50276084 -24621546 5368001 7046151 -16517539 -24610187
8694 -24610187 -3205878 19019804 25940038 35083765 51694388 51560751 28118407 10498808
8686 10498808 13759840 16433299 10002450 20796935 51725805 54138926 1908731 -52476190
8678 -52476190 -49227610 -10049235 4386332 -6778061 2237634 33380845 44341794
8671 44341794 32867780 43833122 82830679 96772036 62822567 29352497 36266264
8664 36266264 53552153 38283970 3484770 -11959202 -1739260 19803954 50831352
8657 50831352 82679925 83502445 45102175 12404887 19215559 28422929 -7825730 -58251160
$$ packed form
8708d2093616L2435558M6914795N374576o1808485p4713090k1850044K5619461
8701i0120845K5410619J4434142K5654538K9989547J678150k3563690q092648
8694b4610187K1404309K2225682O920234R143727J6610623j33637k3442344j7619599
8686A0498808L261032K673459o430849J0794485L0928870K413121n2230195n4384921
8678e2476190L248580L9178375J4435567j1164393R015695L1143211J0960949
8671D4341794j1474014J0965342L8997557J3941357l3949469l3470070O913767
8664C6266264J7285889j5268183l4799200j5443972J0219942K1543214L1027398
8657E0831352L1848573Q22520l8400270l2697288O810672R207370l6248659n0425430
$$ plain form
8649 -58251160 -51888134 7042515 38248204 4628656 -37160903 -26797512 17580457
8642 17580457 39294557 21099826 -11965769 -36582112 -44291651 -31794258 -7968709
8635 -7968709 2980119 -11118138 -30874935 -31979401 -20065348 -20436956 -41494700 -65773413
8627 -65773413 -73054604 -59115656 -34295886 -13690989 -8234218 -19550331 -41502692
8620 -41502692 -63699168 -71509111 -52430297 -13270638 17861448 21810304 12581438 13982656
8612 13982656 22354658 16436704 -4256504 -20183581 -25284576 -26870884 -16417738 19256105
8604 19256105 56216167 49713225 4090702 -21749604 192319 24369888 5634966
8597 5634966 -30676685 -35925973 -16571301 -12760638 -26080995 -25709395 -10843952 -9703973
$$ packed form
8649e8251160O363026N8930649L1205689l3619548m1789559J0363391M4377969
8642A7580457K1714100j8194731l3065595k4616343p709539J2497393K3825549
8635g968709J0948828j4098257j9756797j104466J1914053l71608k1057744k4278713
8627f5773413p281191J3938948K4819770K0604897N456771j1316113k1952361
8620d1502692k2196476p809943J9078814L9159659L1132086L948856r228866J401218
8612A3982656Q372002n917954k0693208j5927077n100995j586308J0453146L5673843
8604A9256105L6960062o502942m5622523k5840306K1941923K4177569j8734922
8597E634966l6311651n249288J9354672L810663j3320357L71600J4865443J139979
$$ plain form
8589 -9703973 -22102682 -18174875 3680439 9814246 -9707090 -24161075 -16906995 -10308674
8581 -10308674 -18461176 -20315080 -4051149 4221377 -12130674 -21274963 9011800 51861506
8573 51861506 54628325 16479563 -11690334 -541015 25882312 36410801 33495450
8566 33495450 32775192 30485469 13502469 -12966442 -28198223 -21094483 1705363 28859274
8558 28859274 51684748 59540362 43485472 12063622 -7519149 2815999 26423576
8551 26423576 27752145 -4871059 -46071713 -68076570 -73354876 -81444485 -96642772 -105387219
8543 -105387219 -96750793 -67925618 -18106286 40778696 73692410 51975748 -3913596
8536 -3913596 -39396800 -32056151 -16037956 -27741930 -55182341 -63058611 -45535815 -26070125
$$ packed form
8589i703973j2398709L927807K1855314O133807j9521336j4453985P254080O598321
8581a0308674q152502j853904J6263931Q272526j6352051r144289L0286763M2849706
8573E1861506K766819l8148762k8169897J1149319K6423327J0528489k915351
8566C3495450p20258k289723j6983000k6468911j5231781P103740K2799846K7153911
8558B8859274K2825474P855614j6054890l1421850j9582771J0335148K3607577
8551B6423576J328569l2623204m1200654k2004857n278306q089609j5198287q744447
8543a05387219Q636426K8825175M9819332N8884982L2913714k1716662n5889344
8536c913596l5483204P340649J6018195j1703974k7440411p876270J7522796J9465690
$$ plain form
8528 -26070125 -18547646 -17644272 -21474713 -35511750 -52573262 -52979589 -32117841 -11636408
8520 -11636408 -14597330 -38179726 -56867635 -49118712 -19489816 5348218 7162379 1938709
8512 1938709 22373262 70869508 108351048 101992332 66363400 39490758 33953330 33515183
8504 33515183 24732565 6991901 -18190946 -42073518 -43313559 -15544067 11046757
8497 11046757 7859304 -5690200 4229496 17823991 -13859596 -72295816 -68260459 33184483
8489 33184483 142882647 151399921 62401194 -28332979 -55369843 -30085003 11268371
8482 11268371 42456844 36686776 -17573657 -80717189 -91327368 -44540065 1130039
8475 1130039 7515867 2755145 22982186 51174594 49126651 22393967 14006037 43004257
$$ packed form
8528b6070125P522479R03374l830441j4037037j7061512m06327K0861748K0481433
8520a1636408k960922k3582396j8687909P748923K9628896K4838034J814161n223670
8512A938709K0434553M8496246L7481540o358716l5628932k6872642n537428m38147
8504C3515183q782618j7740664k5182847k3882572j240041K7769492K6590824
8497A1046757l187453j3549504R919696J3594495l1683587n8436220M035357J01444942
8489C3184483J09698164Q517274q8998727r0734173k7036864K5284840M1353374
8482A1268371L1188473n770068n4260433o3143532j0610179M6787303M5670104
8475A130039O385828m760722K0227041K8192408k047943k6732684q387930K8998220
$$ plain form
8467 43004257 80132207 85503755 51961376 8413404 -11279209 -1687641 11865738
8460 11865738 7875203 -2976618 1144753 13945706 10708868 -6023104 -6927660 10782093
8452 10782093 10840429 -21939571 -48232968 -32231533 196907 2281401 -19408796 -20355465
8444 -20355465 4513799 12160945 -15308126 -38113012 -19359392 19187291 29523063
8437 29523063 2277611 -29062017 -36718003 -25493965 -13511991 -7243309 -2211740 2864928
8429 2864928 2440017 -5848378 -13510576 -9309714 4839322 12599570 1713362 -21251819
8421 -21251819 -38500514 -37802824 -18769034 8372273 24616686 14233638 -15297869
8414 -15297869 -36232386 -34926934 -30970834 -46381226 -68833169 -69058940 -47412753 -35159420
$$ packed form
8467D3004257L7127950N371548l3542379m3547972j9692613R591568J3553379
8460A1865738l990535j0851821M121371J2800953l236838j6731972r04556J7709753
8452A0782093N8336l2780000k6293397J6001435L2428440K084494k1690197r46669
8444b0355465K4869264P647146k7469071k2804886J8753620L8546683J0335772
8437B9523063k7245452l1339628p655986J1224038J1981974O268682N031569N076668
8429B864928m24911q288395p662198M200862J4149036P760248j0886208k2965181
8421b1251819j7248695O97690J9033790K7141307J6244413j0383048k9531507
8414a5297869k0934517J305452L956100j5410392k2451943k25771K1646187J2253333
$$ plain form
8406 -35159420 -48002908 -64630683 -59131460 -32400965 -704819 27108214 46148807
8399 46148807 44235615 12684764 -35843375 -72395552 -74409714 -40500270 10556424
8392 10556424 50842828 61284080 46789063 30718027 30515224 42193241 49906051 44112813
8384 44112813 27425778 9125574 -1959860 -3925041 -4791708 -15803850 -39257245 -64313449
8376 -64313449 -74304426 -57769386 -18439192 20943069 32717426 12137500 -14282372
8369 -14282372 -18428222 -2153711 13147027 19800813 26582832 31909137 19506859 -12576674
8361 -12576674 -40390157 -44510243 -36936364 -42599817 -63004871 -73741037 -57168903 -26739002
8353 -26739002 -14044829 -33645575 -65016501 -74473735 -53503015 -24591891 -6796772
$$ packed form
8406c5159420j2843488j6627775N499223K6730495L1696146K7813033J9040593
8399D6148807j913192l1550851m8528139l6552177k014162L3909444N1056694
8392A0556424M0286404J0441252j4495017j6071036k02803J1678017P712810n793238
8384D4112813j6687035j8300204j1085434j965181q66667j1012142k3453395k5056204
8376f4313449r990977J6535040L9330194L9382261J1774357k0579926k6419872
8369a4282372m145850J6274511J5300738O653786O782019N326305j2402278l2083533
8361a2576674k7813483m120086P573879n663453k0405054j0736166J6572134L0429901
8353b6739002J2694173j9600746l1370926r457234K0970720K8911124J7795119
$$ plain form
8346 -6796772 6699776 24725134 31263382 6783258 -34643702 -57138017 -47598115 -22788695
8338 -22788695 3087648 27296261 36485883 11645684 -36277393 -67745445 -63786680
8331 -63786680 -45634293 -35045025 -27261586 -18217071 -23416846 -45304112 -52404448 -21470529
8323 -21470529 22552035 39589290 29434598 23321481 34798477 48329463 46252057
8316 46252057 21797921 -22538188 -65134442 -69058467 -23950555 30022827 48959710
8309 48959710 39595583 34080449 30572061 5115140 -29433234 -31732320 -1515450 14145764
8301 14145764 -2615985 -10441454 21373877 61913149 71358885 63551713 74364475 98696506
8293 98696506 104233353 86201149 62284517 29230450 -24874836 -72634715 -66917818
$$ packed form
8346f796772J3496548J8025358O538248k4480124m1426960k2494315R539902K4809420
8338b2788695K5876343K4208613R189622k4840199m7923077l1468052L958765
8331f3786680J8152387J0589268P783439R044515n199775k1887266p100336L0933919
8323b1470529M4022564J7037255j0154692o113117J1476996J3530986k077406
8316D6252057k4454136m4336109m2596254l924025M5107912N3973382J8936883
8309D8959710r364127n515134l508388k5456921l4548374k299086L0216870J5661214
8301A4145764j6761749p825469L1815331M0539272R445736p807172J0812762K4332031
8293I8696506N536847j8032204k3916632l3054067n4105286m7759879N716897
$$ plain form
8286 -66917818 -14879340 20549454 10364384 -1039335 23253179 41254074 -6415849
8279 -6415849 -93175200 -127250167 -71783990 12461644 55218090 56459160 54119329 55973905
8271 55973905 43214347 17399682 2768891 9224406 24033855 36392519 44395693
8264 44395693 41310993 20059650 -9375674 -28502355 -34563441 -36360638 -30983680 -9121771
8256 -9121771 19024166 29634610 18633036 5025450 -138891 -3377946 -6338292 -253895
8248 -253895 14539702 29469923 48283793 76487810 90445127 55743302 -15435166
8241 -15435166 -65148509 -62986220 -41443783 -40987081 -57688356 -67116213 -63400800 -48892655
8233 -48892655 -18873118 17376686 33256637 26954597 30373317 52250776 58498910 40751652
$$ packed form
8286f6917818N2038478L5428794j0185070j1403719K4292514J8000895m7669923
8279f415849q6759351l4074967N5466177Q4245634M2756446J241070k339831J854576
8271E5973905j2759558k5814665j4630791O455515J4809449J2358664Q003174
8264D4395693l084700k1251343k9435324j9126681o061086j797197N376958K1861909
8256i121771K8145937J0610444j1001574j3607586n164341l239055k960346O084397
8248b53895J4793597J4930221J8813870K8204017J3957317l4701825p1178468
8241a5435166m9713343K162289K1542437M56702j6701275r427857L715413J4508145
8233d8892655L0019537L6249804J5879951o302040L418720K1877459O248134j7747258
$$ plain form
8225 40751652 49141122 107646265 151505266 116742437 47282766 32047371 67917696
8218 67917696 77177255 44447688 35185376 71804420 91587454 56920230 18109797
8211 18109797 21482151 30790545 -2418282 -48877686 -47389324 -4139889 16465370 -15195570
8203 -15195570 -59731137 -64573274 -22281002 26665094 35034929 -423916 -27957823
8196 -27957823 -416313 57282119 75025231 32539555 -18184430 -33620450 -27630175
8189 -27630175 -20590736 554711 35919611 41909715 -4775945 -57061582 -63237583 -44113460
8181 -44113460 -49292330 -71414971 -67007501 -37357861 -21172409 -20546872 -2482696 27701802
8173 27701802 20541154 -37834206 -94764635 -98404905 -54623018 -1351664 36637337
$$ packed form
8225D0751652Q389470N8505143M3859001l4762829o9459671j5235395L5870325
8218F7917696R259559l2729567r262312L6619044J9783034l4667224l8810433
8211A8109797L372354R308394l3208827m6459404J488362M3249435K0605259l1660940
8203a5195570m4535567m842137M2292272M8946096Q369835l5458845k7533907
8196b7957823K7541510N7698432J7743112m2485676n0723985j5436020N990275
8189b7630175P039439K1145447L5364900N990104m6685660n2285637o176001J9124123
8181d4113460n178870k2122641M407470K9649640J6185452O25537J8064176L0184498
8173B7701802p160648n8375360n6930429l640270M3781887N3271354L7989001
$$ plain form
8166 36637337 51010520 40178696 15768167 -1286870 -3496752 -1996132 -7016674 -18404242
8158 -18404242 -32130445 -40239956 -34046382 -25540466 -46847877 -100163552 -129998413 -86088154
8150 -86088154 2185206 60365428 64340580 48230746 28455992 -12635690 -63065870
8143 -63065870 -73687546 -38105855 -15319372 -38883942 -62650095 -40012350 -3521661
8136 -3521661 -10018893 -46902345 -55953955 -27199944 -6424327 -16552546 -28044701 -13340943
8128 -13340943 14392107 29702689 29654689 26131369 24095429 18961068 5778614 -11586037
8120 -11586037 -15641023 11091506 57949654 85231602 65763538 14277660 -37188478
8113 -37188478 -72813390 -84533679 -57984887 690239 45770533 40499464 12473452
$$ packed form
8166C6637337J4373183j0831824k4410529j7055037k209882J500620n020542j1387568
8158a8404242j3726203q109511O193574Q505916k1307411n3315675k9834861M3910259
8150h6088154Q8273360N8180222L975152j6109834j9774754m1091682n0430180
8143f3065870j0621676L5581691K2786483k3564570k3766153K2637745L6490689
8136c521661o497232l6883452r051610K8754011K0775617j0128219j1492155J4703758
8128a3340943K7733050J5310582m8000l523320k035940n134361j3182454j7364651
8120a1586037m054986K6732529M6858148K7281948j9468064n1485878n1466138
8113c7188478l5624912j1720289K6548792N8675126M5080294n271069k8026012
$$ plain form
8106 12473452 18483728 61116068 85791944 61712535 19164424 -3996294 -9287353
8099 -9287353 -12910289 -12180408 -1032111 9067903 7003884 -368394 -5753691 -14487759
8091 -14487759 -25343514 -23986092 -11900707 -12846453 -29829910 -27101659 16590076 66334356
8083 66334356 77492354 57922187 43968756 37914657 18279220 -3325804 7302759
8076 7302759 41012170 46200453 6052304 -36348610 -46237966 -40973255 -43086426 -39155188
8068 -39155188 -19284610 -12844533 -39800873 -61002208 -28935880 34912183 67995126
8061 67995126 58783073 53856661 75235592 89657081 73375774 53288102 56232683 60511597
8053 60511597 34132984 -7671849 -21883710 94368 23777667 19950135 -4875493
$$ packed form
8106A2473452O010276M2632340K4675876k4079409m2548111k3160718n291059
8099i287353l622936P29881J1148297J0100014k064019p372278n385297q734068
8091a4487759j0855755J357422J2085385r45746j6983457K728251M3691735M9744280
8083F6334356J1157998j9570167j3953431o054099j9635437k1605024J0628563
8076G302759L3709411N188283m0148149m2400914r889356N264711k113171L931238
8068c9155188J9870578O440077k6956340k1201335L2066328O3848063L3082943
8061F7995126r212053m926412K1378931J4421489j6281307k0087672K944581M278914
8053F0511597k6378613m1804833j4211861K1978078K3683299l827532k4825628
$$ plain form
8046 -4875493 -24939609 -21969538 4015439 35296220 49338388 42526898 35568700 43430542
8038 43430542 49625249 28881578 -11440237 -36282961 -30546135 -18917819 -29216006
8031 -29216006 -54416839 -66251189 -56047414 -44370626 -50425088 -66089626 -67624151
8024 -67624151 -46271071 -17449806 -71109 3147621 -204730 -7934313 -21129007 -31240255
8016 -31240255 -24771648 -2813157 17377295 24186877 22831732 20726309 15912845 7731093
8008 7731093 5631107 16806125 35392951 53161088 69333973 79859117 71551881 42768506
8000 42768506 17498846 18449254 33383154 30065876 2275953 -21129858 -16410200 5165564
7992 5165564 15819576 5619539 -12332403 -23528642 -28037492 -33907473 -39760421 -30944618
$$ packed form
8046d875493k0064116K970071K5984977L1280781J4042168o811490o958198P861842
8038D3430542O194707k0743671m0321815k4842724N736826J1628316j0298187
8031b9216006k5200833j1834350J0203775J1676788o054462j5664538j534525
8024f7624151K1353080K8821265J7378697L218730l352351p729583j3194694j0111248
8016c1240255O468607K1958491K0190452O809582j355145k105423m813464q181752
8008G731093k099986J1175018J8586826J7768137J6172885J0525144q307236k8783375
8000D2768506k5269660R50408J4933900l317278k7789923k3405811M719658K1575764
7992E165564J0654012j0200037j7951942j1196239m508850n869981n852948Q815803
$$ plain form
7984 -30944618 588349 36051847 43403081 16113697 -14978904 -17528957 6767571
7977 6767571 32662130 43491537 38261294 19717858 -5223173 -21071511 -18531031 -8594101
7969 -8594101 -6871037 -12263417 -17169242 -26828257 -47280600 -65545917 -67014788 -62557600
7961 -62557600 -69843988 -76994261 -59135664 -26358989 -16701833 -39107259 -61524072 -62106254
7953 -62106254 -53812223 -48547028 -37582171 -23224224 -28606988 -53060967 -57044393 -21104736
7945 -21104736 15776985 12048534 -13079848 -12862598 14426946 30721959 20796794 4726496
7937 4726496 -5651889 -19861082 -36809045 -37079634 -15171623 7601552 8770985 -16020250
7929 -16020250 -57535660 -95095567 -98846492 -56184323 4005549 35879785 23967396
$$ packed form
7984c0944618L1532967L5463498P351234k7289384l1092601k550053K4296528
7977F767571K5894559J0829407n230243j8543436k4941031j5848338K540480R936930
7969h594101J723064n392380m905825r659015k0452343j8265317j468871M457188
7961f2557600p286388p150273J7858597L2776675R657156k2405426k2416813n82182
7953f2106254Q294031N265195J0964857J4357947n382764k4453979l983426L5939657
7945b1104736L6881721l728451k5128382K17250K7289544J6295013r925165j6070298
7937D726496j0378385j4209193j6947963k70589K1908011K2773175J169433k4791235
7929a6020250m1515410l7559907l750925M2662169O0189872L1874236j1912389
$$ plain form
7922 23967396 -12736346 -53422089 -84884221 -89153872 -58377584 -19727385 -9475384
7915 -9475384 -21874406 -20102041 1914230 11036460 -6070406 -21504890 -17575805 -13714432
7907 -13714432 -20995148 -15167316 15333132 35730358 15445505 -22845721 -43045444
7900 -43045444 -51118364 -67223475 -74434266 -49273258 -19809565 -31077457 -63457900
7893 -63457900 -51746330 10653883 52018162 25252969 -28309561 -47268946 -30796364
7886 -30796364 -12816846 290935 17484210 19768903 -15489361 -61501261 -67385149
7879 -67385149 -34914707 -19336758 -45211371 -70214509 -54477475 -23500167 -26457391
7872 -26457391 -60646698 -80770003 -70474210 -59122571 -64481466 -62082750 -30951616
$$ packed form
7922B3967396l6703742m0685743l1462132m269651L0776288L8650199J0252001
7915i475384j2399022J772365K2016271R122230j7106866j5434484L929085L861373
7907a3714432p280716N827832L0500448K0397226k0284853l8291226k0199723
7900d3045444q072920j6105111p210791K5161008K9463693j1267892l2380443
7893f3457900J1711570O2400213M1364279k6765193n3562530j8959385J6472582
7886c0796364J7979518J3107781J7193275K284693l5258264m6011900n883888
7879f7385149L2470442J5577949k5874613k5003138J5737034L0977308k957224
7872b6457391l4189307k0123305J0295793J1351639n358895K398716L1131134
$$ plain form
7865 -30951616 3708349 3795659 -25504681 -46025261 -43999929 -42759877 -56914165 -67531361
7857 -67531361 -56060417 -36811226 -35955598 -54019294 -67875390 -60739511 -36027159 -9359674
7849 -9359674 2686125 -4605894 -14520658 -5998298 12395964 7948536 -22430456 -32728328
7841 -32728328 8608609 60338099 55862783 -3619610 -50452691 -44156218 -16094655
7834 -16094655 -10543020 -26570754 -39954205 -45799975 -52175904 -57859255 -61352208 -71116408
7826 -71116408 -87150083 -94361401 -91111789 -96961292 -112436169 -104142179 -58801398 -19682259
7818 -19682259 -31086320 -73194231 -94466802 -85291886 -71157024 -52839314 -12098867
7811 -12098867 31181108 30617769 -10853240 -34605718 -10834405 23807997 32603379 29719753
$$ packed form
7865c0951616L4659965Q7310k9300340k0520580K025332J240052j4154288j0617196
7857f7531361J1470944J9249191Q55628j8063696j3856096P135879K4712352K6667485
7849i359674J2045799p292019r914764Q522360J8394262m447428l0378992j0297872
7841c2728328M1336937N1729490m475316n9482393m6833081O296473K8061563
7834a6094655N551635j6027734j3383451n845770o375929n683351l492953r764200
7826g1116408j6033675p211318L249612n849503j5474877Q293990M5340781L9119139
7818a9682259j1404061m2107911k1272571R174916J4134862J8317710M0740447
7811a2098867M3279975n63339m1471009k3752478K3771313L4642402Q795382k883626
$$ plain form
7803 29719753 36364476 35940154 12075646 -9145295 167665 16957480 1437461 -36760382
7795 -36760382 -51741633 -27491383 10404178 39468026 57264245 60043866 42664687
7788 42664687 17797945 2269376 -11154423 -35078247 -49230289 -23615853 22340992
7781 22340992 32944031 -1554311 -24468237 3919631 46449979 45573349 5628045
7774 5628045 -22203418 -16723280 -5419231 -12025712 -24272542 -21476989 -6531364 3177252
7766 3177252 1656102 -859448 7210431 25844924 43176668 46257104 33238777 13677067
7758 13677067 -3566000 -17644393 -29035664 -33092150 -26330865 -14409260 -8092356 -13785418
7750 -13785418 -29855942 -46465005 -47055409 -19300749 28696431 69117085 77696770 53344598
$$ packed form
7803B9719753O644723m24322k3864508k1220941R312960J6789815j5520019l8197843
7795c6760382j4981251K4250250L7895561K9063848J7796219K779621j7379179
7788D2664687k4866742j5528569j3423799k3923824j4152042K5614436M5956845
7781B2340992J0603039l4498342k2913926K8387868M2530348q76630l9945304
7774E628045k7831463N480138J1304049o606481j2246830K795553J4945625R708616
7766C177252j521150k515550Q069879J8634493J7331744L080436j3018327j9561710
7758A3677067j7243067j4078393j1391271m056486O761285J1921605O316904n693062
7750a3785418j6070524j6609063n90404K7754660M7997180M0420654Q579685k4352172
$$ plain form
7742 53344598 13788018 -20011929 -32944730 -21327053 2599841 19420355 21899492
7735 21899492 18478055 15076350 6459248 -8469613 -18182156 -15524910 -8565198 -2712573
7727 -2712573 11382030 35549086 46443061 23493814 -16799672 -39373788 -35123155
7720 -35123155 -21127680 -4545744 21443250 47042833 46565722 18168815 -8163409
7713 -8163409 -14354202 -17106585 -32376968 -46163465 -42212387 -33664241 -39877472 -49351791
7705 -49351791 -34480269 6023084 43707815 53435312 31545381 -9709246 -47476100
7698 -47476100 -58924873 -45795997 -36203329 -42952957 -38848154 -838415 42190610 45903760
7690 45903760 20595039 15882318 40191220 51422225 35869066 35938910 73177590 100178503
$$ packed form
7742E3344598l9556580l3799947j2932801J1617677K3926894J6820514K479137
7735B1899492l421437l401705q617102j4928861r712543K657246O959712N852625
7727b712573J4094603K4167056J0893975k2949247m0293486k2574116M250633
7720c5123155J3995475J6581936K5988994K5599583m77111k8396907k6332224
7713h163409o190793k752383j5270383j3786497L951078Q548146o213231r474319
7705d9351791J4871522M0503353L7684731R727497k1889931m1254627l7766854
7698d7476100j1448773J3128876R592668o749628M104803L8009739M3029025L713150
7690D5903760k5308721m712721K4308902J1231005j5553159O9844L7238680K7000913
$$ plain form
7682 100178503 72505196 24275968 17951041 48105840 54537442 17422051 -20455556
7675 -20455556 -28033215 -27323286 -45018086 -67512613 -68679408 -51899522 -39051194 -36498388
7667 -36498388 -33437306 -22840846 -8129698 4715749 12782575 18468960 27006676 34884968
7659 34884968 27328666 2006606 -13776817 6079502 43530339 54752864 31912311
7652 31912311 11861937 16123361 20636489 2903898 -17618020 -14143070 1777398 1763898
7644 1763898 -13972711 -25901769 -32225497 -41673450 -42994715 -20210955 7909562 2896562
7636 2896562 -36279821 -65804742 -53907995 -15038690 21003915 43864257 52685258
7629 52685258 38888668 1083150 -38582382 -53722522 -42876685 -26452438 -20446859
$$ packed form
7682A00178503k7673307m8229228o324927L0154799O431602l7115391l7877607
7675b0455556p577659P09929j7694800k2494527j166795J6779886J2848328K552806
7667c6498388L061082J0596460J4711148J2845447Q066826N686385Q537716P878292
7659C4884968p556302k5322060j5783423J9856319L7450837J1222525k2840553
7652C1912311k0050374M261424M513128j7732591k0521918L474950J5920468j3500
7644A763898j5736609j1929058o323728r447953j321265K2783760K8120517n013000
7636B896562l9176383k9524921J1896747L8869305L6042605K2860342Q821001
7629E2685258j3796590l7805518l9665532j5140140J0845837J6424247O005579
$$ plain form
7622 -20446859 -22410319 -17492942 8252877 53516059 95386382 106486132 84903199
7615 84903199 57958263 49181593 51192594 40530297 10901634 -19853680 -31251807
7608 -31251807 -18372877 7792011 27731981 23390890 -6782686 -39556060 -44098489
7601 -44098489 -15268813 16077283 15694426 -13358676 -34657896 -25365383 -3562119 3231806
$$ packed form
7622b0446859j963460M917377K5745819M5263182M1870323J1099750k1582933
7615H4903199k6944936q776670K011001j0662297k9628663l0755314j1398127
7608c1251807J2878930K6164888J9939970m341091l0173576l2773374m542429
7601d4098489K8829676L1346096l82857k9053102k1299220R292513K1803264O793925
$$ [...]
##END NTUPLES=NMR SPECTRUM
##END=
