##TITLE=31Pdec_SR141_rm1h
 , 124 sc
 19.9.2022
##JCAMPDX= 6.0         $$ Bruker NMR JCAMP-DX V2.0
##DATA TYPE= NMR SPECTRUM
##DATA CLASS= NTUPLES
##ORIGIN= UXNMR, Bruker Analytische Messtechnik GmbH
##OWNER= root
$$ XWIN-NMR		Version 3.5
$$ Mon Sep 19 14:46:06 2022 Russian Standard Time (UT+4h)  she@DPX200
##.OBSERVE FREQUENCY= 81.013821
##.OBSERVE NUCLEUS= ^31P
##.ACQUISITION MODE= SIMULTANEOUS
##.ACQUISITION SCHEME= undefined
##.AVERAGES= 124
##.DIGITISER RES= 16
##SPECTROMETER/DATA SYSTEM= spect
##.PULSE SEQUENCE= zgpg30
##.SOLVENT NAME= CDCl3
##.SHIFT REFERENCE= (INTERNAL, CDCl3, 0, 248.564)
##AUDIT TRAIL= $$ (NUMBER, WHEN, WHO, WHERE, WHAT)
$$ ##TITLE= Audit trail, XWIN-NMR		Version 3.5
$$ ##JCAMPDX= 5.01
$$ ##ORIGIN= Bruker BioSpin GmbH
$$ ##OWNER= she
$$ F:/spectra/data/she/nmr/P31/1/pdata/1/auditp.txt
$$ ##AUDIT TRAIL=  $$ (NUMBER, WHEN, WHO, WHERE, WHAT)
(   1,<2022-09-19 14:43:51.84 +0400>,<she>,<DPX200>,
      <continue with go, POWCHK disabled, PULCHK disabled
       configuration hash MD5:
       00 E9 B6 7A A2 85 ED C7 34 08 36 98 17 FE 4E 26
       data hash MD5: 32K
       5C 7D B8 B3 E8 6E DA 27 37 E9 37 59 60 56 7A 5E>)
(   2,<2022-09-19 14:44:42.85 +0400>,<she>,<DPX200>,
      <Start of raw data processing
       efp BC_mod = 2 LB = 1 FT_mod = 6 PKNL = 1 PHC0 = -10296.19 PHC1 = 149.8566 SI = 64K 
       data hash MD5: 64K
       6A 78 26 C7 41 EE 8C EE 9E D7 D5 B0 C5 DA 15 5B>)
(   3,<2022-09-19 14:45:06.92 +0400>,<she>,<DPX200>,
      <pk PHC0 = 14.65239 PHC1 = -36.40001 
       data hash MD5: 64K
       F0 B9 D9 48 7D 69 9F AF C9 74 D1 0B 9A 4C 19 85>)
(   4,<2022-09-19 14:45:36.50 +0400>,<she>,<DPX200>,
      <pk PHC0 = -8.199992 PHC1 = 0 
       data hash MD5: 64K
       B5 AC 05 B8 47 03 AE 8C ED CF 12 47 C9 F1 A5 A1>)
$$ ##END=
$$ 
$$ hash MD5
$$ 64 02 CD 21 39 7A F7 22 7E 4A 7B 07 6C A8 9F FB
##$RELAX= 
##$RELAX= 
##$RELAX= 
##$RELAX= 
##$RELAX= 
##$RELAX= 
##$RELAX= 
##$RELAX= 
##$RELAX= 
$$ Bruker specific parameters
$$ --------------------------
##$DU= <F:/spectra>
##$EXPNO= 1
##$NAME= <P31>
##$PROCNO= 1
##$TYPE= <nmr>
##$USER= <she>
##$AMP= (0..31)
100 100 100 100 100 100 100 100 100 100 100 100 100 100 100 100 100 100 
100 100 100 100 100 100 100 100 100 100 100 100 100 100 
##$AQSEQ= 0
##$AQ_mod= 1
##$AUNM= <au_zg>
##$AUTOPOS= <>
##$BF1= 81.014009
##$BF2= 200.13
##$BF3= 200.13
##$BF4= 200.13
##$BF5= 200.13
##$BF6= 200.13
##$BF7= 200.13
##$BF8= 200.13
##$BYTORDA= 1
##$CFDGTYP= 0
##$CFRGTYP= 5
##$CHEMSTR= <none>
##$CNST= (0..31)
1 1 145 1 1 1 1 1 1 1 1 1 1 1 1 1 1 1 1 1 1 1 1 1 1 1 1 1 1 1 1 1 
##$CPDPRG= <waltz16>
##$CPDPRG1= <>
##$CPDPRG2= <waltz16>
##$CPDPRG3= <>
##$CPDPRG4= <mlev>
##$CPDPRG5= <mlev>
##$CPDPRG6= <mlev>
##$CPDPRG7= <mlev>
##$CPDPRG8= <mlev>
##$CPDPRGB= <>
##$CPDPRGT= <>
##$D= (0..31)
0 1 0 0 0 0 0 0 0 0 0 0.03 2e-05 3e-06 0 0 0 0 0 0 0 0 0 0 0 0 0 0 0 0 
0 0 
##$DATE= 1663584054
##$DBL= (0..7)
120 120 120 11 120 120 24 19 
##$DBP= (0..7)
150 150 150 150 150 150 150 150 
##$DBP07= 0
##$DBPNAM0= <>
$$ [...]
##$SUBNAM2= <"">
##$SUBNAM3= <"">
##$SUBNAM4= <"">
##$SUBNAM5= <"">
##$SUBNAM6= <"">
##$SUBNAM7= <"">
##$SUBNAM8= <"">
##$SUBNAM9= <"">
##$SW= 501.771253377433
##$SWIBOX= (0..15)
0 1 3 0 0 0 0 0 0 0 0 0 0 0 0 0 
##$SW_h= 40650.406504065
##$TD= 32768
##$TD0= 1
##$TE= 0
##$TE2= 300
##$TE3= 300
##$TEG= 300
##$TL= (0..7)
0 120 53 12 22 120 120 120 
##$TP= (0..7)
150 150 150 150 150 150 150 150 
##$TP07= 0
##$TPNAME0= <>
##$TPNAME1= <>
##$TPNAME2= <>
##$TPNAME3= <>
##$TPNAME4= <>
##$TPNAME5= <>
##$TPNAME6= <>
##$TPNAME7= <>
##$TPOAL= (0..7)
0.5 0.5 0.5 0.5 0.5 0.5 0.5 0.5 
##$TPOFFS= (0..7)
0 0 0 0 0 0 0 0 
##$TUNHIN= 0
##$TUNHOUT= 0
##$TUNXOUT= 0
##$USERA1= <user>
##$USERA2= <user>
##$USERA3= <user>
##$USERA4= <user>
##$USERA5= <user>
##$V9= 5
##$VALIST= <valist>
##$VCLIST= <CCCCCCCCCCCCCCC>
##$VD= 0
##$VDLIST= <DDDDDDDDDDDDDDD>
##$VPLIST= <PPPPPPPPPPPPPPP>
##$VTLIST= <TTTTTTTTTTTTTTT>
##$WBST= 1024
##$WBSW= 4
##$XGAIN= (0..3)
0 0 0 0 
##$XL= 0
##$YL= 0
##$YMAX_a= 26096
##$YMIN_a= -34755
##$ZGOPTNS= <>
##$ZL1= 120
##$ZL2= 120
##$ZL3= 120
##$ZL4= 120
##$ABSF1= 0
##$ABSF2= 0
##$ABSG= 0
##$ABSL= 0
##$ALPHA= 0
##$AQORDER= 0
##$ASSFAC= 0
##$ASSFACI= 0
##$ASSFACX= 0
##$ASSWID= 0
##$AUNMP= <proc_1d>
##$AZFE= 0.1
##$AZFW= 0.5
##$BCFW= 0
##$BC_mod= 2
##$BYTORDP= 0
##$COROFFS= 0
##$CY= -3
##$DATMOD= 1
##$DC= 0
##$DFILT= <>
##$DTYPP= 0
##$F1P= 0
##$F2P= 0
##$FCOR= 1
##$FTSIZE= 65536
##$FT_mod= 6
##$GAMMA= 0
##$GB= 0
##$INTBC= 1
##$INTSCL= 6.834604e-11
##$ISEN= 30
##$LB= 1
##$LEV0= 0
##$LPBIN= 0
##$MAXI= 10000
##$MC2= 0
##$MEAN= 0
##$ME_mod= 0
##$MI= 50
##$NCOEF= 0
##$NC_proc= -6
##$NLEV= 6
##$NOISF1= 182.463
##$NOISF2= 159.3651
##$NSP= 0
##$NTH_PI= 0
##$NZP= 0
##$OFFSET= 248.5645
##$PC= 4
##$PHC0= -10289.74
##$PHC1= 113.4566
##$PH_mod= 1
##$PKNL= yes
##$PPARMOD= 0
##$PSCAL= 0
##$PSIGN= 0
##$REVERSE= no
##$SF= 81.0140089999694
##$SI= 65536
##$SIGF1= 159.3651
##$SIGF2= -187.1042
##$SINO= 113.3802
##$SIOLD= 16384
##$SREGLST= <1H.CDCl3>
##$SSB= 0
##$STSI= 65536
##$STSR= 0
##$SW_p= 40650.406504065
##$SYMM= 0
##$S_DEV= 0
##$TDeff= 32768
##$TDoff= 0
##$TI= <>
##$TILT= no
##$TM1= 0
##$TM2= 0
##$TOPLEV= 0
##$USERP1= <user>
##$USERP2= <user>
##$USERP3= <user>
##$USERP4= <user>
##$USERP5= <user>
##$WDW= 1
##$XDIM= 65536
##$YMAX_p= 389995879
##$YMIN_p= -13605463
$$ End of Bruker specific parameters
$$ ---------------------------------
##NTUPLES= NMR SPECTRUM
##VAR_NAME=  FREQUENCY,     SPECTRUM/REAL,   SPECTRUM/IMAG
##SYMBOL=    X,             R,               I
##VAR_TYPE=  INDEPENDENT,   DEPENDENT,       DEPENDENT
##VAR_FORM=  AFFN,          ASDF,            ASDF
##VAR_DIM=   65536,         65536,           65536
##UNITS=     HZ,            ARBITRARY UNITS, ARBITRARY UNITS
##FACTOR=    0.620285442955139, 1,           1
##FIRST=     20137.2065510682, 0,            0
##LAST=      -20513.1999529968, 0,           0
##MIN=       -20513.1999529968, -13605463,   0
##MAX=       20137.2065510682, 389995879,    0
$$ Real data points
##PAGE= N=1
##DATA TABLE= (X++(R..R)), XYDATA
$$ [...]
$$ plain form
42549 -662700 629090 2703448 3185914 2693772 3639024 6070790 7273775 5828825 3564524
42540 3564524 2504125 2170696 1379836 652156 882492 1187029 324129 -742520 31192
42531 31192 2547349 4482007 4294088 2754084 1690561 2513587 5393609 8423862 8421754
42522 8421754 4507500 188657 -411958 2108547 3568141 2463094 1734075 3397434
42514 3397434 4813622 2620839 -1837400 -3795814 -928713 4276306 7733060 7663863
42506 7663863 5292090 2972551 2116294 2514075 3315403 4175165 4914551 4677773 2794723
42497 2794723 348424 -699131 -111794 541880 645764 1359193 3043809 4042098 3214029
42488 3214029 1745012 1035170 656669 -14026 -61221 1070860 1692067 269257 -1640707
$$ packed form
42549f62700J291790K074358M82466m92142R45252K431766J202985j444950k264301
42540C564524j060399l33429p90860p27680K30336L04537q62900j066649P73712
42531C1192K516157J934658j87919j540004j063523Q23026K880022L030253k108
42522H421754l914254m318843o00615K520505J459594j105047p29019J663359
42514C397434J416188k192783m458239j958414K867101N205019L456754o9197
42506G663863k371773k319539q56257L97781Q01328Q59762P39386k36778j883050
42497B794723k446299j047555N87337O53674J03884P13429J684616R98289q28069
42488C214029j469017p09842l78501o70695m7195J132081O21207j422810j909964
$$ plain form
42479 -1640707 -1401287 783770 2542950 3088832 3528433 3947458 3128386 1196344 -204438
42470 -204438 -668033 -1397115 -2441458 -2196958 -374979 1043684 821229 120097 22098
42461 22098 -319212 -1560876 -2275379 -1014315 1312452 2929055 3688043 4218980 3903205
42452 3903205 1954134 -336517 -932033 -431201 -1609193 -5041123 -7471815 -5949102
42444 -5949102 -2023441 101649 -975377 -2282714 -769346 2607592 4438230 3394560
42436 3394560 1259987 -267709 -1464432 -2576949 -2301549 -111399 1612019 288515
42428 288515 -2878329 -4265331 -2888249 -1358245 -1526669 -2024474 -1179980 198647 664556
42419 664556 733966 1545213 2235133 870052 -2501275 -5495758 -5983816 -3868151 -604818
$$ packed form
42479a640707K39420K185057J759180N45882M39601M19025q19072j932042j400782
42470b04438m63595p29082j044343K44500J821979J418663k22455p01132r7999
42461B2098l41310j241664p14503J261064K326767J616603P58988N30937l15775
42452C903205j949071k290651n95516N00832j177992l431930k430692J522713
42444e949102L925661K125090j077026j307337J513368L376938J830638j043670
42436C394560k134573j527696j196723j112517K75400K190150J723418j323504
42428B88515l166844j387002J377082J530004j68424m97805Q44494J378627M65909
42419F64556O9410Q11247O89920j365081l371327k994483m88058K115665L263333
$$ plain form
42410 -604818 1952007 2549056 1459369 288966 158405 480139 252899 -109461 611776
42401 611776 2342765 3414630 2442470 -244362 -3048445 -4417626 -3843415 -2080448 -305089
42392 -305089 1127142 2627708 3928270 3723628 1598751 -534629 -220877 2522572 4991976
42383 4991976 4626997 1432149 -2245803 -3769100 -2301566 559411 2460682 2868742
42375 2868742 3244939 4257882 4230216 1772765 -1193247 -1308550 1558724 3864009 3105296
42366 3105296 789910 -405629 -366253 -503386 -484398 1294677 4220706 5173391 2685067
42357 2685067 -638751 -1392225 318678 1686523 1490008 1368308 2767703 4640255 4919544
42348 4919544 2900457 -477214 -3411635 -3798649 -701790 3763733 5708206 3990040
$$ packed form
42410f04818K556825N97049j089687j170403j30561L21734k27240l62360P21237
42401F11776J730989J071865r72160k686832k804083j369181N74211J762967J775359
42392c05089J432231J500566J300562k04642k124877k133380L13752K743449K469404
42383D991976l64979l194848l677952j523297J467534K860977J901271M08060
42375B868742L76197J012943k7666k457451k966012j15303K867274K305285p58713
42366C105296k315386j195539L9376j37133J8988J779075K926029R52685k488324
42357B685067l323818p53474J710903J367845j96515j21700J399395J872552K79289
42348D919544k019087l377671k934421l87014L096859M465523J944473j718166
$$ plain form
42340 3990040 1874226 2569125 4816262 5131610 2914338 500360 -836492 -1703773 -1841675
42331 -1841675 18993 3247261 5392512 5719168 5714985 5649803 4031047 1327575 484161
42322 484161 2151402 3099976 1514642 185627 1630669 3605564 3111563 1770329 2804763
42313 2804763 4992098 4552839 1752497 597384 2303212 3828307 3257480 2263679 2397112
42304 2397112 2904375 3276121 4226767 4973021 3291452 -199668 -1567687 606312 2536378
42295 2536378 979336 -1668711 -1377181 1108500 1834052 -14015 -1381178 -344922
42287 -344922 1857322 3765188 5245713 5693271 3971456 1233265 886661 4086716 7616038
42278 7616038 8232278 7132831 7582788 9513594 9646684 6799800 3927148 3875933 5637030
$$ packed form
42340C990040k115814O94899K247137L15348k217272k413978j336852q67281j37902
42331a841675J860668L228268K145251L26656m183o5182j618756k703472q43414
42322D84161J667241R48574j585334j329015J445042J974895m94001j341234J034434
42313B804763K187335m39259k800342j155113J705828J525095n70827r93801J33433
42304B397112N07263L71746R50646P46254j681569l491120j368019K173999J930066
42295B536378j557042k648047K91530K485681P25552j848067j367163J036256
42287c44922K202244J907866J480525M47558j721815k738191l46604L200055L529322
42278G616038O16240j099447M49957J930806J33090k846884k872652n1215J761097
$$ plain form
42269 5637030 6510271 6104915 5972923 6388940 5963133 4247331 2626975 2447145 3899438
42260 3899438 6690135 9922660 11366031 9229072 5224505 3523549 5713670 8974485
42252 8974485 10256330 9827959 9295602 8758262 8019442 8227672 9814506 10930851 10630835
42243 10630835 11437881 15505638 20262575 21825220 21212564 22664580 26663218 29614609
42235 29614609 30499340 32582888 37287784 41324216 42206297 42433486 45236865 49328368
42227 49328368 50867327 48331782 42951624 36542371 31266821 29230075 29677261 28611877
42219 28611877 23819480 18331472 16202476 16893955 17057561 16071236 15911676 16529973 15525836
42210 15525836 12516308 10097543 9738589 9913738 9268019 8626679 8463440 7154527 3831638
$$ packed form
42269E637030Q73241m05356j31992M16017m25807j715802j620356j79830J452293
42260C899438K790697L232525J443371k136959m004567j700956K190121L260815
42252H974485J281845m28371n32357n37340p38820K08230J586834J116345l00016
42243A0630835Q07046M067757M756937J562645o12656J452016L998638K951391
42235B9614609Q84731K083548M704896M036432Q82081K27189K803379M091503
42227D9328368J538959k535545n380158o409253n275550k036746M47186j065384
42219B8611877m792397n488008k128996O91479J63606r86325j59560O18297j004137
42210A5525836l009528k418765l58954J75149o45719o41340j63239j308913l322889
$$ plain form
42201 3831638 872742 1055336 3481848 4924254 4658198 5156374 7491441 8777156 6088146
42192 6088146 1207108 -1308196 -449347 -141527 -3254188 -6966909 -6563678 -2157296 1525342
42183 1525342 1570886 -153156 -932272 -963965 -1614098 -2307125 -1382414 1140064 3549514
42174 3549514 4618157 4408073 3375084 1840019 168058 -1236551 -1983564 -1615513 -26059
42165 -26059 2002638 3377148 3649265 2623882 -217029 -4313832 -6867996 -5550659 -2103523
42156 -2103523 -433882 -1094649 -963825 1092346 2173288 507402 -1256513 -490567 1058907
42147 1058907 512118 -1331167 -1879787 -1240882 -1250838 -1703350 -1000874 748817 2383122
42138 2383122 3924364 5103172 3619441 -1319619 -5544366 -4525006 -189608 1753262
$$ packed form
42201C831638k958896J82594K426512J442406k66056M98176K335067J285715k689010
42192F088146m881038k515304Q58849L07820l112661l712721M03231M406382L682638
42183A525342M5544j724042p79116l1693o50133o93027R24711K522478K409450
42174C549514J068643k10084j032989j535065j671961j404609p47013L68051J589454
42165b6059K028697J374510K72117j025383k840911m096803k554164J317337L447136
42156b103523J669641o60767J30824K056171J080942j665886j763915P65946J549474
42147A058907n46789j843285n48620O38905r956m52512P02476J749691J634305
42138B383122J541242J178808j483731m939060m224747J019360M335398J942870
$$ plain form
42130 1753262 536786 857931 4438792 6934631 5085237 1783535 1141792 2580175
42122 2580175 3134464 2566355 2649047 3323818 2851670 867356 -1174789 -2048212 -1570963
42113 -1570963 -46557 1769147 2778836 2589903 1801503 808215 -545531 -1697575 -1265606
42104 -1265606 998210 3404300 4161663 2966880 577357 -1758593 -2358351 -426551
42096 -426551 2398614 3677501 3456244 3728601 4643652 4231090 2412083 1811714 3230686
42087 3230686 3812135 1813132 -155031 512436 1831535 645957 -1626031 -889691 3025403
42078 3025403 5792887 4642381 1488446 -530027 -692957 -3136 718286 831474 -331126
42069 -331126 -2460246 -3984793 -3562280 -1341131 1411356 3302901 3541695 2474363 1360706
$$ packed form
42130A753262j216476L21145L580861K495839j849394l301702o41743J438383
42122B580175N54289n68109Q2692O74771m72148j984314k042145q73423M77249
42113a570963J524406J815704J009689j88933p88400r93288j353746j152044M31969
42104a265606K263816K406090P57363j194783k389523k335950n99758J931800
42096d26551K825165J278887k21257K72357R15051m12562j819007o00369J418972
42087C230686N81449j999003j968163O67467J319099j185578k271988P36340L915094
42078C025403K767484j150506l153935k018473j62930O89821P21422J13188j162600
42069c31126k129120j524547M22513K221149K752487J891545K38794j067332j113657
$$ plain form
42060 1360706 1017302 1004088 741730 720550 1612049 2880290 3555883 3843739 4493276 4940199
42050 4940199 3815553 1451496 189600 1414449 3413252 3244958 322988 -2822488
42042 -2822488 -3573725 -2345624 -1794798 -2941871 -3539768 -1480860 1506752 1974209 100325
42033 100325 -169900 2993722 6512209 7185189 6202059 6188657 6412417 4627133 1970188
42024 1970188 1731205 3805990 4729205 3635527 3869498 7134158 9931218 8487315 4403054
42015 4403054 2212118 2992086 3669634 2069110 -395948 -1473487 -1142284 -859782 -1165186
42006 -1165186 -1251974 -401074 1035368 2028121 1839602 624405 -674255 -977757 143716
41997 143716 1994936 2958373 1586168 -1947415 -5495286 -6574997 -4612968 -1316645
$$ packed form
42060A360706l43404j3214k62358k1180Q91499J268241O75593K87856O49537M46923
42050D940199j124646k364057j261896J224849J998803j68294k921970l145476
42042b822488p51237J228101N50826j147073n97897K058908K987612M67457j873884
42033A00325k70225L163622L518487O72980r83130j3402K23760j785284k656945
42024A970188k38983K074785R23215j093678K33971L264660K797060j443903m084261
42015D403054k190936P79968O77548j600524k465058j077539L31203K82502l05404
42006a165186q6788Q50900J436442R92753j88519j215197j298660l03502J121473
41997A43716J851220R63437j372205l533583l547871j079711J962029L296323
$$ plain form
41989 -1316645 1228512 2409024 2890163 3173757 3004316 2117057 960326 365777 749150
41980 749150 1884131 3222719 4039249 3441554 967209 -2537155 -5205341 -5822039 -4870635
41971 -4870635 -3579473 -2501337 -1590547 -992115 -837245 -771169 -638100 -999224 -1790570
41962 -1790570 -1329290 1502422 4735634 5425563 4100525 4129374 6120549 6381304 2717806
41953 2717806 -1411129 -1423376 1996735 4415826 4075964 3113320 2959858 2361635 545477
41944 545477 -917302 -733254 -18414 -437282 -1944774 -3529828 -4654996 -4839337 -3294722
41935 -3294722 -343543 1917187 1822831 362772 -107844 979432 1795497 765012 -1194853
41926 -1194853 -1805617 -513302 533546 -667287 -2793110 -2577021 309015 1933362
$$ packed form
41989a316645K545157J180512M81139K83594j69441q87259j156731n94549L83373
41980G49150J134981J338588Q16530n97695k474345l504364k668186o16698R51404
41971d870635J291162J078136R10790N98432J54870O6076J33069l61124p91346
41962a790570M61280K831712L233212O89929j325038K8849J991175K60755l663498
41953B717806m128935j2247L420111K419091l39862r62644j53462n98223j816158
41944E45477j462779J84048P14840m18868j507492j585054j125168j84341J544615
41935c294722K951179K260730r4356j460059m70616J087276Q16065j030485j959865
41926a194853o10764J292315J046848j200833k125823K16089K886036J624347
$$ plain form
41918 1933362 -640513 -4582191 -4639821 -539271 2348456 386866 -3399635 -3599450 565725
41909 565725 4822437 5349313 2507636 -618917 -1609764 -337498 1703067 3208151 4319026
41900 4319026 5796308 7024835 6099497 2731930 -209320 191037 2790831 3476990 653577
41891 653577 -2426543 -2044990 902382 2308178 663184 -1067092 60749 2907639
41883 2907639 4318263 3655080 3080231 4118818 6243966 8551417 10414647 10480113 7764838
41874 7764838 4290114 3636329 5722163 6228219 3185076 765476 3234236 7899171
41866 7899171 8536778 4392810 985276 2102502 5536875 7551384 7510270 6632261 5591919
41857 5591919 5073682 5828150 6590778 4747866 701024 -1401958 617830 3416509 2979536
$$ packed form
41918A933362k573875l941678n7630M100550K887727j961590l786501j99815M165175
41909E65725M256712N26876k841677l126553r90847J272266K040565J505084J110875
41900D319026J477282J228527r25338l367567k941250M00357K599794O86159k823413
41891F53577l080120L81553K947372J405796j644994j730276J127841K846890
41883B907639J410624o63183n74849J038587K125148K307451J863230O5466k715275
41874G764838l474724o53785K085834N06056l043143k419600K468760M664935
41866G899171O37607m143968l407534J117226L434373K014509m1114q78009j040342
41857E591919n18237P54468P62628j842912m046842k102982K019788K798679m36973
$$ plain form
41848 2979536 518960 227483 2852475 5047485 4410714 1977350 -227198 -1432348
41840 -1432348 -1623322 -853465 576929 2579175 5626021 9213176 10703275 7880907
41832 7880907 2503729 -923396 -301218 2003803 2727871 1510733 246795 144776 759089
41823 759089 1271879 1574917 2039598 2718365 2959552 1898448 -554207 -3337322 -4965774
41814 -4965774 -4505200 -2040296 1195520 3276834 3174483 1982762 1382864 868436 -1557608
41805 -1557608 -5278304 -6149153 -1667626 4811008 7633022 5539179 2172067 700053
41797 700053 941664 1671205 2543818 2912979 1503847 -1374712 -3379191 -3185500 -2131102
41788 -2131102 -1581272 -763442 947369 1547027 -1080326 -5145788 -6399366 -3671746 -375854
$$ packed form
41848B979536k460576k91477K624992K195010o36771k433364k204548j205150
41840a432348j90974P69857J430394K002246L046846L587155J490099k822368
41832G880907n377178l427125O22178K305021P24068j217138j263938j02019O14313
41823G59089N12790L03038M64681O78767K41187j061104k452655k783115j628452
41814d965774M60574K464904L235816K081314j02351j191721n99898n14428k426044
41805a557608l720696q70849M481527O478634K822014k093843l367112j472014
41797G00053K41611P29541Q72613L69161j409132k878559k004479J93691J054398
41788b131102N49830Q17830J710811N99658k627353m065462j253578K727620L295892
$$ plain form
41779 -375854 265522 -821279 -832086 516224 1135594 377841 166103 1790834 3619637
41770 3619637 3358685 1334657 -116789 108066 982215 1564528 2374041 4058119 6011218
41761 6011218 7028062 6515868 4707597 2564894 1614618 2628089 4158670 3868478 1845182
41752 1845182 951750 3017427 6381697 8405270 8734231 8583206 8424395 8216886 8440760
41743 8440760 8868810 7784566 4800724 2986219 5151939 9041922 9762256 6665222
41735 6665222 4018135 4378697 5210025 3558985 647384 -486013 619265 2226767
41727 2226767 3320528 3881267 3776085 3522774 4726129 7440033 8383438 4551344 -2011741
41718 -2011741 -5857588 -4597158 -1126118 1045498 1981117 3424517 4959855 4550154
$$ packed form
41779c75854O41376j086801j0807J348310O19370p57753k11738J624731J828803
41770C619637k60952k024028j451446K24855Q74149N82313Q09513J684078J953099
41761F011218J016844n12194j808271k142703r50276J013471J530581k90192k023296
41752A845182q93432K065677L364270K023573L28961j51025j58811k07509K23874
41743H440760M28050j084244k983842j814505K165720L889983P20334l097034
41735F665222k647087L60562Q31328j651040k911601j133397J105278J607502
41727B226767J093761N60739j05182k53311J203355K713904R43405l832094o563085
41718b011741l845847J260430L471040K171616R35619J443400J535338m09701
$$ plain form
41710 4550154 2102516 -8845 -320195 -98004 -737886 -1146993 323107 2463390 2451362
41701 2451362 423883 -267453 1597359 2666942 229174 -2914394 -2313805 1234807
41693 1234807 3001732 1840574 1581257 4202327 6348413 4805556 1533337 263580
41685 263580 1021504 1323064 699366 592051 1052128 834517 147091 375334 1264494 899434
41675 899434 -1363722 -3831013 -4392623 -2222394 1863037 5355484 5379344 1921563 -1203900
41666 -1203900 -663267 2107503 3238219 1973614 884915 1116808 894683 -851802 -2559882
41657 -2559882 -2672660 -1599729 -127556 1694293 3196581 3109019 1943779 1804672 2666975
41648 2666975 1719375 -1832259 -4264194 -2331075 1617547 2810545 715006 -1126106
$$ packed form
41710D550154k447638k111361l11350K22191o39882m09107J470100K140283j2028
41701B451362k027479o91336J864812J069583k437768l143568O00589L548612
41693A234807J766925j161158k59317K621070K146086j542857l272219j269757
41685B63580P57924L01560o23698j07315M60077k17611o87426K28243Q89160l65060
41675H99434k263156k467291n61610K170229M085431L492447K3860l457781l125463
41666a203900N40633K770770J130716j264605j088699K31893k22125j746485j708080
41657b559882j12778J072931J472173J821849J502288q7562j165240j39107Q62303
41648B666975r47600l551634k431935J933119L948622J192998k095539j841112
$$ plain form
41640 -1126106 -1068709 -1182694 -2726307 -3587906 -1880670 703407 1311628 -91815 -1355728
41631 -1355728 -1540801 -1391839 -1042898 295913 2175227 2694026 1305810 -74095 -53299
41622 -53299 -88981 -1845867 -3628053 -2346446 1320500 3057002 1060573 -1168621 -171415
41613 -171415 2199776 1979599 -460238 -1234931 397438 608095 -2722104 -6094093 -5078355
41604 -5078355 -362919 3591469 4502045 4177365 4919861 6369122 6492134 4411416 1454245
41595 1454245 -379516 -659388 -857637 -2125598 -3416741 -2990440 -1307535 -555437 -1168324
41586 -1168324 -1013201 1166514 3713719 4862312 5500603 7083515 8412535 7064935
41578 7064935 3232945 -350704 -2056372 -2649350 -2892047 -2088240 307169 3266203 5211411
$$ packed form
41640a126106N7397j13985j543613q61599J707236K584077O08221j403443j263913
41631a355728j85073J48962L48941J338811J879314N18799j388216j379905K0796
41622e3299l5682j756886j782186J281607L666946J736502j996429k229194R97206
41613a71415K371191k20177k439837p74693J632369K10657l330199l371989J015738
41604e078355M715436L954388R10576l24680P42496J449261J23012k080718k957171
41595A454245j833761k79872j98249j267961j291143M26301J682905P52098o12887
41586a168324J55123K179715K547205J148593O38291J582912J329020j347600
41578G064935l831990l583649j705668n92978k42697Q03807K395409K959034J945208
$$ plain form
41569 5211411 5463103 4189460 1856602 -779620 -2810512 -3702300 -3436326 -2358685 -1368614
41560 -1368614 -1669160 -3360136 -4716311 -4008343 -1737232 125335 784221 1088703 1537029
41551 1537029 1464289 479592 -770868 -1758784 -2769775 -3969429 -4844663 -4996544 -4540377
41542 -4540377 -3517996 -2033016 -1092382 -1835584 -3507664 -3801968 -1998640 -199811 -329788
41533 -329788 -1369688 -1116124 429959 1315254 756016 127030 761667 2328226 3753403
41524 3753403 4464423 4189810 2701530 639976 -213673 1365921 4297030 6120431 5728144
41515 5728144 4243967 2982075 1727667 -63762 -1428042 -933887 814782 1701195
41507 1701195 1368292 1786279 3620976 4371578 2072540 -1086022 -1588326 166000 643357
$$ packed form
41569E211411K51692j273643k332858k636222k030892q91788K65974J077641R90071
41560a368614l00546j690976j356175P07968K271111J862567O58886L04482M48326
41551A537029p2740r84697j250460r87916j010991j199654q75234j51881M56167
41542d540377J022381J484980R40634p43202j672080k94304J803328J798829j29977
41533c29788j039900K53564J546083Q85295n59238o28986O34637J566559J425177
41524C753403P11020k74613j488280k061554q53649J579594K931109J823401l92287
41515E728144j484177j261892j254408j791429j364280M94155J748669Q86413
41507A701195l32903M17987J834697P50602k299038l158562n02304J754326M77357
$$ plain form
41498 643357 -1249373 -2812678 -2150846 -671722 171232 1344643 3479458 4521501 2804942
41489 2804942 323655 -74775 725505 -432102 -3693528 -5695884 -4465411 -1809927
41481 -1809927 -48333 1100355 3013585 5342329 6277340 4848845 1946342 -474576
41473 -474576 -744841 1243481 3654379 4269435 2824582 1157991 791849 1239246 1203501
41464 1203501 599728 490691 1359456 2311156 2188590 1069288 268145 760330 1891667
41455 1891667 2126786 1012466 -327672 -856733 -867126 -986810 -900573 -98966 766567
41446 766567 537894 -688032 -1544676 -1069512 401535 1763411 1884604 402383 -1365738
41437 -1365738 -1123182 1610914 4313907 4557011 3248395 2773929 2956028 1686429 -929734
$$ packed form
41498F43357j892730j563305O61832J479124Q42954J173411K134815J042043j716559
41489B804942k481287l98430Q00280j157607l261426k002356J230473K655484
41481a809927J761594J148688J913230K328744R35011j428495k902503k420918
41473d74576k70265J988322K410898O15056j444853j666591l66142M47397l5745
41464A203501o03773j09037Q68765R51700j22566j119302q01143M92185J131337
41455A891667K35119j114320j340138n29061j0393j19684Q6237Q01607Q65533
41446G66567k28673j225926q56644M75164J471047J361876J21193j482221j768121
41437a365738K42556K734096K702993K43104j308616m74466J82099j269599k616163
$$ plain form
41428 -929734 -2426258 -2224011 -2491989 -3832551 -3771655 -1304412 607280 -375555 -2114009
41419 -2114009 -1930501 -1468601 -3523421 -6224169 -5249208 -877271 2127567 1712171 815874
41410 815874 1626675 2249586 953770 -380929 348052 1889413 2175276 1688493 1523828
41401 1523828 673645 -1574136 -2768705 -502263 3085507 3912364 2154316 1790276 4134340
41392 4134340 5951657 4798593 2461507 1484119 1391081 500404 -778526 -751737 828437
41383 828437 2736848 4056539 4586885 4399052 4177739 5053697 7017749 8495249 8444778
41374 8444778 7659168 6980955 5792019 3741368 2363596 2913053 3837792 2870826 885741
41365 885741 942388 3557341 5637929 4808434 2479861 1413939 2019522 2646445 2480594
$$ packed form
41428i29734j496524K02247k67978j340562O0896K467243J911692r82835j738454
41419b114009J83508M61900k054820k700748R74961M371937L004838m15396q96297
41410H15874Q10801O22911j295816j334699P28981J541361K85863m86783j64665
41401A523828q50183k247781j194569K266442L587770Q26857j758048l64040K344064
41392D134340J817317j153064k337086r77388r3038q90677j278930K6789J580174
41383H28437J908411J319691N30346j87833k21313Q75958J964052J477500n0471
41374H444778p85610o78213j188936k050651j377772N49457R24739r66966j985085
41365H85741N6647K614953K080588q29495k328573j065922O05583O26923j65851
$$ plain form
41356 2480594 2389657 2980797 3171917 1476640 -1606343 -3442547 -2240121 368137 1166902
41347 1166902 -243358 -989542 320364 980738 -1491048 -4716335 -4573214 -1610749 -230703
41338 -230703 -1730609 -2620185 -792793 1048400 278031 -1188283 -399112 1586800 1674512
41329 1674512 -245266 -1775662 -2146619 -2374389 -2171833 -250343 2527489 3637205 2775921
41320 2775921 2214465 2778545 2485995 249370 -1757181 -1094384 1478501 3285061 3291853
41311 3291853 2839712 3443956 5041197 6240430 5787247 3974294 2618968 3184246 5121407
41302 5121407 6690510 6958316 6131693 4704084 3660849 4639153 7751903 9782942 7292258
41293 7292258 1764796 -1232373 917935 4378316 4124770 490765 -1931016 -608973
$$ packed form
41356B480594r0937N91140J91120j695277l082983j836204J202426K608258P98765
41347A166902j410260p46184J309906O60374k471786l225287J43121K962465J380046
41338b30703j499906q89576J827392J841193p70369j466314P89171J985912Q7712
41329A674512j919778j530396l70957k27770K02556J921490K777832J109716q61284
41320B775921n61456N64080k92550k236625k006551O62797K572885J806560O792
41311C291853m52141O04244J597241J199233m53183j812953j355326N65278J937161
41302E121407J569103K67806q26623j427609j043235R78304L112750K031039k490684
41293G292258n527462k997169K150308L460381k53546l634005k421781J322043
$$ plain form
41285 -608973 2248416 3150783 1524243 -152344 360914 2285018 2865757 1427000 1046396
41276 1046396 4407887 9045146 9838489 6252338 3326937 4286846 6169332 5288136 3215392
41267 3215392 3428976 4948824 4206103 1601270 940664 2757304 3436991 1659997 670868
41258 670868 2427236 4072252 2900947 1054031 1940365 4769630 6184879 5445736 4512347
41249 4512347 4192600 3604327 2948517 3697244 5898990 7766510 8182582 7622126 6551754
41240 6551754 4910389 3286538 2641722 2621409 2041973 1395419 2887848 7211076 11904445
41231 11904445 13911311 12705446 10230450 8704853 8958198 10018315 10013056 8269096 6385155
41222 6385155 6142246 6876609 6771938 6363712 8081516 11911087 14454408 13556698 11158770
$$ packed form
41285f08973K857389R02367j626540j676587N13258J924104N80739j438757l80604
41276A046396L361491M637259P93343l586151k925401R59909J882486q81196k072744
41267C215392K13584J519848p42721k604833o60606J816640O79687j776994r89129
41258F70868J756368J645016j171305j846916Q86334K829265J415249p39143r33389
41249D512347l19747n88273o55810P48727K201746J867520M16072n60456j070372
41240F551754j641365j623851o44816k0313n79436o46554J492429M323228M693369
41231A1904445K006866j205865k474996j525597K53345J060117n259j743960j883941
41222F385155k42909P34363j04671m08226J717804L829571K543321q97710k397928
$$ plain form
41213 11158770 9859236 9302676 8233020 7574613 8434552 9043883 7237851 4681698 4835766
41204 4835766 7342993 8359655 6571958 5050696 6297819 8879445 10229378 9828875
41196 9828875 8266008 5920201 4058444 4568193 6906069 7795627 5756393 3477003
41188 3477003 3657849 4966967 4650975 2976257 2093278 2125822 1596298 750402 1306929
41179 1306929 3285558 4891271 5473788 6095291 7036386 7010888 5302962 3005173 1780208
41170 1780208 2508777 4963331 7725454 8992493 8638422 8588521 9860333 10616468 9053037
41161 9053037 6755322 6583770 8271942 9035361 7953719 6756087 6479198 6308857 5871755
41152 5871755 5964664 6752517 7625681 8822393 10779141 12196289 11524020 9990023 9973902
$$ packed form
41213A1158770j299534n56560j069656o58407Q59939O09331j806032k556153J54068
41204D835766K507227J016662j787697j521262J247123K581626J349933m00503
41196I828875j562867k345807j861757N09749K337876Q89558k039234k279390
41188C477003J80846J309118l15992j674718q82979L2544n29524q45896N56527
41179A306929J978629J605713N82517O21503R41095k5498j707926k297789j224965
41170A780208P28569K454554K762123J267039l54071m9901J271812P56135j563431
41161I053037k297715j71552J688172P63419j081642j197632k76889j70341m37102
41152E871755R2909P87853Q73164J196712J956748J417148o72269j533997j6121
$$ plain form
41143 9973902 10692800 9200021 5698606 3757255 4688482 5992926 6393382 7872151 10975562
41134 10975562 12597050 10944224 8730586 8664775 9424432 8944444 8026956 7547855 5808416
41125 5808416 2357959 870375 3869801 7684998 7396004 4177475 2676794 3392449
41117 3392449 3302664 2447256 3654465 6149503 5694379 1921421 -142035 2496683 6750830
41108 6750830 8787668 8900912 8620280 7050909 3357024 -47923 -246592 1921425 3196405
41099 3196405 2399877 1238145 1380987 2824955 4851682 6933910 8540354 9051288 8248993
41090 8248993 6744463 5804520 6319802 7602450 7860098 6451234 4764036 4068707 3856340
41081 3856340 3637191 4731724 8080792 11622693 12549108 11257375 10228100 9813750 8427253
$$ packed form
41143I973902P18898j492779l501415j941351R31227J304444M00456J478769L103411
41134A0975562J621488j652826k213638o5811P59657m79988r17488m79101j739439
41125E808416l450457j487584K999426L815197k88994l218529j500681P15655
41117C392449q9785q55408J207209K495038m55124l772958k063456K638718M254147
41108F750830K036838J13244k80632j569371l693885l404947j98669K168017J274980
41099C196405p96528j161732J42842J443968K026727K082228J606444N10934q02295
41090H248993j504530r39943N15282J282648K57648j408864j687198o95329k12367
41081C856340k19149J094533L349068L541901R26415j291733j029275m14350j386497
$$ plain form
41072 8427253 6405505 5950485 7075814 7382457 6508017 7033582 9843925 12270585 12450068
41063 12450068 12049460 12695095 13036114 11824734 10871534 11898977 12838185 10614903 6145404
41054 6145404 3419339 4417661 7562457 10564079 12358214 12577334 11372341 9929222
41046 9929222 9634531 10609963 11961125 13072059 13799516 14049899 14102529 14655974 15674255
41037 15674255 16001626 15042679 13969790 14272495 15860549 17497340 18356462 18310449 17414126
41028 17414126 15914473 14268913 12781745 11821842 12195717 14011240 15392990 14263962
41020 14263962 11536469 10261749 11151049 11554594 9899182 8396981 9575045 12386656
41012 12386656 13854355 12909973 10752455 8859246 8240976 9190627 10389119 9890944 8133737
$$ packed form
41072H427253k021748m55020J125329L06643q74440N25565K810343K426660J79483
41063A2450068m00608O45635L41019j211380r53200J027443R39208k223282m469499
41054F145404k726065R98322L144796L001622J794135K19120j204993j443119
41046I929222k94691R75432J351162J110934P27457K50383N2630N53445J018281
41037A5674255L27371r58947j072889L02705J588054J636791Q59122m6013q96323
41028A7414126j499653j645560j487168r59903L73875J815523J381750j129028
41020A4263962k727493j274720Q89300M03545j655412j502201J178064K811611
41012A2386656J467699r44382k157518j893209o18270R49651J198492m98175j757207
$$ plain form
41003 8133737 7821171 9569335 10441957 8685076 6853889 7499588 8640347 7060574 3846936
40994 3846936 2717039 4385382 6412121 7417400 7650957 6503225 3545987 1328404
40986 1328404 2864929 6511426 7537225 5031247 3103458 4528419 7208659 8194636
40978 8194636 7623022 7060576 6920222 7075010 7498119 7072310 4324553 449831 -1139910
40969 -1139910 424090 1930847 867412 -957701 -456569 2437388 5499584 7155429
40961 7155429 6747703 3951568 156491 -1358356 941143 4336444 5225463 3802496
40953 3802496 3035796 3952129 4570108 3322282 1216183 167154 726018 1919637 2446017
40944 2446017 1865822 1125405 1591015 3075977 3547234 1598592 -1511485 -3272366 -2752036
$$ packed form
41003H133737l12566J748164Q72622j756881j831187O45699J140759j579773l213638
40994C846936j129897J668343K026739J005279K33557j147732k957238k217583
40986A328404J536525L646497J025799k505978j927789J424961K680240R85977
40978H194636n71614n62446j40354J54788M23109m25809k747757l874722j589741
40969a139910J564000J506757j063435j825113N01132K893957L062196J655845
40961G155429m07726k796135l795077j514847K299499L395301Q89019j422967
40953C802496p66700R16333O17979j247826k106099j049029N58864J193619N26380
40944B446017n80195p40417M65610J484962M71257j948642l110077j760881N20330
$$ plain form
40935 -2752036 -1020550 629203 1724104 2295780 2683824 3483857 4798102 5775259 5683332
40926 5683332 5055872 4899196 5193542 5219630 5024832 5361379 6273017 6934927 6958462 6677071
40916 6677071 5978343 4234471 2018462 1558567 4211425 8176922 10097451 8745209
40908 8745209 5954511 4056227 3802715 4936056 7001726 8717879 8194625 5260790
40900 5260790 2335221 1387787 1327838 419994 -195114 1541295 4096111 3788634 864391
40891 864391 -237758 2144761 4174958 2994981 1406889 2563466 4071942 2216000
40883 2216000 -969145 -487354 3411312 5566050 3924914 1755206 1635896 2461925 3247151
40874 3247151 4983028 7360446 8054902 6734083 5711056 5433286 3747695 971113
$$ packed form
40935b752036J731486J649753J094901N71676L88044Q00033J314245R77157r1927
40926E683332o27460j56676K94346K6088j94798L36547R11638O61910K3535k81391
40916F677071o98728j743872k216009m59895K652858L965497J920529j352242
40908H745209k790698j898284k53512J133341K065670J716153n23254k933835
40900E260790k925569r47434n9949r07844o15108J736409K554816l07477k924243
40891H64391j102149K382519K030197j179977j588092J156577J508476j855942
40883B216000l185145M81791L898666K154738j641136k169708j19310Q26029P85226
40874C247151J735877K377418O94456j320819j023027k77770j685591k776582
$$ plain form
40866 971113 666448 3267001 4152108 1137923 -1169076 1497161 6145670 7536392 6232820
40857 6232820 6214972 7455769 6807620 4456955 3651069 4908708 5942967 6792959 9561332
40848 9561332 13034540 13122345 9602321 7312074 9037829 11800818 12219220 11363769 11719217
40839 11719217 12868799 13155059 12906123 13023546 12424142 9813207 6553036 5040878 5206804
40830 5206804 5097146 4240040 3946039 4385680 3697429 737256 -2762436 -3852808 -1763461
40821 -1763461 1092213 1719931 -78804 -1470600 15285 3546798 6183369 6317153
40813 6317153 4695833 2563832 584112 -377336 537629 2360559 2429710 -327096 -3428364
40804 -3428364 -3627383 -938817 1621651 2008176 1302807 1600529 3086296 4255835 4408575
$$ packed form
40866I71113l04665K600553Q85107l014185k306999K666237M648509J390722j303572
40857F232820j7848J240797o48149k350665q05886J257639J034259Q49992K768373
40848I561332L473208Q7805l520024k290247J725755K762989M18402q55451L55448
40839A1719217J149582K86260k48936J17423n99404k610935l260171j512158J65926
40830E206804j09658q57106k94001M39641o88251k960173l499692j090372K089347
40821a763461K855674O27718j798735j391796J485885L531513K636571J33784
40813F317153j621320k132001j979720r61448R14965J822930O9151k756806l101268
40804c428364j99019K688566K560468L86525p05369K97722J485767J169539J52740
$$ plain form
40795 4408575 4482660 5073424 4983136 3071440 791314 870429 3272087 4622391 2753570
40786 2753570 -94673 -387758 1873076 3731288 3828271 3771851 4961559 6448582 6669791
40777 6669791 5605399 4394753 3904283 4161438 4337380 3221242 732616 -1178430 -460945
40768 -460945 2258201 4275088 4231234 3367587 3161312 3401286 3221402 2656081 2395324
40759 2395324 2842547 3777684 4278114 3229732 975533 -105393 1726701 4868216 6435863
40750 6435863 6567035 7896199 10693043 11809633 9491342 6139056 4665875 4913822
40742 4913822 5627055 7162738 9575284 10434013 7927529 4608642 4494309 7152276 8170513
40733 8170513 5572556 2542154 2938846 6628127 10404359 11705599 10265391 7416689
$$ packed form
40795D408575P4085N90764r0288j911696k280126P9115K401658J350304j868821
40786B753570k848243k93085K260834J858212R6983n6420J189708J487023K21209
40777F669791j064392j210646m90470K57155J75942j116138k488626j911046P17485
40768d60945K719146K016887m3854q63647k06275K39974j79884n65321k60757
40759B395324M47223R35137N00430j048382k254199j080926J832094L141515J567647
40750F435863J31172J329164K796844J116590k318291l352286j473181K47947
40742D913822P13233J535683K412546Q58729k506484l318887j14333K657967J018237
40733H170513k597957l030402L96692L689281L776232J301240j440208k848702
$$ plain form
40725 7416689 4889266 3635228 3270243 3142065 3784528 6141572 9277988 10440682 8307150
40716 8307150 5157857 4603805 7371719 10282098 9723232 5667731 1613247 494905
40708 494905 1574175 2259086 2144656 3242763 6087269 8043813 6835241 3791346 1715713
40699 1715713 1139410 1017815 1798652 4738323 8588535 10133898 8526435 6401941 5934724
40690 5934724 6322502 6226268 6155833 6785913 7070354 6092077 5152621 5828363 7199883 7345130
40680 7345130 6702939 7414302 9630973 11008714 10159992 8365674 7222886 6615462 5950829
40671 5950829 5561918 5548098 4713130 2285895 -287131 -904147 476021 2206901 3440995
40662 3440995 4480244 5021150 4191568 2625710 2406216 4046978 5314260 4294545 2149560
$$ packed form
40725G416689k527423j254038l64985j28178O42463K357044L136416J162694k133532
40716H307150l149293n54052K767914K910379n58866m055501m054484j118342
40708D94905J079270O84911j14430J098107K844506J956544j208572l043895k075633
40699A715713n76303j21595P80837K939671L850212J545363j607463k124494m67217
40690E934724L87778r6234p0435O30080K84441r78277r39456O75742J371520J45247
40680G345130o42191P11363K216671J377741q48722j794318j142788o07424o64633
40671E950829l88911j3820q34968k427235k573026o17016J380168J730880J234094
40662C440995J039249N40906q29582j565858k19494J640762J267282j019715k144985
$$ plain form
40653 2149560 1301016 2057963 2805205 2730216 2463548 2403338 2268052 2244326 2826300 3372415
40643 3372415 2482370 158529 -1867247 -2326546 -1591452 -422977 927627 1967415 1910762
40634 1910762 1046877 774655 1654325 2745640 3322789 3670913 3697790 2622467 742930
40625 742930 -536218 -1279051 -3173202 -5848084 -5938981 -2071194 1995365 2390755 1053170
40616 1053170 2648556 6976729 9001045 6347065 2409950 1076326 2127671 3375589
40608 3375589 4146002 4721916 4801816 4426954 4524860 4957430 3967064 1194007 -708169
40599 -708169 546395 3459850 4825710 4023916 3078574 3188246 3344578 2275480 112206
40590 112206 -2011739 -2963139 -2203188 -109366 2344053 4433717 5707803 5295338 2635011
$$ packed form
40653B149560q48544P56947P47242p4989k66668o0210j35286k3726N81974N46115
40643C372415q90045k323841k025776m59299P35094J168475J350604J039788n6653
40634A910762q63885k72222Q79670J091315N77149L48124K6877j075323j879537
40625G42930j279148p42833j894151k674882r0897L867787M066559L95390j337585
40616A053170J595386M328173K024316k653980l937115j333624J051345J247918
40608C375589P70413N75914P9900l74862R7906M32570r90366k773057j902176
40599g08169J254564K913455J365860q01794r45342J09672J56332j069098k163274
40590A12206k123945r51400P59951K093822K453419K089664J274086m12465k660327
$$ plain form
40581 2635011 -721506 -1907882 -466749 537983 -1179166 -3358089 -2103724 2432860
40573 2432860 6052830 6162048 4838159 5384364 7749208 8884765 6910930 3560830
40565 3560830 2157604 3660775 5490296 4787877 2203299 1034887 2642984 4649216
40557 4649216 4536128 3117296 2816620 3994013 4992557 4845444 3890072 2445468 1003250
40548 1003250 1134325 3841252 7219695 8179150 6674639 5895553 7764116 10497955 11473325
40539 11473325 10458163 8875005 7593762 6777656 6587253 6733712 6311588 5139803 4341734
40530 4341734 4652647 5172695 4873187 4372004 4947051 6518718 7940113 8782626 9445155
40521 9445155 9720065 8720772 6536061 4756581 4638352 5457235 5554859 4681014 4184693
$$ packed form
40581B635011l356517j186376J441133J004732j717149k178923J254365M536584
40573B432860L619970J09218j323889N46205K364844J135557j973835l350100
40565C560830j403226J503171J829521p02419k584578j168412J608097K006232
40557D649216j13088j418832l00676J177393R98544j47113r55372j444604j442218
40548A003250J31075K706927L378443R59455j504511p79086J868563K733839R75370
40539A1473325j015162j583158j281243q16106j90403J46459m22124j171785p98069
40530D341734L10913N20048k99508n01183N75047J571667J421395Q42513O62529
40521I445155K74910r99293k184711j779480j18229Q18883R7624q73845m96321
$$ plain form
40512 4184693 4607322 4356005 2071382 -440614 185972 3951466 6476496 4418355 30048
40503 30048 -1908871 -376853 1430884 1276238 424194 762375 2233769 3950587 5374897
40494 5374897 5413766 2764217 -1543081 -4178326 -3587228 -1972017 -1663822 -1795109 -696204
40485 -696204 566953 -48592 -1655619 -1418926 1101620 3445137 3967150 3436248 2762781
40476 2762781 1710559 548941 756956 2944297 5563436 6698953 6122846 4960833
40468 4960833 4347444 4920187 6574985 8121265 8095796 6472005 4737786 3836278 3005585
40459 3005585 1367473 -177144 290766 3211759 6598293 7871939 6431294 4076817
40451 4076817 2758880 2389797 1698454 927604 1956472 5064390 7492525 6992701 5300117
$$ packed form
40512D184693M22629k51317k284623k511996O26586L765494K525030k058141m388307
40503C0048j938919J532018J807737j54646q52044L38181J471394J716818J424310
40494E374897L8869k649549m307298k635245N91098J615211L08195j31287J098905
40485f96204J263157o15545j607027K36693K520546K343517N22013n30902o73467
40476B762781j052222j161618K08015K187341K619139J135517n76107j162013
40468D960833o13389N72743J654798J546280k5469j623791j734219r01508q30693
40459C005585j638112j544617M67910K920993L386534J273646j440645k354477
40451D076817j317937l69083o91343p70850J028868L107918K428135m99824j692584
$$ plain form
40442 5300117 5517232 6939491 5813693 1537621 -1434043 377722 4378720 5554313
40434 5554313 3411073 1992283 3534317 5557854 5242898 3897666 4817286 8041351
40426 8041351 9877820 7847773 3973739 1930970 2291915 2488885 1120521 100206
40418 100206 1641824 4776564 6537796 5843846 4415833 3912519 3839016 2897974 1258121
40409 1258121 567477 2065851 5137646 7624269 7680386 5731529 4305131 5179724 6996771
40400 6996771 6851875 4253987 2049307 2785293 5432741 6856606 5770497 3913306
40392 3913306 3534184 4973353 6994886 8464503 8963781 8342814 6717103 4987216 4383795
40383 4383795 4857158 4629358 2415202 -243899 -281435 2971417 6541744 7273508 5412546
$$ packed form
40442E300117K17115J422259j125798m276072k971664J811765M000998J175593
40434E554313k143240j418790J542034K023537l14956j345232R19620L224065
40426H041351J836469k030047l874034k042769L60945J96970j368364j020315
40418A00206J541618L134740J761232o93950j428013n03314p3503r41042j639853
40409A258121o90644J498374L071795K486623N6117j948857j426398Q74593J817047
40400F996771j44896k597888k204680P35986K647448J423865j086109j857191
40392C913306l79122J439169K021533J469617M99278o20967j625711j729887o03421
40383D383795M73363k27800k214156k659101l7536L252852L570327P31764j860962
$$ plain form
40374 5412546 3747310 4147969 6198327 8519894 10001156 10055118 9018835 8228916 8620389
40365 8620389 9364062 8860669 6905416 4972138 4620095 6371819 9517758 12057095 11765111
40356 11765111 8778980 6281392 6881606 9133468 9717443 8271142 7355547 7980007 8324104
40347 8324104 7334936 6432691 6536603 6317280 5018307 4437349 6092906 8500241 9356609
40338 9356609 8690397 7766293 6553080 4672485 3476990 4427760 6112377 5623779 2922699
40329 2922699 1462124 3900389 8845427 12504884 12521736 9745888 6963675 6252893 7342907
40320 7342907 8574048 9254920 10157446 11543364 12166574 11120191 9393788 8417905 8168036
40311 8168036 8006822 8312669 9670800 11274730 11871755 11800470 12403663 13710941 14414377
$$ packed form
40374E412546j665236M00659K050358K321567J481262N3962j036283p89919L91473
40365H620389P43673n03393j955253j933278l52043J751724L145939K539337k91984
40356A1765111k986131k497588O00214K251862N83975j446301r15595O24460L44097
40347H324104r89168r02245J03912k19323j298973n80958J655557K407335Q56368
40338I356609o66212r24104j213213j880595j195495R50770J684617m88598k701080
40329B922699j460575K438265M945038L659457J6852k775848k782213p10782J090014
40320G342907J231141O80872R02526J385918O23210j046383j726403r75883k49869
40311H168036j61214L05847J358131J603930N97025p1285O03193J307278P03436
$$ plain form
40302 14414377 14243680 14867033 17881661 22686630 26802720 28232801 27700960 28425598 32802957
40293 32802957 39263435 43756454 44660173 44409672 45442766 46655674 45530996 41989109
40285 41989109 38035547 34905501 32681805 31621885 31622300 31190173 29077251 26235044 24233528
40276 24233528 22709561 20503274 18234214 17241376 16879891 15607429 14046232 14071497 15366968
40267 15366968 15888871 15375928 15214010 15055555 13143595 10266569 9708353 12372272 15304822
40258 15304822 16134035 15788108 15730448 15892850 16777553 20066053 25113228 28224362 27986177
40249 27986177 28197969 32342034 37760292 39085441 35813247 32646106 33014843 35717916
40241 35717916 37952348 38683320 38458201 38081427 38183482 38765192 38893355 37841850 36362123
$$ packed form
40302A4414377j70697O23353L014628M804969M116090J430081n31841P24638M377359
40293C2802957O460478M493019R03719k50501J033094J212908j124678l541887
40285D1989109l953562l130046k223696j059920M15m32127k112922k842207k001516
40276B4233528j523967k206287k269060r92838l61485j272462j561197K5265J295471
40267A5366968N21903n12943j61918j58455j911960k877026n58216K663919K932550
40258A5304822Q29213l45927n7660J62402Q84703L288500N047175L111134k38185
40249B7986177K11792M144065N418258J325149l272194l167141L68737K703073
40241C5717916K234432P30972k25119l76774J02055N81710J28163j051505j479727
$$ plain form
40232 36362123 35791809 36220599 36560122 36059978 34852791 33536527 33077281 34375794 36943005
40223 36943005 38763029 38429752 36620791 34716356 33250050 32687840 33962686 36524973
40215 36524973 37513251 35168773 31886844 31349099 33461116 34865234 34023238 32813978
40207 32813978 32868721 33220909 32534082 31257060 30208087 28821058 26359324 23799982 23123183
40198 23123183 25152458 28863531 32446344 34625501 35371375 35593894 35854222 35593382 34226751
40189 34226751 32520880 31725989 31572224 30570049 28464356 26927146 27258862 28618701
40181 28618701 29236354 28381754 26422573 23903639 21546103 20485346 21371578 23369753
40173 23369753 24884725 25299235 25357397 25786590 26285730 26360278 26653290 28488733 31861566
$$ packed form
40232C6362123n70314M28790L39523n00144j207187j316264m59246J298513K567211
40223C6943005J820024l33277j808961j904435j466306n62210J274846K562287
40215C6524973R88278k344478l281929n37745K112017J404118q41996j209260
40207C2813978N4743L52188o86827j277022j048973j387029k461734k559342o76799
40198B3123183K029275L711073L582813K179157P45874K22519K60328k60840j366631
40189C4226751j705871p94891j53765j002175k105693j537210L31716J359839
40181B8618701O17653q54600j959181k518934k357536j060757Q86232J998175
40173B3369753J514972M14510N8162M29193M99140P4548K93012J835443L372833
$$ plain form
40164 31861566 34750972 35271505 34080955 33598673 34889917 36443624 36298423 34303403
40156 34303403 31753834 29706352 28321231 27239300 26097106 25126155 25259981 26784711
40148 26784711 28059414 27084196 24444440 22761739 22731060 22028103 19274055 16619252 16498400
40139 16498400 17970262 18566979 17871880 16691871 14516646 10903343 7886968 7502677
40131 7502677 8008702 6408158 3961325 4786923 8985865 11897744 11207358 10129440 11554041
40122 11554041 13361458 12534094 10428751 10377813 12421866 13924157 13829758 13176077 12613906
40113 12613906 12296821 13118889 15266073 16584976 15312089 13561287 14944472 19154833
40105 19154833 22152308 21814130 20219517 19702279 19657783 18567028 16750366 15413755 14569883
$$ packed form
40164C1861566K889406N20533j190550m82282J291244J553707j45201j995020
40156C4303403k549569k047482j385121j081931j142194r70951J33826J524730
40148B6784711J274703r75218k639756j682701l0679p02957k754048k654803j20852
40139A6498400J471862N96717o95099j180009k175225l613303l016375l84291
40131G502677N06025j600544k446833Q25598M198942K911879o90386j077918J424601
40122A1554041J807417q27364k105343n0938K044053J502291r4399o53681n62171
40113A2613906l17085Q22068K147184J318903j272887j750802J383185M210361
40105A9154833K997475l38178j594613n17238m4496j090755j816662j336611q43872
$$ plain form
40096 14569883 13443813 11886709 10275688 8988510 8843717 10892079 14667308 17645302
40088 17645302 17726102 15638797 13753259 13071743 12695280 11999169 11821483 12966662 14557559
40079 14557559 14877172 13652020 12630504 13490403 15626639 16688458 15323502 12784410
40071 12784410 11572488 12992066 16352038 20005024 22570388 23485216 23093417 22314648
40063 22314648 21973711 22461727 23934529 26249875 28525783 29504733 28830151 27348946 25743305
40054 25743305 23678749 20886678 18139336 16271691 15111795 14395815 14824370 16899473
40046 16899473 19467923 20868692 20913999 20283203 18737835 15855646 13020648 12457288 14290059
40037 14290059 16597851 18379999 20234630 21953805 22074507 20633645 19927547 21301255
$$ packed form
40096A4569883j126070j557104j611021j287178j44793K048362L775229K977994
40088A7645302Q0800k087305j885538o81516l76463o96111j77686J145179J590897
40079A4557559L19613j225152j021516Q59899K136236J061819j364956k539092
40071A2784410j211922J419578L359972L652986K565364R14828l91799p78769
40063B2314648l40937M88016J472802K315346K275908R78950o74582j481205j605641
40054B5743305k064556k792071k747342j867645j159896p15980M28555K075103
40046A6899473K568450J400769M5307o30796j545368k882189k834998n63360J832771
40037A4290059K307792J782148J854631J719175J20702j440862p06098J373708
$$ plain form
40029 21301255 23244222 23895389 23408910 22540407 21066154 19281587 18978446 20904551 23083688
40020 23083688 23777036 24248196 26115159 27802547 26776605 24044003 22980963 24313626
40012 24313626 25712527 26174291 27212497 29215679 30051062 28442194 25919402 24169302
40004 24169302 22955389 21964159 22301041 24507574 26969466 27831062 27037472 25482549 23875317
39995 23875317 23357096 25124234 28219660 29855066 29313542 29245073 31408951 33550589 32727374
39986 32727374 29536764 26478269 24123944 21883351 20899884 22782656 26360667 28858359
39978 28858359 29696616 30258622 30690720 30137289 29512274 30500363 32060615 31636490 29927787
39969 29927787 30482105 33936746 36859068 37603094 38974138 42757968 45709030 44535784
$$ packed form
40029B1301255J942967O51167m86479q68503j474253j784567l03141J926105K179137
40020B3083688O93348M71160J866963J687388j025942k732602j063040J332663
40012B4313626J398901M61764J038206K003182Q35383j608868k522792j750100
40004B4169302j213913r91230L36882K206533K461892Q61596p93590j554923j607232
39995B3875317n18221J767138L095426J635406n41524o8469K163878K141638q23215
39986C2727374l190610l058495k354325k240593r83467J882772L578011K497692
39978B8858359Q38257N62006M32098n53431o25015R88089J560252m24125j708703
39969B9927787N54318L454641K922322P44026J371044L783830K951062j173246
$$ plain form
39961 44535784 41841529 42888908 48075034 52664448 53392431 51716468 50430361 50277171
39953 50277171 50765494 51928626 54033574 56888419 60314529 64525877 69671626 75659391
39945 75659391 82508401 90308883 99082033 109370652 122524188 139406982 159032296
39938 159032296 179356172 199287443 219290922 240410790 263357439 287922531 312393936
39931 312393936 334163483 351924182 366640506 379225302 387996166 389995879 384487497
39924 384487497 373533586 359154909 341474185 319921794 294878996 267594469 239461149
39917 239461149 211845380 185908196 162261341 141260938 123515376 109355557 97971439
39910 97971439 88066752 79435973 73003669 69221865 67268561 65899566 64313742 62226168
$$ packed form
39961D4535784k694255J047379N186126M589414P27983j675963j286107j53190
39953E0277171M88323J163132K104948K854845L426110M211348N145749N987765
39945G5659391O849010P800482Q773150J0288619J3153536J6882794J9625314
39938A59032296K0323876J9931271K0003479K1119868K2946649K4565092K4471405
39931C12393936K1769547J7760699J4716324J2584796Q770864J999713n508382
39924C84487497j0953911j4378677j7680724k1552391k5042798k7284527k8133320
39917B39461149k7615769k5937184k3646855k1000403j7745562j4159819j1384118
39910I7971439r904687q630779o432304l781804j953304j368995j585824k087574
$$ plain form
39902 62226168 59944864 58293433 57573990 56850945 55338063 54028591 54251058 54847176 53206797
39893 53206797 49763131 48812366 53021183 59268918 62731680 63869467 67956009 77625422
39885 77625422 89392920 99054239 107601364 119073068 134272059 149865644 163231574
39878 163231574 174878395 185395857 193051601 196173518 195744365 193558587 189461347 182721025
39870 182721025 174778347 167820324 161294670 152773751 142161214 132069597 123707434 115538537
39862 115538537 107027660 100621501 98162329 97776584 96390037 93346579 89526164 84895972
39854 84895972 79369742 74409680 71096435 67928328 63318524 59160607 58795069 62013943
39846 62013943 65254039 66621694 67526853 68967609 69444586 67809674 65598123 64901746
$$ packed form
39902F2226168k281304j651431p19443p23045j512882j309472K22467N96118j640379
39893E3206797l443666r50765M208817O247735L462762J137787M086542R669413
39885G7625422J1767498R661319Q547125J1471704J5198991J5593585J3365930
39878A63231574J1646821J0517462P655744L121917m29153k185778m097240o740322
39870A82721025p942678o958023o525654q520919j0612537j0091617q362163q168897
39862A15538537q510877o406159k459172l85745j386547l043458l820415m630192
39854H4895972n526230m960062l313245l168107m609804m157917l65538L218874
39846F2013943L240096J367655R05159J440756M76977j634912k211551o96377
$$ plain form
39838 64901746 65704154 66777647 67826340 69357020 71390477 73476456 75467708 77674277
39830 77674277 80762807 85599037 92298573 99383193 104927568 108549288 111165349 113090281
39822 113090281 114033909 114886952 117484828 122236688 127965307 134617890 143985937 156787799
39814 156787799 171071525 184731402 197643121 209734111 218781306 222288401 220455954
39807 220455954 215214609 207011828 194609055 177855256 158866469 140296059 123753525
39800 123753525 109977791 99160899 90573907 82814040 75140801 68307338 63704185 61690202
39792 61690202 60852635 59056171 55455218 51381872 48880441 48449124 48694670 48081248 46345336
39783 46345336 44180850 42240872 40637237 39036338 37364186 36648550 38305927 41758385
$$ packed form
39838F4901746Q02408J073493J048693J530680K033457K085979J991252K206569
39830G7674277L088530M836230O699536P084620N544375L621720K616061J924932
39822A13090281R43628Q53043K597876M751860N728619O652583R368047J2801862
39814A56787799J4283726J3659877J2911719J2090990R047195L507095j832447
39807B20455954n241345q202781j2402773j6753799j8988787j8570410j6542534
39800A23753525j3775734j0816892q586992p759867p673239o833463m603153k013983
39792F1690202q37567j796464l600953m073346k501431m31317K45546o13422j735912
39783D6345336k164486j939978j603635j600899j672152p15636J657377L452458
$$ plain form
39775 41758385 43945312 42882386 40631315 40268028 40695041 38000355 32270167 28931574
39767 28931574 31391927 36000245 37416457 36087549 36377702 39133728 40828942 39768576
39759 39768576 38498988 38984266 39427102 37973489 36380168 37172700 39289606 39670369 38050492
39750 38050492 37087903 38047332 39377518 40041289 41415994 44593066 48246129 51269101
39742 51269101 55721308 64379042 76114923 86530181 93188985 97520310 101056287 102706820
39734 102706820 101185692 97576948 93399625 88142120 81164039 74466133 70791447 69989654
39726 69989654 70089426 71267734 75696160 83635158 92740646 101471431 110114991 117730506
39718 117730506 121076520 117996034 109733025 98873888 87178332 76383599 68594650
$$ packed form
39775D1758385K186927j062926k251071l63287M27013k694686n730188l338593
39767B8931574K460353M608318J416212j328908K90153K756026J695214j060366
39759C9768576j269588M85278M42836j453613j593321P92532K116906L80763j619877
39750C8050492r62589R59429J330186O63771J374705L177072L653063L022972
39742E1269101M452207Q657734J1735881J0415258O658804M331325L535977J650533
39734A02706820j521128l608744m177323n257505o978081o697906l674686q01793
39726F9989654R9772J178308M428426P938998R105488Q730785Q643560P615515
39718A17730506L346014l080486q263009j0859137j1695556j0794733p788949
$$ plain form
39711 68594650 64275775 61894356 60984722 63344578 69373173 75327950 76639434 72771647
39703 72771647 66867461 61712937 57898522 54917536 52143524 49265116 47019058 46580719
39695 46580719 47158931 45758402 41085536 36351594 36049140 40687124 46614381 50413947
39687 50413947 51567168 51152274 49818443 47404154 43677224 39348122 36318475 35874129
39679 35874129 36461476 35022818 31210831 28225522 28442327 30542956 32367712 33863465
39671 33863465 35123961 34504127 31777149 30439424 32903605 35602050 33641169 28932787
39663 28932787 28276399 33582012 39633686 42538333 44791064 49632878 55557455 60232862
39655 60232862 65897744 75893546 87746242 94486505 92645195 85288739 76968021 69099659
$$ packed form
39711F8594650m318875k381419r09634K359856O028595N954777J311484l867787
39703G2771647n904186n154524l814415k980986k774012k878408k246058m38339
39695D6580719N78212j400529m672866m733942l02454M637984N927257L799566
39687E0413947J153221m14894j333831k414289l726930m329102l029647m44346
39679C5874129N87347j438658l811987k985309K16805K100629J824756J495753
39671C3863465J260496o19834k726978j337725K464181K698445j960881m708382
39663B8932787o56388N305613O051674K904647K252731M841814N924577M675407
39655F0232862N664882R995802J1852696O740263j841310p356456q320718p868362
$$ plain form
39647 69099659 61408409 55048635 52054384 52775821 55620978 59150783 63392243 69120649
39639 69120649 76579065 84950981 92512173 97222424 97851007 95034794 91003941 87908520
39631 87908520 86430735 85778968 84162888 79195409 69556224 57716445 49716671 49901815
39623 49901815 56163926 62473210 65679367 67083257 67437889 64272687 55842554 44595878
39615 44595878 34381852 26554125 21001116 18439935 18730843 18977430 16661925 13320002
39607 13320002 11903912 11750306 9735044 5700074 2984276 3506518 5669272 7494010
39599 7494010 8734741 9274327 8328785 6271171 4983090 5451765 6727748 7651186 7826800
39590 7826800 6827079 4551867 2514335 2501409 3728948 3704254 2216614 1832382 3735399
$$ packed form
39647F9099659p691250o359774k994251P21437K845157L529805M241460N728406
39639F9120649P458416Q371916P561192M710251O28583k816213m030853l095421
39631H7908520j477785o51767j616080m967479r639185j1839779p999774J85144
39623D9901815O262111O309284L206157J403890L54632l165202q430133j1246676
39615D4595878j0214026p827727n553009k561181K90908K46587k315505l341923
39607A3320002j416090j53606k015262m034970k715798N22242K162754J824738
39599G494010J240731N39586r45542k057614j288081M68675J275983R23438J75614
39590G826800r99721k275212k037532j2926J227539k4694j487640l84232J903017
$$ plain form
39581 3735399 5771331 5873424 5075426 5487501 7070113 8167450 8095247 7619937 7418958
39572 7418958 7213307 6367618 4950761 4138263 5116432 7303378 8665478 8543815 8739618
39563 8739618 10458793 11871043 10830762 8500374 7549554 7919595 7461061 5987393 5360976
39554 5360976 5890517 5976284 5321007 5287019 5939153 5821718 4804217 4163289 3943377 3429935
39544 3429935 3947816 7450923 12324363 14519093 13086446 10650671 8411311 5298657
39536 5298657 2333131 2477892 5093483 5985740 4514011 4966376 8792001 11578467 10810032
39527 10810032 10386142 13130979 14733486 10759001 4785545 3123300 5086081 5255002
39519 5255002 2917792 2381100 5033507 7511046 7773740 7617617 8626021 9933025 10455519
$$ packed form
39581C735399K035932J02093p97998M12075J582612J097337p2203m75310k00979
39572G418958k05651q45689j416857q12498R78169K186946J362100j21663J95803
39563H739618J719175J412250j040281k330388r50820L70041m58534j473668o26417
39554E360976N29541Q5767o55277l3988O52134j17435j017501o40928k19912n13442
39544C429935N17881L503107M873440K194730j432647k435775k239360l112654
39536E298657k965526J44761K615591Q92257j471729M52365L825625K786466p68435
39527A0810032m23890K744837J602507l974485n973456j662245J962781J68921
39519E255002k337210n36692K652407K477539K62694j56123J008404J307004N22494
$$ plain form
39510 10455519 9908941 7735159 4192282 1840426 2624952 4421581 4039369 2517968
39502 2517968 3326364 6156968 7089816 4842000 2462894 2360315 3578691 4668506 5685391
39493 5685391 6541479 6465888 5812914 5791591 6136287 5544649 4222159 3292448 2191407
39484 2191407 -265536 -2760721 -2830639 -940513 316806 607657 1560158 2549439 1322380
39475 1322380 -1034444 -590045 3066052 5624105 4610479 2650033 2361000 2358271 830728
39466 830728 -674322 120177 2738989 5571422 8246910 10131971 9305814 5694989 2865161
39457 2865161 4006542 7926762 11212521 12494091 12478264 11697756 10519008 9829167 9675981
39448 9675981 8594441 5875539 2883130 722345 -1320984 -3377818 -3393998 -153301
$$ packed form
39510A0455519n46578k173782l542877k351856P84526J796629l82212j521401
39502B517968Q08396K830604R32848k247816k379106j02579J218376J089815J016885
39493E685391Q56088p5591o52974k1323L44696n91638j322490r29711j101041
39484B191407k456943k495185o9918J890126J257319K90851R52501R89281j227059
39475A322380k356824M44399L656097K558053j013626j960446k89033k729j527543
39466H30728j505050P94499K618812K832433K675488J885061q26157l610825k829828
39457B865161J141381L920220L285759J281570j5827p80508j178748o89841j53186
39448I675981j081540k718902k992409k160785k043329k056834j6180L240697
$$ plain form
39440 -153301 4084929 6270852 6174266 5263496 4017856 2767164 3146081 5774392 8121441
39431 8121441 7748943 6311445 7105418 9780751 11033529 9903452 8651212 8408492 7715901
39422 7715901 6053909 5268681 6119351 6497105 4930546 3272184 3649060 4816441 4234650
39413 4234650 2449047 2455050 5119700 8115287 9800884 11465148 14468364 17406274 18091813
39404 18091813 16839990 15511149 14352543 12512655 11190887 12945039 17217191 19804697
39396 19804697 18364390 15563877 14658050 14741589 13350613 11361386 11424916 12983329 13072122
39387 13072122 11565395 11394166 13302013 14501069 13518371 12578801 13576396 14945909 14516897
39378 14516897 12861585 11761244 11357604 10690753 9580106 8612780 8509039 10069968 13090344
$$ packed form
39440a53301M238230K185923r6586r10770j245640j250692L78917K628311K347049
39431H121441l72498j437498P93973K675333J252778j130077j252240k42720o92591
39422G715901j661992p85228Q50670L77754j566559j658362L76876J167381n81791
39413D234650j785603O003K664650K995587J685597J664264L003216K937910O85539
39404A8091813j251823j328841j158606j839888j321768J754152M272152K587506
39396A9804697j440307k800513r05827Q3539j390976j989227O3530J558413Q8793
39387A3072122j506727j71229J907847J199056r82698r39570R97595J369513m29012
39378A4516897j655312j100341m03640o66851j110647r67326j03741J560929L020376
$$ plain form
39369 13090344 15236020 14441606 12493041 12963425 15189869 14500344 9868473 6714813
39361 6714813 9202561 13885942 14970766 12662770 11763873 14158513 17350758 19317496
39353 19317496 20523158 21512762 22047588 22372447 22510043 21109434 17848236 15641419 16943570
39344 16943570 19139227 17861668 14120625 13257601 16621915 19339900 17690500 14023932
39336 14023932 12147877 11935046 11459289 11176511 12483747 14315187 14611319 13827614 13865479
39327 13865479 14465490 13774742 12093400 11931517 13954502 15687137 15344926 14598751 15707176
39318 15707176 17479494 16520434 12207144 8170759 8018017 11092905 13700050 13549179
39310 13549179 11503781 9461648 8301505 8138012 8954543 10155533 10579985 9829542 8890071
$$ packed form
39369A3090344K145676p94414j948565M70384K226444o89525m631871l153660
39361F714813K487748M683381J084824k307996q98897K394640L192245J966738
39353A9317496J205662R89604N34826L24859J37596j400609l261198k206817J302151
39344A6943570K195657j277559l741043q63024L364314K717985j649400l666568
39336A4023932j876055k12831m75757k82778J307236J831440K96132p83705L7865
39327A3865479O00011o90748j681342j61883K022985J732635l42211p46175J108425
39318A5707176J772318r59060m313290m036385j52742L074888K607145j50871
39310A3549179k045398k042133j160143j63493Q16531J200990M24452p50443r39471
$$ plain form
39301 8890071 8827641 9562992 10435887 11194592 11869901 12372394 12639630 12480600 11194144
39292 11194144 8548240 6343570 7338405 11828562 16734962 18906906 17890288 14784065
39284 14784065 10495376 6561536 5560715 8368484 12261307 13975640 13803968 14687626
39276 14687626 18117418 22987073 27758949 31574585 33646413 33678737 32843050 32653282 32987593
39267 32987593 32573146 30936085 28403003 24837792 20137564 15532483 12653304 11520833
39259 11520833 10802043 9615678 7963308 6272114 5700416 7502466 10535655 11167579
39251 11167579 7837333 3894774 3175610 4584439 4581808 3548052 5259286 10389628 14926620
39242 14926620 15641189 13430819 10613166 8443515 7953315 9614409 11290349 10080788
$$ packed form
39301H890071o2430P35351Q72895P58705O75309N02493K67236j59030j286456
39292A1194144k645904k204670R94835M490157M906400K171944j016618l106223
39284A4784065m288689l933840j000821K807769L892823J714333j71672Q83658
39276A4687626L429792M869655M771876L815636K071828L2324q35687j89768L34311
39267C2987593m14447j637061k533082l565211m700228m605081k879179j132471
39259A1520833p18790j186365j652370j691194n71698J802050L033189O31924
39251A1167579l330246l942559p19164J408829k631j033756J711234N130342M536992
39242A4926620P14569k210370k817653k169651m90200J661094J675940j209561
$$ plain form
39234 10080788 7095518 6628188 9561476 11855224 11253416 10898652 13473993 15998265
39226 15998265 14358687 9889762 7237660 7800054 9301799 10342161 11410218 12264167
39218 12264167 11962283 11181950 11428572 12155665 11400735 9082761 7150864 6633179 6850940
39209 6850940 7278354 7867230 7850852 6681867 5950393 7731766 10903119 11817764 9296071
39200 9296071 6463314 6500489 8583962 9483402 7817444 5233584 4034525 4851060 6593393
39191 6593393 8029191 9079069 10384974 11821633 12400916 12096073 12572604 15020407 18257078
39182 18257078 20347811 21181885 21786033 21983401 20918237 19385870 19068446 19364625 17677409
39173 17677409 13609339 10277952 10050221 11233327 10968832 9603823 9659677 11468441 12604512
$$ packed form
39234A0080788k985270m67330K933288K293748o01808l54764K575341K524272
39226A5998265j639578m468925k652102N62394J501745J040362J068057Q53949
39218A2264167l01884p80333K46622P27093p54930k317974j931897n17685K17761
39209F850940M27414N88876j6378j168985p31474J781373L171353R14645k521693
39200I296071k832757L7175K083473Q99440j665958k583860j199059Q16535J742333
39191F593393J435798J049878J305905J436659N79283l04843M76531K447803L236671
39182A8257078K090733Q34074O04148J97368j065164j532367l17424K96179j687216
39173A7677409m068070l331387k27731J183106k64495j365009N5854J808764J136071
$$ plain form
39164 12604512 11605635 9746240 8505821 7486560 6040931 5157711 5969004 7524195
39156 7524195 8041980 7804938 8637440 10461159 10655719 7722494 3668851 1381820 1123389
39147 1123389 1237685 1096163 1386348 2237796 3058763 3822340 4669700 4710194 3289538
39138 3289538 2046916 3235414 6009129 7058489 5346464 3449695 3430921 4322393 5008889
39129 5008889 6557771 9564625 11878396 11726590 11017921 12423983 14636215 13885284 9536075
39120 9536075 4974963 2935331 2787903 2896165 3108160 3884290 4674955 4294659 2209653
39111 2209653 -876161 -3183181 -2934843 -144925 3075355 4826041 5334653 5670779 5736687
39102 5736687 5038359 4341450 4664486 5483702 5884009 6561375 8416379 10056520 9468498
$$ packed form
39164A2604512r98877j859395j240419j019261j445629q83220Q11293J555191
39156G524195N17785k37042Q32502J823719J94560k933225m053643k287031k58431
39147A123389J14296j41522K90185Q51448Q20967P63577Q47360M0494j420656
39138C289538j242622J188498K773715J049360j712025j896769j8774Q91472O86496
39129E008889J548882L006854K313771j51806p08669J406062K212232p50931m349209
39120I536075m561112k039632j47428J08262K11995P76130P90665l80296k085006
39111B209653l085814k307020K48338K789918L220280J750686N08612L36126O5908
39102E736687o98328o96909L23036Q19216M00307O77366J855004J640141n88022
$$ plain form
39093 9468498 7700270 7851508 10336396 12136362 11222260 8872642 6912560 5470846
39085 5470846 4485968 4732517 5994457 6577102 6012433 6013188 7337055 8036013 6590986
39076 6590986 4638030 4474725 5609604 6018944 5471593 5359237 6160098 7118344 7773602
39067 7773602 8056037 7505879 6005266 4657336 4436554 4598246 3860165 2512380 1944783
39058 1944783 2693455 4241380 6022310 7351939 7296637 6087153 5683965 7201251 8648789
39049 8648789 7244335 3430196 569885 879290 3442504 6028237 7131015 6420879
39041 6420879 4886498 4394325 5617616 6883326 6690477 6431869 8241060 10959161 11446995
39032 11446995 9820477 9779021 12878934 16005429 16162501 14512655 13397500 12360234
$$ packed form
39093I468498j768228J51238K484888J799966r14102k349618j960082j441714
39085E470846r84878K46549J261940N82645n64669P55J323867O98958j445027
39076F590986j952956j63305J134879M09340n47351j12356Q00861R58246O55258
39067G773602K82435n50158j500613j347930k20782J61692p38081j347785n67597
39058A944783P48672J547925J780930J329629n5302j209484m03188J517286J447538
39049H648789j404454l814139k860311L09405K563214K585733J102778p10136
39041F420879j534381m92173J223291J265710j92849k58608J809191K718101M87834
39032A1446995j626518m1456L099913L126495J57072j649846j115155j037266
$$ plain form
39024 12360234 10207077 8607487 9768775 11775435 10316775 5075019 817495 1325137
39016 1325137 5124390 8356987 9433698 9430160 9801156 11239019 13429295 14669990 12974377
39007 12974377 8679575 4709168 3207378 3380988 3795210 4787887 6610406 7143384 4541986
38998 4541986 1054993 672095 3186835 4320254 2343166 679845 2239870 4817846
38990 4817846 4916037 3217588 2753724 3680809 3784845 3003524 3384969 4891808 5231552
38981 5231552 4175804 4190308 5902861 6721027 5455249 4739499 6671582 9144284 9158562
38972 9158562 7259047 5846985 5237945 4491466 4445762 6523340 9440399 10282939 8489639
38963 8489639 6170620 4962416 5016864 6384848 8641297 9703057 7990420 5496215
$$ packed form
39024A2360234k153157j599590J161288K006660j458660n241756m257524N07642
39016A325137L799253L232597J076711l538L70996J437863K190276J240695j695613
39007A2974377m294802l970407j501790J73610M14222R92677J822519N32978k601398
38998D541986l486993l82898K514740J133419j977088j663321J560025K577976
38990D817846R8191j698449m63864R27085J04036p81321L81445J506839L39744
38981E231552j055748J4504J712553Q18166j265778p15750J932083K472702J4278
38972I158562j899515j412062o09040p46479m5704K077578K917059Q42540j793300
38963H489639k319019j208204N4448J367984K256449J061760j712637k494205
$$ plain form
38955 5496215 5739102 8800506 11426909 11973632 11909351 12238189 12108617 11687372 12616088
38946 12616088 14327895 13688724 10182687 7855428 9657330 13120692 14518727 14329683
38938 14329683 15189476 16955141 17708764 17908109 19453201 21568813 21527436 19105376 16687281
38929 16687281 14996074 12319021 8431994 5844368 6035133 7310009 7712201 7603984
38921 7603984 7872697 7764183 6437727 5196098 6059065 8658071 10313473 9379606 7326881
38912 7326881 6811519 8151245 8778492 6695837 3425440 1984561 2561856 2700402 1941849
38903 1941849 2979204 6657384 9227178 7478701 3820205 2587800 3587142 3640182 2754552
38894 2754552 3569415 5522936 5278442 3203360 3546572 6842337 8003160 4479692 877542
$$ packed form
38955E496215K42887L061404K626403N46723o4281L28838j29572m21245R28716
38946A2616088J711807o39171l506037k327259J801902L463362J398035j89044
38938A4329683Q59793J765665P53623J99345J545092K115612m1377k422060k418095
38929A6687281j691207k677053l887027k587626J90765J274876M02192j08217
38921G603984K68713j08514j326456j241629Q62967K599006J655402r33867k052725
38912G326881n15362J339726O27247k082655l270397j440879N77295J38546p58553
38903A941849J037355L678180K569794j748477l658496j232405R99342N3040q85630
38894B754552Q14863J953521k44494k075082L43212L295765J160823l523468l602150
$$ plain form
38885 877542 1971558 5932328 8701941 10865532 15063039 19744322 21198950 20113428
38877 20113428 20688371 23859671 26219698 25589581 23290078 20601108 17093355 13317810
38869 13317810 11522596 12339215 13469214 12901975 11346574 10544652 10924699 11600418 11297111
38860 11297111 9130698 5878540 4185273 5807055 9053902 10787568 10341643 9399315
38852 9399315 8861305 8515600 9137475 11695764 14521345 14505209 11571183 9017693 8842311
38843 8842311 9543154 9233968 8199180 7488318 7359731 7794639 8403900 7736572 5212311
38834 5212311 3447473 5341303 8999082 9595683 6588932 4444410 5257210 5859286 4214823
38825 4214823 3246239 5047627 6337545 3994030 890672 1319629 4041251 5096329
$$ packed form
38885H77542J094016L960770K769613K163591M197507M681283J454628j085522
38877B0113428N74943L171300K360027o30117k299503k688970l507753l775545
38869A3317810j795214Q16619J129999n67239j555401q01922L80047O75719l03307
38860A1297111k166413l252158j693267J621782L246847J733666m45925r42328
38852I399315n38010l45705O21875K558289K825581j6136k934026k553490j75382
38843H842311P00843l09186j034788p10862j28587M34908O09261o67328k524261
38834E212311j764838J893830L657779N96601l006751k144522Q12800O02076j644463
38825D214823r68584J801388J289918k343515l103358M28957K721622J055078
$$ plain form
38817 5096329 4714698 5881489 8130017 8486523 7238906 7119604 7643614 5999320 3174886
38808 3174886 3239281 6137860 7124598 4542119 2448101 3565018 5036001 3978749 2476643
38799 2476643 3560302 6030248 6981407 6611392 6983036 8177527 8839177 8773715 8325322
38790 8325322 6988034 5108700 4901756 7068915 8526436 6587105 3448287 2983015
38782 2983015 4682968 4880300 3121899 2859841 5471897 7787816 7044757 5037799 5238598
38773 5238598 7875074 9966650 9202469 6232886 3599049 3296770 5075843 6775587
38765 6775587 6674907 5341809 4500600 4604033 4822479 5034499 5985999 7329246 7475768
38756 7475768 6134125 5261061 6394341 8451417 9456135 9287888 9215479 9526411 9337171
$$ packed form
38817E096329l81631J166791K248528L56506j247617j19302N24010j644294k824434
38808C174886O4395K898579R86738k582479k094018J116917J470983j057252j502106
38799B476643J083659K469946R51159l70015L71644J194491O61650o5462m48393
38790H325322j337288j879334k06944K167159J457521j939331l138818m65272
38782B983015J699953J97332j758401k62058K612056K315919p43059k006958K00799
38773E238598K636476K091576p64181k969583k633837l02279J779073J699744
38765F775587j00680j333098q41209J03433K18446K12020R51500J343247J46522
38756G475768j341643q73064J133280K057076J004718j68247p2409L10932j89240
$$ plain form
38747 9337171 8495001 8007363 8287977 8324071 7279533 6018921 6104467 7632718 8987149
38738 8987149 8898326 8056948 8139973 9564225 10972023 11082991 10303157 9924133 10260886
38729 10260886 10479388 10118801 9755023 9816720 9604560 8241515 6238639 5349644 6752099
38720 6752099 9752493 12420568 13283857 12268931 10165600 7587882 4848513 2758873
38712 2758873 2814301 5880857 10804223 14924270 16148594 14334060 10919470 7815834
38704 7815834 6449545 6870750 7455674 6289357 3317776 499767 -500564 139890 1672609
38695 1672609 4293347 8041797 11106499 11168103 8391636 5381006 3933566 3518835 3395363
38686 3395363 4223081 6285940 7738379 6561807 3545984 1533979 1963464 3691255
$$ packed form
38747I337171q42170m87638K80614L6094j044538j260612Q5546J528251J354431
38738H987149q8823q41378Q3025J424252J407798J10968p79834l79024L36753
38729A0260886K18502l60587l63778O1697k12160j363045k002876q88995J402455
38720F752099L000394K668075Q63289j014926k103331k577718k739369k089640
38712B758873N5428L066556M923366M120047J224324j814534l414590l103636
38704G815834j366289M21205N84924j166317k971581k818009j000331O40454J532719
38695A672609K620738L748450L064702O1604k776467l010630j447440m14731j23472
38686C395363Q27718K062859J452439j176572l015823k012005M29485J727791
$$ plain form
38678 3691255 5078832 5627003 5378251 4272496 2735656 1819148 2105529 3178634 4473678
38669 4473678 5776583 6577301 6029600 4285564 3058744 3943771 6484264 8535066 8414625
38660 8414625 6419455 4419570 4078913 5253635 6293170 6290426 6522314 8688183 12063049
38651 12063049 13846267 12573894 9867046 8297912 8619099 9613577 9712337 8322166 6419255
38642 6419255 5973400 7737845 9744795 9507214 7491519 6227951 6009586 4527687 1587881
38633 1587881 611182 3315495 6146560 5085164 1441769 -656748 -398778 171872 1097896
38624 1097896 4153122 8013961 8753353 5942648 3869497 5250502 7634968 7929283
38616 7929283 6928776 6848403 7209548 6090104 3613398 1523275 487627 71434 458753
$$ packed form
38678C691255J387577N48171k48752j105755j536840r16508K86381J073105J295044
38669D473678J302905Q00718n47701j744036j226820Q85027K540493K050802j20441
38660H414625j995170j999885l40657J174722J039535k744K31888K165869L374866
38651A2063049J783218j272373k706848j569134L21187R94478R8760j390171j902911
38642F419255m45855J764445K006950k37581k015695j263568k18365j481899k939806
38633A587881r76699K704313K831065j061396l643395k098517K57970N70650R26024
38624A097896L055226L860839P39392k810705k073151J381005K384466K94315
38616G929283j000507q0373L61145j119444k476706k090123j035648m16193L87319
$$ plain form
38607 458753 2138757 4383856 5681963 5477782 4506248 3775380 3832856 4463346 4724424
38598 4724424 3961610 2814618 2280348 2164253 1951171 2567395 4936079 7230144 6700355
38589 6700355 4364125 4218217 6960149 8484749 6269931 3159216 2288694 2238836 612946
38580 612946 -1167896 -788501 232198 -634200 -1758496 -52435 2929677 3054243 822885
38571 822885 772233 3618251 4783018 1944990 -1290999 -1354504 327441 1017718 1332677
38562 1332677 2928525 4501722 3632539 865939 -1096810 -1213613 -646045 -269484 248000
38553 248000 1237305 2391631 3156831 3080386 2335292 2108485 3321570 4824789 4507121
38544 4507121 2464198 997107 946847 510340 -1247816 -2362021 -1187881 748531 1360678
$$ packed form
38607D58753J680004K245099J298107k04181r71534p30868N7476O30490K61078
38598D724424p62814j146992n34270j16095k13082O16224K368684K294065n29789
38589F700355k336230j45908K741932J524600k214818l110715q70522m9858j625890
38580F12946j780842L79395J020699q66398j124296J706061K982112J24566k231358
38571H22885n0652K846018J164767k838028l235989o3505J681945O90277L14959
38562A332677J595848J573197q69183k766600j962749j16803N67568L76561N17484
38553B48000R89305J154326P65200p6445p45094k26807J213085J503219l17668
38544D507121k042923j467091n0260m36507j758156j114205J174140J936412O12147
$$ plain form
38535 1360678 1430192 2796089 4612142 4301952 1582396 -1015199 -1451536 -32580 1799355
38526 1799355 2793461 2283746 800738 -27009 564427 1339363 1212506 1286914 2746985
38517 2746985 3966291 2534002 -450900 -1321230 772977 2710410 2531222 2452553 4839912
38508 4839912 7899290 8224618 6057426 4935335 6554511 8766815 9023522 7439673
38500 7439673 5510889 3704374 1813889 508590 764938 2083491 2778544 2239118 1758965
38491 1758965 2655193 4366767 5048334 3715705 1396475 245455 1475496 3876319
38483 3876319 4711614 2778485 161092 -279090 1133029 1318487 -871135 -2730737 -1672806
38474 -1672806 1102082 2821250 3055256 2919813 2072039 -254938 -2219951 -1038329 2432116
$$ packed form
38535A360678O9514J365897J816053l10190k719556k597595m36337J418956J831935
38526A799355R94106n09715j483008q27747N91436P74936j26857P4408J460071
38517B746985J219306j432289k984902q70330K094207J937433j79188p8669K387359
38508D839912L059378L25328k167192j122091J619176K212304K56707j583849
38500G439673j928784j806515j890485j305299K56348J318553O95053n39426m80153
38491A758965Q96228J711574O81567j332629k319230j151020J230041K400823
38483C876319Q35295j933129k617393m40182J412119J85458k189622j859602J057931
38474a672806K774888J719168K34006j35443q47774k326977j965013J181622L470445
$$ plain form
38465 2432116 4323486 3387932 2515744 3799946 5609539 6034283 5929555 6523414 6880727
38456 6880727 6076238 5479742 6480409 7962044 8285812 7838383 7460926 6465819 4589242
38447 4589242 3743078 5122092 6623441 6034355 4677599 4612302 4387735 1636762 -1838950
38438 -1838950 -2265355 -218786 186029 -1802975 -2588810 -716779 772262 26829 -331072
38429 -331072 1989440 4872587 5378891 4178359 3491160 3315511 2687007 2427633 3576007
38420 3576007 4806488 4326879 2995089 2866960 3867245 4515224 4802895 5586135 5997284
38411 5997284 4373841 1390402 -462689 -485611 -365546 -1055069 -1512160 -1049965 -664368
38402 -664368 -1058109 -1145084 241211 2321701 3254227 2443832 1067507 573347 1288357
$$ packed form
38465B432116J891370r35554q72188J284202J809593M24744j04728N93859L57313
38456F880727q04489n96496J000667J481635L23768m47429l77457r95107j876577
38447D589242q46164J379014J501349n89086j356756o5297k24567k750973l475712
38438a838950m26405K046569M04815j989004p85835J872031J489041p45433l57901
38429c31072K320512K883147N06304j200532o87199j75649o28504k59374J148374
38420C576007J230481m79609j331790j28129J000285O47979K87671P83240M11149
38411E997284j623443k983439j853091k2922J20065o89523m57091M62195L85597
38402f64368l93741q6975J386295K080490R32526q10395j376325m94160P15010
$$ plain form
38393 1288357 2446540 3154387 3096026 2397273 1323302 585235 1386637 4015974 6587883
38384 6587883 6739071 4807267 3522811 3960262 4040859 2423875 1443636 3569788 6707101
38375 6707101 6491329 2723252 -56063 1054753 3618727 3942634 2141089 941708
38367 941708 1228553 1410671 705277 642016 2623825 5408016 6183857 3905802 658863
38358 658863 -753230 -97598 370903 -668391 -1650775 -610246 1525545 1947129 -16700
38349 -16700 -1792672 -918527 2024331 4586122 5375712 4883265 4185582 3876845 4092533
38340 4092533 4894619 6375221 8254098 9352116 8177980 4865616 2013084 2313584
38332 2313584 5393735 8193696 8507202 6908115 5179350 4399462 4894654 6396096 7529879
$$ packed form
38393A288357J158183P07847n8361o98753j073971p38067Q01402K629337K571909
38384F587883J51188j931804j284456M37451Q0597j616984r80239K126152L137313
38375F707101k15772l768077k779315J110816K563974L23907j801545j199381
38367I41708K86845J82118p05394o3261J981809K784191P75841k278055l246939
38358F58863j412093O55632M68501j039294r82384J040529K135791M21584j963829
38349a6700j775972Q74145K942858K561791P89590m92447o97683l08737K15688
38340D092533Q02086J480602J878877J098018j174136l312364k852532L00500
38332B313584L080151K799961L13506j599087j728765p79888M95192J501442J133783
$$ plain form
38323 7529879 6687846 4298691 2822150 3566358 5035370 5542946 5701967 6606432 7201818
38314 7201818 5937860 4054724 4368129 6869609 8294944 6753140 4400300 4231346
38306 4231346 6005021 6968854 5549530 2744226 388901 -536612 15924 1605027 3485924
38297 3485924 4938341 5696157 5896555 5666001 4992081 3972421 3029538 2830333 3803135
38288 3803135 5419515 6144825 4821114 2310051 1001116 2065115 3738338 3279243
38280 3279243 536541 -1489713 -198688 3210263 4918927 3090226 274510 502168
38272 502168 4499100 8804146 9659153 6800893 3005333 772889 308969 338089 -28924
38263 -28924 -383538 375844 2501118 4511050 4552141 2887542 1897138 2744397 3312284
$$ packed form
38323G529879q42033k389155j476541P44208J469012N07576J59021R04465N95386
38314G201818j263958j883136L13405K501480J425335j541804k352840j68954
38306D231346J773675R63833j419324k805304k355325r25513N52536J589103J880897
38297C485924J452417P57816K00398k30554o73920j019660r42883j99205R72802
38288C803135J616380P25310j323711k511063j308935J063999J673223m59095
38280C279243k742702k026254J291025L408951J708664j828701k815716K27658
38272E02168L996932M305046Q55007k858260l795560k232444m63920K9120l67013
38263b8924l54614P59382K125274K009932M1091j664599r90404Q47259N67887
$$ plain form
38254 3312284 1149610 -2411804 -3484090 -949393 2020291 2606183 2020999 2821604 4577405
38245 4577405 4785480 3095714 1833716 2275140 2869791 1929000 107589 -983044 -1179302
38236 -1179302 -1310329 -1270687 -255382 1290225 1612252 100287 -1382550 -640308 1960511
38227 1960511 3892997 3671427 2407797 1776913 1733207 1319018 670993 534850 397470
38218 397470 -692794 -1384528 1300341 7419862 12569408 12820141 9480203 6739252 6124207
38209 6124207 6119440 6149742 7228325 8556870 7350061 3470098 966876 2765952 6372729
38200 6372729 7587801 6577422 6974748 9870333 12156964 11122022 7736730 4416961
38192 4416961 1937597 85185 -426584 1282704 4314525 6584540 7344616 7861619 9421978
$$ packed form
38254C312284k162674l561414j072286K534697K969684N85892n85184Q00605J755801
38245D577405K08075j689766j261998M41424N94651r40791j821411j090633j96258
38236a179302j31027L9642J015305J545607L22027j511965j482837P42242K600819
38227A960511J932486k21570j263630o30884m3706m14189o48025j36143j37380
38218C97470j090264o91734K684869O119521N149546K50733l339938k740951o15045
38209F124207m767L0302J078583J328545j206809l879963k503222J799076L606777
38200F372729J215072j010379L97326K895585K286631j034942l385292l319769
38192D416961k479364j852412n11769J709288L031821K270015P60076N17003J560359
$$ plain form
38183 9421978 11726591 13721296 15179485 16642855 18153336 18977895 18744052 18090917 17789977
38174 17789977 17851589 18045843 18603831 19461351 19409344 17456484 14911902 14372980 16136902
38165 16136902 17369458 16033489 14195027 15552085 20273219 24274797 24001146 20561132
38157 20561132 18298265 19781146 22956712 23537491 20033124 15637000 14324778 15776423
38149 15776423 15997562 13055682 9767334 9420522 11091763 11456789 9635111 7514228
38141 7514228 6256246 5445680 5246758 6238206 6954151 4831335 437033 -2277485 -1237577
38132 -1237577 1076874 1884074 2201098 4219961 6905698 7412501 5656517 4302126 4597544
38123 4597544 5080187 4521510 3575840 2943955 2106259 803019 61564 666462 1794535
$$ packed form
38183I421978K304613J994705J458189J463370J510481Q24559k33843o53135l00940
38174A7789977O1612J94254N57988Q57520n2007j952860k544582n38922J763922
38165A6136902J232556j335969j838462J357058M721134M001578k73651l440014
38157B0561132k262867J482881L175566N80779l504367m396124j312222J451645
38149A5776423K21139k941880l288348l46812J671241L65026j821678k120883
38141G514228j257982q10566j98922R91448P15945k122816m394302k714518J039908
38132a237577K314451Q07200L17024K018863K685737N06803j755984j354391K95418
38123D597544M82643n58677r45670o31885q37696j303240p41455O04898J128073
$$ plain form
38114 1794535 2147988 1559950 629723 -432955 -1597902 -2121379 -968024 1699696 4129478
38105 4129478 4560456 3078159 1507458 1353190 2276705 2985977 3091928 3191970 3460882
38096 3460882 3483773 3509553 4258610 5052311 4012650 1165661 -589406 651441 2676905
38087 2676905 2295516 295887 249647 2853031 4806375 3867192 1890819 1490806 2330393
38078 2330393 2689115 2694943 3638237 5244188 5934071 5317768 4468433 3874355 2853558
38069 2853558 1179806 -144592 -201663 677899 1450320 1473608 909397 497843 1000697
38060 1000697 2440464 3869009 4208013 3253533 1698642 553430 796943 2889961 5907771
38051 5907771 7724820 7056332 5040739 3812925 3751119 3370438 1968796 866040 1284981
$$ packed form
38114A794535L53453n88038r30227j062678j164947n23477J153355K667720K429782
38105D129478M30978j482297j570701j54268R23515P09272J05951J00042K68912
38096C460882K2891K5780P49057P93701j039661k846989j755067J240847K025464
38087B676905l81389j999629m6240K603384J953344r39183j976373m00013Q39587
38078B330393L58722N828R43294J605951O89883o16303q49335n94078j020797
38069B853558j673752j324398n7071Q79562P72421K3288n64211m11554N02854
38060A000697J439767J428545L39004r54480j554891j145212K43513K093018L017810
38051E907771J817049o68488k015593j227814o1806l80681j401642j102756M18941
$$ plain form
38042 1284981 2241058 1852680 193475 -623387 627267 2512879 2868207 1772984 1511978
38033 1511978 3570866 6643679 8155799 7164880 4988246 3232662 2171811 1314914
38025 1314914 701488 834894 1623915 2217693 2117811 1932291 2556561 3797598 4439551
38016 4439551 3950996 3536717 4632866 6498071 6538486 3659741 217339 -594339 1343075
38007 1343075 3258373 3313056 2441697 2043535 1708650 419805 -1259993 -1730188 -585710
37998 -585710 919740 1478341 946880 131346 -737 884116 2002343 2141143 1196619
37989 1196619 370979 390068 478823 -116371 -646804 -85160 1072008 1650368 1740872 2247648
37979 2247648 3082181 3530435 3986833 5397894 7139087 7453915 6123770 4764586 4311017
$$ packed form
38042A284981R56077l88378j659205q16862J250654J885612L55328j095223k61006
38033A511978K058888L072813J512120r90919k176634j755584j060851q56897
38025A314914o13426J33406P89021N93778r9882j85520O24270J241037O41953
38016D439551m88555m14279J096149J865205M0415k878745l442402q11678J937414
38007A343075J915298N4683q71359l98162l34885j288845j679798m70195J144478
37998e85710J505450N58601n31461q15534j32083Q84853J118227J38800r44524
37989A196619q25640J9089Q8755n95194n30433N61644J157168N78360R0504N06776
37979B247648Q34533M48254M56398J411061J741193L14828j330145j359184m53569
$$ plain form
37970 4311017 4270449 4666396 6206697 7836094 6910236 3321469 943965 2839493 6981478
37961 6981478 9111532 8288455 7016484 6990863 7501187 7577255 7124279 5969963 4023560
37952 4023560 2469336 2813565 4652576 6217104 7102540 8530788 10898209 13130895
37944 13130895 14672306 16069450 17324042 17772821 17939824 19200529 21021354 20996897 18626684
37935 18626684 16609803 16967552 18182253 18023489 17157046 17604285 19034066 19108868 16974184
37926 16974184 14406799 13673529 15546014 19002785 21834864 22158542 20191513 17737093
37918 17737093 15517380 12785253 10340182 11195892 16083767 20733000 20719588 17253349
37910 17253349 14698846 13859148 12024125 9081782 8605027 11750358 14437910 12870218
$$ packed form
37970D311017m0568L95947J540301J629397r25858l588767k377504J895528M141985
37961F981478K130054q23077j271971k5621N10324P6068m52976j154316j946403
37952D023560j554224L44229J839011J564528Q85436J428248K367421K232686
37944A3130895J541411J397144J254592M48779J67003J260705J820825k4457k370213
37935A8626684k016881L57749J214701j58764q66443M47239J429781P4802k134684
37926A6974184k567385p33270J872485L456771K832079L23678j967029k454420
37918A7737093k219713k732127k445071Q55710M887875M649233j3412l466239
37910A7253349k554503q39698j835023k942343m76755L145331K687552j567692
$$ plain form
37902 12870218 8717689 6365835 7271024 9355344 10310444 9442180 7550608 6645549 8451810
37893 8451810 11712466 12521129 9052800 4477199 3175910 5314723 7425036 7539392
37885 7539392 7265719 8742253 11578903 13466789 12739386 9856419 6825608 5275522
37877 5275522 5047481 5040107 5119619 5923804 6801058 5961171 3492676 2148080 3627784
37868 3627784 5941410 6410771 5653983 6142360 8018222 9238829 9398971 10395397 12873402
37859 12873402 14670039 13952635 12021693 11530218 12965003 14334722 14145364 13598519 15217545
37850 15217545 19472578 23679637 25095818 24464019 24889701 27367772 29560820 29464966 27853215
37841 27853215 26019640 23719462 21095980 20056603 21346366 22623407 22187258 22199428
$$ packed form
37902A2870218m152529k351854R05189K084320R55100q68264j891572r05059J806261
37893H451810L260656Q08663l468329m575601j301289K138813K110313J14356
37885G539392k73673J476534K836650J887886p27403k882967l030811j550086
37877E275522k28041p374P9512Q04185Q77254q39887k468495j344596J479704
37868C627784K313626M69361p56788M88377J875862J220607J60142R96426K478005
37859A2873402J796637p17404j930942m91475J434785J369719j89358n46845J619026
37850A5217545M255033M207059J416181o31799M25682K478071K193048r5854j611751
37841B7853215j833575k300178k623482j039377J289763J277041m36149J2170
$$ plain form
37833 22199428 24840947 27699002 27298521 25254043 25674726 27581165 25893475 20139870
37825 20139870 16058158 17102825 20103626 21547273 22556216 24469098 24722354 21372107
37817 21372107 17470979 16347534 16095519 13602200 10811110 11349966 13305415 11642589
37809 11642589 6817995 4634987 7135204 9558338 7968533 4774937 4110525 5721645
37801 5721645 6534309 5625815 4633495 4672998 5190674 5169685 4125483 2588696 2160681
37792 2160681 3905063 6356974 6832264 5214642 4432246 6324305 9124841 10244829
37784 10244829 9472075 7835565 5344862 2106247 167324 1495534 4632512 5933762
37776 5933762 4368183 2885657 4183154 6818990 6984350 3392423 -1120738 -3035002
$$ packed form
37833B2199428K641519K858055m00481k044478M20683J906439j687690n753605
37825B0139870m081712J044667L000801J443647J008943J912882K53256l350247
37817B1372107l901128j123445k52015k493319k791090N38856J955449j662826
37809A1642589m824594k183008K500217K423134j589805l193596o64412J611120
37801E721645Q12664r08494r92320L9503N17676k0989j044202j536787m28015
37792B160681J744382K451911M75290j617622p82396J892059K800536J119988
37784A0244829p72754j636510k490703l238615j938923J328210L136978J301250
37776E933762j565579j482526J297497K635836J65360l591927m513161j914264
$$ plain form
37768 -3035002 -1952006 -110399 1011489 1891695 2725814 2164713 -327340 -2533374 -2049895
37759 -2049895 218230 1542865 1666535 2690712 4754727 5192377 2978539 915799
37751 915799 1684054 4231923 5919031 5894382 4396313 1193059 -2749055 -4335825 -2127159
37742 -2127159 813396 1054992 -60972 807459 2819418 2399386 118627 583832 4753414
37733 4753414 7834474 6743401 4541658 4542385 4749316 2249359 -708704 -26950 3353905
37724 3353905 5068166 4435302 4847180 7561378 10121761 11403021 13594364 17910986
37716 17910986 22258713 24747469 26180229 27396922 27200724 24766805 21452470 18421386
37708 18421386 15006267 11277637 9649690 11581064 14681461 15388610 12983744 9212105
$$ packed form
37768c035002J082996J841607J121888Q80206Q34119n61101k492053k206034M83479
37759b049895K268125J324635J23670J024177K064015M37650k213838k062740
37751I15799P68255K547869J687108k4649j498069l203254l942114j586770K208666
37742b127159K940555K41596j115964Q68431K011959m20032k280759M65205M169582
37733D753414L081060j091073k201743P27K06931k499957k958063O81754L380855
37724C353905J714261o32864M11878K714198K560383J281260K191343M316622
37716A7910986M347727K488756J432760J216693j96198k433919l314335l031084
37708A8421386l415119l728630j627947J931374L100397P07149k404866l771639
$$ plain form
37700 9212105 5825292 4302975 5777115 8953925 10191340 8055723 5671222 5938117
37692 5938117 6878445 5153157 1963326 1181101 3026639 4136135 3227619 2171204 1624786
37683 1624786 212017 -1572836 -1177354 1364821 2864294 2230728 2073181 3541196 3927060
37674 3927060 1674901 -308551 670093 2553375 2066904 94417 -32234 2251735 4553742
37665 4553742 5314157 4976786 4325878 3972678 4619632 6000239 6579752 5697974 4529587
37656 4529587 3713606 2155838 -332497 -1740253 -1079669 -191685 -207032 659971 3064976
37647 3064976 3766132 649601 -2711261 -2091959 597275 836646 -568412 672300 3907664
37638 3907664 3946344 172507 -1577968 1952117 6498841 7004605 4322563 2249353 2039820
$$ packed form
37700I212105l386813j522317J474140L176810J237415k135617k384501K66895
37692E938117R40328j725288l189831p82225J845538J109496r08516j056415n46418
37683A624786j412769j784853L95482K542175J499473o33566j57547J468015L85864
37674C927060k252159j983452R78644J883282m86471j972487j26651K283969K302007
37665D553742P60415l37371o50908l53200O46954J380607N79513q81778j168387
37656D529587q15981j557768k488335j407756O60584Q87984j5347Q67003K405005
37647C064976P01156l116531l360862O19302K689234K39371j405058J240712L235364
37638C907664L8680l773837j750475L530085M546724N05764k682042k073210k09533
$$ plain form
37629 2039820 2927738 4553150 5836285 4516126 754206 -1553708 138121 3290248
37621 3290248 4426153 4240308 5213419 6543090 5451209 2212815 13909 242979 1263578
37612 1263578 1851835 2787147 4373151 4863616 2729342 -742688 -2466233 -1133078 1031495
37603 1031495 957347 -896542 -643324 3241266 6386796 3970985 -1683362 -3508372 308835
37594 308835 3941008 3026326 742800 1615448 4127138 4112612 1885522 758725 958834
37585 958834 414538 -36915 2193940 5794878 6524436 3991521 2362175 3624477 5058265
37576 5058265 4648385 4230491 5178701 5236016 2467284 -945348 -1885653 -823520 -251022
37567 -251022 -498334 9402 1504848 2448026 1782583 -159605 -2374016 -3463392 -2186071
$$ packed form
37629B039820Q87918J625412J283135j320159l761920k307914J691829L152127
37621C290248J135905j85845R73111J329671j091881l238394k198906K29070J020599
37612A263578N88257R35312J586004M90465k134274l472030j723545J333155K164573
37603A031495p4148j853889K53218L884590L145530k415811n654347j825010L817207
37594C08835L632173r14682k283526Q72648K511690j4526k227090j126797K00109
37585I58834n44296m51453K230855L600938P29558k532915j629346J262302J433788
37576E058265m09880m17894R48210N7315k768732l412632r40305J062133N72498
37567b51022k47312N07736J495446R43178o65443j942188k214411j089376J277321
$$ plain form
37558 -2186071 856090 3106398 3109507 2600760 3843140 5897153 5734681 2728419 -174430
37549 -174430 -212751 1913023 3385909 2858110 1580022 1185604 1475240 1238690 846563
37540 846563 2380684 6285519 9446943 8730458 5644080 4668897 6827441 8110934 5525077
37531 5525077 1527324 65506 834731 808584 -232494 334260 2949668 4745309 4062663
37522 4062663 2623408 1942984 797963 -1689264 -3129685 -871518 3645597 6413203
37514 6413203 6001104 4595358 4257588 4757611 5326441 6041035 6592953 5776700 3538282
37505 3538282 2044332 3241327 6241439 8369677 8147391 6220275 4058675 2908599
37497 2908599 3508775 5640587 8133465 10109919 11796762 13334772 13597856 11550465
$$ packed form
37558b186071L042161K250308L109n08747J242380K054013j62472l006262k902849
37549a74430l8321K125774J472886n27799j278088l94418K89636k36550l92127
37540H46563J534121L904835L161424p16485l086378r75183K158544J283493k585857
37531E525077l997753j461818P69225k6147j041078N66754K615408J795641o82646
37522D062663j439255o80424j145021k487227j440421K258167M517115K767606
37514F413203m12099j405746l37770N00023N68830P14594N51918q16253k238418
37505C538282j493950J196995L000112K128238k22286j927116k161600j150076
37497B908599O00176K131812K492878J976454J686843J538010K63084k047391
$$ plain form
37489 11550465 8293561 6185345 5952061 6068645 5130314 3522934 2453041 2469531 3312216
37480 3312216 4324150 4791158 4630890 4642419 5182168 5035136 3031721 469924 72659
37471 72659 2427225 5301643 6681106 6472478 5008564 2470865 587990 1969872 6008451
37462 6008451 8087400 5322731 995164 421030 3965812 7312033 7738907 6769365 6626850
37453 6626850 7172493 7113518 5974986 4051191 2031147 1103742 1901668 3167323 3127385
37444 3127385 2259647 2744956 4948873 6706472 6817311 6924665 8475429 9691347 7616521
37435 7616521 2364730 -2436670 -3340725 -231786 3997197 6149931 5317769 3403018
37427 3403018 3041218 4854667 7075517 7844446 7118511 6059471 5420940 5223879 5481771
$$ packed form
37489A1550465l256904k108216k33284J16584r38331j607380j069893J6490Q42685
37480C312216J011934M67008j60268J1529N39749j47032k003415k561797l97265
37471G2659K354566K874418J379463k08628j463914k537699j882875J381882M038579
37462F008451K078949k764669m327567n74134L544782L346221M26874r69542j42515
37453F626850N45643n8975j138532j923795k020044r27405P97926J265655l9938
37444C127385q67738M85309K203917J757599J10839J07354J550764J215918k074826
37435G616521n251791m801400r04055L108939M228983K152734q32162j914751
37427C403018l61800J813449K220850P68929p25935j059040o38531j97061K57892
$$ plain form
37418 5481771 6388851 7734240 8604983 8031448 6070690 4060643 3300975 3470961 3161631
37409 3161631 2227204 2386212 4595546 7065743 7426651 5966470 4799379 4389715 3261930
37400 3261930 1234897 410118 1986954 4172168 4680128 3803386 3440672 4156256 4888634
37391 4888634 5032300 5182493 5778387 6273729 6087705 5639659 5861631 6861281 7528809
37382 7528809 6744664 4825229 3295246 3142837 3917539 4814603 5790299 6954926 7753349
37373 7753349 7781870 7715926 8247033 8705361 8050658 6726456 6159194 6888628 8555081
37364 8555081 11011916 13707864 14752912 12907675 10061884 9153090 9807736 9000372 6250062
37355 6250062 4742314 6194088 7975355 7289205 5307265 4632505 4982386 4311452 2656719
$$ packed form
37418E481771R07080J345389Q70743n73535j960758k010047p59668J69986l09330
37409C161631r34427J59008K209334K470197L60908j460181j167091m09664j127785
37400C261930k027033q24779J576836K185214N07960q76742l62714P15584P32378
37391D888634J43666J50193N95894M95342j86024m48046K21972R99650O67528
37382G528809p84145j919435j529983j52409P74702Q97064R75696J164627P98423
37373G753349K8521o5944N31107M58328o54703j324202n67262P29434J666453
37364H555081K456835K695948J045048j845237k845791r08794O54646q07364k750310
37355F250062j507748J451774J781267o86150j981940o74760L49881o70934j654733
$$ plain form
37346 2656719 1901647 2525728 3180792 3095829 2799053 2850800 3689389 6152674 10203684
37337 10203684 13588053 13719654 10713556 6945185 4083519 2338607 2051287 3694029
37329 3694029 6198338 7389936 6588251 5209518 4513637 4340920 4415556 5233258 6885644
$$ packed form
37346B656719p55072O24081O55064q4963k96776N1747Q38589K463285M051010
37337A0203684L384369J31601l006098l768371k861666j744912k87320J642742
37329C694029K504309J191598q01685j378733o95881j72717P4636Q17702J652386
$$ [...]
##END NTUPLES=NMR SPECTRUM
##END=
