##TITLE=31Pdec_SR141_oil
 DMSO-d6, 124 sc
 19.9.2022
##JCAMPDX= 6.0         $$ Bruker NMR JCAMP-DX V2.0
##DATA TYPE= NMR SPECTRUM
##DATA CLASS= NTUPLES
##ORIGIN= UXNMR, Bruker Analytische Messtechnik GmbH
##OWNER= root
$$ XWIN-NMR		Version 3.5
$$ Mon Sep 19 15:53:47 2022 Russian Standard Time (UT+4h)  she@DPX200
##.OBSERVE FREQUENCY= 81.013821
##.OBSERVE NUCLEUS= ^31P
##.ACQUISITION MODE= SIMULTANEOUS
##.ACQUISITION SCHEME= undefined
##.AVERAGES= 124
##.DIGITISER RES= 16
##SPECTROMETER/DATA SYSTEM= spect
##.PULSE SEQUENCE= zgpg30
##.SOLVENT NAME= CDCl3
##.SHIFT REFERENCE= (INTERNAL, CDCl3, 0, 248.564)
##AUDIT TRAIL= $$ (NUMBER, WHEN, WHO, WHERE, WHAT)
$$ ##TITLE= Audit trail, XWIN-NMR		Version 3.5
$$ ##JCAMPDX= 5.01
$$ ##ORIGIN= Bruker BioSpin GmbH
$$ ##OWNER= she
$$ F:/spectra/data/she/nmr/P31/1/pdata/1/auditp.txt
$$ ##AUDIT TRAIL=  $$ (NUMBER, WHEN, WHO, WHERE, WHAT)
(   1,<2022-09-19 15:53:00.31 +0400>,<she>,<DPX200>,
      <continue with go, POWCHK disabled, PULCHK disabled
       configuration hash MD5:
       00 E9 B6 7A A2 85 ED C7 34 08 36 98 17 FE 4E 26
       data hash MD5: 32K
       5F 59 B3 97 E3 38 E3 22 54 FE 2C EA 0A A0 CF 33>)
(   2,<2022-09-19 15:53:02.57 +0400>,<she>,<DPX200>,
      <Start of raw data processing
       efp BC_mod = 2 LB = 1 FT_mod = 6 PKNL = 1 PHC0 = -10289.74 PHC1 = 113.4566 SI = 64K 
       data hash MD5: 64K
       AC 1D 65 A3 F9 7B 5A 8F A2 72 A3 16 05 18 3E 66>)
(   3,<2022-09-19 15:53:18.37 +0400>,<she>,<DPX200>,
      <pk PHC0 = -14.56179 PHC1 = 36.39999 
       data hash MD5: 64K
       7A A8 FA 8F 4B A5 17 2B 89 48 82 26 B3 97 9A 3E>)
$$ ##END=
$$ 
$$ hash MD5
$$ 2A 3E 63 72 86 6B 3F F4 AF FE B2 18 03 19 C4 AC
##$RELAX= 
##$RELAX= 
##$RELAX= 
##$RELAX= 
##$RELAX= 
##$RELAX= 
##$RELAX= 
##$RELAX= 
##$RELAX= 
$$ Bruker specific parameters
$$ --------------------------
##$DU= <F:/spectra>
##$EXPNO= 1
##$NAME= <P31>
##$PROCNO= 1
##$TYPE= <nmr>
##$USER= <she>
##$AMP= (0..31)
100 100 100 100 100 100 100 100 100 100 100 100 100 100 100 100 100 100 
100 100 100 100 100 100 100 100 100 100 100 100 100 100 
##$AQSEQ= 0
##$AQ_mod= 1
##$AUNM= <au_zg>
##$AUTOPOS= <>
##$BF1= 81.014009
##$BF2= 200.13
##$BF3= 200.13
##$BF4= 200.13
##$BF5= 200.13
##$BF6= 200.13
##$BF7= 200.13
##$BF8= 200.13
##$BYTORDA= 1
##$CFDGTYP= 0
##$CFRGTYP= 5
##$CHEMSTR= <none>
##$CNST= (0..31)
1 1 145 1 1 1 1 1 1 1 1 1 1 1 1 1 1 1 1 1 1 1 1 1 1 1 1 1 1 1 1 1 
##$CPDPRG= <waltz16>
##$CPDPRG1= <>
##$CPDPRG2= <waltz16>
##$CPDPRG3= <>
##$CPDPRG4= <mlev>
##$CPDPRG5= <mlev>
##$CPDPRG6= <mlev>
##$CPDPRG7= <mlev>
##$CPDPRG8= <mlev>
##$CPDPRGB= <>
##$CPDPRGT= <>
##$D= (0..31)
0 1 0 0 0 0 0 0 0 0 0 0.03 2e-05 3e-06 0 0 0 0 0 0 0 0 0 0 0 0 0 0 0 0 
0 0 
##$DATE= 1663588213
##$DBL= (0..7)
120 120 120 11 120 120 24 19 
##$DBP= (0..7)
150 150 150 150 150 150 150 150 
##$DBP07= 0
##$DBPNAM0= <>
##$DBPNAM1= <>
##$DBPNAM2= <>
##$DBPNAM3= <>
##$DBPNAM4= <>
##$DBPNAM5= <>
##$DBPNAM6= <>
##$DBPNAM7= <>
##$DBPOAL= (0..7)
0.5 0.5 0.5 0.5 0.5 0.5 0.5 0.5 
$$ [...]
##$SUBNAM2= <"">
##$SUBNAM3= <"">
##$SUBNAM4= <"">
##$SUBNAM5= <"">
##$SUBNAM6= <"">
##$SUBNAM7= <"">
##$SUBNAM8= <"">
##$SUBNAM9= <"">
##$SW= 501.771253377433
##$SWIBOX= (0..15)
0 1 3 0 0 0 0 0 0 0 0 0 0 0 0 0 
##$SW_h= 40650.406504065
##$TD= 32768
##$TD0= 1
##$TE= 0
##$TE2= 300
##$TE3= 300
##$TEG= 300
##$TL= (0..7)
0 120 53 12 22 120 120 120 
##$TP= (0..7)
150 150 150 150 150 150 150 150 
##$TP07= 0
##$TPNAME0= <>
##$TPNAME1= <>
##$TPNAME2= <>
##$TPNAME3= <>
##$TPNAME4= <>
##$TPNAME5= <>
##$TPNAME6= <>
##$TPNAME7= <>
##$TPOAL= (0..7)
0.5 0.5 0.5 0.5 0.5 0.5 0.5 0.5 
##$TPOFFS= (0..7)
0 0 0 0 0 0 0 0 
##$TUNHIN= 0
##$TUNHOUT= 0
##$TUNXOUT= 0
##$USERA1= <user>
##$USERA2= <user>
##$USERA3= <user>
##$USERA4= <user>
##$USERA5= <user>
##$V9= 5
##$VALIST= <valist>
##$VCLIST= <CCCCCCCCCCCCCCC>
##$VD= 0
##$VDLIST= <DDDDDDDDDDDDDDD>
##$VPLIST= <PPPPPPPPPPPPPPP>
##$VTLIST= <TTTTTTTTTTTTTTT>
##$WBST= 1024
##$WBSW= 4
##$XGAIN= (0..3)
0 0 0 0 
##$XL= 0
##$YL= 0
##$YMAX_a= 14385
##$YMIN_a= -18152
##$ZGOPTNS= <>
##$ZL1= 120
##$ZL2= 120
##$ZL3= 120
##$ZL4= 120
##$ABSF1= 0
##$ABSF2= 0
##$ABSG= 0
##$ABSL= 0
##$ALPHA= 0
##$AQORDER= 0
##$ASSFAC= 0
##$ASSFACI= 0
##$ASSFACX= 0
##$ASSWID= 0
##$AUNMP= <proc_1d>
##$AZFE= 0.1
##$AZFW= 0.5
##$BCFW= 0
##$BC_mod= 2
##$BYTORDP= 0
##$COROFFS= 0
##$CY= -3
##$DATMOD= 1
##$DC= 0
##$DFILT= <>
##$DTYPP= 0
##$F1P= 0
##$F2P= 0
##$FCOR= 1
##$FTSIZE= 65536
##$FT_mod= 6
##$GAMMA= 0
##$GB= 0
##$INTBC= 1
##$INTSCL= 6.834604e-11
##$ISEN= 30
##$LB= 1
##$LEV0= 0
##$LPBIN= 0
##$MAXI= 10000
##$MC2= 0
##$MEAN= 0
##$ME_mod= 0
##$MI= 50
##$NCOEF= 0
##$NC_proc= -5
##$NLEV= 6
##$NOISF1= 182.463
##$NOISF2= 159.3651
##$NSP= 0
##$NTH_PI= 0
##$NZP= 0
##$OFFSET= 248.5645
##$PC= 4
##$PHC0= -10304.3
##$PHC1= 149.8566
##$PH_mod= 1
##$PKNL= yes
##$PPARMOD= 0
##$PSCAL= 0
##$PSIGN= 0
##$REVERSE= no
##$SF= 81.0140089999694
##$SI= 65536
##$SIGF1= 159.3651
##$SIGF2= -187.1042
##$SINO= 113.3802
##$SIOLD= 16384
##$SREGLST= <1H.CDCl3>
##$SSB= 0
##$STSI= 65536
##$STSR= 0
##$SW_p= 40650.406504065
##$SYMM= 0
##$S_DEV= 0
##$TDeff= 32768
##$TDoff= 0
##$TI= <>
##$TILT= no
##$TM1= 0
##$TM2= 0
##$TOPLEV= 0
##$USERP1= <user>
##$USERP2= <user>
##$USERP3= <user>
##$USERP4= <user>
##$USERP5= <user>
##$WDW= 1
##$XDIM= 65536
##$YMAX_p= 341963884
##$YMIN_p= -13757747
$$ End of Bruker specific parameters
$$ ---------------------------------
##NTUPLES= NMR SPECTRUM
##VAR_NAME=  FREQUENCY,     SPECTRUM/REAL,   SPECTRUM/IMAG
##SYMBOL=    X,             R,               I
##VAR_TYPE=  INDEPENDENT,   DEPENDENT,       DEPENDENT
##VAR_FORM=  AFFN,          ASDF,            ASDF
##VAR_DIM=   65536,         65536,           65536
##UNITS=     HZ,            ARBITRARY UNITS, ARBITRARY UNITS
##FACTOR=    0.620285442955139, 1,           1
##FIRST=     20137.2065510682, 0,            0
##LAST=      -20513.1999529968, 0,           0
##MIN=       -20513.1999529968, -13757747,   0
##MAX=       20137.2065510682, 341963884,    0
$$ Real data points
##PAGE= N=1
##DATA TABLE= (X++(R..R)), XYDATA
$$ [...]
$$ plain form
42540 670585 901963 796185 -168361 -1272201 -1569930 -1084812 -429924 61268 363917
42531 363917 528526 725505 986029 864519 49586 -804797 -794405 -214864 -159978 -665048
42521 -665048 -572115 508355 1458629 1366645 742915 427911 431358 542836 1011299 1802007
42511 1802007 2120902 1564886 974183 1268536 2087305 2432167 2087944 1535064 886130
42502 886130 -206083 -1735712 -3051460 -3301379 -1960635 633685 2993424 3397956 1698237
42493 1698237 -264493 -612297 589253 1797954 1966295 1393672 920806 963305 1315418
42484 1315418 1460183 1018908 83657 -876562 -1375184 -1069582 80908 1360636 1454867
42475 1454867 -41259 -1547429 -1100215 1022031 2608358 2564034 2064620 2221412 2404376
$$ packed form
42540F70585K31378j05778r64546j103840k97729M85118O54888M91192L02649
42531C63917J64609J96979K60524j21510q14933q54383J0392N79541N4886n05070
42521f65048R2933J080470R50274r1984o23730l15004L447J11478M68463P90708
42511A802007L18895n56016n90703K94353Q18769L44862l44223n52880o48934
42502H86130j092213j529629j315748k49919J340744K594320K359739M04532j699719
42493A698237j962730l47804J201550J208701J68341n72623m72866M2499L52113
42484A315418J44765m41275r35251r60219m98622L05602J150490J279728R4231
42475A454867j496126j506170M47214K122246J586327m4324m99414J56792J82964
$$ plain form
42466 2404376 1926963 1715345 2716965 3890744 3596969 2195538 1442326 1787520 2071416
42457 2071416 1661344 1083656 479186 -808869 -2680073 -3792718 -3279254 -1868788 -755093
42448 -755093 -276529 -211644 -485614 -948443 -1087536 -569891 254127 716006 465983 -268730
42438 -268730 -725275 -123598 1267206 1859646 420796 -2111824 -3478890 -2774657 -1234960
42429 -1234960 -282547 -9824 39493 -169729 -697770 -1078263 -1021466 -949690 -1147474 -1099012
42419 -1099012 -409667 298209 259348 -217114 -305670 -34061 -157408 -858945 -1438710 -1284574
42409 -1284574 -480739 557548 1491523 2074248 2196376 1925848 1253446 47137 -1394204
42400 -1394204 -2160375 -1743912 -949251 -1006020 -1879317 -2303619 -1574628 -420821 242281
$$ packed form
42466B404376m77413k11618J001620J173779k93775j401431p53212L45194K83896
42457B071416m10072n77688o04470j288055j871204j112645N13464J410466J113695
42448g55093M78564O4885k73970m62829j39093N17645Q24018M61879k50023p34713
42438b68730m56545O01677J390804N92440j438850k532620j367066P04233J539697
42429a234960R52413K72723M9317k09222n28041l80493N6797P1776j97784M8462
42419a099012O89345P07876l8861m76462q8556K71609j23347p01537n79765J54136
42409a284574Q03835J038287R33975N82725J22128k70528o72402j206309j441341
42400a394204p66171M16463P94661n6769q73297m24302P28991J153807O63102
$$ plain form
42391 242281 579499 1193273 1820214 1616540 617301 -29219 377396 979894 457356 -1084308
42381 -1084308 -2081955 -1472832 -1004 853027 762757 708861 1385740 2171994 1960691 609681
42371 609681 -796948 -1057599 -60135 1140033 1481772 1086868 967571 1432269 1389884
42362 1389884 -134681 -2262332 -3039873 -1867444 -85655 975710 1326592 1277390 449057
42353 449057 -1139175 -2093372 -1245735 351854 626831 -538290 -1227842 -569005 -41701
42344 -41701 -860718 -1708978 -665550 1604855 2515031 1189182 -437259 -550736 214742
42335 214742 381602 184422 920761 2393345 2805809 1383500 -412146 -894851 -180604
42326 -180604 643001 1353161 2357019 3199440 2787103 1208859 100726 670345 2165467
$$ packed form
42391B42281L37218O13774O26941k03674r99239o46520M06615O02498n22538j541664
42381a084308r97647O09123J471828Q54031r0270n3896O76879P86254k11303j351010
42371F09681j406629k60651R97464J200168L41739l94904j19297M64698m2385
42362A389884j524565k127651p77541J172429J781789J061365L50882m9202q28333
42353D49057j588232r54197Q47637J597589K74977j165121o89552O58837N27304
42344d1701q19017q48260J043428K270405R10176j325849j626441j13477P65478
42335B14742J66860j97180P36339J472584M12464j422309j795646m82705P14247
42326a80604Q23605P10160J003858Q42421m12337j578244j108133N69619J495122
$$ plain form
42317 2165467 2926904 2450241 1719443 1662106 1907282 1363304 -163115 -1361336 -830682
42308 -830682 1010786 2130281 1326855 -252203 -744009 -39534 506657 406470 567285
42299 567285 1387126 1881646 1337748 517176 326404 410601 152543 93027 974052 2000493
42289 2000493 1632523 -10840 -1018753 -256643 1134713 1360343 202302 -1085569 -1602657
42280 -1602657 -1752641 -2379004 -3438309 -3878907 -2923023 -1252494 -459379 -1176836 -2256960
42271 -2256960 -2197667 -945773 298998 762766 844829 1206847 1750163 1720043 567845
42262 567845 -1335092 -2743566 -2565009 -1098399 97953 -55968 -941565 -1206376 -479281
42253 -479281 523844 1185857 1459423 1413311 1158524 1084509 1368595 1418011 663837 -275748
$$ packed form
42317B165467P61437m76663p30798n7337K45176n43978j526419j198221N30654
42308h30682J841468J119495q03426j579058m91806P04475N46191j00187J60815
42299E67285Q19841M94520n43898q20572j90772Q4197k58058n9516Q81025J026441
42289B000493l67970j643363j007913P62110J391356K25630j158041j287871n17088
42280a602657j49984o26363j059305m40598R55884J670529P93115p17457j080124
42271b256960N9293J251894J244771M63768Q2063L62018N43316l0120j152198
42262E67845j902937j408474J78557J466610J196352j53921q85597k64811P27095
42253d79281J003125O62013K73566m6112k54787p4015K84086M9416p54174r39585
$$ plain form
42243 -275748 -257898 633717 1164399 876722 676067 1124048 1422218 781726 -303101 -1035365
42233 -1035365 -1630814 -2558242 -3140365 -2215082 -42446 1583012 1366175 -65796 -1051567
42224 -1051567 -729086 302687 872248 463806 -468446 -1232844 -1656480 -1951845 -2117776
42215 -2117776 -1907758 -1308585 -621898 -108431 66475 -297130 -1078803 -1530630 -1020913
42206 -1020913 14898 600804 540401 324001 -50904 -923823 -1714413 -1391023 -436739
42197 -436739 -558005 -1802838 -1946990 43204 1878428 1110666 -1168343 -2076587 -1226808
42188 -1226808 -636840 -1002362 -959063 -149021 -167463 -1651965 -2884442 -2480375 -1422630
42179 -1422630 -1071310 -960161 -140827 805886 853579 449639 573164 829657 356741 -113281
$$ packed form
42243b75748J7850Q91615N30682k87677k00655M47981K98170o40492j084827p32264
42233a035365n95449r27428n82123R25283K172636J625458k16837j431971r85771
42224a051567L22481J031773N69561m08442r32252p64398m23636k95365j65931
42215b117776K10018N99173O86687N13467J74906l63605p81673m51827N09717
42206a020913J035811N85906o0403k16400l74905q72919p90590L23390R54284
42197d36739j21266j244833j44152J990194J835224p67762k279009r08244Q49779
42188a226808N89968l65522M3299Q10042j8442j484502j232477M04067J057745
42179a422630L51320J11149Q19334R46713M7693m03940J23525K56493m72916m70022
$$ plain form
42169 -113281 828711 2617086 3092070 1653553 51128 -420878 -598513 -1427794 -1980761
42160 -1980761 -939023 1005866 1839842 940012 -245049 -232172 839548 1818035 2016847
42151 2016847 1673409 1326154 1117029 718831 -74913 -771790 -550665 587091 1466457
42142 1466457 1023393 -339175 -1254198 -1065398 -347173 142147 224528 -79772 -822871
42133 -822871 -1632570 -1731641 -1038262 -577434 -1060965 -1643322 -1049466 444246 1303262 938446
42123 938446 406570 624020 1026986 659580 -305546 -1006692 -1263746 -1555268 -1904961 -1743397
42113 -1743397 -964129 -384422 -830950 -2111914 -3160404 -3125686 -2252322 -1624840 -1905751
42104 -1905751 -2440295 -2023708 -549668 733668 832042 164457 -327071 -501134 -738841
$$ packed form
42169a13281R41992J788375M74984j438517j602425m72006j77635q29281n52967
42160a980761J041738J944889Q33976q99830j185061J2877J071720R78487J98812
42151B016847l43438l47255k09125l98198p93744o96877K21125J137756Q79366
42142A466457m43064j362568r15023J88800P18225M89320Q2381l04300p43099
42133h22871q09699r9071O93379M60828m83531n82357N93856J493712Q59016l64816
42123I38446n31876K17450M02966l67406r65126p01146k57054k91522l49693J61564
42113a743397P79268N79707m46528j280964j048490L4718Q73364O27482k80911
42104a905751n34544M16587J474040J283336R8374o67585m91528j74063k37707
$$ plain form
42095 -738841 -950149 -793349 -544932 -801676 -1472272 -1948422 -2187193 -2726548 -3582675 -3959423
42085 -3959423 -3224455 -1594514 148576 1104897 694363 -600854 -1258298 -445752 584428
42076 584428 28884 -1794307 -2817932 -2262258 -1546075 -1774824 -2141535 -1656427 -777799
42067 -777799 -188245 527821 1627326 2024376 988181 -150022 154546 1017175 421615
42058 421615 -1369210 -1966709 -463499 1238117 1224148 -68150 -1030329 -1005458 -377828
42049 -377828 383422 928750 1005894 840074 932581 1149616 772759 -231431 -878485 -547970
42039 -547970 127203 227116 -390010 -1446286 -2786152 -3927719 -3897900 -2365102 -427374
42030 -427374 478125 108748 -680810 -1143963 -1201041 -1182766 -1528427 -2394491 -3182885 -2940542
$$ packed form
42095g38841k11308J56800K48417k56744o70596m76150k38771n39355q56127l76748
42085c959423P34968J629941J743090R56321m10534j295217o57444Q12546J030180
42076E84428n55544j823191j023625N55674P16183k28749l66711M85108Q78628
42067g77799N89554P16066J099505L97050j036195j138203L04568Q62629n95560
42058D21615j790825n97499J503210J701616j3969j292298r62179K4871O27630
42049c77828P61250N45328P7144j65820R2507K17035l76857j004190o47054L30515
42039e47970O75173R9913o17126j056276j339866j141567K9819J532798J937728
42030d27374R05499l69377p89558m63153n7078J8275l45661q66064p88394K42343
$$ plain form
42020 -2940542 -1641771 -488559 -398107 -787762 -529777 434262 1216803 1282344 776907
42011 776907 -118680 -1273051 -2199587 -2417518 -2186237 -2136599 -2215484 -1789887 -847849 -235015
42001 -235015 -394012 -601784 26144 1242984 1969243 1714662 1171777 1268430 1960476 2286975
41991 2286975 1590540 330174 -560877 -861895 -1160405 -1855593 -2615108 -2927331 -2687850
41982 -2687850 -2073096 -1344894 -991387 -1495869 -2628002 -3471356 -3513791 -3213388 -3132957 -3104513
41972 -3104513 -2723397 -2079573 -1428105 -695434 69258 358352 77077 143673 1251907
41963 1251907 2494888 2335650 724211 -851871 -1342347 -1068120 -658797 -214020 165244
41954 165244 17559 -766910 -1523307 -1548285 -828079 178361 993075 1206993 669764 -192883
$$ packed form
42020b940542J298771J153212R0452l89655K57985R64039P82541O5541n05437
42011G76907q95587j154371r26536k17931K31281M9638p8885M25597R42038O12834
42001b35015j58997k07772O27928J216840P26259k54581n42885R6653O92046L26499
41991B286975o96435j260366q91051l01018k98510o95188p59515l12223K39481
41982b687850O14754P28202L53507n04482j132133q43354m2435L00403Q0431K8444
41972c104513L81116O43824O51468P32671P64692K89094k81275O6596J108234
41963A251907J242981j59238j611439j576082m90476K74227M09323M44777L79264
41954A65244j47685p84469p56397k4978P20206J006440Q14714K13918n37229q62647
$$ plain form
41944 -192883 -704133 -704489 -561870 -429289 -93288 375238 473520 -33447 -785004 -1335720
41934 -1335720 -1531842 -1353629 -901400 -532795 -500658 -574718 -583813 -994892 -2089921 -2936584
41924 -2936584 -2412525 -1089011 -626829 -1223050 -1337578 -370558 229947 -554191 -1485871
41915 -1485871 -1118703 -196861 -268478 -999653 -863578 123564 442569 -294145 -754350 -230062
41905 -230062 241072 -232016 -894748 -687759 52903 329724 151016 291702 733768 490103
41895 490103 -871692 -2382862 -2805489 -2151367 -1510236 -1500192 -1539345 -936292 -121786 -71128
41885 -71128 -740572 -1023295 -435665 91331 -379539 -1377240 -1749097 -1235468 -515648 -78821
41875 -78821 127537 170259 44589 -1623 272002 624550 688087 579732 562752 394813
$$ packed form
41944a92883n11250l56J42619J32581L36001M68526R8282n06967p51557n50716
41934a335720j96122J78213M52229L68605L2137p4060r095m11079j095029q46663
41924b936584N24059J323514M62182n96221j14528R67020O00505p84138r31680
41915a485871L67168R21842p1617p31175J36075R87142L19005p36714m60205N24288
41905b30062M71134m73088o62732K06989P40662K76821j78708J40686M42066k43665
41895D90103j361795j511170m22627O54122O41131J0044l9153O03053Q14506N0658
41885g1128o69444k82723N87630N26996m70870r97701l71857N13629P19820M36827
41875g8821K06358M2722j25670m6212K73625L52548O3537j08355j6980j67939
$$ plain form
41865 394813 -271568 -1124927 -1631623 -1954263 -2499967 -2783625 -1886780 -85339 1139745
41856 1139745 1016624 418376 509869 1331378 2134045 2321376 1624876 106377 -1512886
41847 -1512886 -2179509 -1670700 -918469 -833161 -1396279 -2190733 -3018271 -3525333 -3078532 -1729525
41837 -1729525 -595027 -475696 -704980 -245928 614948 722294 -115028 -851730 -730211
41828 -730211 -80278 514176 931671 1153612 1019004 721685 863680 1552989 2007465 1551808
41818 1551808 531406 -303599 -858818 -1414340 -1617281 -746870 919904 1979841 1631576
41809 1631576 773841 665698 1091530 863512 -134207 -617066 186890 1417360 1919110
41800 1919110 1756419 1615164 1455096 765959 -274820 -941034 -1076968 -1137857 -1189023 -800186
$$ packed form
41865C94813o66381q53359n06696l22640n45704k83658Q96845J801441J225084
41856A139745j23121n98248R1493Q21509Q02667J87331o96500j518499j619263
41847a512886o66623N08809P52231Q5308n63118p94454q27538n07062M46801J349007
41837a729525J134498J19331k29284M59052Q60876J07346q37322p36702J21519
41828g30211O49933N94454M17495K21941j34608k97319J41995O89309M54476m55657
41818A551808j020402q35005n55219n55522k02941Q70411J666774J059937l48265
41809A631576q57735j08143M25832k28018r97719m82859Q03956J230470N01750
41800A919110j62691j41255j60068o89137j040779o66214j35934o0889n1166L88837
$$ plain form
41790 -800186 -25414 373471 -61119 -873178 -1305041 -1061634 -430647 -72084 -523926 -1399699
41780 -1399699 -1465294 -315313 523397 -579877 -2726740 -3322059 -1675193 5285 -189042
41771 -189042 -1421195 -1912234 -1634819 -1733381 -2367345 -2746207 -2646739 -2396629 -1786664 -401419
41761 -401419 1218134 1979153 1628771 731907 -353295 -1363141 -1497408 -334339 911829
41752 911829 609646 -855899 -1448842 -433761 659320 450478 -473056 -877204 -646873
41743 -646873 -303718 124158 716038 982452 592187 150398 320253 689409 420890 -359711
41733 -359711 -697172 -85492 1112814 2311544 3109231 3233804 2677016 1784168 818075
41724 818075 -306940 -1489342 -2094020 -1718880 -914674 -475019 -345800 8789 426256
$$ packed form
41790h00186P74772L98885m34590q12059m31863K43407O30987L58563m51842q75773
41780a399699o5595J149981Q38710j103274k146863n95319J646866J680478j94327
41771a89042j232153m91039K77415r8562o33964l78862R9468K50110O09965J385245
41761d01419J619553P61019l50382q96864j085202j009846j34267J163069J246168
41752I11829l02183j465545n92943J015081J093081k08842r23534m04148K30331
41743f46873L43155M27876N91880K66414l90265m41789J69855L69156k68519p80601
41733c59711l37461O11680J198306J198730P97687J24573n56788q92848r66093
41724H18075j125015j182402o04678L75140Q04206M39655J29219L54589M17467
$$ plain form
41715 426256 132363 -1008421 -2166538 -2644092 -2625548 -2614754 -2698458 -2650753 -2339314 -1764784
41705 -1764784 -1014763 -378739 -243014 -704036 -1451981 -2058599 -2197446 -1716515 -861689
41696 -861689 -328943 -623067 -1384273 -1837193 -1858877 -1950967 -2103844 -1552391 -72177 1272810
41686 1272810 1391177 632906 169690 246241 -2544 -1029048 -2099466 -2305308 -1621397
41677 -1621397 -600312 370314 1064177 1200658 780859 269963 -65200 -607505 -1567613
41668 -1567613 -2138009 -1388606 166139 970938 531296 -11934 179879 341376 -372117
41659 -372117 -1115987 -498276 1093121 1883677 1306136 581102 443000 -35421 -1523670
41650 -1523670 -2795198 -2326666 -598678 638144 847507 994273 1583595 1909218 1432277
$$ packed form
41715D26256k93893j140784j158117m77554J8544J0794q3704M7705L11439N74530
41705a764784P50021O36024J35725m61022p47945o06618j38847M80931Q54826
41696h61689N32746k94124p61206m52920k1684r2090j52877N51453J480214J344987
41686A272810J18367p58271m63216P6551k48785j026504j070418k05842O83911
41677a621397J021085R70626O93863J36481m19799n10896l35163n42305r60108
41668a567613n70396P49403J554745Q04799m39642n43230J91813J61497p13493
41659c72117p43870O17711J591397P90556n77541p25034j38102m78421j488249
41650a523670j271528M68532J727988J236822K09363J46766N89322L25623m76941
$$ plain form
41641 1432277 609430 -50426 -649004 -1115441 -778567 556924 1868099 2043269 1277464
41632 1277464 666831 799707 1370232 1853296 1933796 1487129 702867 113924 87024 400493
41622 400493 573714 357224 -262029 -1042836 -1251470 -181960 1629660 2564504 1987829
41613 1987829 1205619 1359508 1447661 42418 -1884228 -2068428 -650488 -267170 -1958884
41604 -1958884 -3470604 -2820781 -1303759 -1140514 -1993167 -2090828 -1502792 -1692597 -2497740
41595 -2497740 -2255423 -886297 -260082 -1022877 -1447070 -325398 1108936 1340165 786852
41586 786852 414730 -245980 -1906175 -3511547 -3399796 -1863501 -752988 -804061 -994764
41577 -994764 -466728 453508 1271334 2000574 2570875 2689363 2504827 2392012 1999159 659124
$$ packed form
41641A432277q22847o59856n98578m66437L36874J335491J311175J75170p65805
41632A277464o10633J32876N70525M83064Q0500m46667p84262n88943k6900L13469
41622D00493J73221k16490o19253p80807k08634J069510J811620R34844n76675
41613A987829p82210J53889Q8153j405243j926646j84200J417940L83318j691714
41604a958884j511720O49823J517022J63245q52653r7661N88036j89805q05143
41595b497740K42317J369126O26215p62795m24193J121672J434334K31229n53313
41586G86852l72122o60710j660195j605372J11751J536295J110513n1073j90703
41577i94764N28036R20236Q17826P29240N70301J18488j84536j12815l92853j340035
$$ plain form
41567 659124 -1138159 -1989285 -1589410 -1148193 -1348966 -1377566 -750453 -549755 -1529238 -2280499
41557 -2280499 -1052011 1337198 2304239 1053633 -464386 -404809 757868 1489188 1353824
41548 1353824 970043 647744 100297 -789366 -1653177 -2020828 -1657908 -697708 314930
41539 314930 758033 527091 56123 -327126 -648553 -807574 -477422 207207 485363 -34191
41529 -34191 -749514 -967096 -880644 -973437 -960985 -266018 699882 757482 -431941 -1819437
41519 -1819437 -2255661 -1640064 -558734 525758 1323177 1515472 1050387 390541 74945
41510 74945 143467 199350 -106594 -784028 -1510472 -1829919 -1530926 -898067 -433893 -359447
41500 -359447 -559638 -849595 -993060 -711056 -153826 -95371 -973041 -1944461 -1799392 -752724
$$ packed form
41567F59124j797283q51126L99875M41217k00773k8600O27113K00698r79483p51261
41557b280499J228488K389209R67041j250606j518019N9577J162677P31320j35364
41548A353824l83781l22299n47447q89663q63811l67651L62920R60200J012638
41539C14930M43103k30942m70968l83249l21427j59021L30152O84629K78156n19554
41529c4191p15323k17582Q6452r2793J2452O94967R65900N7600j189423j387496
41519a819437m36224O15597J081330J084492P97419J92295m65085o59846l15596
41510G4945O8522N5883l05944o77434p26444l19447K98993O32859M64174P4446
41500c59447k00191k89957j43465K82004N57230N8455q77670r71420J45069J046668
$$ plain form
41490 -752724 -261712 -895952 -1561320 -1268458 -475720 19805 354972 778719 619127 -618872
41480 -618872 -1871358 -1681933 -350932 461224 44158 -789581 -1282455 -1449268 -1188298
41471 -1188298 -192604 900762 705858 -922433 -2294122 -2070352 -1061325 -958687 -2031492
41462 -2031492 -3010277 -2764907 -1262607 783669 2440768 2929619 2148200 809440 -278295
41453 -278295 -885698 -1097828 -849736 -232291 113062 -409948 -1424296 -1798000 -906105
41444 -906105 616377 1450611 786551 -992947 -2648762 -3133198 -2418679 -1335317 -707478
41435 -707478 -767789 -1207330 -1449015 -975040 177719 1219311 1286318 386026 -617060
41426 -617060 -920417 -429526 318503 520492 -279792 -1414055 -1327260 622171 2948108
$$ packed form
41490g52724M91012o34240o65368K92862P92738M95525L35167M23747j59592j237999
41480f18872j252486J89425J331001Q12156m17066q33739m92874j66813K60970
41471a188298R95694J093366j94904j628291j371689K23770J009027J02638j072805
41462b031492r78785K45370J502300K046276J657099M88851p81419j338760j087735
41453b78295o07403k12130K48092O17445L45353n23010j014348l73704Q91895
41444i06105J522482Q34234o64060j779498j655815m84436P14519J083362O27839
41435g07478o0311m39541k41685M73975J152759J041592O7007r00292j003086
41426f17060l03357M90891P48029K01989q00284j134263Q6795J949431K325937
$$ plain form
41417 2948108 3619629 2606813 1644615 1582482 1469541 549082 -409962 -511932 -159703
41408 -159703 -160653 -445875 -599122 -742560 -956283 -643521 551384 1877102 2408628 2192600
41398 2192600 1711035 1030203 316050 236910 814572 851415 -253308 -1087868 -172140 1490547
41388 1490547 1642355 103645 -1070832 -703879 168909 393663 314170 560589 692514
41379 692514 68050 -861364 -1078250 -323040 776096 1553243 1809442 1692610 1385468
41370 1385468 873355 71170 -740581 -990465 -636372 -383631 -579489 -546633 209022 828114
41360 828114 246364 -1019017 -1530354 -1039317 -546685 -445723 -122577 537502 798411
41351 798411 568009 804337 1853879 2597403 1960820 409822 -633590 -226591 1474701
$$ packed form
41417B948108O71521j012816r62198o2133j12941r20459r59044j01970L52229
41408a59703r50k85222j53247j43438k13723L12762J194905J325718N31526k16028
41398B192600m81565o80832p14153p9140N77662L6843j104723q34560R15728J662687
41388A490547J51808j538710j174477L66953Q72788K24754p9493K46419J31925
41379F92514o24464r29414k16886P55210J099136P77147K56199j16832l07142
41370A385468n12113q02185q11751k49884L54093K52741j95858L2856P55655O19092
41360H28114n81750j265381n11337M91037M92632J00962L23146O60079K60909
41351G98411k30402K36328J049542P43524o36583j550998j043412M06999J701292
$$ plain form
41342 1474701 3283242 3614426 2005701 55128 -234060 951189 1606034 924614 270703
41333 270703 691577 1239546 705252 -507494 -1395443 -1948379 -2457244 -2349074 -1157314
41324 -1157314 129793 137547 -914047 -1506133 -764581 907300 2744524 4119094 4406653
41315 4406653 3388241 1744801 446978 -208126 -446917 -344909 5022 72777 -533042
41306 -533042 -1289291 -1264579 -249857 1133968 2184076 2492942 1966916 1012898 339932
41297 339932 101164 -277029 -920207 -867156 583060 2466150 3099318 2140370 786125
41288 786125 108616 67708 85717 -234816 -1030491 -2145516 -3063748 -3320013 -2989453 -2435354
41278 -2435354 -1745909 -859081 -88628 -16240 -814072 -1945161 -2564563 -2206247 -1271892
$$ packed form
41342A474701J808541L31184j608725j950573k89188J185249O54845o81420o53911
41333B70703M20874N47969n34294j212746q87949n52936n08865J08170J191760
41324a157314J287107P754j051594n92086P41552J671881J837224J374570K87559
41315D406653j018412j643440j297823o55104k38791J02008L49931O7755o05819
41306e33042p56249K4712J014722J383825J050108L08866n26026r54018o72966
41297C39932k38768l78193o43178N3051J450216J883090O33168r58948j354245
41288G86125o77509m0908J8009l20533p95675j115025r18232k56265L30560N54099
41278b435354O89445Q86828P70453P2388p97832j131089o19402L58316R34355
$$ plain form
41269 -1271892 -776140 -1218119 -1819586 -1492168 -427643 187018 29154 7670 487349
41260 487349 513084 -509799 -1646181 -1897418 -1716336 -1963745 -2342338 -2075094 -1317128
41251 -1317128 -701723 -265946 1755 -540023 -1945579 -2647965 -1360473 671223 1158637
41242 1158637 13692 -904705 -1011836 -1684856 -3437449 -4620833 -3851249 -2028978 -847149
41233 -847149 -552645 -286514 271798 669951 576622 140214 -224478 -38496 774927 1395052
41223 1395052 750424 -994773 -2261449 -1803647 -153177 1023801 631953 -940067 -2176037
41214 -2176037 -1685002 347285 1996319 1568730 -316016 -1451085 -858414 147140 -38474
41205 -38474 -1294251 -2314758 -2319883 -1536943 -551244 150445 307576 75461 -69812 116300
$$ packed form
41269a271892M95752m41979o01467L27418J064525O14661j57864k1484M79679
41260D87349K5735j022883j136382k51237J81082k47409l78593K67244P57966
41251a317128O15405M35777K67701n41778j405556p02386J287492K031696M87414
41242A158637j144945r18397j07131o73020j752593j183384P69584J822271J181829
41233h47149K94504K66131N58312L98153r3329m36408l64692J85982Q13423O20125
41223A395052o44628j745197j266676M57802J650470J176978l91848j572020j235970
41214b176037M91035K032287J649034m27589j884746j135069N92671J005554j85614
41205c8474j255777j020507n125P82940R85699P01689J57131k32115j45273J86112
$$ plain form
41195 116300 360036 223690 -488249 -1621777 -2612914 -2667710 -1525292 29717 949902
41186 949902 1101167 1068248 1012441 567686 -191050 -601204 -353175 226742 886913 1571781
41176 1571781 1801958 1003403 -298700 -702842 198480 1141774 911536 -176890 -1110042
41167 -1110042 -1584294 -1792598 -1573413 -762512 32151 -25200 -777070 -1150726 -524622 524352
41157 524352 1005116 709870 366995 634836 1200958 1218565 609886 353884 1145796 2353802
41147 2353802 2883050 2535233 1776776 743891 -482820 -1089549 -363746 826287 798563
41138 798563 -561466 -1558770 -1146357 -257881 -110787 -446969 -349875 96849 -49396 -1211717
41128 -1211717 -2716716 -3377968 -2449362 -406163 1189061 1188644 196773 -289168 118353
$$ packed form
41195A16300K43736j36346p11939j133528r91137n4796J142418J555009R20185
41186I49902J51265l2919n5807m44755p58736m10154K48029N79917O60171O84868
41176A571781K30177p98555j302103m04142R01322R43294k30238j088426r33152
41167a110042m74252k08304K19185Q10901P94663n7351p51870l73656O26104J048974
41157E24352M80764k95246l42875K67841N66122J7607o08679k56002P91912J208006
41147B353802N29248l47817p58457j032885j226711o06729P25803J190033k7724
41138G98563j360029r97304M12413Q88476J47094l36182R7094M46724j46245j162321
41128a211717j504999o61252R28606K043199J595224m17r91871m85941M07521
$$ plain form
41119 118353 544425 527725 536575 747285 741008 686832 1328454 2334520 2214508 592691
41109 592691 -894329 -842802 105673 607027 470698 177161 -196486 -459498 118477 1567245
41099 1567245 2642616 2610853 2432065 2947066 3193323 2105365 720118 762919 1809563
41090 1809563 1875918 472065 -861369 -1036424 -698303 -776067 -1184225 -1398639 -1345387 -1364385
41080 -1364385 -1833509 -2776584 -3420786 -2667866 -687851 663760 -9435 -1763757 -2690327
41071 -2690327 -2448010 -2067635 -1897808 -1437994 -895519 -1118607 -1899251 -1959903 -923606
41062 -923606 107598 307646 192860 467249 880523 801171 184982 -467299 -663400 -322648
41052 -322648 -8840 -496471 -1578724 -1880029 -736245 400688 -267460 -2195354 -3151054
$$ packed form
41119A18353M26072j6700Q850K10710o277n4176O41622J006066j20012j621817
41109E92691j487020N1527R48475N01354j36329k93537l73647k63012N77975J448768
41099A567245J075371l1763j78788N15001K46257j087958j385247M2801J046644
41090A809563O6355j403853j333434j75055L38121p7764m08158k14414N3252j8998
41080a364385m69124r43075o44202P52920J980015J351611o73195j754322r26570
41071b690327K42317L80375J69827M59814N42475k23088p80644o0652J036297
41062i23606J031204K00048j14786K74389M13274p9352o16189o52281j96101L40752
41052c22648L13808m87631j082253l01305J143784J136933o68148j927894r55700
$$ plain form
41043 -3151054 -2386589 -1455387 -1680080 -2446855 -2548395 -1842886 -909327 -159299 63441
41034 63441 -552711 -1580324 -1876457 -908317 495983 1131265 685130 -212367 -772570
41025 -772570 -753641 -670814 -1120404 -1651072 -1014807 843818 2077338 1403220 245806
41016 245806 662800 1962465 1661425 -540032 -2293193 -2297161 -1856031 -2066175 -2015595 -1007427
41006 -1007427 -285395 -921850 -1848813 -1726636 -1174554 -1272654 -1215279 406558 2835649
40997 2835649 3788009 2569273 799607 100181 500031 1175136 1552834 1486427 1137130
40988 1137130 808623 509738 -66007 -826742 -1135950 -777272 -308507 -2045 585534
40979 585534 1370538 1263523 -87611 -1212379 -727907 610670 1113470 570414 16448
$$ packed form
41043c151054P64465R31202k24693p66775j01540P05509R33559P50028K22740
41034F3441o16152j027613k96133R68140J404300O35282m46135q97497n60203
41025g72570J8929Q2827m49590n30668O36265J858625J233520o74118j157414
41016B45806M16994J299665l01040k201457j753161l968M41130k10144N0580J008168
41006a007427P22032o36455r26963J22177N52082r8100N7375J621837K429091
40997B835649R52360j218736j769666o99426L99850O75105L77698o6407l49297
40988A137130l28507k98885n75745p60735l09208L58678M68765L06462N87579
40979E85534P85004j07015j351134j124768M84472J338577N02800n43056n53966
$$ plain form
40970 16448 -192557 -503232 -877722 -924086 -931395 -1309950 -1388798 -293537 1320213 1993997
40960 1993997 1626174 1235631 866768 -307414 -1816362 -1996952 -721856 59119 -662427
40951 -662427 -1315049 -326053 1303490 1541277 292044 -800946 -850204 -493476 -465013
40942 -465013 -741911 -1123609 -1583423 -1856067 -1484485 -556108 154386 65017 -511452 -780574
40932 -780574 -407292 179296 419984 360371 506715 983997 1252415 888057 244129 -44275
40922 -44275 152136 600124 1190547 1691996 1520936 598764 -1578 651777 1693373 1381625
40912 1381625 -350758 -1636064 -1190888 262554 1507388 2366366 3026467 3135542 2546799
40903 2546799 1933459 1681705 1118366 -139724 -1039062 -542241 577517 794838 98793
$$ packed form
40970A6448k09005l10675l74490m6364p309l78555p8848J095261J613750O73784
40960A993997l67823l90543l68863j174182j508948j80590J275096P80975p21546
40951f62427o52622R88996J629543K37787j249233j092990m9258L56728K8463
40942d65013k76898l81698m59814k72644L71582R28377P10494q9369n76469k69122
40932g80574L73282N86588K40688n9613J46344M77282K68418l64358o43928k88404
40922d4275J96411M47988N90423N01449j71060r22172o00342O53355J041596l11748
40912A381625j732383j285306M45176J453442J244834Q58978O60101J09075n88743
40903B546799o13340k51754n63339j258090q99338M96821J119758K17321o96045
$$ plain form
40894 98793 -264795 73524 253136 -182782 -754037 -1137418 -1399294 -1104769 301927 2005038
40884 2005038 2267948 872338 -376461 -248803 291859 3194 -572317 -337389 211888
40875 211888 -234198 -1490792 -2050007 -1374326 -484540 -178881 -43565 449062 998616
40866 998616 1061741 527063 -494085 -1753660 -2535927 -2126855 -891196 11554 275100
40857 275100 793035 1923285 2558533 1755724 335483 -201119 312450 854581 871689
40848 871689 635467 232372 -610346 -1657527 -2136300 -1772045 -1097760 -578539 -102925
40839 -102925 487243 941459 876206 150553 -1036754 -2123255 -2469392 -2049652 -1510842
40830 -1510842 -1137492 -419072 652328 752110 -1019141 -3260301 -3866990 -3104702 -3052216
$$ packed form
40894I8793l63588L38319J79612m35918n71255l83381k61876K94525J406696J703111
40884B005038K62910j395610j248799J27658N40662k88665n75511K34928N49277
40875B11888m46086j256594n59215O75681Q89786L05659J35316M92627N49554
40866I98616O3125n34678j021148j259575p82267M09072J235659R02750K63546
40857B75100N17935J130250O35248q02809j420241n36602N13569N42131J7108
40848H71689k36222m03095q42718j047181m78773L64255O74285N19221M75614
40839a02925N90168M54216o5253p25653j187307j086501l46137M19740N38810
40830a510842L73350P18420J071400R9782j771251k241160o06689P62288N2486
$$ plain form
40821 -3052216 -4007810 -3836058 -1555839 789372 1164523 412074 376363 862391 524695
40812 524695 -458598 -822413 -536959 -527222 -602990 145460 1174362 972165 -226497 -454634
40802 -454634 848942 1854333 1241604 107127 -142837 -122241 -1231503 -3206467 -4370619
40793 -4370619 -3805005 -2179048 -744629 -237598 -472664 -578617 7466 686324 544858
40784 544858 9303 395515 1561554 1621606 -193037 -1983747 -1795802 -444577 -109411
40775 -109411 -1104252 -1874388 -1607814 -982117 -540653 -93059 225349 -99952 -769244 -870077
40765 -870077 -494359 -734522 -1766894 -2385883 -1917900 -1185015 -929151 -672393 -22926
40756 -22926 183560 -770224 -1981595 -2076769 -1213154 -674995 -909108 -1195538 -1036900 -695742
$$ packed form
40821c052216r55594J71752K280219K345211L75151p52449l5711M86028l37696
40812E24695r83293l63815K85454R737p5768P48450J028902k02197j198662k28137
40802d54634J303576J005391o12729j134477k49964K0596j109262j974964j164152
40793d370619N65614J625957J434419N07031k35066j05953N86083O78858j41466
40784E44858n35555L86212J166039O0052j814643j790710J87945J351225L35166
40775a09411r94841p70136K66574O25697M41464M47594L18408l25301o69292j00833
40765h70077L75718k40163j032372o18989M67983P32885K55864K56758O49467
40756b2926K06486r53784j211371r5174Q63615N38159k34113k86430J58638L41158
$$ plain form
40746 -695742 -389026 -511 337080 302253 116279 342758 884483 1119532 1159339 1846100
40736 1846100 3081531 3343342 1746488 -321264 -779064 460805 1609755 1539641 856362
40727 856362 350979 -191345 -1028554 -1542798 -1293790 -1092664 -1788475 -2583806 -2011419 -348111
40717 -348111 565100 113022 -175732 772609 1679223 969285 -480799 -470565 1185357
40708 1185357 2329661 1540080 -141461 -987146 -647719 234890 1260995 2224510 2694709
40699 2694709 2529622 2214617 2011848 1431385 263341 -576912 -185133 822033 912499
40690 912499 -438018 -2172159 -2819524 -1702445 623241 2541353 2560444 1108150 510383
40681 510383 2169041 4413614 4544784 2565962 1147303 1860517 3296019 3497248 2594411
$$ packed form
40746f95742L06716L88515L37591l4827j85974K26479N41725K35049L9807O86761
40736A846100J235431K61811j596854k067752m57800J239869J148950p0114o83279
40727H56362n05383n42324q37209n14244K49008K01126o95811p95331N72387J663308
40717c48111R13211m52078k88754R48341R06614p09938j450084J0234J655922
40708A185357J144304p89581j681541q45685L39427Q82609J026105R63515M70199
40699B694709j65087l15005k02769n80463j168044q40253L91779J007166R0466
40690I12499j350517j734141o47365J117079K325686J918112J9091j452294n97767
40681E10383J658658K244573J31170j978822j418659P13214J435502K01229r02837
$$ plain form
40672 2594411 1961956 1989880 1972843 1529472 987094 680598 698071 1050148 1464685 1350851
40662 1350851 540013 -299678 -525414 -401139 -571225 -1055401 -1354043 -1220767 -783765
40653 -783765 -197215 357875 639728 679405 726854 591040 -256335 -1487500 -1767495 -602103
40643 -602103 559496 199795 -989097 -1046227 469960 2067994 2534591 2121589 1447528
40634 1447528 623807 -160294 -399543 -149549 -195915 -865108 -1481777 -1417196 -871771 -210805
40624 -210805 651315 1708196 2456872 2596150 2517874 2598596 2572397 2089109 1352688 735955
40614 735955 291766 123891 699670 2175953 3728102 4087079 2674406 82211 -2280415
40605 -2280415 -3041349 -1972722 -391583 151148 -322332 -464688 286789 946439 707925
$$ packed form
40672B594411o32455K7924j7037m43371n42378l06496J7473L52077M14537j13834
40662A350851q10838q39691k25736J24275j70086m84176k98642J33276M37002
40653g83765N86550N55090K81853L9677M7449j35814q47375j231165k79995J165392
40643f02103J161599l59701j188892n7130J516187J598034M66597m13002o74061
40634A447528q23721p84101k39249K49994m6366o69193o16669O4581N45425O60966
40624b10805Q62120J056881P48676J39278p8276Q0722k6199m83288p36421o16733
40614G35955m44189j67875N75779J476283J552149L58977j412673k592195k362626
40605b280415p60934J068627J581139N42731m73480j42356P51477O59650k38514
$$ plain form
40596 707925 224779 373724 792652 703199 369149 538624 1003235 964172 514578 533451
40586 533451 1190079 1670185 1491332 1162425 1342645 2041407 2778963 2985630 2264850 839995
40576 839995 -328027 -457279 120211 508119 499945 555348 746645 658428 325555 329865
40566 329865 789353 1084915 826246 328409 -116990 -672399 -1319588 -1531458 -1039585 -326207
40556 -326207 138850 619190 1488034 2260483 1920285 189516 -1952672 -3107625 -2660046
40547 -2660046 -1178576 224758 851373 726335 148507 -619556 -1067511 -450920 1288113
40538 1288113 2945722 3154359 1979157 757184 409842 635919 795188 792813 860511
40529 860511 1116915 1596714 2174437 2319644 1548700 276622 -455615 -305639 18077
$$ packed form
40596G07925m83146J48945M18928q9453l34050J69475M64611l9063m49594J8873
40586E33451O56628M80106j78853l28907J80220O98762P37556K06667p20780j424855
40576H39995j168022j29252N77490L87908q174N5403J91297q8217l32873M310
40566C29865M59488K95562k58669m97837m45399n55409o47189k11870M91873P13378
40556c26207M65057M80340Q68844P72449l40198j730769k142188j154953M47579
40547b660046J481470J403334O26615j25038n77828p68063m47955O16591J739033
40538A288113J657609K08637j175202j221973l47342K26077J59269k375O7698
40529H60511K56404M79799N77723J45207p70944j272078p32237J49976L23716
$$ plain form
40520 18077 -60720 -264261 -265898 -349437 -717324 -922406 -653476 -407191 -661775 -1007928
40510 -1007928 -881099 -561759 -551331 -483573 285133 1349999 1658221 1091275 515177 252982
40500 252982 -283351 -1153090 -1254524 182988 2241215 3167979 2191102 51643 -1795271
40491 -1795271 -2114209 -623099 1575075 2685956 1969980 537620 -85921 214030 413320
40482 413320 51949 -296816 -211628 -102033 -427170 -1000359 -1420775 -1554288 -1267324 -407370
40472 -407370 505748 370092 -1001080 -2195394 -1969626 -1090738 -1171698 -2075640 -2074693 -677829
40462 -677829 431860 -45138 -1117521 -1310876 -1054282 -1629117 -2582774 -2154050 -149127
40453 -149127 1471913 1311246 298953 34602 637670 1199570 1402218 1544575 1537060 1041849
$$ packed form
40520A8077p8797k03541j637q3539l67887k05082K68930K46285k54584l46153
40510a007928J26829L19340J0428O7758P68706J064866L08222n66946n76098k62195
40500B52982n36333q69739j01434J437512K058227R26764r76877k139459j846914
40491a795271l18938J491110K198174J110881p15976j432360o23541K99951J99290
40482D13320l61371l48765Q5188J09595l25137n73189m20416j33513K86964Q59954
40472d07370R13118j35656j371172j194314K25768Q78888q0960r03942R47J396864
40462f77829J109689m76998j072383j93355K56594n74835r53657M28724K004923
40453a49127J621040j60667j012293k64351O03068N61900K02648J42357p515m95211
$$ plain form
40443 1041849 435406 615091 1742670 2921191 3288131 2868057 2192146 1599702 1170119
40434 1170119 949164 934260 1052256 1352554 1990254 2808539 3218692 2865708 2228591 2042920
40424 2042920 2137796 1514636 -87322 -1370362 -977604 571016 1441808 933248 213566
40415 213566 299529 542532 -15714 -815512 -602272 505775 1195996 1012502 804747 1003674
40405 1003674 850282 -148022 -1157411 -1164621 -363829 365281 778493 1306291 2083596 2567522
40395 2567522 2101823 670210 -803608 -1058769 155947 1551277 1807493 1332147 1434123
40386 1434123 1960565 1393743 -360529 -1147941 380630 2449319 2441688 424315 -1297902
40377 -1297902 -1441390 -832063 -590894 -891404 -1497941 -2134612 -2244704 -1543507 -759545
$$ packed form
40443A041849o06443J79685J127579J178521L66940m20074o75911n92444m29583
40434A170119k20955j4904J17996L00298O37700Q18285M10153l52984o37117j85671
40424B042920R4876o23160j601958j283040L92758J548620Q70792n08560p19682
40415B13566Q5963K43003n58246p99798K13240J108047O90221j83494k07755J98927
40405A003674j53392r98304j009389p210Q00792P29110M13212N27798P77305M83926
40395B567522m65699j431613j473818k55161J214716J395330K56216m75346J01976
40386A434123N26442n66822j754272p87412J528571K068689p631k017373j722217
40377a297902j43488O09327K41169l00510o06537o36671j10092P01197P83962
$$ plain form
40368 -759545 -715230 -907915 -326863 569595 331515 -1026503 -1848124 -1441082 -1000117 -1251367
40358 -1251367 -1060336 419705 1836415 1503935 73926 -436459 298938 584361 -632111
40349 -632111 -2255694 -2556474 -1178388 770169 2002878 2100174 1629647 1442477 1766313
40340 1766313 2093075 2004650 1701390 1497722 1328278 1170540 1438937 2397509 3581169
40331 3581169 4332877 4515802 4222100 3385642 2375261 2284783 3571109 4875086 4483640
40322 4483640 2797907 1940244 2708515 3372507 2223312 128998 -645049 428332 1505826
40313 1505826 961747 -485655 -891339 230160 1269275 697707 -928693 -1787718 -1124450
40304 -1124450 187072 1268254 2204514 3024929 2951528 1589678 -15169 -621236 -480297
$$ packed form
40368g59545M4315j92685N81052Q96458k38080j358018q21621M07042M40965k51250
40358a251367J91031J480041J416710l32480j430009n10385P35397K85423j216472
40349f32111j623583l00780J378086J948557J232709R7296m70527j87170L23836
40340A766313L26762q8425l03260k03668j69444j57738K68397R58572J183660
40331C581169P51708J82925k93702q36458j010381r0478J286326J303977l91446
40322D483640j685733q57663P68271O63992j149195k094314p74047J073381J077494
40313A505826n44079j447402m05684J121499J039115n71568j626400q59025O63268
40304a124450J311522J081182R36260Q20415p3401j361850j604847o06067J40939
$$ plain form
40295 -480297 -628062 -991153 -555013 795579 1991611 2397335 2446216 2483313 2185836 1455539
40285 1455539 805621 502521 265018 35386 27830 -145038 -1171959 -2599898 -3024885
40276 -3024885 -2134311 -1155591 -759321 -99204 1277744 2235018 1895704 1116513 760969
40267 760969 58362 -1630471 -2871769 -2076672 -233936 561902 435821 1061061 2257211
40258 2257211 2126579 586908 -169638 646861 1080906 -123877 -1316230 -804629 254195
40249 254195 -98403 -1296764 -1269781 144613 1060003 524723 -311668 -194138 575657
40240 575657 919432 482916 -78554 96245 1100856 1957111 1601893 330047 -405363
40231 -405363 43905 655145 436015 -26923 263886 865646 546703 -693757 -1594761
$$ packed form
40295d80297j47765l63091M36140J350592J196032M05724M8881L7097k97477p30297
40285A455539o49918l03100k37503k29632p556j72868j026921j427939m24987
40276c024885Q90574R78720L96270O60117J376948R57274l39314p79191l55544
40267G60969p02607j688833j241298P95097J842736P95838j26081O25240J196150
40258B257211j30632j539671p56546Q16499M34045j204783j192353N11601J058824
40249B54195l52598j198361K6983J414394R15390n35280q36391J17530P69795
40240E75657L43775m36516n61470J74799J004611Q56255l55218j271846p35410
40231d05363M49268O11240k19130m62938K90809O01760l18943j240460r01004
$$ plain form
40222 -1594761 -1411680 -529493 542876 1581903 2086131 1520749 312423 -430807 -397542
40213 -397542 -335270 -685016 -980109 -899930 -894092 -1258106 -1485042 -1171548 -833665 -1090466
40203 -1090466 -1583985 -1499890 -820476 -253492 -52612 255673 813672 888409 -53555 -1199310
40193 -1199310 -1144629 209243 1345801 1084796 73520 -370994 -226075 -461976 -1180317
40184 -1180317 -1483277 -1231333 -1376483 -2076118 -2011490 -456492 1348759 2012873 1933346
40175 1933346 2075459 1999223 877023 -347046 123320 2092207 3360036 2676226 1060496
40166 1060496 -8441 -155302 419901 1492195 2368770 2262851 1606150 1737516 2864355
40157 2864355 3685514 3539616 3417998 4019027 4262106 2969067 934673 -58041 361140
$$ packed form
40222a594761J83081Q82187J072369J039027N04228n65382j208326p43230L3265
40213c97542O2272l49746k95093Q0179N838l64014k26936L13494L37883k56801
40203a090466m93519Q4095O79414N66984K00880L08285N57999P4737r41964j145755
40193a199310N4681J353872J136558k61005j011276m44514J44919k35901p18341
40184a180317l02960K51944j45150o99635O4628J554998J805251O64114p9527
40175A933346J42113p6236j122200j224069M70366J968887J267829o83810j615730
40166A060496j068937j46861N75203J072294Q76575j05919o56701J31366J126839
40157B864355Q21159j45898j21618O01029K43079j293039k034394r92714M19181
$$ plain form
40148 361140 979473 842119 183404 -273002 -70978 799837 1834259 2279576 1963263
40139 1963263 1572252 1651939 1738784 1086938 -80556 -733456 -334023 569110 1048862 768651
40129 768651 244379 267385 984276 1628830 1472551 883829 874188 1689098 2646454 3450246
40119 3450246 4704209 6714128 8605499 9202732 8235007 6294330 4214021 2806657
40111 2806657 2456496 2532177 1940696 684999 26153 611062 1449447 1497394 1230345 1578368
40101 1578368 2168113 1980860 1260383 1333267 2612649 4024467 4548214 4269351 3656993
40092 3656993 2755484 1574659 629028 518911 1232922 2235380 3126184 3949538 4837719
40083 4837719 5555470 5679118 5324452 5331499 6292008 7670916 8587559 9332577 11115864
$$ packed form
40148C61140O18333j37354o58715m56406K02024Q70815J034422M45317l16313
40139A963263l91011P9687Q6845o51846j167494o52900L99433R03133M79752k80211
40129G68651n24272K3006P16891O44554j56279n88722r641Q14910R57356Q03792
40119C450246J253963K009919J891371N97233r67725j940677k080309j407364
40111B806657l50161P5681n91481j255697o58846N84909Q38385M7947k67049L48023
40101A578368N89745j87253p20477P2884J279382J411818N23747k78863o12358
40092C656993r01509j180825r45631j10117P14011J002458Q90804Q23354Q88181
40083D837719P17751J23648l54666P047R60509J378908R16643P45018J783287
$$ plain form
40074 11115864 14027228 16232783 15902015 13321370 10378418 8375429 7113654 5967103
40066 5967103 5089465 5200037 6351921 7326178 6780627 5115311 4411281 5837874 7882748
40057 7882748 8309003 7242774 6684287 7238232 7355263 6139576 4863812 4832573 5499402
40048 5499402 5782979 5735346 5798094 5851138 6118668 7457112 9416620 9682683 7235334
40039 7235334 4655118 5203394 8609862 11825566 13105629 13137110 12737464 11863547 10879352
40030 10879352 10703886 11520154 13068351 16118356 21559473 27717319 30699157 28427941
40022 28427941 23025729 18381134 16356936 16004262 15505182 14007023 11943125 10173406
40014 10173406 8989941 8158866 7824581 8513692 9978226 11287158 12724617 15918200
$$ packed form
40074A1115864K911364K205555l30768k580645k942952k002989j261775j146551
40066E967103q77638J10572J151884R74257n45551j665316p04030J426593K044874
40057G882748M26255j066229n58487N53945J17031j215687j275764l1239O66829
40048E499402K83577m7633O2748N3044K67530J338444J959508K66063k447349
40039G235334k580216N48276L406468L215704J280063L1481l99646q73917r84195
40030A0879352j75466Q16268J548197L050005N441117O157846K981838k271216
40022B8427941n402212m644595k024198l52674m99080j498159k063898j769719
40014A0173406j183465q31075l34285O89111J464534J308932J437459L193583
$$ plain form
40006 15918200 20671303 23409723 21105252 15620520 11527511 10284141 9420031 7235766
39998 7235766 5134101 4679266 5182638 5363400 5191668 4950344 4390976 3902386 4757713
39989 4757713 7178233 9831332 12174072 15427109 19994883 23671619 23973903 21058747
39981 21058747 17076491 13799151 12016571 11986308 13097587 14005714 14240737 14873099 16810953
39972 16810953 19556421 22387379 25299471 27790973 28469680 27486166 27847659 32134878
39964 32134878 38576419 42313517 40444267 34614652 29051634 27114339 29052971 31769015
39956 31769015 31238571 26424243 20419911 16814951 15793660 15077582 13645368 12541124
39948 12541124 12475410 12729337 12601608 12234298 11694753 10700934 9589397 9187079 9305388
$$ packed form
40006A5918200M753103K738420k304471n484732m093009j243370q64110k184265
39998G235766k101665m54835N03372J80762j71732k41324n59368m88590Q55327
39989D757713K420520K653099K342740L253037M567774L676736L02284k915156
39981B1058747l982256l277340j782580l0263J111279R08127K35023O32362J937854
39972A6810953K745468K830958K912092K491502O78707r83514L61493M287219
39964C2134878O441541L737098j869250n829615n563018j937295J938632K716044
39956C1769015n30444m814328o004332l604960j021291p16078j432214j104244
39948A2541124o5714K53927j27729l67310n39545r93819j111537m02318J18309
$$ plain form
39939 9305388 8637988 6677081 4579588 3548690 3439828 3641355 4237429 5316604 6011805
39930 6011805 5499749 4522901 4634639 6008223 7225160 7433890 7465051 8207497 9036346
39921 9036346 8910068 8196212 8072026 8581462 8733473 8305291 7997526 7876714 7450619
39912 7450619 7428608 9307566 12691845 15348788 16804887 19192741 23001175 24979112
39904 24979112 22853693 19466167 18869798 20551348 21492703 22129076 25410548 30706610
39896 30706610 33708436 32714414 30481395 29321225 28833160 29176315 31963113 36895850
39888 36895850 42028336 48149660 58013116 71068600 85750323 107568888 144696707
39881 144696707 190299277 219140340 211711588 176557764 139775346 117451111 108655899
$$ packed form
39939I305388o67400j960907k097493j030898j08862K01527N96074J079175O95201
39930F011805n12056r76848J11738J373584J216937K08730L1161P42446Q28849
39921I036346j26278p13856j24186N09436J52011m28182l07765j20812m26095
39912G450619k2011J878958L384279K656943J456099K387854L808434J977937
39904B4979112k125419l387526n96369J681550R41355O36373L281472N296062
39896C0706610L001826r94022k233019j160170m88065L43155K786798M932737
39888C6895850N132486O121324R863456J3055484J4681723K1818565L7127819
39881A44696707M5602570K8841063p428752l5153824l6782418k2324235q795212
$$ plain form
39874 108655899 110160805 122032156 136788959 138061734 118332829 89475596 68253916
39867 68253916 57738989 49988629 41042877 34227354 31341575 29329022 26136251 23573579
39859 23573579 23110746 23349155 22929694 22563185 23058436 23891660 24524266 25049010 25043850 23711434
39849 23711434 21576839 20325809 20553156 21100233 20855136 19910903 18859740 18201702 18418888
39840 18418888 19316433 19356165 17110251 13493228 11089060 10955878 11485434 10889509 9441706
39831 9441706 8473508 8329724 8447442 8729370 9579046 10790379 11538891 11629961 11835578
39822 11835578 12661915 13617685 14227242 14944479 16254414 17713445 19183650 22312284 28757349
39813 28757349 36921328 42714595 44311414 44041817 44675547 46548705 50217572 58751405
$$ packed form
39874A08655899J504906J1871351J4756803J272775j9728905k8857233k1221680
39867F8253916j0514927p750360q945752o815523k885779k012553l192771k562672
39859B3573579m62833K38409m19461l66509M95251Q33224O32606N24744n160j332416
39849B3711434k134595j251030K27347N47077k45097r44233j051163o58038K17186
39840A8418888Q97545L9732k245914l617023k404168j33182N29556n95925j447803
39831I441706r68198j43784J17718K81928Q49676J211333P48512R1070K05617
39822A1835578Q26337R55770O09557P17237J309935J459031J470205L128634O445065
39813B8757349Q163979N793267J596819k69597O33730J873158L668867Q533833
$$ plain form
39805 58751405 73318112 88020958 94063988 89879500 83343739 82378580 86337385 88797275
39797 88797275 86727904 84219874 87621363 99110503 116381426 138851331 172346529
39790 172346529 223193673 284656188 332686760 341963884 308076726 250583930 193821980
39783 193821980 148940939 114871443 89189921 72047043 62871383 59348935 59279707 59942301
39775 59942301 57027370 48220145 37060118 29362784 26104516 23381817 19049521 15331766
39767 15331766 14245366 14257248 13081406 11012217 9742118 9781660 10485423 11199800 11312465
39758 11312465 10365257 8851337 7802359 7257983 6458010 5677881 6134385 7683887 8497253
39749 8497253 7766785 6983766 7563270 8795279 9342572 9470027 10458387 12622924 14979814
$$ packed form
39805E8751405J4566707J4702846O043030m184488o535761r65159L958805K459890
39797H8797275k069371k508030L401489J1489140J7270923K2469905L3495198
39790A72346529N0847144O1462515M8030572R277124l3887158n7492796n6761950
39783A93821980m4881041l4069496k5681522j7142878r175660l522448o9228O62594
39775E9942301k914931q807225j1160027p697334l258268k722699m332296l717755
39767A5331766j086400J1882j175842k069189j270099L9542P03763P14377J12665
39758A1312465r47208j513920j048978n44376p99973p80129M56504J549502Q13366
39749H497253p30468p83019N79504J232009N47293J27455R88360K164537K356890
$$ plain form
39740 14979814 16277063 15678077 13231281 10350005 8958623 9392083 9923305 9085006 7621698
39731 7621698 7358220 8996315 11975252 15707676 19719964 22973296 24275860 23449242
39723 23449242 21370490 18942752 16650065 14892711 13897935 13258502 12369014 11556808 12019220
39714 12019220 14097329 16168139 16121336 13865808 11490235 10673390 10894786 10946661 11229741
39705 11229741 13013957 15833743 17598246 17652345 17721517 18829780 19227933 17068295 13580856
39696 13580856 11454311 11137339 11092930 10963716 11773323 13158108 13267287 11974202 11591196
39687 11591196 13404442 15766823 16780158 16684885 16159146 14402486 10909137 7456598
39679 7456598 6037013 5936119 5122445 3662145 3306761 4139765 4259368 3044995 2306017
$$ packed form
39740A4979814J297249n98986k446796k881276j391382M33460N31222q38299j463308
39731G621698k63478J638095K978937L732424M012288L253332J302564q26618
39723B3449242k078752k427738k292687j757354r94776o39433q89488q12206M62412
39714A2019220K078109K070810m6803k255528k375573q16845K21396N1875K83080
39705A1229741J784216K819786J764503N4099O9172J108263L98153k159638l487439
39696A3580856k126545l16972m4409j29214Q09607J384785J09179j293085l83006
39687A1591196J813246K362381J013335r5273n25739j756660l493349l452539
39679G456598j419585j00894q13674j460300l55384Q33004J19603j214373p38978
$$ plain form
39670 2306017 3309186 4631979 4246540 2376219 910436 814949 1414078 1813559 1883443
39661 1883443 1899076 2087159 2657527 3700442 4877425 5562465 5410035 4580152 3411783
39652 3411783 2133945 921401 -67313 -868882 -1704940 -2537135 -2776693 -1830432 -2497
39643 -2497 1550968 2015951 1713993 1349778 913713 70614 -592119 209198 2623271 4960549
39633 4960549 5507046 4464548 3390270 3225933 3763316 4700974 6073230 7507118 8147763
39624 8147763 7929490 8229044 10432692 13990066 16493014 15855377 12232810 7789774 4758065
39615 4758065 3751084 3772436 3574498 2791716 1837410 1125113 717358 540878 555315 725521
39605 725521 1094121 1794986 2692717 3173618 2790354 2059536 1999658 2744438 3263770 2794737
$$ packed form
39670B306017J003169J322793l85439j870321j465783r5487N99129L99481O9884
39661A883443J5633J88083N70368J042915J176983O85040j52430q29883j168369
39652C411783j277838j212544r88714q01569q36058q32195k39558R46261J827935
39643b497J553465M64983l01958l64215m36065q43099o62733Q01317K414073K337278
39633D960549N46497j042498j074278j64337N37383R37658J372256J433888O40645
39624H147763k18273K99554K203648L557374K502948o37637l622567m443036l031709
39615D758065j006981K1352j97938p82782r54306p12297m07755j76480J4437J70206
39605G25521L68600P00865Q97731M80901l83264p30818n9878P44780N19332m69033
$$ plain form
39595 2794737 1949669 1865591 2682470 3502382 3636363 3277122 3002382 3140836 3659519 4289666
39585 4289666 4750046 5110271 5806719 7029133 8366908 9441263 10473704 11577228 11865834
39576 11865834 10258576 7158413 4375645 3161876 3104329 3162023 2943491 2593346 2158282
39567 2158282 1536389 620886 -617022 -1630341 -1109350 1563696 4671899 5503370 3805174
39558 3805174 2330608 3135302 4927749 5289905 3997576 2551554 1722598 1435741 2049335
39549 2049335 3641026 4700230 3688640 1529243 483740 875811 1101586 675041 807925
39540 807925 1764108 2131188 1381060 891430 1523667 2216332 2007772 1621444 1951379 2615041
39530 2615041 3068570 3623268 4366892 4608068 4335936 4631813 5686383 6143279 5455549
$$ packed form
39595B794737q45068q4078Q16879Q19912J33981l59241k74740J38454N18683O30147
39585D289666M60380L60225O96448J222414J337775J074355J032441J103524K88606
39576A1865834j607258l100163k782768j213769n7547N7694k18532l50145m35064
39567B158282o21893r15503j237908j013319N20991K673046L108203Q31471j698196
39558C805174j474566Q04694J792447L62156j292329j446022q28956k86857O13594
39549B049335J591691J059204j011590k159397j045503L92071K25775m26545J32884
39540H07925R56183L67080p50128m89630O32237O92665k08560l86328L29935O63662
39530B615041M53529N54698P43624K41176k72132K95877J054570M56896o87730
$$ plain form
39521 5455549 5008865 5643794 6039056 5122545 4135704 4408880 4892229 4074033 2781007
39512 2781007 2687614 3326472 3080952 2160290 2043559 2655482 2594005 1746274 1316519 1493427
39502 1493427 1296919 644436 594087 1610365 3255235 5222781 7018734 7319642 5625706
39493 5625706 3818000 3889899 4907333 4678561 3617740 3971046 5705892 6510161 5869285
39484 5869285 5682616 6402410 6108886 4361786 3490742 4618101 5657609 5080816 4624363
39475 4624363 6028138 7796255 7784923 6768627 6672511 7081348 6441066 5406633 5921412
39466 5921412 7574644 7746530 5442597 2678985 1680792 2420752 3352607 3325964 2389877
39457 2389877 1496299 1594888 2620869 3592266 3950043 4139001 4496491 4503066 3743547 2673133
$$ packed form
39521E455549m46684O34929L95262r16511r86841K73176M83349q18196j293026
39512B781007r3393O38858k45520r20662j16731O11923o1477q47731m29755J76908
39502A493427j96508o52483n0349J016278J644870J967546J795953L00908j693936
39493E625706j807706P1899J017434k28772j060821L53306J734846Q04269o40876
39484E869285j86669P19794k93524j747100q71044J127359J039508n76793m56453
39475D624363J403775J768117j1332j016296r6116M08837o40282j034433N14779
39466E921412J653232J71886k303933k763612r98193P39960R31855k6643r36087
39457B389877q93578R8589J025981R71397L57777J88958L57490O575p59519j070414
$$ plain form
39447 2673133 1777015 949946 321615 517856 1388725 1812301 1598564 2061455 3642240
39438 3642240 4701273 4168005 3645024 4855849 6478929 5976349 3604122 1984953 2134581
39429 2134581 2501839 1992956 1498804 1875839 2453384 2401059 2110844 2392341 3266036 4087742
39419 4087742 4143547 2975265 936913 -566067 -317776 1195350 2360188 2432468 2060679
39410 2060679 1982500 2217276 2497175 2555755 2065456 1160394 813538 1759216 3303391 4183690
39400 4183690 4248698 4168627 3928782 3051790 2090867 2302252 3687191 4782086 4676122
39391 4676122 3994924 3602261 3506230 3403870 3276276 3085096 2711125 2403112 2564611 3102416
39381 3102416 3691187 4393268 5153823 5215302 4227510 3347553 3721272 4453209 3957042 2809218
$$ packed form
39447B673133q96118q27069o28331J96241Q70869M23576k13737M62891J580785
39438C642240J059033n33268n22981J210825J623080n02580k372227j619169J49628
39429B134581L67258n08883m94152L77035N77545n2325k90215K81497Q73695Q21706
39419D087742N5805j168282k038352j502980K48291J513126J164838P2280l71789
39410B060679p8179K34776K79899N8580m90299r05062l46856R45678J544175Q80299
39400D183690O5008q0071k39845q76992r60923K11385J384939J094895j05964
39391D676122o81198l92663r6031j02360j27594j91180l73971l08013J61499N37805
39381C102416N88771P02081P60555O1479r87792q79957L73719P31937m96167j147824
$$ plain form
39371 2809218 2896881 3920877 3585910 1729730 1228516 3527226 6094889 6240795 5032498
39362 5032498 5020864 6031922 6053808 5027918 4740725 5458820 5535123 4446776 3658987
39353 3658987 3946813 4079665 3026463 1651980 1157965 1248388 1022933 698219 1209132
39344 1209132 2562993 3575250 3178156 1542145 41564 237595 2471615 5328841
39336 5328841 7038348 7512613 8213737 9733974 10582774 9214871 6409755 4374495 3842465
39327 3842465 3426057 1942200 44857 -1015005 -1152998 -1079977 -934448 -372907 366908
39318 366908 615366 418967 519343 1073127 1340365 890744 230583 -99947 -191081 -150316
39308 -150316 240762 746189 555805 -325199 -574363 592064 2034799 2408712 2363133
$$ packed form
39371B809218Q7663J023996l34967j856180n01214K298710K567663J45906j208297
39362E032498j1634J011058K1886j025890k87193P18095P6303j088347p87789
39353C658987K87826J32852j053202j374483m94015R0423k25455l24714N10913
39344A209132J353861J012257l97094j636011j500581J96031K234020K857226
39336E328841J709507M74265P01124J520237Q48800j367903k805116k035260n32030
39327C842465m16408j483857j897343j059862j37993P3021J45529N61541P39815
39318C66908K48458j96399J00376N53784K67238m49621o60161l30530r1134M0765
39308a50316L91078N05427j90384q81004k49164J166427J442735L73913m5579
$$ plain form
39299 2363133 3379139 5001256 5230210 3688211 2401313 2852685 3964141 3960817 2942702
39290 2942702 2450890 3239173 4465022 4722947 3348334 1117714 -126785 756260 2670417
39281 2670417 3472272 2854116 2673721 3936488 5122040 4632947 3367418 3188217 3960702
39272 3960702 4077873 3260545 2744356 2917252 2891231 2592474 3144082 4500568 4694628
39263 4694628 2654471 208821 -242243 1030125 1825190 1316898 814882 1339414 2179276
39254 2179276 2362740 2202433 2492743 3008594 2792700 1612545 319774 -211514 55890
39245 55890 583566 990748 1415080 2319546 3946839 5884180 7328359 7907750 7966815
39236 7966815 7827156 7195112 5785825 4151657 3147566 2755637 2297946 1789199 2051984
$$ packed form
39299B363133J016006J622117K28954j541999j286898M51372J111456l324j018115
39290B942702m91812P88283J225849K57925j374613k230620j244499Q83045J914157
39281B670417Q01855o18156j80395J262767J185552m89093j265529j79201P72485
39272C960702J17171q17328n16189J72896k6021k98757N51608J356486J94060
39263D694628k040157k445650m51064J272368P95065n08292n02016N24532Q39862
39254B179276J83464j60307K90310N15851k15894j180155j292771n31288K67404
39245E5890N27676M07182M24332R04466J627293J937341J444179N79391N9065
39236G966815j39659o32044j409287j634168j004091l91929m57691n08747K62785
$$ plain form
39227 2051984 3209598 4113545 3885375 3153801 3000286 3462860 4008065 4746807 5934319
39218 5934319 6712533 5826605 3653796 2180543 2553646 3710414 3967173 3100985 2203705
39209 2203705 2074835 2447987 2558885 2017387 1183874 790857 1046472 1290461 965363
39200 965363 657101 1367168 2802529 3366112 2129361 -12731 -1484236 -1558341 -462783
39191 -462783 1130017 2243830 2120072 1228063 984031 1848665 2543631 1897987 570867
39182 570867 -64853 48471 -20219 -426107 -514271 -247138 -208731 -201675 709227 2459885
39172 2459885 3613788 3274704 2299620 1971664 2372595 2764581 2784490 2446233 1585389
39163 1585389 213903 -927903 -1023131 -240714 506241 706857 547779 257186 -123187
$$ packed form
39227B051984J157614R03947k28170p31574j53515M62574N45205P38742J187512
39218E934319P78214q85928k172809j473253L73103J156768K56759q66188q97280
39209B203705j28870L73152J10898n41498q33513l93017K55615K43989l25098
39200I65363l08262P10067J435361N63583j236751k142092j471505p4105J095558
39191d62783J592800J113813j23758q92009k44032Q64634O94966o45644j327120
39182E70867o35720J13324o8690m05888q8164K67133L8407P056R10902J750658
39172B459885J153903l39084r75084l27956M00931L91986J9909l38257q60844
39163A585389j371486j141806r5228P82417P46955K00616j59078k90593l80373
$$ plain form
39154 -123187 -364041 -183001 158044 87243 -266952 -22091 1134506 2241835 2284255 1624300
39144 1624300 1456709 2069855 2499679 2006049 1115144 794029 1130644 1402441 1216446
39135 1216446 997546 1278887 1917243 2236884 1785015 768952 -172532 -464204 93577
39126 93577 1226420 2208160 2202565 1021419 -411866 -812471 22330 933305 854272 28483
39116 28483 -716640 -1281518 -1981008 -2401429 -1865518 -949535 -1066496 -2210815 -2625745 -1428723
39106 -1428723 -72760 -55061 -563879 -55318 886770 379164 -1489751 -2440796 -1311081
39097 -1311081 401050 951319 578454 368801 389765 238886 363128 1356536 2527698
39088 2527698 2583829 1569231 890297 1297883 1889128 1519143 461222 20369 755606
$$ packed form
39154a23187k40854J81040L41045p0801l54195K44861J156597J107329M2420o59955
39144A624300j67591O13146M29824m93630q90905l21115L36615K71797j85995
39135A216446k18900K81341O38356L19641m51869j016063r41484k91672N57781
39126I3577J132843R81740n595j181146j433285m00605Q34801R10975p9033q25789
39116B8483p45123n64878o99490m20421N35911R15983j16961j144319m14930J197022
39106a428723J355963J7699n08818N08561R42088n07606j868915r51045J129715
39097a311081J712131N50269l72865k09653K0964j50879J24242R93408J171162
39088B527698N6131j014598o78934M07586N91245l69985j057921m40853P35237
$$ plain form
39079 755606 1721731 1713734 892398 583104 1409372 2377700 2378703 1941883 2466216 4006027
39069 4006027 5096942 4918718 4348598 4378733 4694482 4647865 4640357 5443958 6787085 7751489
39059 7751489 8269523 9243759 11335385 14436746 18119618 21730434 24184153 24614474 23325177
39050 23325177 21345863 19035804 15981865 12364683 9369250 7710018 6578004 4821869
39042 4821869 2655565 1345248 1442009 2184444 2661134 2709547 2389249 1416932 -173343
39033 -173343 -1368091 -1141480 46236 676791 233132 -142354 543213 1630540 1881973
39024 1881973 1293665 815623 733033 454959 -237211 -800278 -866987 -697888 -585920 -537976
39014 -537976 -546064 -442041 370837 2119119 3744045 3931070 3023956 2590504 2964415 2792215
$$ packed form
39079G55606R66125p997q21336l09294Q26268R68328J003m36820N24333J539811
39069D006027J090915j78224n70120L0135L15749m6617p508Q03601J343127R64404
39059G751489N18034R74236K091626L101361L682872L610816K453719M30321j289297
39050B3325177j979314k310059l053939l617182k995433j659232j132014j756135
39042D821869k166304j310317R6761P42435M76690M8413l20298r72317j590275
39033a73343j194748K26611J187716O30555m43659l75486O85567J087327K51433
39024A881973n88308m78042q2590k78074o92170n63067o6709J69099J11968M7944
39014e37976q088J04023Q12878J748282J624926J87025r07114m33452L73911j72200
$$ plain form
39004 2792215 1504457 540900 1097701 2124775 1971264 951943 695675 1579958 2367811
38995 2367811 2120980 1101434 -129865 -1252011 -1751553 -1089685 391288 1531912 1617292
38986 1617292 1035479 569751 575293 975495 1594132 2287280 2960180 3507131 3703796 3405961
38976 3405961 2946167 2912524 3347461 3679692 3689285 3893236 4625829 5502109 6307702 7565054
38966 7565054 9443396 10918784 11048162 10465899 10470666 11046571 11002879 9887971 8572515
38957 8572515 7868513 7576593 7101199 6265097 5357640 4896411 5286997 6236955 6763888
38948 6763888 6361645 5783589 5959655 6597704 6801573 6686028 7223882 8635060 10071587
38939 10071587 10909799 11275969 11235966 10589653 9709399 9559579 10502853 11854548 12853524
$$ packed form
39004B792215j287758r63557N56801J027074j53511j019321k56268Q84283P87853
38995B367811k46831j019546j231299j122146m99542O61868J480973J140624Q5380
38986A617292n81813m65728N542M00202O18637O93148O72900N46951J96665k97835
38976C405961m59794l3643M34937L32231R593K03951P32593Q76280Q05593J257352
38966G565054J878342J475388J29378n82263M767N75905m3692j114908j315456
38957H572515p04002k91920m75394q36102r07457m61229L90586R49958N26933
38948F763888m02243n78056J76066O38049K03869j15545N37854J411178J436527
38939A0071587Q38212L66170m0003o46313q80254j49820R43274J351695R98976
$$ plain form
38930 12853524 13310359 13132730 12083995 10330985 8503945 6942195 5528926 4382478
38922 4382478 3886259 3835525 3449499 2565618 1941697 1926361 1721816 656465 -531130
38913 -531130 -568616 571166 1677943 2059641 2438481 3663618 5067783 4994314 3169578
38904 3169578 1681380 2626830 5179199 6387942 5080181 3370019 3473522 4632871
38896 4632871 4742412 3759611 3372107 3895153 3868584 2844535 2323936 3203544 4161927
38887 4161927 3676297 2278709 1617540 2175299 2992573 3088106 2293410 1066754 121649
38878 121649 -44420 339801 547377 265041 -93170 -35815 496819 1234100 1673999 1253442
38868 1253442 62037 -857631 -662484 189584 843455 1478704 2616980 3600413 3416839
$$ packed form
38930A2853524M56835j77629j048735j753010j827040j561750j413269j146448
38922D382478m96219n0734l86026q83881o23921j5336k04545j065351j187595
38913e31130l7486J139782J106777L81698L78840J225137J404165p3469j824736
38904C169578j488198R45450K552369J208743j307761j710162J03503J159349
38896D632871J09541r82801l87504N23046k6569j024049n20599Q79608R58383
38887D161927m85630j397588o61169N57759Q17274R5533p94696j226656r45105
38878A21649j66069L84221K07576k82336l58211N7355N32634P37281M39899m20557
38868A253442j191405r19668J95147Q52068O53871O35249J138276R83433j83574
$$ plain form
38859 3416839 2652814 2692834 3162855 2412080 675897 237864 1761836 2967619 2104384
38850 2104384 417823 -273235 -254903 -452254 -340744 630879 1289615 634902 3454
38841 3454 1032143 2765658 3220696 2643084 2529926 2408025 676226 -1799218 -2220061
38832 -2220061 -253557 1189898 359162 -982161 -830634 -44240 -418905 -1586098 -1855267
38823 -1855267 -991305 -252742 -245404 -336518 1878 517529 858942 1033231 1068750 803235
38813 803235 171676 -535302 -787044 -258016 702623 1270048 1160501 1102152 1659205 1979611
38803 1979611 792816 -1399051 -2395801 -1005656 1355024 2410736 1596624 199713
38795 199713 -444751 -125238 550801 951994 941834 905592 1169943 1378247 869666 -190299
$$ packed form
38859C416839p64025M0020M70021p50775j736183m38033J523972J205783q63235
38850B104384j686561o91058J8332j97351J11510R71623O58736o54713o31448
38841C454J028689J733515M55038n77612j13158j21901j731799k475444m20843
38832b220061J966504J443455q30736j341323J51527P86394l74665j167193k69169
38823a855267Q63962P38563P338r1114L38396N15651L41413J74289L5519k65515
38813H03235o31559p06978k51742N29028R60639N67425j09547n8349N57053L20406
38803A979611j186795k191867r96750J390145K360680J055712q14112j396911
38795A99713o44464L19513O76039M01193j0160l6242K64351K08304n08581j059965
$$ plain form
38785 -190299 -654506 205811 1585742 1995375 1039106 -193009 -557754 -220244 -228441 -898271
38775 -898271 -1232935 -360096 945562 1129269 199555 -34431 1408632 3059124 3036876
38766 3036876 1654375 557770 110717 -520503 -1101058 -326356 1664300 2877102 2376284
38757 2376284 1805489 2857085 4719009 5442267 4717693 3753489 3146774 2461082 1590496
38748 1590496 1119244 1323424 1877233 2530811 3174851 3337946 2582363 1404598 835829
38739 835829 1075107 1364948 1296822 1314286 1677566 1848629 1396661 786389 657981 857911
38729 857911 844898 672993 816110 1176294 1085489 458440 204493 997019 2127502 2301206
38719 2301206 1415297 756865 1243656 2179637 2224533 1069971 -431134 -1371224 -1316615
$$ packed form
38785a90299m64207Q60317J379931M09633r56269j232115l64745L37510q197o69830
38775h98271l34664Q72839J305658J83707r29714k33986J443063J650492k2248
38766C036876j382501j096605m47053o31220n80555P74702J990656J212802n00818
38757B376284n70795J051596J861924P23258p24574r64204o06715o85692q70586
38748A590496m71252K04180N53809O53578O44040J63095p55583j177765n68769
38739H35829K39278K89841o8126J7464L63280J71063m51968o10272j28408J99930
38729H57911j3013j71905J43117L60184r0805o27049k53947P92526J130483J73704
38719B301206q85909o58432M86791R35981M4896j154562j501105r40090N4609
$$ plain form
38710 -1316615 -118448 1802258 3042023 2198626 -347606 -2476987 -2625001 -1341496
38702 -1341496 -123042 505788 1039253 1804438 2680447 3656379 4754715 5536447 5492288
38693 5492288 4860899 4294387 3764250 2662939 1099254 163907 489838 1294728 1422613
38684 1422613 784123 138250 -114780 -162212 -34196 503089 1196741 1226179 284380 -800750
38674 -800750 -1075579 -756037 -854597 -1610250 -2035180 -1298014 35254 676396 229201 -460197
38664 -460197 -514863 -44255 210570 -139978 -771840 -1092814 -845976 -311035 35983 90707
38654 90707 259775 905750 1810905 2458833 2694330 2697770 2409596 1564370 393290 -334338
38644 -334338 -274421 45208 148776 409204 1279939 2194460 2146042 1253366 801958 1504658
$$ packed form
38710a316615J198167J920706J239765q43397k546232k129381j48014J283505
38702a341496J218454O28830N33465P65185Q76009R75932J098336P81732m4159
38693E492288o31389n66512n30137j101311j563685r35347L25931Q04890J27885
38684A422613o38490o45873k53030m7432J28016N37285O93652K9438r41799j085130
38674h00750k74829L19542r8560p55653m24930P37166J333268O41142m47195o89398
38664d60197n4666M70608K54825l50548o31862l20974K46838N34941L47018N4724
38654I0707J69068O45975R05155O47928K35497L440k88174q45226j171080p27628
38644c34338N9917L19629J03568K60428Q70735R14521m8418q92676m51408P02700
$$ plain form
38634 1504658 2541328 2776562 2267279 1906700 1974919 1796717 790628 -713052 -1778375
38625 -1778375 -1635396 -221556 1581687 2281097 945801 -1704502 -3811112 -4224746 -3476178
38616 -3476178 -2719339 -2262942 -1620468 -561293 585749 1514648 2176346 2432352 2043887
38607 2043887 1118495 156261 -419389 -468677 8969 769512 1210187 972075 604451 922131
38597 922131 1659508 1575738 139774 -1647970 -2453269 -1956587 -725141 475859 859960
38588 859960 -26787 -1534530 -2234418 -1604476 -634270 -194726 171060 962874 1337889
38579 1337889 355603 -1191515 -1724893 -1143997 -567811 -191655 815414 2294519 2802943
38570 2802943 1759104 361045 -171894 23057 315603 548638 599902 180453 -380636
$$ packed form
38634A504658J036670K35234n09283l60579O8219j78202j006089j503680j065323
38625a778375J42979J413840J803243O99410j335296k650303k106610m13634P48568
38616c476178P56839M56397O42474J059175J147042R28899O61698K56006l88465
38607B043887r25392r62234n75650m9288M77646P60543M40675k38112l67624L17680
38597I22131P37377q3770j435964j787744q05299M96682J231446J201000L84101
38588H59960q86747j507743o99888O29942R70206M39544L65786P91814L75015
38579A337889r82286j547118n33378N80896N76186L76156J007069J479105N08424
38570B802943j043839j398059n32939J94951K92546K33035N1264m19449n61089
$$ plain form
38561 -380636 -294548 301089 401420 18791 430762 1827897 2459368 1294346 -113065
38552 -113065 48373 1099707 1265523 602897 442586 770208 473851 -187282 307540
38543 307540 2075870 3385497 3215031 2359615 1532578 254641 -1605942 -2876295 -2673549
38534 -2673549 -1660188 -794869 -26723 861886 1307937 947289 545233 830266 1243745
38525 1243745 967182 406444 419544 698562 272396 -713297 -1018264 -65834 1347434
38516 1347434 2087524 1607977 6146 -1955759 -3024920 -2570774 -1457992 -969209 -1046016
38507 -1046016 -630128 373611 766270 -56969 -1090428 -1133609 -287776 540182 844858
38498 844858 659306 185821 -126054 243747 1057242 1245061 220897 -1289795 -2250632
$$ packed form
38561c80636Q6088N95637J00331l82629M11971J397135O31471j165022j407411
38552a13065J61438J051334J65816o62626j60311L27622k96357o61133M94822
38543C07540J768330J309627j70466q55416q27037j277937j860583j270353K02746
38534b673549J013361Q65319P68146Q88609M46051l60648m02056K85033M13479
38525A243745k76563n60738J3100K79018m26166r85693l04967R52430J413268
38516A347434P40090m79547j601831j961905j069161M54146J112782M88783p6807
38507a046016M15888J003739L92659q23239j033459m3181Q45833Q27958L04676
38498H44858j85552m73485l11875L69801Q13495J87819j024164j510692r60837
$$ plain form
38489 -2250632 -2488291 -2289303 -1625572 -641059 -178999 -715177 -1295443 -762165 338683
38480 338683 457809 -505192 -978147 -143810 946601 1265482 1389099 2202947 3117114
38471 3117114 2817881 1222875 -450818 -1285998 -1364903 -1036632 -423286 230415 396703
38462 396703 -279423 -1594833 -2843611 -3163129 -2182954 -606249 286253 88616 -264136
38453 -264136 75224 638000 586345 236963 527492 1326357 1564970 1060616 947933 1974028
38443 1974028 3425244 4176558 3878130 2671586 745891 -1139980 -1636265 -313392 1387511
38434 1387511 1754838 1010203 834818 1816640 2576102 1822746 280143 -285169 531211
38425 531211 1330348 950601 76420 219717 1568092 2687366 2376810 1034115 -141122
$$ packed form
38489b250632k37659J98988O63731R84513M62060n36178n80266N33278J100848
38480C38683J19126r63001m72955Q34337J090411L18881J23617Q13848R14167
38471C117114k99233j595006j673693q35180p8905L28271O13346O53701J66288
38462C96703o76126j315410j248778l19518R80175J576705Q92502j97637l52752
38453b64136L39360N62776n1655l49382K90529P98865K38613n04354j12683J026095
38443A974028J451216P51314k98428j206544j925695j885871m96285J322873J700903
38434A387511L67327p44635j75385R81822P59462p53356j542603n65312Q16380
38425E31211P99137l79747q74181J43297J348375J119274l10556j342695j175237
$$ plain form
38416 -141122 -615725 -648124 -495547 -238249 -97064 -195233 -167737 340231 991333 1270455
38406 1270455 1410140 1915524 2374598 1838991 401761 -739698 -938037 -648790 -158596
38397 -158596 833975 1920844 1825453 421314 -546730 54066 897138 351619 -727880
38388 -727880 -325599 1416042 2422710 1954139 1362171 1399434 1063688 -141907 -908349
38379 -908349 -308555 451296 -2039 -861950 -534932 587703 734357 -305777 -854014
38370 -854014 -69142 825428 602528 -205965 -476300 -248939 -264319 -552354 -603617 -480875
38360 -480875 -698501 -1220771 -1537335 -1618385 -1859857 -2102052 -1694337 -699115 -44032 -136135
38350 -136135 -295935 -79411 -152737 -1019869 -1763760 -1210358 200905 942051 485024 -379248
$$ packed form
38416a41122m74603l2399J52577K57298J41185r8169K7496N07968O51102K79122
38406A270455J39685N05384M59074n35607j437230j141459j98339K89247M90194
38397a58596R92571J086869r5391j404139r68044O00796Q43072n45519j079499
38388g27880M02281J741641J006668m68571n91968L7263l35746j205595p66442
38379i08349N99794P59851m53335q59911L27018J122635J46654j040134n48237
38370h54014P84872Q94570k22900q08493k70335K27361j5380k88035n1263J22742
38360d80875k17626n22270l16564q1050k41472k42195M07715R95222O55083r2103
38350a36135j59800K16524p3326q67132p43891N53402J411263P41146m57027q64272
$$ plain form
38340 -379248 -1118644 -1947311 -2655773 -2466663 -1534237 -1188455 -1921211 -2358708 -1209902
38331 -1209902 799612 2033643 2091128 1624645 786178 -677759 -2189160 -2685046 -2141952
38322 -2141952 -1498976 -1110245 -536041 130080 146875 -383261 -307997 722009 1454390 888954
38312 888954 -134630 -198785 628324 1097324 712352 304799 755281 1920128 2880151
38303 2880151 2802342 1639899 314686 -37787 645332 1187413 728462 -31292 163986
38294 163986 1251723 1876442 1186752 -272283 -1526824 -2163146 -2107420 -1268599 74274
38285 74274 1114114 1314502 1001362 727033 478712 41349 -306039 -205257 -55645 -559259
38275 -559259 -1473710 -1756955 -1170014 -788833 -1391272 -2155077 -1777832 -352980 792958
$$ packed form
38340c79248p39396q28667p08462J89110R32426L45782p32756m37497J148806
38331a209902K009514J234031N7485m66483q38467j463937j511401m95886N43094
38322b141952O42976L88731N74204O66121J6795n30136P5264J030006P32381n65436
38312H88954j023584o4155Q27109M69000l84972m07553M50482J164847R60023
38303B880151p7809j162443j325213l52473O83119N42081m58951p59754J95278
38294A63986J087737O24719o89690j459035j254541o36322N5726Q38821J342873
38285G4274J039840K00388l13140k74329k48321m37363l47388J00782J49612n03614
38275e59259r14451k83245N86941L81181o02439p63805L77245J424852J145938
$$ plain form
38266 792958 844709 160359 -652957 -1332980 -1587853 -1151558 -513027 -679950 -1792851 -2805638
38256 -2805638 -3022482 -3047973 -3486378 -3571897 -2208152 105230 1575204 1276872 44127
38247 44127 -845415 -1004845 -785302 -548162 -436931 -441948 -447139 -408692 -440302 -512403 -363718
38236 -363718 -79348 -300693 -1245256 -2014718 -1770289 -1171543 -1481872 -2485226 -2702708
38227 -2702708 -1769811 -1086422 -1624738 -2517868 -2607672 -2112117 -1713693 -1082469 380841
38218 380841 2039030 2608004 1908962 871995 60716 -644457 -1028580 -457430 928409
38209 928409 1898021 1447239 -124986 -1700391 -2411573 -2061028 -987910 160157 772549
38200 772549 659436 150210 -108165 451759 1690864 2469172 1647122 -299102 -1439823
$$ packed form
38266G92958N1751o84350q13316o80023k54873M36295O38531j66923j112901j012787
38256b805638k16844k5491m38405q5519J363745K313382J469974k98332j232745
38247D4127q89542j59430K19543K37140J11231n017n191L8447l1610p2101J48685
38236c63718K84370k21345r44563p69462K44429N98746l10329j003354k17482
38227b702708R32897O83389n38316q93130q9804M95555L98424O31224J463310
38218C80841J658189N68974o99042j036967q11279p05173l84123N71150J385839
38209I28409R69612m50782j572225j575405p11182L50545J073118J148067O12392
38200G72549j13113n09226k58375N59924J239105P78308q22050j946224j140721
$$ plain form
38191 -1439823 -746095 541111 739104 68363 -61728 581272 1009201 1019917 1449834
38182 1449834 2287879 2316515 1146723 -25300 -429679 -927846 -2215534 -3295485 -3072464
38173 -3072464 -2251270 -2075984 -2104666 -1010439 936341 2033153 1691533 1093127 1094008 1078465
38163 1078465 432608 -226644 -117863 399967 459457 -31074 -516992 -764024 -990172 -1270619
38153 -1270619 -1356299 -995724 -173596 778378 1186067 573791 -519587 -713439 738113
38144 738113 2862907 3840461 2952307 1356814 836835 1918855 3368117 3602192 2456632
38135 2456632 1206216 841012 970184 831538 664681 1191005 2183419 2709120 2697744
38126 2697744 3062004 4060358 4697729 4210897 3175264 2587388 2656234 3032841 3523492
$$ packed form
38191a439823O93728J287206J97993o70741j30091O43000M27929J0716M29917
38182A449834Q38045K8636j169792j172023m04379m98167j287688j079951K23021
38173c072464Q21194J75286k8682J094227J946780J096812l41620n98406Q81j5543
38163A078465o45857o59252J08781N17830N9490m90531m85918k47032k26148k80447
38153a270619q5680L60575Q22128R51974M07689o12276j093378j93852J451552
38144G38113K124794R77554q88154j595493n19979J082020J449262K34075j145560
38135B456632j250416l65204J29172j38646j66857N26324R92414N25701j1376
38126B697744L64260R98354O37371m86832j035633n87876O8846L76607M90651
$$ plain form
38117 3523492 4094549 4784486 5883187 7524447 9167905 10625577 13394720 18909593
38109 18909593 24951174 26321916 20806754 12503886 7127384 5654648 5056003 3715740
38101 3715740 2777707 2749979 2370415 1300224 884406 1409577 1319136 143279 -388019
38092 -388019 600587 1420337 660584 -554339 -870680 -1067716 -2054591 -2529965 -1157304
38083 -1157304 488370 -68404 -2247212 -3263467 -2372026 -1462883 -1540200 -1398840 -303715
38074 -303715 507004 24703 -713218 -222765 1277522 2401358 2438080 1798673 1172023
38065 1172023 857503 646612 147971 -524339 -596174 353807 1632652 2388034 2790013
38056 2790013 3305362 3426330 2478992 1237112 1111651 1927063 2211431 1665194 1464506
$$ packed form
38117C523492N71057O89937J098701J641260J643458J457672K769143N514873
38109A8909593O041581J370742n515162q302868n376502j472736n98645j340263
38101C715740r38033k7728l79564j070191m15818N25171r0441j175857n31298
38092c88019R88606Q19750p59753j214923l16341j97036r86875m75374J372661
38083a157304J645674n56774k178808j016255Q91441R09143p7317J41360J095125
38074c03715Q10719m82301p37921M90453J500287J123836L6722o39407o26650
38065A172023l14520k10891m98641o72310p1835R49981J278845P55382M01979
38056B790013N15349J20968r47338j241880j25461Q15412K84368n46237k00688
$$ plain form
38047 1464506 1873274 1577704 96137 -1034653 -548197 628307 924916 318892 -236046
38038 -236046 -466745 -613002 -490010 62078 487384 374704 393631 1356960 2910414 4077449
38028 4077449 4545419 4574817 4294433 3973885 4310476 5541379 7044545 8788069 12127921
38019 12127921 17607729 22681025 23577616 19512283 13509155 8862853 6201299 4377490
38011 4377490 2763290 1667052 1243839 974095 189480 -1195808 -2430605 -2507085 -1303732
38002 -1303732 53634 462072 240895 570498 1666720 2374833 1718846 63074 -1568220
37993 -1568220 -2644015 -3179710 -3191788 -2674485 -1905503 -1330445 -1152695 -1218498 -1228817 -949291
37983 -949291 -344491 333945 668963 475788 131749 369804 1550574 3151380 4248664
$$ packed form
38047A464506M08768k95570j481567j130790M86456J176504K96609o06024n54938
38038b36046k30699j46257J22992N52088M25306j12680J8927R63329J553454J167035
38028D077449M67970K9398k80384l20548L36591J230903J503166J743524L339852
38019A2127921N479808N073296Q96591m065333o003128m646302k661554j823809
38011D377490j614200j096238m23213k69744p84615j385288j234797p6480J203353
38002a303732J357366M08438k21177L29603J096222P08113o55987j655772j631294
37993a568220j075795n35695j2078N17303P68982N75058J77750o5803j0319K79526
37983i49291O04800O78436L35018j93175l44039K38055J180770J600806J097284
$$ plain form
37974 4248664 4607850 4914915 5650531 6233689 5892084 4947649 4318442 3991844 3157729
37965 3157729 1882184 1315150 1852325 2426093 2299377 2263017 3070028 3872373 3513339
37956 3513339 2456759 1974306 2060098 1688188 770737 316979 715858 1227803 1239195 844049
37946 844049 187696 -584868 -749836 341450 1920050 2401825 1571962 918652 1466966
37937 1466966 2538694 3120317 3200364 3075859 2487795 1352535 486144 640910 1370819
37928 1370819 1659160 1262259 776752 743804 1240659 2001698 2452133 1971435 589340
37919 589340 -854886 -1578354 -1571835 -1233839 -745013 -132923 412653 580869 68525 -1277230
37909 -1277230 -2952335 -3634555 -2481831 -643553 -283538 -1689381 -2613512 -1278206 1139229
$$ packed form
37974D248664L59186L07065P35616N83158l41605r44435o29207l26598q34115
37965C157729j275545n67034N37175N73768j26716l6360Q07011Q02345l59034
37956C513339j056580m82453Q5792l71910r17451m53758L98879N11945J1392l95146
37946H44049o56353p72564j64968J091286J578600M81775q29863o53310N48314
37937A466966J071728N81623Q0047j24505n88064j135260q66391J54766P29909
37928A370819K88341l96901m85507l2948M96855P61039M50435m80698j382095
37919E89340j444226p23468O519L37996M88826O12090N45576J68216n12344j345755
37909a277230j675105o82220J152724J838278L60015j405843r24131J335306K417435
$$ plain form
37900 1139229 2179677 1354367 313449 281469 829605 1140027 1126698 1010721 834946
37891 834946 790317 1209732 1857887 1938339 1229311 581127 748436 1213078 843188 -473040
37881 -473040 -1542636 -1373748 -469287 -207283 -1108969 -2197641 -2207980 -1054482 206670
37872 206670 612648 90370 -799764 -1410450 -1309004 -492979 612922 1658300 2720292
37863 2720292 3740869 3941192 2651400 657478 -322461 213041 908999 531484 -384030
37854 -384030 -579490 75949 738138 1028835 1300558 1696928 1823909 1333973 290739
37845 290739 -893334 -1482187 -805500 811010 1982179 1834889 1168069 1217959 1772414
37836 1772414 1620545 568465 -285943 -295424 14816 229541 758661 1655713 1845579 525662
$$ packed form
37900A139229J040448q25310j040918l1980N48136L10422j3329j15977j75775
37891H34946m4629M19415O48155Q0452p09028o48184J67309M64642l69890j316228
37881d73040j069596J68888R04461K62004r01686j088672j0339J153498J261152
37872B06670M05978n22278q90134o10686J01446Q16025J105901J045378J061992
37863B720292J020577K00323j289792j993922r79939N35502O95958l77515r15514
37854c84030j95460O55439O62189K90697K71723L96370J26981m89936j043234
37845B90739j184073n88853O76687J616510J171169j47290o66820M9890N54455
37836A772414j51869j052080q54408r481L10240K14725N29120Q97052J89866j319917
$$ plain form
37826 525662 -1321319 -1879389 -756481 616945 919103 495636 576892 1400568 1819021
37817 1819021 914837 -568709 -1006474 117130 1761837 2912033 3624352 4076911 3697985
37808 3697985 2282110 1110194 1466079 2432117 1848908 -446028 -2067513 -1335235 526706
37799 526706 1425800 1227665 1115430 1138669 228558 -1619432 -2914889 -2723360 -1784843
37790 -1784843 -1086362 -512491 322023 908019 635752 172257 738820 2076302 2416124
37781 2416124 913129 -973978 -1346404 -323934 437049 202318 -195009 -110227 -5965
37772 -5965 -126299 350078 1816885 2980980 2472404 1079109 853060 2180486 3246192
37763 3246192 2612087 988369 -21155 185621 1155861 2280234 3055012 3159975 2941508
$$ packed form
37826E25662j846981n58070J122908J373426L02158m23467Q1256Q23676M18453
37817A819021r04184j483546m37765J123604J644707J150196P12319M52559l78926
37808C697985j415875j171916L55885R66038n83209k294936j621485P32278J861941
37799E26706Q99094j98135j12235K3239r10111j847990j295457J91529R38517
37790a784843O98481N73871Q34514N85996k72267m63495N66563J337482L39822
37781B416124j502995j887107l72426J022470P60983k34731l97327Q4782J04262
37772e965j20334M76377J466807J164095n08576j393295k26049J327426J065706
37763C246192o34105j623718j009524K06776R70240J124373P74778J04963k18467
$$ plain form
37754 2941508 3274321 4380072 5285815 4964972 3547150 1985848 1086127 1254296 2463333
37745 2463333 3838513 3986618 2562075 984279 779404 1699055 2382310 2406604 2525913
37736 2525913 3057785 3289514 2752142 2087590 2151947 2881559 3503811 3474674 2850984 2011903
37726 2011903 1327270 1011967 1145211 1763716 2770210 3691178 3850122 3034474 1730404
37717 1730404 508454 -394720 -644649 302882 2182158 3397839 2578968 458308 -797940
37708 -797940 -163813 1208587 1618897 686459 -584478 -920798 223565 2219517 3683415
37699 3683415 3793654 3116118 2667607 2548042 2287101 2060843 2324203 2522853 1747631
37690 1747631 715450 1277239 3422807 4648374 3399310 1497190 1595235 3437716 4433640
$$ packed form
37754B941508L32813J105751R05743l20843j417822j561302q99721J68169J209037
37745B463333J375180J48105j424543j577796k04875R19651O83255K4294J19309
37736B525913N31872K31729n37372o64552O4357P29612O22252k9137o23690q39081
37726B011903o84633l15303J33244O18505J006494R20968J58944q15648j304070
37717A730404j221950r03174k49929R47531J879276J215681q18871k120660j256248
37708g97940O34127J372400M10310r32438j270937l36320J144363J995952J463898
37699C683415J10239o77536m48511j19565k60941k26258K63360J98650p75222
37690A747631j032181N61789K145568J225567j249064j902120R8045J842481R95924
$$ plain form
37681 4433640 3235506 994263 -612015 -997094 -413142 497391 831088 267626 -223072
37672 -223072 421530 1632236 1910871 1084068 392654 314717 -40560 -979723 -1352784 -484327
37662 -484327 427741 -30118 -1426105 -2193325 -1673260 -448317 725623 1341676 1073649
37653 1073649 279603 86313 1001826 1934964 1631682 566970 145391 429113 222913
37644 222913 -638835 -835658 128687 778582 -212072 -2016116 -2964468 -2893564 -2776213 -2641694
37634 -2641694 -1518450 557421 1977705 1505411 -221364 -1638311 -1948920 -1442907 -852782
37625 -852782 -873639 -1669992 -2379341 -1767660 98796 1553905 1346970 203709 -428446
37616 -428446 -360909 -253199 5505 914723 1742216 1104971 -704874 -1715754 -1016299
$$ packed form
37681D433640j198134k241243j606278l85079N83952R10533L33697n63462m90698
37672b23072O44602J210706K78635q26803o91414p7937l55277r39163l73061Q68457
37662d84327R12068m57859j395987p67220N20065J224943J173940O16053k68027
37653A073649p94046j93290R15513R33138l03282j064712m21579K83722k06200
37644B22913q61748j96823R64345O49895r90654j804044r48352P0904J17351J34519
37634b641694J123244K075871J420284m72294j726775j416947l10609N06013N90125
37625h52782k0857p96353p09349O11681J866456J455109k06935j143261o32155
37616d28446O7537J07710K58704R09218Q27493o37245j809845j010880O99455
$$ plain form
37607 -1016299 152313 607693 776158 1146148 982577 -32586 -476498 714241 2050327
37598 2050327 1387878 -839829 -2323889 -2184161 -1472376 -850075 -84105 290727 -711110
37589 -711110 -2236535 -2060122 -35041 1248099 267447 -1201496 -1065173 -61155 -59229
37580 -59229 -824245 -661691 629002 1524808 1122744 45385 -787734 -974721 -468833
37571 -468833 266392 264739 -767911 -1726074 -1506314 -527568 158229 480163 834424 795081
37561 795081 -133019 -1145545 -1160021 -636787 -679178 -923817 -311571 535570 56083 -1264768
37551 -1264768 -1189860 681990 2195064 2187721 2139335 3079115 3409358 1675964 -558951
37542 -558951 -866308 457357 1214683 740242 269277 470473 781264 1010138 1632366
$$ packed form
37607a016299J168612M55380J68465L69990j63571j015163m43912J190739J336086
37598B050327o62449k227707j484060J39728P11785O22301P65970L74832j001837
37589g11110j525425J76413K025081J283140r80652j468943J36323J004018J926
37580e9229p65016J62554J290693Q95806m02064j077359q33119j86987N05888
37571d68833P35225j653j032650r58163K19760R78746O85797L21934L54261l9343
37561G95081r28100j012526j4476N23234m2391k44639O12246Q47141m79487j320851
37551a264768P4908J871850J513074p343m8386R39780L30243j733394k234915
37542e58951l07357J323665P57326m74441m70965K01196L10791K28874O22228
$$ plain form
37533 1632366 2377940 2207882 986577 -165769 -451712 -210973 -17570 -22089 -298798
37524 -298798 -850129 -1197348 -883315 -307177 -103604 50493 799020 1547274 1081656 -292754
37514 -292754 -980887 -713617 -1038258 -2554051 -3606357 -2890622 -1608911 -1465677 -1934736
37505 -1934736 -1387115 67337 893319 727529 664283 1154962 1532119 1656399 2171789
37496 2171789 2870564 2647285 1555867 1059746 1481765 1105748 -948421 -2693204 -1887617
37487 -1887617 543395 1722049 771373 -489928 -584075 -92868 -72006 -527676 -1110065
37478 -1110065 -1901060 -2717246 -2740976 -1698785 -590957 -469373 -1118426 -1599096 -1511115
37469 -1511115 -1100278 -658499 -421434 -612052 -1089936 -1390601 -1442261 -1635610 -1888325 -1521964
$$ packed form
37533A632366P45574j70058j221305j152346k85943K40739J93403m519k76709
37524b98798n51331l47219L14033N76138K03573J54097P48527P48254m65618j374410
37514b92754o88133K67270l24641j515793j052306P15735J281711J43234m69059
37505a934736N47621J454452Q25982j65790o3246M90679L77157J24280N15390
37496B171789O98775k23279j091418m96121M22019l76017k054169j744783Q05587
37487a887617K431012J178654r50676j261301r4147M91207K0862m55670n82389
37478a110065p90995q16186k3730J042191J107828J21584o49053m80670Q7981
37469a511115M10837M41779K37065j90618m77884l00665n1660j93349k52715L66361
$$ plain form
37459 -1521964 -574705 -224104 -1100320 -2147602 -2187745 -1697295 -1747583 -1974838 -1199459 383606
37449 383606 1319258 1079088 536491 242138 -134150 -451301 61794 1085572 1042438 -468698
37439 -468698 -1614969 -886136 596999 766904 -391440 -1181791 -987077 -965256 -1904896
37430 -1904896 -2881947 -2579455 -1023707 523092 904739 49579 -950856 -630565 1452045
37421 1452045 3913460 4637596 2942232 281731 -1434764 -1786758 -1731529 -1983269 -2239836
37412 -2239836 -2040392 -1636904 -1523874 -1561031 -1263932 -785483 -781975 -1206542 -1140063 -236477
37402 -236477 542088 337867 -239537 -131800 417901 353272 -330778 -585640 -114246 184734
37392 184734 -238119 -869095 -1263823 -1657694 -2045896 -1876345 -1169446 -764542 -897458 -735371
$$ packed form
37459a521964R47259L50601q76216j047282m0143M90450n0288k27255P75379J583065
37449C83606R35652k40170n42597k94353l76288l17151N13095J023778m3134j511136
37439d68698j146271P28833J483135J69905j158344p90351J94714K1821r39640
37430a904896r77051L02492J555748J546799L81647q55160j000435L20291K082610
37421A452045K461415P24136j695364k660501j716495l51994N5229k51740k56567
37412b239836J99444M03488J13030l7157K97099M78449L508m24567O6479R03586
37402b36477P78565k04221n77404J07737N49701o4629o84050k54862M71394K98980
37392A84734m22853o30976l94728l93871l88202J69551P06899M04904j32916J62087
$$ plain form
37382 -735371 78842 741798 873888 1315401 2330087 2548484 1098091 -640134 -1124606
37373 -1124606 -1209167 -2497090 -4164697 -3989659 -2127172 -1131671 -1956690 -2546738 -1273177
37364 -1273177 540589 888597 62331 -294555 113048 195424 -480003 -1110078 -941188
37355 -941188 -71190 939475 1512557 1286160 533872 133729 555026 1113160 774148
37346 774148 -507106 -1741815 -2025111 -1303471 -227046 416943 322743 -30924 57881
37337 57881 553995 784330 633700 844944 1663116 2046418 1095680 -390559 -919999 -523793
37327 -523793 -708322 -2128208 -3519961 -3449346 -2229767 -1394864 -1742263 -2556571 -2603052
37318 -2603052 -1446194 157680 940821 305143 -1035693 -1778065 -1469041 -873123 -726531
$$ packed form
37382g35371Q14213O62956J32090M41513J014686K18397j450393j738225m84472
37373a124606q4561j287923j667607J75038J862487R95501q25019n90048J273561
37364a273177J813766L48008q26266l56886M07603Q2376o75427o30075J68890
37355i41188Q69998J010665N73082k26397p52288m00143M21297N58134l39012
37346G74148j281254j234709k83296P21640J076425O43989r4200l53667Q8805
37337E7881M96114K30335j50630K11244Q18172L83302r50738j486239n29440L96206
37327e23793j84529j419886j391753P0615J219579Q34903l47399q14308m6481
37318b603052J156858J603874P83141o35678j340836p42372L09024N95918J46592
$$ plain form
37309 -726531 -646864 177251 1544584 2255424 1616600 274788 -689544 -952302 -874605 -707830
37299 -707830 -388927 106116 681325 1266066 1664225 1474093 651974 -39629 196075 1002145
37289 1002145 1163774 222257 -920746 -1279846 -950665 -559849 -216492 351018 1083924
37280 1083924 1685975 2076589 2118083 1286944 -558562 -2339598 -2685364 -1772969 -1295147
37271 -1295147 -2260420 -3639806 -3762817 -2459353 -1072195 -617213 -741535 -646911 -364543
37262 -364543 -543233 -1219346 -1534358 -964625 -273948 -602440 -1845364 -2679894 -2192746
37253 -2192746 -726073 938625 2261049 2533560 1022252 -1641339 -3256226 -2462169
37245 -2462169 -628213 32808 -343623 325950 2637307 4578540 4368692 2783588 1731183
$$ packed form
37309g26531P9667Q24115J367333P10840o38824j341812r64332k62758P7697J66775
37299g07830L18903M95043N75209N84741L98159j90132q22119o91603K35704Q06070
37289A002145J61629r41517j143003l59100L29181L90816L43357N67510P32906
37280A083924O02051L90614M1494q31139j845506j781036l45766R12395M77822
37271a295147r65273j379386j23011J303464J387158M54982j24322R4624K82368
37262c64543j78690o76113l15012N69733O90677l28492j242924q34530M87148
37253b192746J466673J664698J322424K72511j511308k663591j614887P94057
37245b462169J833956O61021l76431O69573K311357J941233k09848j585104j052405
$$ plain form
37236 1731183 1754565 2038710 2002215 1734723 1387963 1129426 1323469 1903511 1950094 802706
37226 802706 -681036 -930521 338283 1799609 2267180 1955169 1724733 1744782 1424936
37217 1424936 434631 -676751 -1039207 -545213 -107329 -566302 -1525670 -1835586 -1248111
37208 -1248111 -786961 -1110476 -1400491 -689393 436391 641626 -20860 -153048 757264
37199 757264 1556237 1361396 985764 1506315 2378871 2187124 766443 -628203 -1101545
37190 -1101545 -945419 -670157 -320831 -39017 -283413 -957018 -1128396 -250847 1018845
37181 1018845 1892391 2654379 3874333 4947956 4640286 2991381 1483918 1053442 984945
37172 984945 293040 -696940 -913978 -137880 779558 1084875 869082 676668 816543 1079653
$$ packed form
37236A731183K3382K84145l6495k67492l46760k58537J94043N80042M6583j147388
37226H02706j483742k49485J268804J461326M67571l12011k30436K0049l19846
37217A424936r90305j111382l62456M93994M37884m58973r59368l09916N87475
37208a248111M61150l23515k90015P11098J125784K05235o62486j32188R10312
37199G57264P98973j94841l75632N20551Q72556j91747j420681j394646m73342
37190a101545J56126K75262L49326K81814k44396o73605j71378Q77549J269692
37181A018845Q73546P61988J219954J073623l07670j648905j507463m30476o8497
37172I84945o91905r89980k17038P76098R17438L05317k15793j92414J39875K63110
$$ plain form
37162 1079653 895265 -125519 -1547747 -2154560 -989973 1541207 3728908 3831018 1518567
37153 1518567 -1693938 -3562167 -3002017 -916542 968836 1764659 1588658 735056 -346262
37144 -346262 -614966 664651 2511588 3060303 2085634 1257238 1412189 1276443 -116227
37135 -116227 -1429508 -1023568 361154 790811 110641 -258793 53874 18700 -671194
37126 -671194 -1094650 -889618 -793731 -1106803 -1202469 -900362 -804799 -921382 -463896 517445
37116 517445 843679 96241 -702106 -924574 -1286896 -2097671 -2125444 -449285 1771025
37107 1771025 2679684 1972126 612284 -747100 -1771956 -1725449 -267727 1467582 2020460
37098 2020460 1605276 1659496 2513104 2878119 1906942 562952 330305 1288155 2124686
$$ packed form
37162A079653j84388j020784j422228o06813J164587K531180K187701J02110k312451
37153A518567l212505j868229N60150K085475J885378P95823j76001q53602j081318
37144c46262k68704J279617J846937N48715r74669q28396J54951j35746j392670
37135a16227j313281M05940J384722M29657o80170l69434L12667l5174o89894
37126f71194m23456K05032R5887l13072r5666L02107R5563j16583M57486R81341
37116E17445L26234p47438p98347k22468l62322q10775k7773J676159K220310
37107A771025R08659p07558j359842j359384j024856M6507J457722J735309N52878
37098B020460m15184N4220Q53608L65015r71177j343990k32647R57850Q36531
$$ plain form
37089 2124686 1755852 414556 -837712 -1333312 -1313738 -1303164 -1345610 -1179148 -890739 -804627
37079 -804627 -748553 -103497 1184150 2187527 1959674 623264 -712163 -942996 73837
37070 73837 1257034 1164475 -428671 -2051562 -2212499 -1206822 -438800 -338089 -163112
37061 -163112 280855 210922 -574745 -1117888 -811938 -231767 164320 898696 2199135 3004044
37051 3004044 2339069 909864 260393 843933 1824062 2402345 2524222 2451313 2260850
37042 2260850 1822220 1111840 559220 782008 1670131 2303479 2358878 2687670 3476514 3120108
37032 3120108 789740 -1118443 143267 3138728 3972236 2295395 1645352 3401009
$$ packed form
37089B124686l68834j341296j252268m95600J9574J0574m2446J66462K88409Q6112
37079h04627N6074O45056J287647J003377k27853j336410j335427k30833J016833
37070G3837J183197r2559j593146j622891j60937J005677P68022J00711J74977
37061a63112M43967o9933p85667n43143L05950N80171L96087P34376J300439Q04909
37051C004044o64975j429205o49471N83540R80129N78283J21877p2909j90463
37042B260850m38630p10380n52620K22788Q88123O33348N5399L28792P88844l56406
37032C120108k330368j908183J261710K995461Q33508j676841o50043J755657
$$ [...]
##END NTUPLES=NMR SPECTRUM
##END=
