##TITLE=31Pdec_SR141_oil
 DMSO-d6, 124 sc
 19.9.2022
##JCAMPDX= 6.0         $$ Bruker NMR JCAMP-DX V2.0
##DATA TYPE= NMR SPECTRUM
##DATA CLASS= NTUPLES
##ORIGIN= UXNMR, Bruker Analytische Messtechnik GmbH
##OWNER= root
$$ XWIN-NMR		Version 3.5
$$ Fri Sep 23 13:11:57 2022 Russian Standard Time (UT+4h)  she@DPX200
##.OBSERVE FREQUENCY= 81.013821
##.OBSERVE NUCLEUS= ^31P
##.ACQUISITION MODE= SIMULTANEOUS
##.ACQUISITION SCHEME= undefined
##.AVERAGES= 24
##.DIGITISER RES= 16
##SPECTROMETER/DATA SYSTEM= spect
##.PULSE SEQUENCE= zgpg30
##.SOLVENT NAME= CDCl3
##.SHIFT REFERENCE= (INTERNAL, CDCl3, 0, 248.564)
##AUDIT TRAIL= $$ (NUMBER, WHEN, WHO, WHERE, WHAT)
$$ ##TITLE= Audit trail, XWIN-NMR		Version 3.5
$$ ##JCAMPDX= 5.01
$$ ##ORIGIN= Bruker BioSpin GmbH
$$ ##OWNER= she
$$ F:/spectra/data/she/nmr/P31/1/pdata/1/auditp.txt
$$ ##AUDIT TRAIL=  $$ (NUMBER, WHEN, WHO, WHERE, WHAT)
(   1,<2022-09-23 13:10:38.82 +0400>,<she>,<DPX200>,
      <created by zg, POWCHK disabled, PULCHK disabled
       configuration hash MD5:
       00 E9 B6 7A A2 85 ED C7 34 08 36 98 17 FE 4E 26
       data hash MD5: 32K
       5A FB 23 2E 96 B0 E5 20 A0 F2 1A A4 59 17 07 C0>)
(   2,<2022-09-23 13:11:03.62 +0400>,<she>,<DPX200>,
      <Start of raw data processing
       efp BC_mod = 2 LB = 1 FT_mod = 6 PKNL = 1 PHC0 = -10304.3 PHC1 = 149.8566 SI = 64K 
       data hash MD5: 64K
       F1 19 3C 2F 7D 6D 76 0C B2 02 33 54 BC 8C D4 3D>)
(   3,<2022-09-23 13:11:19.03 +0400>,<she>,<DPX200>,
      <pk PHC0 = 16.55157 PHC1 = 0 
       data hash MD5: 64K
       F6 C3 29 BB 3D 2B B5 61 B8 AD 75 B5 EE 13 6F 6C>)
(   4,<2022-09-23 13:11:22.06 +0400>,<she>,<DPX200>,
      <abs ABSG = 5 
       data hash MD5: 64K
       99 47 14 14 14 EA 61 EC 40 13 0B 15 A6 13 8C A6>)
$$ ##END=
$$ 
$$ hash MD5
$$ 90 CA B7 C4 92 3B 83 2C AD 1F 8A 64 24 81 7A AE
##$RELAX= 
##$RELAX= 
##$RELAX= 
##$RELAX= 
##$RELAX= 
##$RELAX= 
##$RELAX= 
##$RELAX= 
##$RELAX= 
$$ Bruker specific parameters
$$ --------------------------
##$DU= <F:/spectra>
##$EXPNO= 1
##$NAME= <P31>
##$PROCNO= 1
##$TYPE= <nmr>
##$USER= <she>
##$AMP= (0..31)
100 100 100 100 100 100 100 100 100 100 100 100 100 100 100 100 100 100 
100 100 100 100 100 100 100 100 100 100 100 100 100 100 
##$AQSEQ= 0
##$AQ_mod= 1
##$AUNM= <au_zg>
##$AUTOPOS= <>
##$BF1= 81.014009
##$BF2= 200.13
##$BF3= 200.13
##$BF4= 200.13
##$BF5= 200.13
##$BF6= 200.13
##$BF7= 200.13
##$BF8= 200.13
##$BYTORDA= 1
##$CFDGTYP= 0
##$CFRGTYP= 5
##$CHEMSTR= <none>
##$CNST= (0..31)
1 1 145 1 1 1 1 1 1 1 1 1 1 1 1 1 1 1 1 1 1 1 1 1 1 1 1 1 1 1 1 1 
##$CPDPRG= <waltz16>
##$CPDPRG1= <>
##$CPDPRG2= <waltz16>
##$CPDPRG3= <>
##$CPDPRG4= <mlev>
##$CPDPRG5= <mlev>
##$CPDPRG6= <mlev>
##$CPDPRG7= <mlev>
##$CPDPRG8= <mlev>
##$CPDPRGB= <>
##$CPDPRGT= <>
##$D= (0..31)
0 1 0 0 0 0 0 0 0 0 0 0.03 2e-05 3e-06 0 0 0 0 0 0 0 0 0 0 0 0 0 0 0 0 
0 0 
##$DATE= 1663924238
##$DBL= (0..7)
120 120 120 11 120 120 24 19 
##$DBP= (0..7)
150 150 150 150 150 150 150 150 
##$DBP07= 0
##$DBPNAM0= <>
##$DBPNAM1= <>
$$ [...]
##$SUBNAM3= <"">
##$SUBNAM4= <"">
##$SUBNAM5= <"">
##$SUBNAM6= <"">
##$SUBNAM7= <"">
##$SUBNAM8= <"">
##$SUBNAM9= <"">
##$SW= 501.771253377433
##$SWIBOX= (0..15)
0 1 3 0 0 0 0 0 0 0 0 0 0 0 0 0 
##$SW_h= 40650.406504065
##$TD= 32768
##$TD0= 1
##$TE= 0
##$TE2= 300
##$TE3= 300
##$TEG= 300
##$TL= (0..7)
0 120 53 12 22 120 120 120 
##$TP= (0..7)
150 150 150 150 150 150 150 150 
##$TP07= 0
##$TPNAME0= <>
##$TPNAME1= <>
##$TPNAME2= <>
##$TPNAME3= <>
##$TPNAME4= <>
##$TPNAME5= <>
##$TPNAME6= <>
##$TPNAME7= <>
##$TPOAL= (0..7)
0.5 0.5 0.5 0.5 0.5 0.5 0.5 0.5 
##$TPOFFS= (0..7)
0 0 0 0 0 0 0 0 
##$TUNHIN= 0
##$TUNHOUT= 0
##$TUNXOUT= 0
##$USERA1= <user>
##$USERA2= <user>
##$USERA3= <user>
##$USERA4= <user>
##$USERA5= <user>
##$V9= 5
##$VALIST= <valist>
##$VCLIST= <CCCCCCCCCCCCCCC>
##$VD= 0
##$VDLIST= <DDDDDDDDDDDDDDD>
##$VPLIST= <PPPPPPPPPPPPPPP>
##$VTLIST= <TTTTTTTTTTTTTTT>
##$WBST= 1024
##$WBSW= 4
##$XGAIN= (0..3)
0 0 0 0 
##$XL= 0
##$YL= 0
##$YMAX_a= 4794
##$YMIN_a= -5092
##$ZGOPTNS= <>
##$ZL1= 120
##$ZL2= 120
##$ZL3= 120
##$ZL4= 120
##$ABSF1= 248.5645
##$ABSF2= -253.2056
##$ABSG= 5
##$ABSL= 3
##$ALPHA= 0
##$AQORDER= 0
##$ASSFAC= 0
##$ASSFACI= 0
##$ASSFACX= 0
##$ASSWID= 0
##$AUNMP= <proc_1d>
##$AZFE= 0.1
##$AZFW= 0.5
##$BCFW= 0
##$BC_mod= 2
##$BYTORDP= 0
##$COROFFS= 0
##$CY= -3
##$DATMOD= 1
##$DC= 0
##$DFILT= <>
##$DTYPP= 0
##$F1P= 0
##$F2P= 0
##$FCOR= 1
##$FTSIZE= 65536
##$FT_mod= 6
##$GAMMA= 0
##$GB= 0
##$INTBC= 1
##$INTSCL= 6.834604e-11
##$ISEN= 30
##$LB= 1
##$LEV0= 0
##$LPBIN= 0
##$MAXI= 10000
##$MC2= 0
##$MEAN= 0
##$ME_mod= 0
##$MI= 50
##$NCOEF= 0
##$NC_proc= -5
##$NLEV= 6
##$NOISF1= 182.463
##$NOISF2= 159.3651
##$NSP= 0
##$NTH_PI= 0
##$NZP= 0
##$OFFSET= 248.5645
##$PC= 4
##$PHC0= -10287.75
##$PHC1= 149.8566
##$PH_mod= 1
##$PKNL= yes
##$PPARMOD= 0
##$PSCAL= 0
##$PSIGN= 0
##$REVERSE= no
##$SF= 81.0140089999694
##$SI= 65536
##$SIGF1= 159.3651
##$SIGF2= -187.1042
##$SINO= 113.3802
##$SIOLD= 16384
##$SREGLST= <1H.CDCl3>
##$SSB= 0
##$STSI= 65536
##$STSR= 0
##$SW_p= 40650.406504065
##$SYMM= 0
##$S_DEV= 0
##$TDeff= 32768
##$TDoff= 0
##$TI= <>
##$TILT= no
##$TM1= 0
##$TM2= 0
##$TOPLEV= 0
##$USERP1= <user>
##$USERP2= <user>
##$USERP3= <user>
##$USERP4= <user>
##$USERP5= <user>
##$WDW= 1
##$XDIM= 65536
##$YMAX_p= 287791481
##$YMIN_p= -15444431
$$ End of Bruker specific parameters
$$ ---------------------------------
##NTUPLES= NMR SPECTRUM
##VAR_NAME=  FREQUENCY,     SPECTRUM/REAL,   SPECTRUM/IMAG
##SYMBOL=    X,             R,               I
##VAR_TYPE=  INDEPENDENT,   DEPENDENT,       DEPENDENT
##VAR_FORM=  AFFN,          ASDF,            ASDF
##VAR_DIM=   65536,         65536,           65536
##UNITS=     HZ,            ARBITRARY UNITS, ARBITRARY UNITS
##FACTOR=    0.620285442955139, 1,           1
##FIRST=     20137.2065510682, 0,            0
##LAST=      -20513.1999529968, 0,           0
##MIN=       -20513.1999529968, -15444431,   0
##MAX=       20137.2065510682, 287791481,    0
$$ Real data points
##PAGE= N=1
##DATA TABLE= (X++(R..R)), XYDATA
$$ [...]
39566E43947k15153n69356m70427j81083j9443J46885M94396P18864M32884j48807
39556G32707m25565k12953Q4134P5271j54645k31593K0754L36043K99161n3273
39546D70041j57733K54632N66489R6854p18295q28369j97340J30207k22974l64311
39536i70799K16205O42656J67229m53173k44570K84365R8112m73704l53043K91312
39526g95410L37518k43551l58953J76686L21737k05347l33514M09668R60110N29947
39516G98891q0754L6121L66000N5539n10245m45332R6499L18465J33670rj05418
39505F63427m57423p34012m56620M5833J26361l3273J98365O40656N30132j10174
39495D13272m44645j94272L1914q3624p4335L28147O12296L05802k97472o22786
$$ plain form
39566 543947 328794 -240562 -710989 -892072 -911515 -764630 -270234 448630 881514 732707
39556 732707 307142 94189 178323 253594 98949 -132644 -111890 224153 523314 470041
39546 470041 312308 566940 1133429 1230283 511988 -316381 -513721 -383514 -606488 -970799
39536 -970799 -754594 -111938 55291 -397882 -642452 -358087 -259975 -733679 -1086722 -795410
39526 -795410 -457892 -701443 -1060396 -883710 -561973 -767320 -1100834 -691166 268944 798891
39516 798891 718137 754258 1120258 1175797 665552 220220 316719 635184 768854 768845 663427
39505 663427 206004 -528008 -984628 -938795 -812434 -845707 -647342 -6686 523446 413272
39495 413272 -31373 -225645 -193731 -277355 -351690 -23543 588753 894555 597083 -25703
39485b5703n15499j65869K08550L74681J94892r7945j11483J35149K44518O2238
39475C03529j75359k92528k78952m948N69380R37617N05081m31417q95359n64257
39465c27213j33948j28103j53688K44749P11281O25840L0534n07692o05131k52007
39455d95378L32566P03652M42926k67589p06958n21523j35765j0388k7503N4760
39445f31200J06792J4237K3900K39792K95379J2961j60404P6958K53191p7519
39435A54087m68408k98142J37277J45866j41976p2949K70496J88759l25769m83930
39425h94689l2930L23937J23971j57241j4174K63482J63584k49315n62098n63786
39415a599259k21480M00407Q80652O50814j54306n99414j51206N32776N31447
$$ plain form
39485 -25703 -541202 -707071 -498521 -123840 71052 -26893 -138376 -3227 241291 303529
39475 303529 128170 -164358 -443310 -448258 121122 1058739 1563820 1132403 237044 -327213
39465 -327213 -461161 -589264 -742952 -498203 213078 838918 869452 361760 -243371 -495378
39455 -495378 -162812 540840 983766 716177 9219 -512304 -648069 -658457 -685960 -631200
39445 -631200 -524408 -510171 -486271 -246479 48900 61861 -98543 -21585 231606 154087
39435 154087 -314321 -612463 -475186 -329320 -471296 -544245 -273749 -84990 -410759 -894689
39425 -894689 -927619 -603682 -479711 -636952 -651126 -387644 -224060 -473375 -1035473 -1599259
39415 -1599259 -1820739 -1420332 -539680 111134 -43172 -642586 -793792 -261016 270431
39406B70431r0535n52695m98725k18942R584J56512J54616k1509q1004K29634
39396f42633N81737M39786p1223k87114k2414J82264j1934k12797j9132K84017
39386B20557K13303j29873k85290j97161k12094m04062m18894o7723L35048L95686
39376e50503J28908j45501j97639k9004K20542L56486K43989k2278j72269j11969
39366b79238q1399k82455m94416l43009J13048M14004L69860L23176N39925O86286
39356I65782K98493m14365p09899k78173L46876M90996J20005l03648m70964m26718
39346c81615k81338p0579J09952J18736j5862r7319m5715J026m4530l1166J94453
39335e43957M76163M72194R6679l11921l46860l463K99800K03474j53780k89417
$$ plain form
39406 270431 179896 -372799 -871524 -1090466 -1080882 -924370 -769754 -791263 -872267 -642633
39396 -642633 -60896 378890 307667 20553 -1861 180403 168469 -44328 -63460 220557
39386 220557 433860 303987 18697 -178464 -390558 -794620 -1213514 -1281237 -946189 -550503
39376 -550503 -421595 -567096 -764735 -793739 -573197 -216711 27278 5000 -167269 -279238
39366 -279238 -360637 -643092 -1137508 -1480517 -1367469 -953465 -583605 -260429 279496 965782
39356 965782 1264275 849910 140011 -138162 208714 699710 819715 516067 45103 -381615
39346 -381615 -662953 -733532 -623580 -504844 -520706 -618025 -663740 -662714 -707244 -738410 -543957
39335 -543957 -67794 404400 501079 189158 -157702 -161165 138635 342109 188329 -101088
39325a01088J8355M34392M92662J79213j24369j87853j19099j7173J69124L07483
39315A051647M0899o00222r25890m17725M21541O46853J75125j80495j1739J38859
39305C38853j78367n03628k59878K46256L44277R9340P3850K45094O1989m64777
39295C009o53112k95846l4417k36016l23546K09635Q04967O15757j58264n32878
39285f00711j51788L38823L41519M2406q6090L4643J95484L03568L59535K61090
39275A038479o3248m16043m71640j61657K28273L78239K51969L9671j36594l18420
39265C69029m94113m69613j15387L71134O48064N95587L06213j45349o12378p07175
39255b53988j99434M47529M91032n8024m08527j62439J57788P4390p7029J12627
$$ plain form
39325 -101088 -82733 351659 844321 1023534 899165 711312 592213 575040 744164 1051647
39315 1051647 1092546 492324 -433566 -851291 -429750 217103 392228 211733 199994 338853
39305 338853 160486 -343142 -603020 -356764 -12487 86853 160703 405797 467786 3009
39295 3009 -650103 -945949 -980366 -1216382 -1539928 -1330293 -525326 90431 -67833 -600711
39285 -600711 -752499 -413676 -72157 -29751 -115841 -81198 114286 417854 777389 1038479
39275 1038479 975231 559188 87548 -74109 154164 532403 784372 824043 687449 369029
39265 369029 -125084 -594697 -710084 -338950 309114 904701 1210914 1065565 453187 -253988
39255 -253988 -453422 -5893 485139 427115 18588 -143851 13937 88327 11298 123925
39245A23925K80624o1824n40889m45933P5329K54995k2579j05022K68509N68467
39235C95602L91511K1909j42047r9156O757R6286j1796m22844p57888n32505J9240
39224a034931K03292m917O5261N20345N86230o9410o52240m63355L8964J11046
39214f99715p5385P2054M42065M62873Q7995k59002m23031m73847k31865M10797
39204f87061R53487Q32281L03918M7080Q0753j18414n53310o36601k18700J41308
39194A44741R8027j0296J53055L89252L89367J91852m1309k86134m72752m12183
39184A43620j15705J16116Q6136p1930j52764j15851n563J24146J73747R0375
39174B72327l2705j17340k21352l11628j83840J14107J38278k62979n20656j59279
$$ plain form
39245 123925 404549 342725 -198164 -644097 -568768 -313773 -336352 -441374 -172865 395602
39235 395602 787113 809022 666975 567819 574576 670862 659066 236222 -521666 -1054171 -1034931
39224 -1034931 -831639 -836556 -771295 -250950 335280 265870 -386370 -849725 -810761 -699715
39214 -699715 -775100 -703046 -260981 201892 289887 30885 -392146 -865993 -1097858 -687061
39204 -687061 266426 1098707 1402625 1449705 1530458 1412044 858734 222133 3433 144741
39194 144741 242768 232472 385527 774779 1164146 1355998 1314689 1028555 555803 143620
39184 143620 27915 144031 230167 158237 5473 -110378 -115941 8205 181952 272327
39174 272327 239622 122282 -99070 -410698 -594538 -480431 -342153 -605132 -1125788 -1285067
39164a285067L69903L78303Q3222J85549N94530O03932J98317M7492J77452j26243
39154A227390q55520r86598j46188O11053L96645j84808j59035K68297K89294
39145D60530o3473j31402J35717J85529j14010l53837l76333m12208m73550k87538
39135a430575J50529M99818N66926M71502L62767K88082K36817R0460k43399m85905
39125E07022k06153L82941M48410k38423p69778l88711L45752M47607k7618l13648
39115A87401k55551k75715l43254o1421L66478L16695j37668k89750j1762P6860
39105d27687k41533m26569j69087J52153K42772L04449M31598L69503J10527p670
39095C38456R066k07249n52157m53742O5418K50306j42947m02717p8944K87262
$$ plain form
39164 -1285067 -915164 -536861 -453639 -268090 326440 930372 1128689 1176181 1353633 1227390
39154 1227390 371870 -614728 -760916 -149863 246782 61974 -97061 171236 460530
39145 460530 397057 265655 401372 586901 472891 119054 -257279 -669487 -1143037 -1430575
39135 -1430575 -1280046 -780228 -213302 258200 620967 909049 1145866 1236326 992927 507022
39125 507022 300869 683810 1132220 893797 124019 -264692 81060 528667 501049 187401
39115 187401 -68150 -343865 -687119 -748540 -382062 -65367 -203035 -492785 -504547 -427687
39105 -427687 -669220 -1095789 -1264876 -1112723 -869951 -565502 -133904 235599 346126 338456
39095 338456 347522 140273 -411884 -865626 -800208 -549902 -692849 -1095566 -1174510 -887248
39085h87248J71902q5479m1734Q4662N0762J67697N40368N49562j05401o31997
39075a86906l10876K99318L14873j8349L5002K27535j58262p32026m15765O44785
39065c00671J059242K90249n73506n55643r5495j7185k27943k01103J6571P4284
39055e31200N6178K12688L31515N5313m15784n34435j79666K58417M54493M00784
39045A08303J88300q2948k32032j59059m5237j26467l08512k58926J24246N42494
39035b49838O22828K95121j57201l66518k45834r4006k18330m61553l38407K81961
39025i31777R02447R78219N31122j8593l79429m66190k03871L20980O35226K84766
39015A652900m98358r58177p39927k47234N3553K09590L82313L57561m1293l90791
$$ plain form
39085 -887248 -715346 -800825 -842559 -757897 -707135 -539438 930 550492 445091 -186906
39075 -186906 -497782 -198464 116409 98060 133062 360597 202335 -529691 -945456 -300671
39065 -300671 758571 1048820 475314 -80329 -175824 -193009 -420952 -622055 -605484 -531200
39055 -531200 -475022 -262334 69181 124494 -291290 -825725 -1005391 -746974 -292481 108303
39045 108303 296603 213655 -18377 -177436 -222673 -349140 -657652 -916578 -792332 -249838
39035 -249838 372990 668111 510910 144392 -101442 -195448 -413778 -875331 -1213738 -931777
39025 -931777 -29330 948889 1480011 1461418 1081989 615799 411928 732908 1368134 1652900
39015 1652900 1154542 196365 -543562 -790796 -737243 -527653 -145340 212221 170928 -219863
39005b19863j54938M18380N63140J39366k03099j15264j8296j80300j50463L18894
38995C97557N52207j4244o81396m21474M09718N00773l55209q97868l42081N20466
38985c31551O81986L26080J54484J72463n03k44280k31139j45880l02559m28101
38975c49000j21660L08768K79516p0264j31578J30030K05360k9231k29773l23635
38965c31467m97408n19594L0182Q23638R86999L93100j22747o2964Q1591j85997
38955E95333n59218n58208k69189L3613L85366P42446O67321k4647p47558q27842
38945e62583l55849J18349L67209M66972L61674J7383k44690j29085R7947k1656
38935A15671l69155l81692R0931N52674N37375J33162k53070l62576k20281m019
$$ plain form
39005 -219863 -374801 43579 606719 746085 542986 427722 409426 229126 78663 397557
38995 397557 949764 935520 254124 -167350 242368 743141 387932 -509936 -852017 -331551
38985 -331551 350435 676515 830999 1003462 1002959 758679 527540 381660 79101 -349000
38975 -349000 -470660 -161892 117624 47360 -84218 45812 251172 221941 -7832 -331467
38965 -331467 -828875 -1348469 -1318287 -494649 492350 885450 762703 699739 781330 595333
38955 595333 36115 -522093 -791282 -757669 -372303 370143 1037464 1012817 265259 -562583
38945 -562583 -918432 -800083 -432874 34098 395772 413155 168465 39380 137327 115671
38935 115671 -253484 -635176 -544245 8429 545804 678966 425896 63320 -156961 -160980
38925a60980J22803J17919K2664j52139l76386m60563k17283J78347K83305k6167
38915f68480l45790k80697Q7355M29103N56582M08877K905l72590k88094K09185
38905b61644M83331J67310k42621r0578M74192P63300N38721J65224r0403l24987
38895A581845n64690n94505l36319j6465J44686J29149j0943j90735k03722Q3382
38885B1683M22532L91526k2627l41596k12483J32800K01240j12547l90845k43146
38875a53463J24405J16376l70106n92261P2202J021596J026693p887p63806l85979
38865H7770K76094P3950n87268m52509M69449Q46749J01645p36201o47114k3794
38855e91229J70226j56427l64164j59027J90270M38837N65144N23323K78613K2710
$$ plain form
38925 -160980 -38177 79742 102406 -49733 -426119 -886682 -1103965 -925618 -642313 -668480
38915 -668480 -1014270 -1294967 -1207612 -778509 -221927 186950 189855 -182735 -470829 -261644
38905 -261644 221687 388997 146376 55798 529990 1293290 1832011 1997235 1906832 1581845
38895 1581845 1017155 422650 86331 69866 214552 343701 332758 142023 -61699 21683
38885 21683 444215 835741 813114 471518 259035 391835 593075 480528 89683 -153463
38875 -153463 -29058 87318 -282788 -875049 -802847 218749 1245442 1237555 473749 87770
38865 87770 363864 437814 -149454 -601963 -132514 714235 815880 79679 -567435 -591229
38855 -591229 -421003 -577430 -941594 -1100621 -910351 -471514 93630 616953 895566 918276
38845I18276j4059Q3026L5305j95427l36573j68500J88528L67668J24855l32182
38835F70917m76629j03401K97491J38628m02533n98988k42636R5578K0998j15278
38825g15853N7708K50065Q3127j57531p21L23285K09753k80289m67627j37856
38815h35939J68564J03143L3047K85760M98637K39902j78570j48369K27931K77127
38805F71233j31637l35952L9633M10727J11226n42193p07737k67512J19683J43693
38795d88836K03899M67464M06785k37599p45179l89437L74111N36978N7061j75478
38785I769J90022M86788J98946k67910l59415k02337j88333k75058j98863J1144
38775e95247J68047K55004K75094J23810q0398L3723M31274M74748j29253o77607
$$ plain form
38845 918276 904217 987243 1022548 827121 490548 322048 510576 878244 1003099 670917
38835 670917 194288 90887 388378 527006 124473 -474515 -717151 -621573 -600575 -715853
38825 -715853 -658145 -408080 -324953 -482484 -483205 -159920 49833 -230456 -698083 -835939
38815 -835939 -667375 -564232 -531185 -245425 253212 493114 314544 166175 394106 671233
38805 671233 539596 203644 243277 654004 765230 223037 -484700 -752212 -632529 -488836
38795 -488836 -284937 182527 589312 351713 -393466 -782903 -408792 128186 185247 9769
38785 9769 199791 686579 885525 617615 258200 55863 -132470 -407528 -606391 -595247
38775 -595247 -427200 -172196 102898 226708 146310 180033 611307 1086055 956802 279195
38765B79195m09964K94837M38481j09971m93617k14936K27332K45650m744o0301
38755A91962J05203J86460P6578q2052j92538k59531k61873j76278m8737Q7486
38745c73320K64746M43559M45052J70381j83269k92641j13225K4035j62605m57281
38735b34568l55680J97109N75090K78588k80213l12700J45723K67086k31495n77647
38725e28707j73610M13271L57018j17971j78754K33169L79757l7411m74501m19397
38715e47136L2694N15355O89083K63467o01738j021115l23902P82824R40934Q8309
38705H18775m11337J50458P95143M87597k94130m89071j07464N1583k24183m49679
38695C27692l66721j27923J80789M71307L98971j29215n31915l46283l1675j78502
$$ plain form
38765 279195 -130769 164068 602549 492578 -1039 -215975 11357 257007 252263 191962
38755 191962 297165 483625 560203 478151 285613 26082 -235791 -412069 -460806 -373320
38745 -373320 -108574 334985 780037 950418 767149 474508 361283 385318 222713 -234568
38735 -234568 -590248 -393139 181951 460539 180326 -132374 13349 280435 48940 -528707
38725 -528707 -702317 -289046 67972 -49999 -228753 4416 384173 346762 -127739 -547136
38715 -547136 -514442 913 689996 953463 351725 -669390 -993292 -210468 730466 818775
38705 818775 407438 557896 1353039 1840636 1546506 1057435 949971 1001554 777371 327692
38695 327692 -39029 -166952 13837 485144 884115 754900 222985 -123298 -154973 -333475
38685c33475l92360j221N20257J22661r41599j205156j65698R35613R75931L99881
38675h5166J59544K58447J85349k5428p7300j56416n14134p62538m34814J13775
38665a338681K05848l6595O7244N56319P44421L43930j40632k83762k83830l88707
38655e54445l87353l1999M47625O00512K88266k53870o78639p06572k80416L02281
38645a254610N98888M81884K23354P3144m750r0064q0452J05746K97134K46242
38635E96516n4648l61641m02490o8726M50927O75698K25868o22648j029050n18784
38625a108978L56299O54175K34595j60171o1173P9522k47559o20099k48912O90881
38615d31420J126351N92259j49709l51197l21406n76489o79836M2154J047879
$$ plain form
38685 -333475 -725835 -727056 -206799 -84138 -1025737 -2230893 -2396591 -1460978 -485047 -85166
38675 -85166 74378 332825 518174 492746 415446 259030 -255104 -1017642 -1452456 -1338681
38665 -1338681 -1132833 -1169428 -1102184 -545865 198556 542486 401854 118092 -165738 -554445
38655 -554445 -941798 -973797 -526172 74340 362606 108736 -569903 -1276475 -1556891 -1254610
38645 -1254610 -655722 -173838 49516 122660 117910 27846 -52606 53140 350274 596516
38635 596516 541868 180227 -222263 -290989 159938 835636 1061504 438856 -590194 -1108978
38625 -1108978 -752679 -98504 136091 -24080 -85253 -5731 -253290 -873389 -1122301 -431420
38615 -431420 694931 1287190 1137481 786284 464878 -111611 -791447 -749293 298586
38606B98586J077956P6759o19723k88719J94018o2997n31216l08006K87641K86370
38596D10669l01887n67303j55282L81932N66600M10907m4247o90643r29315k59927
38586a178496O91046P49244p6846n13171N8080P09525N08760j17202l07011j40775
38576C83154j54161j90043J84431N74521K27177n70625p01137P4859O67707K73550
38566G69433m63216n01392M7239K15358k83003o59678k80164M20163O24186K74497
38556A63423j1957L9819N0223k48998n11252l16835K07464O35047P45833M76929
38546A229696j89492q63301p74562J99125R80336N78821m27067o73205k3409L83588
38536D20530O9990j46051K39011N18800J38464k53590N372L61169K1402o39085
$$ plain form
38606 298586 1376542 1453301 833578 544859 738877 675880 144664 -163342 124299 410669
38596 410669 108782 -458521 -613803 -231871 334729 745636 701389 10746 -918569 -1178496
38586 -1178496 -487450 261794 184948 -328223 -270143 439382 948142 830940 523929 383154
38576 383154 228993 38950 223381 797902 1025079 454454 -246683 -171824 495883 769433
38566 769433 306217 -195175 -147936 67422 -215581 -875259 -1155423 -735260 -111074 163423
38556 163423 151466 191285 241508 -7490 -518742 -835577 -628113 6934 752767 1229696
38546 1229696 1040204 176903 -597659 -398534 581802 1160623 733556 60351 36942 420530
38536 420530 490520 344469 583480 1102280 1240744 987154 992526 1353695 1375097 736012
38526G36012p31858k88594L1829J42976L47136M06206m8020n03856j59076O70447
38516F03202R04280L61550j05411j29071k51024o68851p67618k67749K17088K12419
38506A08815M8764N4486k9242l30645l83094M4795L89928J72991k09454j89673
38496c22329N3705L4338j69758j49612Q8322K22822J92021J40965N0592j14429
38486B6637j52673L9571J63263j6446k02218m3734K06089O3714l58496m69051
38476g43344o3864M24595N38453K53482j65684m25391l33635K1360K42098M9464
38466b02466k88771k38780K75963O90034M38409l40341q61210n11223L98277Q79167
38456B39059M22184l40090m82523m8327J57048q3995j11111L67431O53316K04016
$$ plain form
38526 736012 4154 -284440 -252611 -109635 237501 643707 595687 91831 -67245 603202
38516 603202 1507482 1869032 1763621 1634550 1383526 714675 -52943 -320692 -103604 108815
38506 108815 157579 212065 182823 -147822 -530916 -486121 -96193 76798 -132656 -322329
38496 -322329 -268624 -234286 -404044 -553656 -465334 -242512 -50491 90474 141066 26637
38486 26637 -126036 -86465 76798 60352 -141866 -185600 20489 84203 -274293 -743344
38476 -743344 -807208 -382613 155840 409322 243638 -181753 -515388 -494028 -251930 -202466
38466 -202466 -491237 -730017 -454054 235980 674389 334048 -527162 -1038385 -640108 239059
38456 239059 661243 321153 -161370 -209697 -52649 -136644 -247755 119676 772992 977008
38446I77008l86294k95290K25479L08930j61012n30011m94143l53192k30887P9863
38436h59549M34756L39158j68602l81450L6069N23034M87690J14922j09982j70584
38426B45462k89527l10365P9708O65697Q20128L51409k01252k75758J3495J09272
38416A208269k06329n25129l64806J57340M03495j94o42167p66786j69383N54807
38406c50883O84916J34013n28122o81362k07367M56185P16788L54012k62108n28814
38396b12742k61798R1062J4732l79675m82838m7546M08002L06981j50752l00179
38386a014753k2388J42289l8221p9372L20780O09445K05727m77205n91224j32522
38376a077444J78433J37985K35317N42285M36832k37708o65433k65065L52285
$$ plain form
38446 977008 590714 295424 520903 829833 668821 138810 -355333 -708525 -939412 -859549
38436 -859549 -424793 -85635 -254237 -635687 -599618 -76584 411106 526028 416046 245462
38426 245462 -44065 -354430 -274722 390975 1211103 1562512 1361260 1085502 1098997 1208269
38416 1208269 1001940 476811 112005 269345 672840 672646 30479 -736307 -905690 -350883
38406 -350883 334033 468046 -60076 -741438 -948805 -492620 224168 578180 316072 -212742
38396 -212742 -474540 -383478 -368746 -748421 -1231259 -1278805 -870803 -563822 -714574 -1014753
38386 -1014753 -1037141 -894852 -933073 -1012445 -691665 -82220 123507 -353698 -944922 -1077444
38376 -1077444 -899011 -761026 -525709 16576 453408 215700 -449733 -714798 -362513
38367c62513L15830j93282l29115R1424M23982K20787k31702m05512j14409L96357
38357a88153O56773L65776k08831m44474j83438K6129j91599l93654n7786M53947
38347a65310L66630k96411p00403l68784K63977N39711L06206j33934l94853k50222
38337h33393J73703M27340K24523j75331l39282k37690j01037P0741L78255N83094
38327A70923L63503p1854k01570o718J7906k79344m40507j63047K07347K24713
38317a78648k6383j50744j5377J73729K12167J13666M0418Q6866J23251n1971
38307C26974l49897m06852j18911J33398N6649q9996L2620K51082K34940J08592
38297A78599J30195Q4743k91877n60635j23656O18714O42503j11604n53122j09778
$$ plain form
38367 -362513 -46683 -239965 -569080 -477656 -53674 167113 -64589 -470101 -584510 -188153
38357 -188153 468620 834396 625565 181091 -2347 23782 -167817 -561471 -619257 -165310
38347 -165310 201320 -95091 -795494 -1164278 -900301 -360590 -54384 -188318 -583171 -833393
38337 -833393 -659690 -232350 -7827 -183158 -522440 -760130 -861167 -790426 -412171 170923
38327 170923 534426 462572 261002 254284 272190 -7154 -447661 -610708 -403361 -178648
38317 -178648 -205031 -355775 -371152 -197423 14744 128410 168828 255694 378945 326974
38307 326974 -22923 -429775 -548686 -415288 -358639 -448635 -416015 -164933 70007 178599
38297 178599 308794 393537 101660 -458975 -582631 36083 678586 566982 13860 -95918
38287i5918M32089K46107k84327l30628P1610K82179J57195Q0721J47739N6529
38277G63296k56808m78697m30257k66030j35767p924J37964K17496J67156n128
38267b94699k42554l80025k10859J97005M17843J54528l10616m18046j4085N19619
38257e81889P69831O58253L05014j77083o15411p26788l89280Q7410K20086m5501
38247d95358k27141K4835L90318L39536m5869j89119R0014L62288L51859K94910
38237H96273L33470K19216n3887m9361K16632o790r02597j351830n06614O49928
38227e55560O14942l01949n01565K92840O77519j063o00930j86443M75182L51088
38217B64061j84426k11774J66784K71008J36157K21857L37277l2902o33778o93096
$$ plain form
38287 -95918 336171 582278 297951 -32677 38933 321112 478307 559028 706767 763296
38277 763296 506488 27791 -402466 -668496 -804263 -812187 -674223 -456727 -289571 -294699
38267 -294699 -537253 -917278 -1128137 -931132 -513289 -358761 -669377 -1087423 -1101508 -581889
38257 -581889 187942 846195 1151209 974126 358715 -368073 -757353 -669943 -449857 -495358
38247 -495358 -722499 -697664 -307346 32190 -13679 -202798 -112784 249504 601363 896273
38237 896273 1229743 1448959 1395072 1345711 1562343 1555553 652956 -698874 -1205488 -555560
38227 -555560 59382 -242567 -744132 -451292 226227 225164 -375766 -562209 -87027 264061
38217 264061 79635 -132139 34645 305653 441810 663667 1000944 968042 334264 -358832
38207c58832j37542L11213K12232j40747l21691k24919P5705M19191N14394J94580
38197E43584l08136n98878n22507j80754J98034K84234o5746m14614j58922M99033
38187g24672O73066J42071k56518j0636K34332r2703l83092N8948O50048M39820
38177G30664k38495l37024J10245J40760l94924o48394l42477j60604l61595k97683
38167a799527K95734P00045M30815M0456J04616K94421J28368j07054P1803M25604
38157E85281L82364l5650l31373l11663j86633j00027n3909j39705m01537n78542
38147a171394l68482J10148M25732L62881J04476p5316r0919j7884O7120J68172
38137d85466L07470L95144K57657j07898m12991l73767m9806K69455M03710L28329
$$ plain form
38207 -358832 -496374 -185161 27071 -113676 -435367 -660286 -584581 -165390 349004 543584
38197 543584 235448 -363430 -885937 -1066691 -868657 -584423 -650169 -1064783 -1223705 -724672
38187 -724672 -51606 90465 -166053 -176689 57643 -35060 -418152 -359204 290844 730664
38177 730664 492169 155145 265390 406150 11226 -637168 -979645 -1140249 -1501844 -1799527
38167 -1799527 -1503793 -803748 -372933 -332477 -227861 66560 194928 87874 159677 585281
38157 585281 967645 931995 600622 288959 102326 2299 -51610 -191315 -592852 -1171394
38147 -1171394 -1539876 -1429728 -1003996 -641115 -536639 -611955 -702874 -720758 -653638 -485466
38137 -485466 -177996 217148 474805 366907 -46084 -419851 -469657 -200202 203508 531837
38127E31837M6539l23348m74182k28575J60364L00808J40950j05829l28735m77154
38117g57325l50965J38882O31724O71847L11238k9790j63274j84870j19310k598
38107A45559j15248n62788q13134l19729N24293P92663L30108j35737j94963k02698
38097e51674l77769l44007R0493M70244M21665J94262Q6384l9228k63816k60482
38087e73928J05726L88121K40812k6020l1271N8936j6362o2528J28241K63566
38077D75293N1660k23166k08398j32269l11992m35058o7434M46813L95825j70205
38067a78931m98838k51380J67698L76059M01671K67245j15455n04531m27188P7449
38057f86201L87196J97359n0545P6085L29053K44469j27738l91692m16963l50136
$$ plain form
38127 531837 578376 255028 -219154 -447729 -287365 13443 154393 48564 -280171 -757325
38117 -757325 -1108290 -969408 -337684 334163 645401 615611 452337 267467 148157 145559
38107 145559 30311 -532477 -1345611 -1665340 -1141047 -348384 -18276 -154013 -348976 -551674
38097 -551674 -929443 -1273450 -1182957 -712713 -291048 -96786 -10402 -49630 -313446 -573928
38087 -573928 -468202 -80081 160731 134711 103440 162376 146014 83486 211727 475293
38077 475293 526953 303787 95389 -36880 -348872 -783930 -851364 -404551 -8726 -178931
38067 -178931 -677769 -929149 -761451 -385392 16279 283524 168069 -336462 -763650 -686201
38057 -686201 -299005 -101646 -152191 -76106 252947 497416 369678 -22014 -438977 -789113
38047g89113k11196Q4065L89642M31025K43665J45784K19816J76050j29074l75777
38037A84887k39081R2732K04023R5915J22095L20250K92365j15040m74477l92615
38027I1054o2909J42924K55779M31192M43852N6014l60352k65964J21968J26578
38017I80136k05567j29177M18787M58998n02425j461207j199114L4020R60499
38008f45050R66765M81552m3669n59688q55310n12803L12645P88933M41889k19641
37998A55623m47488j88489R2269J73241K13945K85420J91367j71026n22666m53058
37988f70862N9301N11923M14260o9043k68773Q6174M43693K06937l64401n32117
37978a82908j89768M8072j00411j52314K27480N42543K34641l44946m22965P640
$$ plain form
38047 -789113 -1000309 -916244 -526602 -95577 148088 293872 513688 689738 560664 184887
38037 184887 -54194 38538 242561 338476 460571 780821 1073186 958146 483669 91054
38027 91054 28145 171069 426848 858040 1301892 1357906 997554 731590 853558 980136
38017 980136 774569 645392 1064179 1523177 1020752 -440455 -1639569 -1605549 -645050
38008 -645050 321715 803267 759598 199910 -655400 -1168203 -855558 -66625 375264 155623
37998 155623 -291865 -480354 -388085 -214844 -899 284521 475888 304862 -217804 -670862
37988 -670862 -611561 -99638 314622 245579 -23194 62980 506673 713610 349209 -182908
37978 -182908 -372676 -324604 -425015 -577329 -349849 192694 427335 82389 -340576 -332936
37968c32936K38367M014j97041o4956J1391k17745k72835K24780P05079M09526
37958E07644l49980n60426j0227M65902L08851p9494k09135j99892k00440P1309
37948b55888O24096P64600J12711n70776m30345J17447N8461n32746o21923N6910
37938f77453N67064K70236k63359k37886K92412P58677Q33110M72810k04544p64371
37928A046696p36027l07408j38391k90420j11049N31808Q11301K48102m31098
37919F23514m34378r7091j05145k55430J4566M25393K85038k35973l64076o3623
37909b07205k8858l89112m93955r5871K57409K43704K60938N63213P17925L59882
37899A188070j74300m12855m07629m02807l22785k9403K83363L58038K53084J39208
$$ plain form
37968 -332936 -94569 -90555 -287596 -352552 -341161 -558906 -831741 -606961 98118 507644
37958 507644 157664 -402762 -412989 52913 361764 282270 73135 -126757 -327197 -255888
37948 -255888 368208 1132808 1245519 674743 244398 361845 420306 -112440 -734363 -677453
37938 -677453 -110389 159847 -103512 -341398 -48986 709691 1542801 2015611 1811067 1046696
37928 1046696 310669 3261 -135130 -425550 -536599 -4791 806510 1054612 623514
37919 623514 189136 92045 -13100 -268530 -253964 171429 456467 220494 -143582 -207205
37909 -207205 -236063 -625175 -1119130 -1215001 -957592 -713888 -452950 110263 828188 1188070
37899 1188070 1013770 600915 193286 -209521 -532306 -561709 -278346 79692 332776 471984
37889D71984Q653j26745o4288K35290L99154J04154m07254o04130l32562P1547
37879b44197K39672J14828q8328j00667J53237M19655L35722j33994o13097p27252
37869f44421m49701p920L31929L45997O969l37420k47551J87107L40081r5199
37859e70129n74153m09179K30379N22638J45289k85977r2405N52839Q97509N85103
37849A001914m994l58252m12012l93545l43967j14700K46064M40787L28497J08260
37839D98052k7888j59625l63466m32957j72957K02444L07952J28009j8087R739
37829b8784N4945M6392J06994K20497J78472j1211m1098J72547K47680q5596m70397
37818C90441l80989Q9160L39016J17459j66551r4509J76763K13009p1916l87825
$$ plain form
37889 471984 480637 353892 289604 524894 924048 1028202 620948 16818 -315744 -244197
37879 -244197 -4525 110303 21975 -78692 74545 494200 829922 695928 82831 -644421
37869 -644421 -1094122 -1102042 -770113 -424116 -417147 -754567 -1002118 -815011 -474930 -570129
37859 -570129 -1144282 -1553461 -1323082 -800444 -655155 -941132 -1033537 -480698 416811 1001914
37849 1001914 996920 638668 226656 -166889 -510856 -625556 -379492 61295 389792 498052
37839 498052 470164 310539 -52927 -485884 -658841 -456397 -148445 -20436 -38523 -28784
37829 -28784 26161 72553 179547 400044 578516 567305 526207 698754 946434 860838 390441
37818 390441 9452 98612 437628 555087 388536 294027 470790 683799 611883 224058
37808B24058n29811n36859m08984k4960N11542P43701L68592k81639n80793l73655
37798h88808q0294l1470o3109Q8754L17734L37513J42006j4998j1914K9743J4131
37787a60712K8410J62316L05703K48986j1666j76658m071K46141K7455o43745
37777B2159r08193j12587J077639J303357K94514p07026n98650J89077M58300
37768A018590j18618p71720p65950j64397M32700M75384j08693p60950p51071
37759a514725n3437N45596N03637K19536K35208K98582o8852n28230l58906K97861
37749d23730N80172K31603j31177j19849l2628n8333Q3952M27264M92563J03176
37739A153013k50001k20854j08779j79672j79196M0505Q9408k39463m47342j30620
$$ plain form
37808 224058 -305753 -842612 -1251596 -1276556 -765014 -21313 347279 65640 -515153 -888808
37798 -888808 -969102 -1000572 -1063681 -974927 -657193 -319680 -177674 -192672 -204586 -174843 -160712
37787 -160712 -132302 30014 335717 584703 573037 396379 392308 638449 665904 22159
37777 22159 -886034 -998621 79018 1382375 1676889 969863 371213 560290 1018590
37768 1018590 899972 128252 -637698 -802095 -369395 105989 -2704 -763654 -1514725
37759 -1514725 -1568162 -1022566 -518929 -299393 -64185 234397 165545 -362685 -721591 -423730
37749 -423730 156442 388045 256868 137019 104391 46058 130010 557274 1049837 1153013
37739 1153013 903012 682158 573379 393707 214511 255016 344424 104961 -342381 -473001
37729d73001K58894J34740k17067j15063L58978M80815L6731l82899k87792J03255
37719a02409K90742J21116j49402j76821J29921M56147L68516j13716m55852l13742
37709E4500r493Q78j70304j03472J84832K65720l304k67668k07471P3131K61224
37698G8573J93739m8149k37974j96982J0012J43966J15365O2386M2157o8488k37892
37687a43287k10328J6640N9793j99541k92932O6675L64294N8150m07182j67063
37677h54781O59091R98900L34150o04792q78305m22569J90318N22110M61147R1251
37667D96520k77540k66451J00773L58520K29735l1000j23399j42089k45089k58680
37657a58700j832K79836K34204k8711j16274Q780Q513k11974k80103J04627O80072
$$ plain form
37729 -473001 -214107 -79367 -296434 -411497 -52519 428296 465027 82128 -205664 -102409
37719 -102409 188333 309449 160047 -16774 113147 569294 937810 824094 368242 54500
37709 54500 45007 45885 -124419 -227891 -43059 222661 219357 -48311 -255782 -182651 78573
37698 78573 272312 224163 -13811 -210793 -200781 -56815 58550 120936 163093 94605 -143287
37687 -143287 -353615 -336975 -277182 -476723 -769655 -702980 -338686 -280536 -687718 -854781
37677 -854781 -195690 803210 1137360 532568 -345737 -768306 -577988 -55878 405269 496520
37667 496520 218980 -47471 53302 411822 641557 610557 487158 345069 99980 -158700
37657 -158700 -160532 119304 353508 324797 208523 217303 225816 13842 -266261 -161634 518438
37646E18438Q70292M26317l04320p22726n45887l4834L29916L48976J99272Q7040
37636A172484J3170o7817r4068n6912j13424l26289m52696k49122J22725K69035
37626B17086P9189k02473l62435l70131j85937K01271N02935L23729k17997m87554
37616e02317k10397P4207j64975n61478l65393L77105Q42323O09320J42372m2834
37606A97933l2866m8767N1891L47233M31752l89n02904m18269J50293N10765L82881
37595A069553J12862m0901j88443l28340k25765O1047J05803j93487l58271n7607
37585d3549L64486M31786K11950O7414N1738l1119j89636k70236k81560l41153
37575b9879l95946l09827j58219j39501k16975j11731L00772P49518P97355K99639
$$ plain form
37646 518438 1388730 1815047 1510727 788001 242114 207280 537196 886172 1085444 1172484
37636 1172484 1185654 1117837 1023769 966857 853433 527144 74448 -174674 -51949 217086
37626 217086 296275 93802 -268633 -638764 -824701 -623430 -120495 203234 -14763 -502317
37616 -502317 -712714 -638507 -803482 -1364960 -1730353 -1353248 -510925 98395 240767 197933
37606 197933 165067 116300 168191 515424 947176 946787 443883 25614 175907 686672 1069553
37595 1069553 1182415 1141514 953071 624731 398966 460013 565816 372329 14058 -43549
37585 -43549 320937 752723 964673 1032087 1083825 1052706 863070 592834 311274 -29879
37575 -29879 -425825 -735652 -893871 -1033372 -1250347 -1362078 -1061306 -311788 485567 785206
37565G85206l57820n63208j62418K70430J25124l68705l97291K60797Q38201N95541
37555A025857k31783q43956q46672m30762P6076M03778L43004j8863k49949j07491
37545h80761J20693J43612J84825M98774P28229L97525j87028k89368O7653O7892
37535H52046o00588j168667q58269N2059O78930O49185L03269L8501q7587j65286
37525c06407k09802j99580j48651o9015O2394K52913M24102M34322K32952k1209
37515D52019j09078k6838M6680O4642J43471K32600J01455k07438l26563j93377
37505A77573k41650n93743o20059Q9772Q23073O48912j16420l41344J61821M05071
37495C93006j27818p02673n92205j30402N7312N0923J92575L25269J98415R0216
$$ plain form
37565 785206 427386 -135822 -298240 -27810 97314 -271391 -668682 -407885 430316 1025857
37555 1025857 794074 -49882 -896554 -1327316 -1251240 -847462 -504458 -523321 -773270 -880761
37545 -880761 -760068 -616456 -431631 67143 795372 1192897 1005869 716501 784154 852046
37535 852046 251458 -917209 -1775478 -1723419 -1044489 -395304 -92035 -53534 -141121 -306407
37525 -306407 -516209 -715789 -864440 -933455 -871061 -618148 -194046 240276 473228 452019
37515 452019 342941 316103 362783 427425 570896 803496 904951 697513 370950 177573
37505 177573 -64077 -657820 -1277879 -1188107 -365034 283878 167458 -173886 -12065 393006
37495 393006 265188 -437485 -1029690 -1160092 -1102780 -1051857 -859282 -534013 -335598 -245382
37485b45382K94200M46143J16489l25281k47173J53820J61704k43937l86325o5932
37475c41674J69517M9718M159K77782M18083P5251l51496l87702k50337l37548
37465f74247m01129L4582O70610O64489r4758o85387l93544L53587P11535N78262
37455G64000M35248L54090n4277p02417q60748k67359K92579R5365l71986j51662
37445d67167O30793R01530K82910l90968m31455k03839k10190j71090K42852N10883
37435F94259M2669o45820n83838J04955L90111j0358k82613K7806L17298Q4764
37425A39233j92197M4509M36735L32158j49353l86687k16884J8921J05421O9124
37415B00980q4887k70276k33867m968m5249m66892n98909M015O26727L49479m49403
$$ plain form
37485 -245382 48818 494961 611450 286169 38996 192816 354520 110583 -275742 -341674
37475 -341674 -172157 -122439 -118280 159502 577585 652836 301340 -86362 -336699 -674247
37465 -674247 -1075376 -1040794 -370184 294305 199547 -485840 -879384 -525797 185738 764000
37455 764000 1199248 1553338 1499061 796644 -64104 -331463 -38884 56481 -315505 -467167
37445 -467167 163626 1065156 1348066 957098 525643 321804 111614 -59476 183376 694259
37435 694259 736928 91108 -492730 -387775 2336 -8022 -290635 -262829 54469 139233
37425 139233 -52964 -8455 428280 760438 611085 224398 7514 26435 131856 200980
37415 200980 116093 -154183 -388050 -393018 -438267 -905159 -1504068 -1500053 -873326 -523847 -973250
37404i73250n94130Q3235N70031L13348j07195j34714L3988J79914M62813P02737
37394E36777L30209m65649o46276K2950M12827q9644m23825K81405R32526J49363
37384A040663j233089j258414O9235Q42936L00682k56917Q2321M80246J72020
37375B39683j51830J57849L60106k59712q75752m42260M33950M49134k43937l90801
37365g23570K29924N67749J48204k64338r8258J37940j29427n39705l96308K68518
37355g99271P34109M78982k42196o48961k68093M45107N86189K3167l69663k9882
37345i0512L98409J26419m58886m60940J6681J40236j44063r5895L57459M08970
37335A97878j62079n15255j59181K54808J11716j70711j3910K87376J92512q1109
$$ plain form
37404 -973250 -1567380 -1484145 -914114 -600766 -707961 -842675 -808687 -628773 -165960 536777
37394 536777 866986 401337 -244939 -221989 190838 101194 -322631 -41226 891300 1040663
37384 1040663 -192426 -1450840 -1381605 -538669 -237987 -494904 -412583 67663 239683
37375 239683 87853 245702 605808 346096 -529656 -971916 -537966 -88832 -332769 -723570
37365 -723570 -493646 74103 222307 -42031 -140289 -2349 -131776 -671481 -1067789 -799271
37355 -799271 -65162 413820 171624 -477337 -745430 -300323 285866 309033 -60630 -90512
37345 -90512 307897 434316 -24570 -485510 -468829 -328593 -472656 -568551 -211092 197878
37335 197878 35799 -479456 -638637 -383829 -272113 -442824 -456734 -169358 23154 -57955
37325e7955j6873K14064O0304m02138n41019j28384L99300N98791M42575J11268
37315F79933k23523l93877l05442m1323K26766L55782K30914j26098m02112k60108
37305b59088J58309L54128J73080m4727j09548k32460m43756l74749M7713K84927
37295d46171N118l27245j92965J53882J89972J9459R9454L83956M28206J65752
37285D79418m8674p0760q7748j70236j76603n9358R9905K55168L03594O6715l14565
37274B76856l16976K07310O08505L21168k37077l28029p3080j17723l78872j49185
37264a87103N48626P55395R924q95190j032370n09194j7766K13767M25958O40038
37254d7915N70173J46589k90963l72317p7100K85645M02485K55335P2271j9657
$$ plain form
37325 -57955 -74828 139236 199540 -202598 -743617 -872001 -472701 126090 568665 679933
37315 679933 456410 62533 -242909 -284232 -57466 298316 529230 403132 1020 -259088
37305 -259088 -100779 253349 426429 381702 272154 39694 -404062 -778811 -731098 -446171
37295 -446171 -441053 -768298 -961263 -807381 -617409 -597950 -498496 -114540 313666 479418
37285 479418 430744 359984 272236 102000 -74603 -133961 -34056 221112 524706 591421 276856
37274 276856 -40120 167190 775695 1096863 859786 531757 458677 340954 -37918 -187103
37264 -187103 361523 1116918 1126842 231652 -800718 -1309912 -1327678 -1113911 -687953 -47915
37254 -47915 522258 668847 377884 5567 -71533 214112 616597 871932 944203 924546
37244I24546j18698k40089j72624J20625K74096N5361j83408o4449J13002j46548
37234E61814n89730n20257L0858K75046r6465m56683k64825J96677M37624M49809
37224B3868L98929K21270n4778j15098Q4291O5478m07996p78855m30941L78226
37214f15606Q36687N79631o2631n78896o43995k11164L73535N47301J43917l75321
37204f542n39085l95081j73728J33836M79573M95855M6920l28840r9856M29114
37194D2166N49966J63828k37958l92426m32179l80835j22298J88407K60699J51539
37184b09091Q2227p3599m87624p26452j99739P54790J080120M43333l26324m65134
37174a27493j50752J48910L82147N13665K01128n02825p86862j60033O21914N19770
$$ plain form
37244 924546 805848 565759 393135 513760 787856 843217 659809 595360 708362 561814
37234 561814 -27916 -548173 -517315 -242269 -338734 -795417 -1060242 -863565 -425941 23868
37224 23868 422797 644067 589289 474191 558482 623960 215964 -562891 -993832 -615606
37214 -615606 221081 800712 738081 159185 -484810 -695974 -322439 224862 368779 -6542
37204 -6542 -545627 -940708 -1114436 -980600 -501027 -5172 41748 -287092 -386948 42166
37194 42166 592132 755960 518002 125576 -306603 -687438 -809736 -621329 -360630 -209091
37184 -209091 -126864 -200463 -688087 -1414539 -1614278 -859488 220632 663965 337641 -127493
37174 -127493 -278245 -129335 252812 766477 967605 464780 -322082 -482115 139799 659569
37164F59569k73608o51316k24365K63003J69608k17702l18548q0960J34658P5201
37154d64460k23487m68189k56090M37743R27016M96477n05148q88849j82684O98622
37144d29049P69568L11831K20260N14376M21191k31780o80681m46527l6150l2611
37134C80428j96738m4040K26289J02263k57087k14509K29947L29069k08040o48330
37124c00748l22123L07993L21381k65483n56935j71644K19406l028m48186l67042
37114a586409J93042N24719L51798J24775J99147L25783J81722p6739j31618l2366
37104G3854k5554q5977k2667Q0259m6442l44291m10108q7598K63667K65308L5425
37093c04124j2715K55879N42390M98801J20449k69814l69589j96162j9578j3542
$$ plain form
37164 659569 385961 -265355 -489720 -226717 -57109 -274811 -593359 -674319 -539661 -464460
37154 -464460 -687947 -1156136 -1412226 -974483 -47467 449010 -56138 -944987 -1127671 -429049
37144 -429049 340519 652350 872610 1386986 1808177 1576397 895716 449189 413039 380428
37134 380428 183690 139650 365939 468202 211115 -3394 226553 555622 347582 -300748
37124 -300748 -622871 -314878 6503 -258980 -815915 -987559 -768153 -771181 -1219367 -1586409
37114 -1586409 -1393367 -868648 -516850 -392075 -192928 132855 314577 237838 106220 73854
37104 73854 48300 -37677 -60344 19915 -26527 -370818 -780926 -868524 -604857 -339549 -304124
37093 -304124 -316839 -60960 481430 980231 1100680 830866 461277 265115 245537 231995
37083B31995p7427o0269r255l6808p0943L0349J89801J84014l3401l10643n21633
37072d84220n45733j67587N83081J083103O72424l70056r89883o71052O742L60225
37062e22956M56332N47110L78766k27510o76433l54069K90844L53011q1866j20176
37052D3053L70620M91179j62703p56535m97969J91174M11968O0554k87752l02579
37042d38990r4052J73383L29659J58920k30813l25014O5738L76970J06702l45197
37032b22694k87552J60687L19414O1593j23505p1951j16770k88640j75119K47632
37022d96905M20540J20960j37102K2629K39987J35443j9065R3716J49059j95932
37012C33330m76425q0576N65989M64057l53830p15129o5864O31034L18702o08648
$$ plain form
37083 231995 154568 94299 85044 48236 -22707 7642 197443 381457 348056 37413 -484220
37072 -484220 -1029953 -1197540 -614459 468644 1141068 771012 -218871 -889923 -883181 -522956
37062 -522956 -66624 480486 859252 631742 -44691 -398760 -107916 245095 163229 43053
37052 43053 413673 904852 742149 -14386 -512355 -321181 90787 151341 -136411 -438990
37042 -438990 -533042 -359659 -30000 128920 -101893 -426907 -361169 15801 122503 -222694
37032 -222694 -510246 -349559 -30145 31448 -92057 -164008 -280778 -569418 -744537 -496905
37022 -496905 -76365 44595 -92507 -69878 170109 305552 286487 380203 529262 333330
37012 333330 -143095 -223671 342318 806375 452545 -262584 -328448 302586 621288 12640
37002A2640r61639m36840K39077N61661O96802P04130K71017n07572q93128m81534
36992g95386K14617N94522P46272Q72664O25333k02485q71789n78371J95155K93134
36982A093666l07335n14402j8602J58077n42309j137313o27747M36206R10894
36973e48865P71456P39514P97366L39122m73095p48924k78250J68799P8099k03504
36963F41718k66890j91040r2502R4193J90924j07570n09852l27609L74158O84400
36953D89930K19383l05614l09809k15356m49893m86444K18299J015527Q54626
36944A030649r9858o77184l72243J48351K26269K3048m2172M6773J21153K10614
36934F15400L72778M31009J68905l14846o00572l33035L28831P01445K81812n08379
$$ plain form
37002 12640 -948999 -1385839 -1146762 -585101 111701 815831 1086848 579276 -313852 -795386
36992 -795386 -580769 13753 760025 1632689 2258022 2055537 1183748 605377 800532 1093666
36982 1093666 786331 271929 253327 411404 -130905 -1268218 -1895965 -1459759 -548865
36973 -548865 222591 962105 1759471 2098593 1625498 876574 598324 767123 845222 641718
36963 641718 374828 183788 91286 185479 376403 268833 -241019 -568628 -194470 489930
36953 489930 709313 403699 93890 -121466 -571359 -1057803 -839504 176023 1030649
36944 1030649 930791 253607 -118636 29715 255984 279032 236860 283633 404786 615400
36934 615400 988178 1419187 1588092 1273246 672674 339639 668470 1369915 1651727 1143348
36924A143348p04272q4617M57660J87558m05062m15271P4658K12281k46674o32454
36914d12845m27537J08659M79462M91278J61675l31753n23616n9601O66902Q39280
36904I91904K98542k64401l25144j26267n5636l5670J39565L56321M16540L34134
36894A729888J34973k40700o08484n66190j27810J24593j43278m80142l19088
36885d96238J84922M29714K22684o5534p8385J22843J97704p0931m52482m09298
36875d15001J99496P06897M05166l79194o42897j51279K89080J81003K6095K39727
36865D59093L26171j63694o67513m77254P0879K13949N0352J90953N04241L06871
36855H14048l60689p02472m03940L5176K37510L33564L51305R6120k34717j51464
$$ plain form
36924 1143348 439076 354459 812119 999677 594615 179344 254002 466283 219609 -412845
36914 -412845 -840382 -731723 -252261 239017 400692 68939 -454677 -514278 152624 991904
36904 991904 1290446 1026045 700901 574634 518998 483328 622893 979214 1395754 1729888
36894 1729888 1864861 1624161 1015677 449487 321677 446270 302992 -177150 -496238
36885 -496238 -311316 118398 341082 275548 197163 320006 517710 446779 -5703 -415001
36875 -415001 -215505 491392 896558 517364 -125533 -276812 12268 193271 219366 459093
36865 459093 785264 621570 -45943 -523197 -452318 -238369 -188017 2936 507177 814048
36855 814048 453359 -249113 -653053 -617877 -380367 -46803 304502 400622 165905 14441
36845A4441K55517L42288k5891k55319p1314N9773j52078l11881j29838N6306
36835b17996k0932p3927O6879K8560l24603m09984J30976O61897M65349j12010
36825A94209k26964J67982M29140L22545J83310J33282n6608l44720l63783m2757
36815C95636K82296L95792L33164M9723m58309p50377l39369M29745O01223o2418
36805H77106o37859l19533M22830N28190j54443o88268l36052N08602Q80600M35275
36795A516448k18277l40051M6892K88097L1712l14452k40418N1387q1073o91520
36785D8745r83880l15407Q50398J357885O70332n17352j055365n56892L02389
36776a99147O35995L02316r7715m6590L14179M82070K33267k16371n47348o03047
$$ plain form
36845 14441 269958 612246 586355 331036 259722 319495 167417 -144464 -274302 -217996
36835 -217996 -238928 -312855 -245976 -217416 -542019 -952003 -821027 -159130 306219 194209
36825 194209 -32755 135227 564367 886912 1070222 1203504 1146896 802176 438393 395636
36815 395636 677932 1073724 1406888 1456611 998302 247925 -91444 338301 939524 877106
36805 877106 239247 -80286 342544 870734 716291 28023 -308029 200573 1081173 1516448
36795 1516448 1298171 958120 1005012 1293109 1324821 1010369 769951 821338 740265 48745
36785 48745 -935135 -1250542 -400144 957741 1628073 1110721 55356 -501536 -199147
36776 -199147 436848 739164 641449 594859 909038 1391108 1624375 1408004 860656 257609
36766B57609l75681K8597L65208L87426J12480j57962j67865K2616J59705R8895
36756G31028r7018k75477k95455q5137K41286L66516R1676k94676k46074K92188
36746D28857O57683L04035l85871n87152k02948N7039j76953l93532j11595L02006
36736a08431K53260j17903k31005j464J75056J68847J80140J73358q0855m17633
36726f630l68805J05673N36097O33331N35700L69740J15284j07447j76458l14477
36716A322008o73195p51367o9947P18527M91894n20073q31890O7316R04564O43937
36706A301774k310l483K49670j24982p49079n94747J97379N32331J41850j64672
36696G83731K6661K19771Q4594q420K21015M76189M57237K90427J94932K12883
$$ plain form
36766 257609 -118072 -89475 275733 663159 775639 617677 449812 472428 632133 731028
36756 731028 634010 358533 63078 -22059 219227 585743 677419 382743 136669 428857
36746 428857 1086540 1390575 1004704 417552 214604 271643 94690 -298842 -410437 -108431
36736 -108431 144829 26926 -204079 -205543 -30487 138360 318500 491858 411003 -6630
36726 -6630 -375435 -269762 266335 899666 1435366 1805106 1920390 1812943 1636485 1322008
36716 1322008 648813 -102554 -172501 546026 1037920 517847 -314043 -246727 657837 1301774
36706 1301774 1299464 1295981 1545651 1420669 671590 76843 274222 806553 948403 783731
36696 783731 810392 1030163 1114757 1106337 1327352 1803541 2260778 2551205 2746137 2959020
36686B959020L29073M31721K51879k09784m36688j22441J94283p6435n09072k91609
36676B519947L44256L85418l26803q13861m62814J93689M76488M39379L85470
36667C141169K73288K4325j59042j39462p2958r0168j48684k53666l85324k73500
36657A915978K22471O38651M44311r4123k93180j10388j4259j2397K27485M57870
36647C382419J54139l44828j89114M95128P51252M79562N43758R89931P57485
36638G019732l42451r77364m03330K83821N596n53617k42859O53674J087661R35972
36628G466835P94003P90992P32540Q09324J169009J388429J249452J346636K079082
36619A7826302K839007L083722L332214M164017N196172O048058P221838Q907917
$$ plain form
36686 2959020 3288093 3719814 3971693 3761909 3325221 3202780 3397063 3320628 2811556 2519947
36676 2519947 2864203 3249621 2922818 2108957 1646143 1839832 2316320 2755699 3141169
36667 3141169 3414457 3438782 3279740 3140278 3067320 2977152 2828468 2574802 2189478 1915978
36657 1915978 2138449 2777100 3221411 3127288 2834108 2723720 2709461 2697064 2924549 3382419
36647 3382419 3536558 3191730 3002616 3497744 4248996 4728558 5272316 6262247 7019732
36638 7019732 6677281 5699917 5296587 5580408 5586004 5032387 4789528 5443202 6530863 7466835
36628 7466835 8260838 9051830 9784370 10593694 11762703 13151132 14400584 15747220 17826302
36619 17826302 20665309 23749031 27081245 31245262 36441434 42489492 49711330 58619247
36611E8619247J0185587J0781847J2274986J5936754K0858158K6063421L2336324
36604A87056324L8609488L8210552K3915117k066556k7143976l9655433l8779630
36597A80145886l1829264k4956081j9461582j4934727j1757277j0120691r196700
36590E7889564q216885p156910o066504m785353l503352k712822k468724k369350
36582B0609664k230089k129138j917655j387586q40828q04829j195901j372901
36574H730737j042867n85918m34900n69396o88513n68500k14563J40543K24959
36565D991582K2997k47759m68328o25397m91533J70544R32764Q71751k15770j341980
36555C598871j527651r38464l25395Q3356M44772N58264J39887m01030l32655
$$ plain form
36611 58619247 68804834 79586681 91861667 107798421 128656579 154720000 187056324
36604 187056324 225665812 263876364 287791481 285724925 258580949 218925516 180145886
36597 180145886 148316622 123360541 103898959 88964232 77206955 67086264 57889564
36590 57889564 49672679 42515769 36449265 31663912 28160560 25447738 22979014 20609664
36582 20609664 18379575 16250437 14332782 12945196 12104368 11299539 10103638 8730737
36574 8730737 7687870 7101952 6667052 6097656 5409143 4840643 4626080 4766623 4991582
36565 4991582 5014579 4766820 4298492 3673095 3181562 3352106 4284870 5156621 4940851 3598871
36555 3598871 2071220 1132756 807361 890717 1335489 1893753 2033640 1632610 1299955
36546A299955K76139N70999J49154l91831l61988J01656L50977J43165j06342
36537B031884O2469N02457N90654P0182m69979l18503K86113M07216j93906o59564
36527B309023l70539J06522L9764k00199J82193R11018R16181K0746o95687m30452
36517B788570L03436N38951J05001m25477o03081m77207l03604j96089n9827J85024
36507A855697L14285m5129p73499j105065n64279K23744K84113l13530n69192
36498f92855n9470N02334M25736l5498l07537l31001k65737J4490N13162P03511
36488D67135K31469l47334k75585K32004L33117o5892j82440K99967O68146L27560
36478A688147k57810l50595q4990j03258l96534l30801K13224N14253P9788n61225
$$ plain form
36546 1299955 1576094 2147093 2296247 1904416 1542428 1644084 1995061 2138226 2031884
36537 2031884 2094353 2596810 3187464 3257646 2787667 2469164 2755277 3162493 2968587 2309023
36527 2309023 1938484 2045006 2084770 1884571 2066764 2977782 3893963 3914709 3219022 2788570
36517 2788570 3092006 3630957 3735958 3310481 2707400 2230193 1926589 1730500 1670673 1855697
36507 1855697 2169982 2124853 1351354 246289 -317990 -94246 189867 -123663 -692855
36498 -692855 -752325 -249991 175745 140247 -167290 -498291 -764028 -749538 -236376 467135
36488 467135 698604 351270 75685 307689 640806 574914 392474 692441 1360587 1688147
36478 1688147 1430337 1079742 994752 891494 494960 164159 377383 891636 971424 410199
36468D10199n76345J8924M36229K20481k12285k58501L2406J23390j49592k97667
36458b52761P3013N59647M49130j76243m10107J55051O66541J74406q47812j023196
36448f32331m7841Q23782N61878k74892n44305j41636K01200K26245K99840M60078
36438I32018K67034l13180o55561l31525L38609P66713O81904J50034n24218q39323
36428D72505n09962Q4518L01184Q7050o2684M3257J09190M1949J06451K59715
36418I33173O8748m72703p61166n01208j07995R0338K84535M77886K20822m35995
36408b03565o11038Q6016P27829M15159k99296l35704J94651L49683n360j66197
36398A52178J3698n0603m36073m86071k5485K68256L4473j75502J17222N55361
$$ plain form
36468 410199 -166146 -147222 289007 509488 297203 38702 71108 194498 44906 -252761
36458 -252761 -179748 379899 829029 652786 242679 397730 1064271 1238677 390865 -632331
36448 -632331 -680172 143610 705488 430596 -113709 -255345 -54145 172100 471940 932018
36438 932018 1199052 885872 230311 -101214 237395 1004108 1686012 1836046 1311828 472505
36428 472505 -37457 47061 348245 435295 372611 415868 525058 567007 673458 933173
36418 933173 1001921 529218 -231948 -733156 -841151 -750813 -466278 11608 232430 -203565
36408 -203565 -814603 -728587 -758 414401 115105 -220599 -25948 323735 318375 152178
36398 152178 165876 115273 -320800 -806871 -832356 -564100 -529627 -705129 -587907 -32546
36388c2546O25604M14092K15564j8000l58713n26395l08234J8259R0598k3849
36378I6380o1056r565j386m106Q2915K02156K16151P8609j50214l04557j90121
36367d4794R1432O9985m24536p46529k33119O38023P49272K3703m00591N1187
36357b25967N03797J09838n55759m52607K78863O15733J84331m27754o51365m25193
36347a046083J01167O16165N89167j04524o84133l46606N12928P83028K35906
36338F57015k50520r7840K71484L30897J73249J5406k31794m92209l32920K74817
36328C17585O20216K15920m12131m52717Q2902N22315M62211K5378n05185q05729
36318G0765n50587J56731O43906M59404L3696K2042K89821K16840k14100m12737
$$ plain form
36388 -32546 593058 1007150 1222714 1204714 846001 319606 11372 29631 120229 96380
36378 96380 35324 25759 24373 20267 103182 305338 521489 600098 449884 145327 -44794
36367 -44794 46638 116623 -307913 -1054442 -1287561 -649538 99734 123437 -277154 -225967
36357 -225967 277830 387668 -168091 -620698 -341835 273898 458229 30475 -620890 -1046083
36347 -1046083 -944916 -328751 260416 155892 -528241 -874847 -361919 421109 657015
36338 657015 406495 308655 580139 911036 1084285 1099691 867897 375688 42768 317585
36328 317585 937801 1153721 741590 288873 371775 894090 1356301 1381679 876494 70765
36318 70765 -479822 -323091 320815 780219 813915 835957 1125778 1342618 1128518 715781
36308G15781k00265l4718j36720j64020L7710R8946j35149k12482J37659M15854
36298E22596J02489m55192n15092j7332L96173K96714j03172l77411l32730n3580
36288e36537J93334J51471j11251k28035o9456K5196j62767k74453M7681M72507
36278d92310M73286K36278L33305O25196L73266m44141q31101k00436O47682N95100
36268A316125k41421p32430k96704M25214N11184j13214p05564o50192j37464
36259f24466J48105q2127l75798k24375J78078K61312J2460l23L90492N83951
36249B67309J51864l93642l00039K91069N14360J898o11117n30385K16404Q70848
36239D78569Q44824K86753k60277n30114o20238n20074l0710O49712P84216N1368
$$ plain form
36308 715781 515516 480798 344078 180058 217768 316714 181565 -30917 106742 522596
36298 522596 625085 169893 -345199 -362531 33642 330356 227184 -150227 -482957 -536537
36288 -536537 -343203 -191732 -302983 -531018 -600474 -575278 -738045 -1012498 -964817 -492310
36278 -492310 -19024 217254 550559 1175755 1549021 1104880 273779 73343 721025 1316125
36268 1316125 1074704 342274 45570 470784 981968 868754 163190 -487002 -624466
36259 -624466 -476361 -558488 -934286 -1158661 -980583 -719271 -706811 -707134 -316642 267309
36249 267309 419173 25531 -274508 16561 530921 532819 -78298 -608683 -392279 478569
36239 478569 1323393 1610146 1349869 819755 199517 -320557 -351267 298445 1082661 1134029
36229A134029p57755o97645m5836J48562k47222k98145L14714O48484O9019o13917
36219c45712m17798K57174L57747j21291k61134K37164O64654M44332j53605n15480
36209A46051l30541K68093P63257N79319k28646q34593o25100l561K71175J24810
36199A30264n9258k27674m43220l31368L31716Q39011M02833m68000n74135J22190
36189b77641M69639r775m93167l43836j7306l9392j45913J6585K33634K93827
36179c13345M07099N75131L52775k77344o06699k97787K5703j61317m49031l36332
36169a081147j07647j57365j86656J45744M40295K33601j39855j59795l103l659
36159a019587J31233O29393Q10133O3241q15918n52420N96403J081109L09923
$$ plain form
36229 1134029 376274 -321371 -367207 -218645 -465867 -764012 -449298 199186 268205 -345712
36219 -345712 -763510 -506336 -148589 -269880 -531014 -293850 370804 815136 661531 146051
36209 146051 -184490 83603 846860 1426179 1197533 362940 -262160 -265721 5454 130264
36199 130264 71006 -156668 -599888 -931256 -599540 239471 642304 174304 -399831 -277641
36189 -277641 191998 182223 -310944 -654780 -672086 -711478 -857391 -840806 -607172 -313345
36179 -313345 93754 668885 1021660 744316 137617 -160170 -134467 -295784 -744815 -1081147
36169 -1081147 -1188794 -1346159 -1532815 -1387071 -946776 -713175 -853030 -1012825 -1015928 -1019587
36159 -1019587 -888354 -258961 551172 614413 -201505 -753925 -157522 923587 1233510
36150A233510o31652p36964l45582j86485j82428J08966N60229O81088L77823
36141H78505j7837k24572j65103R8455L06451J48423k82956m61675j12864L35247
36131E02074K86500k29364o22032n07844j02116J75260K20047K16588K43560J65777
36121C48450m9342j73426o5446M2611r4205k75854j62972J15461J84034J34310
36111C621L33022N44874J28081p07421q47013M0238P67325L47869m74548m40044
36101c03996K53056M51852J9656j08607L30044N25472O3762m47235n01644l52471
36091g0111k22213J08587N34325M41405k19895n98624k29395K09801N4848k54807
36081b46079k1538M59456L93281k07529n81605l62092Q0714L26532L22085J67007
$$ plain form
36150 1233510 601858 -135106 -480688 -667173 -849601 -740635 -180406 500682 878505
36141 878505 860668 636096 470993 569448 875899 1024322 741366 279691 166827 502074
36131 502074 788574 559210 -62822 -570666 -672782 -497522 -277475 -60887 182673 348450
36121 348450 299108 125682 60236 102847 8642 -267212 -430184 -314723 -130689 3621
36111 3621 336643 881517 1009598 302177 -544836 -504598 262727 610596 136048 -303996
36101 -303996 -50940 400912 420568 311961 642005 1167477 1231239 784004 282360 -70111
36091 -70111 -292324 -183737 350588 791993 572098 -26526 -255921 -46120 8728 -246079
36081 -246079 -267617 191839 585120 377591 -204014 -566106 -485392 -158860 163225 330232
36071C30232k9894j09782j6661R3911J17347J51868J91241K5320k84053k73965
36061A95564J83517M72917O9632o21986q42634n45074k61839j93422r9598R8341
36051a544582K68104M65684P48301P66058K33763l61842l18507J35724J54365
36042E47068k92589l38058K42518N32967j050n53739k98151K47761J57683k98514
36032e4104j64283M83746N98250r5760o42546m06150P896j10323m25600k59860
36022a068734K11710K94682o0144k39689R283K66095J93597O130J0551J35259
36012b41260J39181j8535k17785l67718l93986k04879J74729N24266N87364L01706
36002B83083j12842k82477l2472L08367J84293m14893p45380k38453O11520Q19848
$$ plain form
36071 330232 300338 190556 173895 267806 385153 537021 728262 753582 469529 195564
36061 195564 379081 851998 921630 299644 -542990 -1088064 -1349903 -1543325 -1642923 -1544582
36051 -1544582 -1276478 -810794 -62493 703565 937328 575486 256979 392703 547068
36042 547068 254479 -83579 158939 691906 690856 137117 -161034 86727 244410 -54104
36032 -54104 -218387 265359 863609 767849 125303 -280847 -272951 -383274 -808874 -1068734
36022 -1068734 -857024 -562342 -622486 -862175 -852892 -586797 -393200 -387070 -376519 -241260
36012 -241260 -102079 -120614 -338399 -706117 -1100103 -1304982 -1130253 -605987 -18623 283083
36002 283083 170241 -112236 -144708 163659 347952 -66941 -812321 -1050774 -439254 380594
35992C80594K54232k26147l4604L88599L44511j48008n26833m63622r7678K50307
35982A21351L09315K5522k92919k45927R8272K42169j621k41177j85356r2745
35972b63116k10354k65564K3651L57328K99820q191j13778K4725Q4760m6891j99747
35961c17357k46492j45531J07255K71680j4559n67586o23567N5534O24436L39193
35951e16994k90004l37229R1864K24607k535l2319J37740L4326j84055J06452
35941g68147P35028Q30738K65217j64837j38310k00591n33828n60754j16807J75416
35931d76875R4690J81592M92475L07122l60689l77801N69761J064065Q5635j216626
35921C63349j226631k72501J68102j34355j73507L65177P56347O16508K70197
$$ plain form
35992 380594 634826 408679 374075 762674 1107185 959177 432344 -31278 -128956 121351
35982 121351 430666 456188 163269 -82658 15614 257783 256162 14985 -170371 -263116
35972 -263116 -473470 -739034 -715383 -358055 -58235 -66426 -180204 -155479 -70719 -117610 -317357
35961 -317357 -563849 -709380 -602125 -330445 -345004 -912590 -1536157 -1480623 -856187 -516994
35951 -516994 -806998 -1144227 -1052363 -827756 -830291 -862610 -724870 -690544 -874599 -768147
35941 -768147 -33119 797619 1062836 897999 759689 559098 25270 -535484 -652291 -476875
35931 -476875 -382185 -200593 291882 599004 238315 -139486 430275 1494340 1579975 363349
35921 363349 -863282 -1135783 -967681 -1102036 -1275543 -910366 -154019 462489 732686
35912G32686j42915o94713r33527l42303N47720O95928J55768o6708K58488K98894
35902E09318k40414n40233q9603M60789L91098p7521l80087m21149l26577r2370
35892h06749J14186k9857l56850k74465K32243M51871J42407L396M57476Q33608
35882G67266M55586k12102l35360l9883n4365m07339m36187K2210L27385M2106
35872A29317m37886n13758j81836R9697R2940L0850K09970N33019O14732L20779
35862H97824l2080j52510j84178l37370l80979n626M68246L95901j61523m10960
35852I6745k2708L37653M3910n27359n95446j14190K71004J81641j14378k21157
35842f64285q9428P6797J25498Q6023Q5374J66791K24258J74881R4000M6542m7245
$$ plain form
35912 732686 589771 -104942 -1038469 -1380772 -833052 -137124 18644 -48064 210424 509318
35902 509318 268904 -271329 -360932 99857 490955 413434 33347 -387802 -714379 -806749
35892 -806749 -692563 -722420 -1079270 -1353735 -1121492 -669621 -527214 -523818 -66342 767266
35882 767266 1222852 1010750 675390 635507 581142 173803 -262384 -240174 87211 129317
35872 129317 -308569 -822327 -1004163 -904466 -811526 -780676 -570706 -37687 577045 897824
35862 897824 865744 713234 529056 191686 -189293 -194919 273327 669228 507705 96745
35852 96745 74037 411690 455600 -71759 -667205 -781395 -510391 -328750 -443128 -664285
35842 -664285 -753713 -676916 -551418 -465395 -380021 -213230 11028 185909 279909 326451 279206
35831B79206j63594m2366L45820M89949K4091n35395m28228J51983L24595q4024
35821C62037l61810j97529r3849k35536n7609N63291P72358J07021n70978l81811
35811i4415J87784J90277k28518k81293L0799J08719k8962R9925L40416J30925
35801D55657l21499k79554J58873J41286m05409n54073K8132M63971J42838k73755
35791d43533k1257M89897M12076j56432m10838r6973K80743L34246J74295l2675
35781E29549k82474m41029k39949K53645N25782K36340k48474k48514L28599P88795
35771A202270N26162j63225n06133l40439k28737m37390m80335j7679M38993L02052
35761B95539j19343j38965J79605K13124j22575k86555n2366K26191K70680J13068
$$ plain form
35831 279206 115612 73246 419066 909015 933106 397711 -30517 121466 446061 362037
35821 362037 227 -197302 -291151 -526687 -584296 -21005 751353 858374 287396 -94415
35811 -94415 93369 283646 55128 -226165 -195366 -86647 -115609 -15684 324732 455657
35801 455657 134158 -145396 13477 154763 -250646 -804719 -776587 -312616 -169778 -443533
35791 -443533 -464790 25107 437183 280751 -130087 -227060 53683 387929 562224 529549
35781 529549 247075 -193954 -433903 -180258 345524 581864 333390 84876 413475 1202270
35771 1202270 1728432 1565207 1059074 718635 489898 52508 -427827 -445506 -6513 295539
35761 295539 176196 37231 216836 429960 307385 20830 -31536 194655 465335 578403
35751E78403k50589p25519p73805n5279O98320M54953m78572p27186Q2746P58982
35741d37546M37993k03357k66728p93j1336j12765O5882J72331j56583l97882
35731i10784j460M95271L00603k49787k93171O3669P3961k02246q8307L02962
35721e09289K15369k54845j87111N08010Q07007K59944l04895k18207N5178m9560
35711C21601k48415j63031q7669k78941l12048R1853L53441k5425m80529k45568
35701a074731L45264L73312k09951n90011l54248J13814M10315N02209L74264
35692a09763p121l50063k67566J15708L13390K10500J17637J37162M5625j85786
35682A9723l10549k80035k67914k03782J54115O30367P07959L06902q2468j74977
$$ plain form
35751 578403 327814 -397705 -1171510 -1226789 -528469 -73516 -552088 -1279274 -1196528 -437546
35741 -437546 447 -202910 -469638 -470431 -481767 -594532 -528650 -356319 -512902 -910784
35731 -910784 -912244 -416973 -116370 -366157 -659328 -595659 -521698 -723944 -812251 -509289
35721 -509289 -293920 -548765 -735876 -227866 579141 839085 534190 315983 371161 321601
35711 321601 73186 -89845 -177514 -456455 -768503 -676650 -323209 -348634 -829163 -1074731
35701 -1074731 -729467 -356155 -566106 -1156117 -1510365 -1396551 -986236 -484027 -109763
35692 -109763 -116884 -466947 -734513 -618805 -305415 -94915 22722 159884 205509 19723
35682 19723 -290826 -570861 -838775 -1042557 -888442 -258075 449884 756786 674318 499341
35672D99341k07117l12412k32423N9440Q7892l44583o66026l37891K98591N33136
35662f22052K90608M9316K3952L0956J3709J15154K66376K09866n6496k75710
35652D5679l48907l56186k26188J45776M77503L32687j52808l23191M4122L77006
35642A5493J95572j47711p5715K46177J59024m04009p04487k27372N36923O76139
35632B70034J7399o55888n74810J05992N62826L25842k43075n22053l61991m7095
35622a122819K12822M00165M26013J50032l07504n91346m98788r7413M79812R98466
35612D9440R73273J22956r42086j133722k75653N36793L91887k30968l20653J42211
35602f86522L60351Q7653j34488l6008L1371o9128L8073M14819N05851Q6847k15684
$$ plain form
35672 499341 292224 -20188 -252611 -193171 -105279 -449862 -1115888 -1453779 -1155188 -622052
35662 -622052 -331444 -282128 -258176 -227220 -213511 -98357 168019 377885 321389 45679
35652 45679 -303228 -659414 -885602 -739826 -262323 70364 -82444 -405635 -361513 15493
35642 15493 211065 63354 -12361 233816 392840 -11169 -715656 -943028 -406105 270034
35632 270034 287433 -368455 -943265 -837273 -274447 51395 -191680 -713733 -1075724 -1122819
35622 -1122819 -909997 -509832 -83819 66213 -241291 -832637 -1331425 -1428838 -949026 49440
35612 49440 1022713 1145669 203583 -930139 -1205792 -668999 -277112 -508080 -828733 -686522
35602 -686522 -326171 -238518 -373006 -409014 -377643 -446771 -408698 6121 511972 598819 383135
35591C83135J00769N40679L59266k91115o59108n03196k07044j9749J23761J61550
35581a1052l0650j87699P0505N14660N22180O9639j94917j9599O1568k79802n27998
35570a3165k07090K21667O2068m38181m34477J63961N34961K13427k55624k35658
35560c88111O9927Q9277j53983j50297K01341M08092J58169k07211k25127K3704
35550a74219J00423j18252l01340j80637J08725L05232L79034M12263L06946p7855
35540G60320n24655n33623K6279N73309M14826l64630r17949o24964J80043O58227
35530c52817M67083L5111r9347J03289L22375L34561J35541j85180m42907l81276
35520f3567J4302L22288J34709l29335m30898R814M33358L10837j69404m53066
$$ plain form
35591 383135 483904 1024583 1383849 1092734 433626 -69570 -276614 -296363 -172602 -11052
35581 -11052 -41702 -229401 -158896 355764 877944 947583 752666 733067 794635 514833 -13165
35570 -13165 -220255 1412 63480 -374701 -809178 -645217 -110256 103171 -152453 -388111
35560 -388111 -318184 -228907 -382890 -533187 -331846 76246 234415 27204 -197923 -174219
35550 -174219 -73796 -192048 -493388 -674025 -565300 -260068 118966 531229 838175 760320
35540 760320 235665 -297958 -271679 301630 716456 351826 -566123 -1191087 -1011044 -352817
35530 -352817 114266 149377 50030 153319 475694 810255 945796 760616 317709 -63567
35520 -63567 -49265 273023 407732 78397 -352501 -342687 90671 401508 232104 -220962
35510b20962l55038j04977J11459K67625K88366J17023p3605q3800k4475q6406
35500a64790q4076K69515O65027M15586m41809r21707l92896M49200N27583r6033
35490B25600m20103n3784L09648J18356j81975P864L85254K37184l62550o29622
35480c64128k82322P5205l3584k30879K1859N10522O13180K66372l7093j14914
35470D24218l02975o79615p09231l1887Q25031J016061M51508j67153l07202j35438
35460C83317l0970j7549O1775J10551r2013m10805l99417M9665M23171K49381
35450C27106j72514j59749K82399L75439k14260p11997l54563L58948M03107j02470
35440C1446q1484O16475P99756j27103j032065p46378J19445K25430l64725m85742
$$ plain form
35510 -220962 -576000 -680977 -569518 -301893 -13527 103496 29891 -53909 -78384 -164790
35500 -164790 -248866 20649 685676 1101262 659453 -262254 -655150 -205950 321633 225600
35490 225600 -194503 -248287 61361 179717 -2258 5606 390860 628044 265494 -364128
35480 -364128 -646450 -571245 -604829 -835708 -813849 -303327 309853 576225 539132 424218
35470 424218 121243 -558372 -1267603 -1299490 -474459 541602 993110 825957 518755 383317
35460 383317 352347 334798 396573 507124 415111 4306 -395111 -345446 77725 327106
35450 327106 154592 -5157 277242 652681 438421 -273576 -628139 -269191 133916 31446
35440 31446 -50038 566437 1366193 1239090 207025 -539353 -419908 -194478 -559203 -1044945
35430a044945R3769M25625J34781k8777L41468N99016K78459j02977n8354O2134
35420G00199r3883j77218M5261P1780l58183n39282L8883O10993K79930m41024
35410A37456m36921J70043L18905j36926k70659K26895N51743K40966r5052N9057
35400G65507K68436L1754l32560l10760m6104L3397p9963j74676k69876l73315
35390d88160k21867K38525N01951J52513m35493n46998n4601N40332P96034O49879
35380A132115K26866k60709n18416m09881j43649k3841j36231l99847o70299o47814
35370a851706p1781P25148Q97270J51210o59568n64016K05773N92188K34252j67036
35360e08266n9368J72262l6058m95086n98173k26173K02426L96847M12830K75594
$$ plain form
35430 -1044945 -951176 -525551 -390770 -419547 -78079 520937 799396 696419 638065 700199
35420 700199 606316 429098 474359 546139 187956 -351326 -312443 298550 578480 137456
35410 137456 -299465 -129422 189483 52557 -218102 8793 560536 801502 706450 765507
35400 765507 1033943 1065697 733137 422377 376273 409670 329707 155031 -114845 -488160
35390 -488160 -710027 -471502 30449 182962 -252531 -799529 -854130 -313798 482236 1132115
35380 1132115 1358981 1098272 579856 169975 26326 2485 -133746 -533593 -1203892 -1851706
35370 -1851706 -1923487 -1198339 -301069 -149859 -809427 -1373443 -1167670 -575482 -341230 -508266
35360 -508266 -567634 -395372 -431430 -926516 -1524689 -1750862 -1548436 -1151589 -738759 -463165
35350d63165j02356n18080m63232J84011P73879O01924j50281o34322m41551K265
35340a210908K09870K35251K60884J61065p6461j7593N04006P88376K03435o01523
35330D56402m43103N18587Q30443o6881r06037m93377N01543O29619j92033p55717
35320G9446m31150J61491L17745J24569k0082l2364j3062J9933N3859N4302Q4019
35309C98706J67958J10971k00215m39079k20755K67195M97376L72487K40298K21755
35299A416697J15943n0071j6432J13957o5766m89295n72706j56702J72935L579
35289D72139l04607l09989j68187j57192r1904K17132L95033N3054m28014l66397
35279f88932J52703L80218N0244k41464L0560N40073N72596j1026n88869n21179
$$ plain form
35350 -463165 -565521 -1083601 -1546833 -1362822 -588943 12981 -137300 -771622 -1213173 -1210908
35340 -1210908 -1001038 -765787 -504903 -343838 -420299 -437892 66114 854490 1057925 456402
35330 456402 13299 531886 1362329 1295448 389411 -103966 397577 1027196 835163 79446
35320 79446 -351704 -190213 127532 252101 232019 199655 186593 206526 260385 314687 398706
35309 398706 566664 677635 477420 38341 -182414 84781 582157 954644 1194942 1416697
35299 1416697 1532640 1482569 1466137 1580094 1514328 1025033 452327 295625 468560 472139
35289 472139 167532 -142457 -310644 -467836 -559740 -342608 52425 105479 -322535 -688932
35279 -688932 -536229 -156011 -105767 -347231 -316671 223402 795998 784972 196103 -325076
35269c25076R1266N05021K29301l24297l53729K27139O38480L36744k29393l31207
35259D64249l170J57305m3262k35204j85078o4721p380P4840J52459L7303k05121
35248A42220k40848j195J80055J05782k3573n2451j29434k88263k17627K09216
35238c16118N61122M14951j2432k32932k19976k74670l61829j63854K53666M16530
35228F4458J73822o7419j1593R9091j8654j90905j28837N6638P1854m9917m8525
35217d9987R2177J50925P1564R918J5772p328m6514l945L2677j20954l64501l66670
35205e86866o3833K32314L09471K89034K76645J57185q3999k06392j14784o6847
35195A41928k15449k94115q0792J68389J42588K3147J47418L82373L46817P4818
$$ plain form
35269 -325076 -233810 271211 500512 176215 -177514 49625 688105 1024849 795456 464249
35259 464249 461079 618384 575122 339918 154840 90119 82739 157579 310038 347341 142220
35248 142220 -98628 -99823 80232 186014 162441 109990 -19444 -307707 -525334 -316118
35238 -316118 245004 659955 647523 414591 194615 -80055 -441884 -605738 -352072 64458
35228 64458 238280 170861 159268 258359 239705 48800 -80037 -23399 48455 -1462 -49987
35217 -49987 42190 193115 264679 274597 290369 283041 236527 232582 265259 144305 -220196 -586866
35205 -586866 -650699 -418385 -108914 180120 456765 613950 529951 323559 208775 141928
35195 141928 -73521 -367636 -448428 -280039 -137451 -114304 33114 415487 762304 837122
35185H37122p3204l0910k4331o5017j1087k8013l40600n84150j63139O70947R25010
35174A112628K89370l61254k84101J12202J22512j20204j07140M7365o0769k20899
35164E29710J5584L14261o4826r05001j078573j80350P92070P96508M4292n54444
35154b90769o33610m67165k55904L3614L11057L92019L29573L18974L29108J67277
35144B34174j48995l97076m68018l86209r3630M31224Q63301P34327N0544o06992
35134B12650p39330m29556n4614K17563M16515M88050L44966J10459J9698Q6533
35124F72934J07120q87j05769j40811k09615l11376k28571J17011M12207L15227
35114F27470o9077l49776l83031l32490k52749L838L86132N20966K07762k22150
$$ plain form
35185 837122 763918 733008 708677 643660 632573 604560 263960 -320190 -483329 187618 1112628
35174 1112628 1401998 1040744 756643 868845 991357 871153 764013 811378 750609 529710
35164 529710 545294 859555 794729 -110272 -1188845 -1369195 -577125 219383 263675 -290769
35154 -290769 -924379 -1391544 -1647448 -1613834 -1302777 -910758 -581185 -262211 66897 234174
35144 234174 85179 -311897 -779915 -1166124 -1259754 -828530 34771 769098 819642 212650
35134 212650 -526680 -956236 -1010850 -793287 -376772 111278 456244 566703 586401 672934
35124 672934 780054 779167 673398 532587 322972 11596 -216975 -99964 312243 627470
35114 627470 558393 208617 -174414 -506904 -759653 -755815 -369683 151283 359045 136895
35104A36895k97489n05K70949K30306l2990k53315k49077j0725K94388M03961
35094D92398J82083k27574n36942n63487l01914J29950N01712N55919K67746m7609
35084D52282o5000J53768K60073Q2747j84930k69440j36233J6714J920j42324
35074A69577j68294Q1017L85112L37185j00549m65631l90022p9618O0978L5166
35064a35079J06500K33053J35652j32440j98513P30J03417n0347j75157j01542
35054b13726o3802j61305o4477L44166N39818J12714m53064m18619P7883K70723
35044b9689j3368k13651j13898j51644m10463k26328O58974J333852Q85355k04698
35034A514442p06186l52194K9056n1122j77900j8953R2311q2387j70913P4583
$$ plain form
35104 136895 -160594 -161099 109850 340156 307166 53851 -195226 -205951 88437 492398
35094 492398 674481 446907 -90035 -653522 -955436 -825486 -323774 232145 499891 452282
35084 452282 387282 541050 801123 883870 698940 429500 293267 309981 311901 169577
35074 169577 1283 82300 467412 804597 704048 238417 -151605 -231223 -170245 -135079
35064 -135079 -28579 204474 340126 207686 9173 9903 113320 62973 -112184 -213726
35054 -213726 -277528 -438833 -503310 -159144 380674 493388 40324 -378295 -300412 -29689
35044 -29689 -43057 -256708 -370606 -522250 -932713 -1159041 -500067 833785 1719140 1514442
35034 1514442 808256 456062 485118 433996 256096 237143 329454 247067 76154 150737
35024A50737K38184K75k12903l965J77333j92760o34651l50931L54094M60472
35014a4115r3336l23446J15714M07957Q7573j69502J06323K21817l66519q16963
35004h44497j85825Q19089P66575k54204p90787l01071K18256O3851j55939J42666
34994e21886M36309J43870k48958o2711L16481P5231n97848p55889j72886L66860
34984a021427K88016n5892o5278K84491N48305L89917r8901m53138k28912M28856
34974A6037P45493J83866p67391j089858m68505L96616P07556L77131j10695k45468
34964b55218J49023P14290P18099j29433j031800q86322J82133P99662J95721
34955D56155o82488n45047L90904Q47831M24610o874J35583K74253k20206r25204
$$ plain form
35024 150737 388921 389196 176293 172328 349661 156901 -477750 -828681 -474587 -14115
35014 -14115 -107451 -430897 -315183 92774 180347 10845 117168 338985 -27534 -844497
35004 -844497 -1030322 -211233 555342 301138 -489649 -790720 -572464 -508613 -664552 -521886
34994 -521886 -85577 58293 -190665 -253376 63105 138336 -459512 -1215401 -1388287 -1021427
34984 -1021427 -733411 -789303 -854581 -570090 -21785 368132 269231 -183907 -412819 16037
34974 16037 761530 945396 178005 -911853 -1380358 -983742 -276186 100945 -9750 -255218
34964 -255218 -106195 608095 1326194 1196761 164961 -721361 -539228 260434 456155
34955 456155 -226333 -771380 -380476 467355 891965 885091 1020674 1294927 1074721 149517
34945A49517j029226n19615o742K51097M30582N01271K54748j00977r8931J91487
34935B3211K11777j29373k57993P1334L11989O4886k06005O914L01591M739o26686
34924b23616p16935j29385L53844K46563n8161j04485l3461j01157j54763j753
34914i23309J63855J14376M417N7346J47805N6712j23877j72921q7220M3721K44965
34903d74130M47922L73008l7246l52054k00603J70521K89019J52826P9564Q5987
34893E34814n1817k50413j87008J06576K33409N9660j09974o0939N5803Q4030
34883D14141J04178J71079J41478p8362l53671m86145l66298J5575M53820N13492
34873E29287J3850n37386m74029O5387K78314r1814l50682K7298N22440L70046
$$ plain form
34945 149517 -879709 -1399324 -1406066 -1154969 -724387 -223116 31632 -69345 -168276 23211
34935 23211 234988 105615 -152378 -81044 230945 295831 89826 96740 398331 403070 -223616
34924 -223616 -940551 -1069936 -716092 -469529 -527690 -632175 -665636 -766793 -921556 -923309
34914 -923309 -759454 -645078 -640661 -583315 -435510 -378798 -502675 -675596 -762816 -719095 -474130
34903 -474130 -26208 346800 309554 -42500 -243103 -72582 216437 369263 448827 534814
34893 534814 482997 232584 45576 152152 385561 445221 335247 274308 330111 414141
34883 414141 518319 689398 830876 752514 398843 -87302 -453600 -438025 15795 529287
34873 529287 543137 5751 -468278 -402891 -124577 -216391 -567073 -539775 -17335 352711
34863C52711k35498m40455j4871L78752K18513j97016l04829n5597J68676J49722
34853B0108K7712j1110K1950L8923P5482K18574L58672K05772l07909p75741p17358
34842h44925k01086K16108K11226M7982R0113K92034M04045M00753L91549L01897
34832A309696j2923m39730o95040o67658m26800k4933M01020M86036K1266n68802
34822f17868n94749q74N48225N83043L56245K51124J63360j36064m15573k89248
34812a52379R2329J92250j21965m20912l76573j36724N0567J56405J67245j5634
34802e65391k47339j16449M27804P85172M55744j98281m20212r0759K32557J84883
34792D47729p4547l62548o65070p48373k59746N40272Q09533K69880k95682j79683
$$ plain form
34863 352711 117213 -323242 -338113 40639 259152 62136 -242693 -298290 -129614 20108
34853 20108 47820 36710 58660 97583 173065 391639 750311 956083 648174 -127567 -844925
34842 -844925 -1046011 -829903 -618677 -570695 -480582 -188548 215497 616250 1007799 1309696
34832 1309696 1296773 857043 162003 -505655 -932455 -957388 -556368 -70332 -49066 -617868
34822 -617868 -1212617 -1213491 -665266 -82223 274022 525146 688506 552442 136869 -152379
34812 -152379 -60050 132200 10235 -410677 -787250 -923974 -873407 -717002 -549757 -565391
34802 -565391 -812730 -929179 -501375 283797 739541 541260 121048 30289 262846 447729
34792 447729 373182 10634 -654436 -1402809 -1662555 -1122283 -312750 -42870 -338552 -518235
34782e18235K21061J69002j64746q3535L46220L82211j02856l99567j51197J50076
34772a51566J17675O9827K83537M14743J61196j45040j47591r7418l02005m65109
34762b61751k15246J46251J11752j61918j51063J28433K23779P6006M2706J84667
34752A23616J95525M32j85899l42922n72496o15366j19532O14347Q54789M66904
34742D19398M0203p2383j11805k00125p8674J99661J25081l56245n48660q1004
34732f64553M47683M26178J40966J02999J25098j60448m12133r6418M66261M84800
34722H60433n6502l97342j84642J43858J86161N1807q8631k75927m35219l29089
34712e25093J4470K77304L19302K44916M3830l16691n00936j34903M64701N69486
$$ plain form
34782 -518235 -297174 -128172 -292918 -376453 -30233 351978 249122 -150445 -301642 -151566
34772 -151566 -33891 35936 319473 734216 895412 750372 602781 505363 203358 -261751
34762 -261751 -476997 -330746 -218994 -380912 -531975 -403542 -179763 -103757 -61051 123616
34752 123616 319141 319573 133674 -209248 -781744 -1397110 -1516642 -902295 -47506 419398
34742 419398 459601 387218 275413 75288 -3386 196275 321356 -34889 -583549 -664553
34732 -664553 -216870 209308 350274 453273 578371 417923 5790 -90628 375633 860433
34722 860433 803931 406589 221947 365805 551966 603773 515142 239215 -196004 -525093
34712 -525093 -510623 -233319 85983 330899 374729 58038 -442898 -577801 -113100 456386
34702D56386J18201k02027q4000j8895l17894n21781k32268J76662K19995P8943
34692c26678J46104L06232K56235J01808O3357n345k46022l56824j01495J64561
34682A933Q7137k2390J90156L15808j40589o87816m74399K58913M58804p4301
34672h6744m35661j46494J89424N7033j88678j45288k9872k9437J49552N44456
34662a21709N82297O5771k87229L2156M31206K17352k43200k57940l2966j49458
34652B36280l71569j12697L07842R6695n32198n57219J77402O94561M40260k7645
34642C51712j56761j24458j13069Q8906L43544N1360p04495r18615j96592M74726
34632i03742K63509j85419M9500N39953L21888l22354l13244L27986M89147j38492
$$ plain form
34702 456386 574587 372560 288560 269665 -48229 -570010 -802278 -625616 -405621 -326678
34692 -326678 -180574 125658 381893 483701 547058 541713 295691 -61133 -162628 1933
34682 1933 89070 66680 256836 572644 432055 -255761 -730160 -471247 -12443 -86744
34672 -86744 -522405 -668899 -479475 -422442 -611120 -756408 -786280 -815717 -666165 -121709
34662 -121709 460588 526359 239130 271286 702492 919844 676644 418704 385738 236280
34652 236280 -135289 -247986 59856 156551 -375647 -932866 -755464 -60903 379357 351712
34642 351712 194951 70493 -42576 46330 389874 441234 -263261 -1181876 -1378468 -903742
34632 -903742 -640233 -825652 -776152 -236199 85689 -236665 -549909 -221923 267224 128732
34622A28732n75541k31543K06260O4705k27992l9526L36287K46258k08065m09727
34612g10152k16886r757K7510M5238O9135m4914k18829j65141J58907M24798L19663
34601c20428j12669m99749m18658K07320Q70842Q66391J10817o55599p30637k65995
34591i48365Q3517P1502r873M2229Q6501L1536M3571K27731M19085M28070K55757
34580G31261k6456l63990n85153m51608k6077K29039k7823n10439n84564o0101
34570a675911N30332N63285P7722l19437k64211n7230j11307k56676m173N84033
34560i33573Q13243L23821l31346m36044p2706J41942L3418m358K09012L44682
34550H8091J80455k1209q846J5147k08788m71021l64809P0352L48513J53826l10407
$$ plain form
34622 128732 -446809 -678352 -472092 -407387 -635379 -674905 -338618 -92360 -300425 -710152
34612 -710152 -927038 -936795 -909285 -864047 -794912 -839826 -1058655 -1223796 -1064889 -640091 -320428
34601 -320428 -433097 -932846 -1351504 -1144184 -273342 593049 703866 48267 -682370 -948365
34591 -948365 -864848 -793346 -803219 -760990 -674489 -642953 -599382 -371651 47434 475504 731261
34580 731261 704805 340815 -244338 -695946 -722023 -492984 -520807 -1031246 -1615810 -1675911
34570 -1675911 -1145579 -582294 -504572 -824009 -1088220 -1145450 -1256757 -1513433 -1517606 -933573
34560 -933573 -120330 203491 -127855 -563899 -636605 -494663 -461245 -465603 -256591 88091
34550 88091 268546 247337 238491 253638 44850 -426171 -790980 -720628 -372115 -218289 -528696
34539e28696n94350m36703N1171M63478L94651j51284o45248n25022J46407O96204
34529a129392O13637J36306j16800K7143J46400m9853k18621P7218N69520N49214
34519F04772n9215m71153j60994L30195K13166l33250m71319l7440K55779K5806
34509a03653j97961N6193L70857J45393l82730n02825j23720J94036J93589K36071
34499a14750N69624Q48670O24663l9685o69345q60911n29538R8698N94022O12752
34489A134200K30698j36244k25245j82467k40809l38879k45677M2855K44798J49990
34479D33220j01048j84272k696J75592O6111k13433k54556O6461L38679J30928
34469D54986l84934o02487k65229J91202K06721j79197l89225p1390M14594M41573
$$ plain form
34539 -528696 -1123046 -1559749 -1508578 -1045100 -650449 -801733 -1446981 -1972003 -1825596 -1129392
34529 -1129392 -515755 -379449 -496249 -469106 -322706 -372559 -591180 -513962 55558 604772
34519 604772 545557 74404 -86590 243605 456771 123521 -347798 -385238 -129459 -103653
34509 -103653 -301614 -245421 125436 270829 -111901 -614726 -738446 -544410 -350821 -114750
34499 -114750 454874 1303544 1928207 1888522 1219177 358266 -171272 -72574 521448 1134200
34489 1134200 1364898 1228654 1003409 820942 580133 241254 -4423 38432 283230 433220
34479 433220 332172 147900 145204 320796 386907 173474 -81082 -14621 324058 454986
34469 454986 70052 -532435 -797664 -606462 -399741 -578938 -968163 -1039553 -624959 -183386
34459a83386l6128l66449o8830M69162N25500R4128j44416P6648J94907k00013
34449C61123n97629l43883K73477M43089Q1810j27832R4171K28870r4111m74715
34439a55630m13378m3070K09239K59988K60345J95793P780j40843j04310m8066
34429B7848j53093k34968m1777K34900J75313k03303m05118j25814L56771N60303
34419A91062L46425o718j47940l123J62382M6796k90498m56733k53691m931j22649
34408e39618m55506m02878K50809R13584Q39994Q2237n14600l41067K23088L47531
34398D03574j18904m97457l12290M7759K4652k18706j61152J41545J94227M28
34388d96324O9058M30501M77320L4722k30461Q8311L82705N062o20118o27109
$$ plain form
34459 -183386 -219514 -585963 -654793 -185631 339869 433997 289581 366229 561136 361123
34449 361123 -236506 -580389 -306912 136177 217987 90155 184326 413196 319085 -155630
34439 -155630 -569008 -612078 -402839 -142851 117494 313287 321067 180224 75914 27848
34429 27848 -125245 -360213 -401990 -167090 8223 -195080 -600198 -726012 -369241 191062
34419 191062 537487 530769 382829 379706 542088 588884 298386 -158347 -412038 -416969 -539618
34408 -539618 -995124 -1398002 -1147193 -233609 606385 688622 174022 -167045 56043 403574
34398 403574 284670 -212787 -525077 -477318 -452666 -671372 -832524 -690979 -496752 -496324
34388 -496324 -427266 3235 480555 515277 284816 373127 755832 760894 140776 -486333
34378d86333l4749L58099J72653k02168l54950k72878n1221K35142L77799K42866
34368a5740P8643J66697L09261J65678r4467p9568O5534r5157l98370k45502L32384
34357A89393O12172L08921n8911j32979j88317l43506j92554K99341L93523k68871
34347F18212q59834n12841L22704N80205J87050k5174K08895K68497j47538m87516
34337A52660l39033j38041l79897p12434m42405L63157R03501P12711J77061j24438
34327A72842j59660k36872l47731j66577L15915O09030L77022o5750k28071j40080
34317A30068j67918l24920k83053j4602J24158J6961l0574J24912K11748Q3991
34307a29229J2327J51777J97474o7168l04284j29062K51194L40483N0024k92120
$$ plain form
34378 -486333 -521082 -162983 9670 -192498 -547448 -820326 -871547 -636405 -258606 -15740
34368 -15740 62903 229600 538861 704539 610072 530504 596038 500881 102511 -142991 189393
34357 189393 801565 1110486 1051575 918596 730279 386773 194219 493560 887083 618212
34347 618212 -241622 -754463 -431759 148446 335496 310322 519217 787714 640176 152660
34337 152660 -186373 -324414 -704311 -1416745 -1859150 -1495993 -592492 120219 297280 172842
34327 172842 13182 -223690 -571421 -737998 -422083 186947 563969 498219 270148 130068
34317 130068 -37850 -362770 -645823 -660425 -536267 -519306 -549880 -424968 -213220 -129229
34307 -129229 -116902 34875 232349 165181 -139103 -268165 -16971 323512 373536 81416
34297H1416m09897k35727J53841M58052L02466k17772m83851j82135K08874J68361
34287a56372p2205j3402K54649L16716J96595J53911L1134m07420p33224l44878
34277g74496M11768N56484n8643n33513l27618M8267M7742r0135J0714J53774
34267e55656M8763j04391m0407O8896K6114M6482L03325M91831L36736R5050N1265
34256G68008l3379l98376o53897l50102J75045K62107L741N8015M92123O34524
34246I57809J72991l44467l52880j8703J67568R1024l0096o3751k8294N7184J45392
34235G53777J27046j2095j28683j20713n1868j1307j1996q4838k84942n23248
34225c48867n69465l20442O5420L52608M12635K27702q3678k31234m106L74854
$$ plain form
34297 81416 -328481 -564208 -410367 47685 350151 132379 -351472 -533607 -324733 -156372
34287 -156372 -228577 -241979 12670 329386 525981 679892 711026 303606 -429618 -774496
34277 -774496 -362728 193756 135113 -398400 -726018 -677751 -630009 -720144 -709430 -555656
34267 -555656 -506893 -611284 -651691 -582795 -556681 -510199 -206874 284957 621693 716743 768008
34256 768008 734629 336253 -317644 -667746 -492701 -230594 -226853 -168838 323285 957809
34246 957809 1130800 786333 433453 414750 582318 673342 643246 579495 551201 608385 753777
34235 753777 880823 868728 740045 619332 567464 556157 544161 459323 174381 -348867
34225 -348867 -918332 -1238774 -1173354 -820746 -408111 -180409 -264087 -495321 -499427 -124573
34215a24573M26978O7911k22234p1041K50082K59492k5013k10299j95983k36812
34205h1492l64012k66191J01350K75385k7268l62955j52480M09725N62325N1557
34195A45944n13293n04362m4918K97248K60490M7080n8945M5126K79510M36684
34185C90564L44108J11281M6339J93751K08703j02615m11916l47074p0319Q681
34175C71503j27512j81444o7313R1018K90139M74194K72896m44811r73908n53849
34165h49087L59696N80008r093k83221J99140M03133l38406r47330k53047R35852
34155b02355R24040k31502q16960j21403O22836L28584l62641l37409K49746M62949
34145E15885J31931p3570J69825M04359J48843m32876p28740l53382L69653O32728
$$ plain form
34215 -124573 302405 370316 148082 77041 327123 586615 561602 351303 155320 -81492
34205 -81492 -445504 -711695 -610345 -334960 -362228 -725183 -877663 -467938 94387 145944
34195 145944 -367349 -871711 -916629 -619381 -358891 -311811 -370756 -325630 -46120 390564
34185 390564 734672 845953 892292 1086043 1294746 1192131 780215 433141 362822 371503
34175 371503 243991 62547 -4766 86252 376391 850585 1123481 678670 -295238 -849087
34165 -849087 -489391 90617 81524 -201697 -2557 400576 62170 -885160 -1138207 -202355
34155 -202355 721685 490183 -326777 -448180 174656 503240 140599 -196810 52936 515885
34145 515885 647816 574246 744071 1148430 1297273 864397 135657 -217725 151928 784656
34135G84656P9805n92186m49926L16545N79044m9452o15054l39148J78232L4583
34125g2901m64818l94213K06124M73945K11600O7895K56289K32979j62819l27479
34115B6602l223K21200o658j43516K25008N52345K71084j69803p6751K73696J53237
34104A323221l26359m61925k08529j21453k11245K7820M58210L49859k22814k54183
34094C52602M87073Q27390n600j014122q65309J30869O40741L37518M8298J52305
34084A091765J31569k36385m26356j85710p987k08014l79102j93751K9931L0129
34074c53911J37916N52373P40859K36413m89338o75069l94040k72735l69159j58809
34064a045500M25546P30711L31271l46016o02598k92803J59914L28074J76431
$$ plain form
34135 784656 864461 272275 -177651 138894 717938 668486 53432 -285716 -107484 -72901
34125 -72901 -537719 -931932 -725808 -251863 -40263 27632 283921 516900 354081 26602
34115 26602 23379 244579 237921 94405 319413 871758 1142842 973039 896288 1169984 1323221
34104 1323221 996862 534937 326408 204955 -6290 21530 479740 829599 606785 352602
34094 352602 839675 1667065 1661465 647343 -217966 -87097 553644 891162 939460 1091765
34084 1091765 1223334 986949 560593 374883 366896 158882 -220220 -413971 -384040 -353911
34074 -353911 -215995 336378 1077237 1313650 824312 149243 -244797 -517532 -886691 -1045500
34064 -1045500 -619954 110757 442028 96012 -506586 -799389 -639475 -311401 -134970
34055a34970K709O5965K65350K83972P5492m9314M7256N9907k22332m65909k96408
34044c68282N1855J05230o2184m708K69671L04675K2334j10761J22852L17322
34034F48004R0028l67716o21675n01517j06386L23006M07854o4932o79540o92911
34024a565785k5180N17935L12903k44767l70555K8990L98823M07488K57271K11599
34014g1278K65798L15554L16940K17342k9935l14615m07093k26983J2660k131
34004G6259l40970o92781o56850k27527J46622J29911n2490M851K43035K87004
33994a082936J33917J67011M45048N34154K17409j51200k44358k11345k28664
33985d20964j05634K50601M29362R0594l91888m09871j3811K21296Q0539q9078
$$ plain form
34055 -134970 -132261 -66296 199054 483026 558518 509204 556460 616367 394035 -71874 -368282
34044 -368282 -316427 -211197 -273381 -278089 -8418 296257 318591 207830 330682 648004
34034 648004 738032 370316 -251359 -752876 -859262 -536256 -128402 -193334 -872874 -1565785
34024 -1565785 -1590965 -1073030 -760127 -1004894 -1375449 -1346459 -947636 -540148 -282877 -71278
34014 -71278 194520 510074 827014 1044356 1014421 699806 292713 65730 78390 76259
34004 76259 -264711 -957492 -1614342 -1841869 -1695247 -1565336 -1617826 -1612975 -1369940 -1082936
33994 -1082936 -949019 -782008 -336960 197194 414603 263403 19045 -192300 -420964
33985 -420964 -526598 -275997 153365 243959 -147929 -557800 -571611 -350315 -269776 -358854
33975c58854l0781P6333J6405j07442p2392J38798L36158L36124J26959j35879
33965C25429l08058l95260m19623k66767Q2207L01380J21001j23250P4608M46411
33955a61922K33563m56377n62120K31492P57770J23705p55788m96804O01077J069841
33945E84437N12159r6822j98863k86798n91877n26180J11346N48170K58015j82283
33935A31304q2290L06868L56463L1963k82371l95222k68760J10645M37155K43596
33925E89351k97632m18508K6132K11383k67902n84520l4526O66854M81418k44783
33915A27267l79514J25168K57984k93242o73541l02840L06872M96997L35636J63235
33905A64022j0120k38709l20917j20011J82555L79144M18984K19860k34809n59678
$$ plain form
33975 -358854 -389635 -313302 -296897 -404339 -476731 -337933 -1775 334349 461308 325429
33965 325429 17371 -377889 -797512 -1064279 -982072 -680692 -559691 -682941 -608333 -161922
33955 -161922 71641 -384736 -946856 -715364 42406 166111 -589677 -1086481 -485404 584437
33945 584437 1096596 999774 800911 514113 -77764 -603944 -492598 55572 313587 131304
33935 131304 49014 355882 712345 744308 461937 66715 -202045 -91400 345755 589351
33925 589351 291719 -126789 -100657 110726 -157176 -741696 -776222 -109368 372050 127267
33915 127267 -252247 -127079 130905 -162337 -835878 -1138718 -831846 -334849 787 164022
33905 164022 153902 -84807 -405724 -525735 -343180 35964 454948 674808 439999 -119679
33895a19679l13270K13621K29916l27722n49627P6909Q00492P09525O6208k34564
33885E51809p0397m9352l03419l00469R3578K85026l1077l17984j11621J81440
33875g2466Q726l29083j71541L21264L61506j45280l87416K5377M03488J36142
33865A50717k67854m4065N01118M60428j95256o07063m04477q4370N3165K97783
33855a39874O01114L43850m61101p69430n1068O95956M17486l21538k89389L99859
33845D25865N72840k0647m24935j68467J21979J4934q9703j643k10468p61529
33835e41774p91770O6654Q08820M79912l39111m71295O4967K99772n2933l20684
33825g97442r9352K47724L58270L08099J90688l2889j85281k3764K04312J2492
$$ plain form
33895 -119679 -432949 -219328 10588 -317134 -866761 -789852 10640 720165 786373 551809
33885 551809 481412 432060 128641 -171828 -78250 206776 175699 -142285 -253906 -72466
33875 -72466 -63740 -392823 -564364 -243100 118406 -26874 -414290 -388913 14575 150717
33865 150717 -117137 -161202 339916 800344 605088 -1975 -406452 -490822 -437657 -139874
33855 -139874 461240 805090 343989 -425441 -476509 219447 636933 315395 26006 425865
33845 425865 998705 978058 553123 384656 506635 521569 431866 430223 219755 -541774
33835 -541774 -1333544 -1266890 -458070 21842 -317269 -788564 -723597 -423825 -476758 -797442
33825 -797442 -896794 -649070 -290800 17299 207987 175098 -10183 -33947 170365 182857
33815A82857m50823m75309J17476O49438N88801K08404n6958k36751l90540j97596
33805f1001M26338Q13931L58251m79747p12707k16738J68667o2620m33895l55144
33795e54665J0411J60838O1015J7500M0662r7047k73195p9426M27417N88757O0433
33784C62700n68206n26645M5140L26058M1259j86319J32714N85025N18255K0056
33774G50037l06030k73243k21664k94047k17306J01497L03970J33615j49709j71824
33764c44704M8127K39560K66901J40376j10831l35455k70672Q0952L08218J12067
33754A34539k35185k68183J2105K12126J55278M4180N8325J23773R2242r0021
33744B39179l52996m58924j51946M02229N79887Q2294n09616m69723L9919L24790
$$ plain form
33815 182857 -267966 -743275 -625799 23639 612440 820844 763886 527135 136595 -61001
33805 -61001 365337 1179268 1537519 1057772 345065 128327 296994 234374 -199521 -554665
33795 -554665 -544254 -383416 -322401 -304901 -264239 -361286 -634481 -713907 -286490 302267 362700
33784 362700 -205506 -732151 -687011 -360953 -319694 -506013 -373299 211726 729981 750037
33774 750037 444007 170764 -50900 -344947 -562253 -460756 -156786 -23171 -172880 -344704
33764 -344704 -296577 -57017 209884 350260 239429 -96026 -366698 -285746 22472 134539
33754 134539 -100646 -368829 -356724 -144598 10680 54860 113185 236958 329200 239179
33744 239179 -113817 -572741 -724687 -322458 257429 339723 -169893 -639616 -599697 -274907
33734b74907L16406M90160O99067K05679q53713j211014l18581N93927K58354
33725i4622o98954p57456J54902P00114K94850j72005M0826M42021L00559k45582
33715c5347o16759o08013k98606K40909P21005O79042J60655j71912J9950K48971
33705C39895J5546m41956o30028m89680j78697K79327O85633O01974R6842o9016
33695B09840M16934P52928K18419n97621o46923R077M46276L09562k078k88173
33685H28241o37576p48682k28807M89132N67268Q3546j21455P9361l9168n57067
33675b85207n58602K65417Q68210M12351m06904m46213K38966P12150N70334J83574
33665A554076j26855l80280n84521o68136o40448m73063p9352L28110K94413j38963
$$ plain form
33734 -274907 41499 531659 1230726 1436405 582692 -628322 -946903 -352976 -94622
33725 -94622 -793576 -1551032 -1396130 -696016 -401166 -573171 -532345 -90324 210235 -35347
33715 -35347 -652106 -1260119 -1558725 -1317816 -596811 82231 242886 70974 90924 339895
33705 339895 355441 -86515 -716543 -1206223 -1384920 -1105593 -419960 182014 278856 209840
33695 209840 626774 1379702 1598121 1000500 353577 362654 808930 1118492 1116414 828241
33685 828241 190665 -558017 -786824 -297692 269576 353122 231667 311028 271860 -285207
33675 -285207 -843809 -578392 289818 702169 295265 -150948 88018 800168 1370502 1554076
33665 1554076 1427221 1046941 462420 -205716 -846164 -1319227 -1398579 -1070469 -776056 -915019
33655i15019k83784J72855N67909K61104l05423k77824K82785N61781K66172o7868
33645B62688k1113J55371O6362k44410m15470k18271J86144L61642R2185k27200
33635b072n0889M16516L74388k89305o15639J1106Q01444O80688j24774n47693
$$ plain form
33655 -915019 -1198803 -1025948 -458039 -196935 -502358 -780182 -497397 64384 330556 262688
33645 262688 241575 396946 463308 218898 -196572 -414843 -228699 132943 225128 -2072
33635 -2072 -52961 363555 737943 448638 -167001 -155895 645549 1326237 1201463 653770
$$ [...]
##END NTUPLES=NMR SPECTRUM
##END=
