##TITLE=31Pdec_SR13_K
 CDCl3, 24 sc
 25.2.2020
##JCAMPDX= 6.0         $$ Bruker NMR JCAMP-DX V2.0
##DATA TYPE= NMR SPECTRUM
##DATA CLASS= NTUPLES
##ORIGIN= UXNMR, Bruker Analytische Messtechnik GmbH
##OWNER= root
$$ XWIN-NMR		Version 3.5
$$ Tue Feb 25 14:21:37 2020 Russian Standard Time (UT+4h)  she@DPX200
##.OBSERVE FREQUENCY= 81.013821
##.OBSERVE NUCLEUS= ^31P
##.ACQUISITION MODE= SIMULTANEOUS
##.ACQUISITION SCHEME= undefined
##.AVERAGES= 24
##.DIGITISER RES= 17
##SPECTROMETER/DATA SYSTEM= spect
##.PULSE SEQUENCE= zgpg30
##.SOLVENT NAME= CDCl3
##.SHIFT REFERENCE= (INTERNAL, CDCl3, 0, 182.463)
##AUDIT TRAIL= $$ (NUMBER, WHEN, WHO, WHERE, WHAT)
$$ ##TITLE= Audit trail, XWIN-NMR		Version 3.5
$$ ##JCAMPDX= 5.01
$$ ##ORIGIN= Bruker BioSpin GmbH
$$ ##OWNER= she
$$ F:/spectra/data/she/nmr/P31/1/pdata/1/auditp.txt
$$ ##AUDIT TRAIL=  $$ (NUMBER, WHEN, WHO, WHERE, WHAT)
(   1,<2020-02-25 14:20:31.06 +0400>,<she>,<DPX200>,
      <created by zg, POWCHK disabled, PULCHK disabled
       configuration hash MD5:
       00 E9 B6 7A A2 85 ED C7 34 08 36 98 17 FE 4E 26
       data hash MD5: 32K
       DB 9C 36 F1 31 1C 13 35 E3 31 4F 4C BC C2 2B 05>)
(   2,<2020-02-25 14:20:34.18 +0400>,<she>,<DPX200>,
      <Start of raw data processing
       efp BC_mod = 2 LB = 1 FT_mod = 6 PKNL = 1 PHC0 = -1516.351 PHC1 = 465.4013 SI = 64K 
       data hash MD5: 64K
       9F C7 7B 6E 25 33 0A 3B 94 C5 E9 83 C4 22 81 86>)
(   3,<2020-02-25 14:20:58.50 +0400>,<she>,<DPX200>,
      <pk PHC0 = 57.75999 PHC1 = 76.00003 
       data hash MD5: 64K
       5E 5D D9 28 48 A8 85 D2 56 A4 16 C4 C3 62 4F DA>)
(   4,<2020-02-25 14:21:01.56 +0400>,<she>,<DPX200>,
      <abs ABSG = 5 
       data hash MD5: 64K
       6C C5 0C 02 C7 08 66 BD D6 F1 7D 67 EC B3 25 73>)
(   5,<2020-02-25 14:21:14.04 +0400>,<she>,<DPX200>,
      <abs ABSG = 5 
       data hash MD5: 64K
       E8 09 A5 8E 2F FC EA BD EB 14 80 96 31 26 7B B6>)
$$ ##END=
$$ 
$$ hash MD5
$$ 92 B0 2A 44 32 18 7E C5 DE 26 D8 19 FA 55 EC 9B
##$RELAX= 
##$RELAX= 
##$RELAX= 
##$RELAX= 
##$RELAX= 
##$RELAX= 
##$RELAX= 
##$RELAX= 
$$ Bruker specific parameters
$$ --------------------------
##$DU= <F:/spectra>
##$EXPNO= 1
##$NAME= <P31>
##$PROCNO= 1
##$TYPE= <nmr>
##$USER= <she>
##$AMP= (0..31)
100 100 100 100 100 100 100 100 100 100 100 100 100 100 100 100 100 100 
100 100 100 100 100 100 100 100 100 100 100 100 100 100 
##$AQSEQ= 0
##$AQ_mod= 1
##$AUNM= <au_zg>
##$AUTOPOS= <>
##$BF1= 81.014009
##$BF2= 200.13
##$BF3= 200.13
##$BF4= 200.13
##$BF5= 200.13
##$BF6= 200.13
##$BF7= 200.13
##$BF8= 200.13
##$BYTORDA= 1
##$CFDGTYP= 0
##$CFRGTYP= 5
##$CHEMSTR= <none>
##$CNST= (0..31)
1 1 145 1 1 1 1 1 1 1 1 1 1 1 1 1 1 1 1 1 1 1 1 1 1 1 1 1 1 1 1 1 
##$CPDPRG= <waltz16>
##$CPDPRG1= <>
##$CPDPRG2= <waltz16>
##$CPDPRG3= <>
##$CPDPRG4= <mlev>
##$CPDPRG5= <mlev>
##$CPDPRG6= <mlev>
##$CPDPRG7= <mlev>
##$CPDPRG8= <mlev>
##$CPDPRGB= <>
##$CPDPRGT= <>
##$D= (0..31)
0 1 0 0 0 0 0 0 0 0 0 0.03 2e-05 3e-06 0 0 0 0 0 0 0 0 0 0 0 0 0 0 0 0 
0 0 
$$ [...]
##$SUBNAM3= <"">
##$SUBNAM4= <"">
##$SUBNAM5= <"">
##$SUBNAM6= <"">
##$SUBNAM7= <"">
##$SUBNAM8= <"">
##$SUBNAM9= <"">
##$SW= 369.568048894756
##$SWIBOX= (0..15)
0 1 3 0 0 0 0 0 0 0 0 0 0 0 0 0 
##$SW_h= 29940.119760479
##$TD= 32768
##$TD0= 1
##$TE= 0
##$TE2= 300
##$TE3= 300
##$TEG= 300
##$TL= (0..7)
0 120 53 12 22 120 120 120 
##$TP= (0..7)
150 150 150 150 150 150 150 150 
##$TP07= 0
##$TPNAME0= <>
##$TPNAME1= <>
##$TPNAME2= <>
##$TPNAME3= <>
##$TPNAME4= <>
##$TPNAME5= <>
##$TPNAME6= <>
##$TPNAME7= <>
##$TPOAL= (0..7)
0.5 0.5 0.5 0.5 0.5 0.5 0.5 0.5 
##$TPOFFS= (0..7)
0 0 0 0 0 0 0 0 
##$TUNHIN= 0
##$TUNHOUT= 0
##$TUNXOUT= 0
##$USERA1= <user>
##$USERA2= <user>
##$USERA3= <user>
##$USERA4= <user>
##$USERA5= <user>
##$V9= 5
##$VALIST= <valist>
##$VCLIST= <CCCCCCCCCCCCCCC>
##$VD= 0
##$VDLIST= <DDDDDDDDDDDDDDD>
##$VPLIST= <PPPPPPPPPPPPPPP>
##$VTLIST= <TTTTTTTTTTTTTTT>
##$WBST= 1024
##$WBSW= 4
##$XGAIN= (0..3)
0 0 0 0 
##$XL= 0
##$YL= 0
##$YMAX_a= 10505
##$YMIN_a= -10310
##$ZGOPTNS= <>
##$ZL1= 120
##$ZL2= 120
##$ZL3= 120
##$ZL4= 120
##$ABSF1= 182.463
##$ABSF2= -187.1042
##$ABSG= 5
##$ABSL= 3
##$ALPHA= 0
##$AQORDER= 0
##$ASSFAC= 0
##$ASSFACI= 0
##$ASSFACX= 0
##$ASSWID= 0
##$AUNMP= <proc_1d>
##$AZFE= 0.1
##$AZFW= 0.5
##$BCFW= 0
##$BC_mod= 2
##$BYTORDP= 0
##$COROFFS= 0
##$CY= -3
##$DATMOD= 1
##$DC= 0
##$DFILT= <>
##$DTYPP= 0
##$F1P= 0
##$F2P= 0
##$FCOR= 1
##$FTSIZE= 65536
##$FT_mod= 6
##$GAMMA= 0
##$GB= 0
##$INTBC= 1
##$INTSCL= 5.30512e-09
##$ISEN= 30
##$LB= 1
##$LEV0= 0
##$LPBIN= 0
##$MAXI= 10000
##$MC2= 0
##$MEAN= 0
##$ME_mod= 0
##$MI= 50
##$NCOEF= 0
##$NC_proc= -7
##$NLEV= 6
##$NOISF1= 182.463
##$NOISF2= 159.3651
##$NSP= 0
##$NTH_PI= 0
##$NZP= 0
##$OFFSET= 182.463
##$PC= 4
##$PHC0= -1458.591
##$PHC1= 541.4014
##$PH_mod= 1
##$PKNL= yes
##$PPARMOD= 0
##$PSCAL= 0
##$PSIGN= 0
##$REVERSE= no
##$SF= 81.0140089999434
##$SI= 65536
##$SIGF1= 159.3651
##$SIGF2= -187.1042
##$SINO= 113.3802
##$SIOLD= 16384
##$SREGLST= <1H.CDCl3>
##$SSB= 0
##$STSI= 65536
##$STSR= 0
##$SW_p= 29940.119760479
##$SYMM= 0
##$S_DEV= 0
##$TDeff= 32768
##$TDoff= 0
##$TI= <>
##$TILT= no
##$TM1= 0
##$TM2= 0
##$TOPLEV= 0
##$USERP1= <user>
##$USERP2= <user>
##$USERP3= <user>
##$USERP4= <user>
##$USERP5= <user>
##$WDW= 1
##$XDIM= 65536
##$YMAX_p= 423058295
##$YMIN_p= -27862936
$$ End of Bruker specific parameters
$$ ---------------------------------
##NTUPLES= NMR SPECTRUM
##VAR_NAME=  FREQUENCY,     SPECTRUM/REAL,   SPECTRUM/IMAG
##SYMBOL=    X,             R,               I
##VAR_TYPE=  INDEPENDENT,   DEPENDENT,       DEPENDENT
##VAR_FORM=  AFFN,          ASDF,            ASDF
##VAR_DIM=   65536,         65536,           65536
##UNITS=     HZ,            ARBITRARY UNITS, ARBITRARY UNITS
##FACTOR=    0.456856943014862, 1,           1
##FIRST=     14782.0589164792, 0,            0
##LAST=      -15158.0608439998, 0,           0
##MIN=       -15158.0608439998, -27862936,   0
##MAX=       14782.0589164792, 423058295,    0
$$ Real data points
##PAGE= N=1
##DATA TABLE= (X++(R..R)), XYDATA
$$ [...]
$$ plain form
45678 1001928 552393 -921055 -1265540 120483 1264471 486108 -1549738 -3499384 -5241191
45669 -5241191 -7002876 -8199836 -8466408 -8634992 -9435216 -10133294 -9504414 -7423866 -4856002
45660 -4856002 -3156011 -3628293 -6215871 -8171767 -6188654 -1031022 2163007 17650
45652 17650 -4679316 -7022215 -6488149 -6194331 -6916580 -5856173 -1702029 2637955 3778786
45643 3778786 1868504 -594550 -2008420 -2222421 -1396307 21799 1020509 1031599 724978
45634 724978 1026917 1934549 2819383 3124063 2319900 183219 -2283024 -3204330 -1824599
45625 -1824599 657630 2656237 3504092 2782967 -60893 -4342524 -7694318 -8392471 -7319566
45616 -7319566 -6520446 -6708023 -7259303 -7566116 -7031314 -4812279 -1250336 1272831 719320
$$ packed form
45678A001928m49535j473448l44485J386023J143988p78363k035846j949646j741807
45669e241191j761685j196960k66572j68584q00224o98078O28880K080548K567864
45660d856002J699991m72282k587578j955896J983113N157632L194029k145357
45652A7650m696966k342899N34066K93818p22249J060407M154144M339984J140831
45643C778786j910282k463054j413870k14001Q26114J418106R98710J1090l06621
45634G24978L01939R07632Q84834L04680q04163k136681k466243r21306J379731
45625a824599K482229J998607Q47855p21125k843860m281631l351794o98153J072905
45616g319566P99120j87577n51280l06813N34802K219035L561943K523167n53511
$$ plain form
45607 719320 -1899205 -3901789 -4453873 -4804413 -5455216 -5311288 -3761270 -1596618 460921
45598 460921 2351174 3545723 3297708 2538642 3498590 6449917 8530960 7024995 2590768
45589 2590768 -1745817 -3650576 -2697802 80528 2665917 3161208 1663033 283292
45581 283292 440748 1103902 597608 -1083302 -2973461 -4888012 -6810095 -7479572 -5635152
45572 -5635152 -2394908 -472700 -758613 -1263839 -55877 2010529 2487287 721849 -1009508
45563 -1009508 -176346 2653029 4144279 2400335 -192747 236931 4004446 7728230
45555 7728230 9237713 9961335 11433055 12205757 10431342 7433833 5982546 6308652 6581045
45546 6581045 6405853 6965105 8195964 8757034 8611899 8707861 8113589 4793922 -170127
$$ packed form
45607G19320k618525k002584n52084l50540o50803J43928J550018K164652K057539
45598D60921J890253J194549k48015p59066R59948K951327K081043j505965m434227
45589B590768m336585j904759R52774K778330K585389M95291j498175j379741
45581B83292J57456O63154n06294j680910j890159j914551j922083o69477J844420
45572e635152L240244J922208k85913n05226J207962K066406M76758j765438j731357
45563a009508Q33162K829375J491250j743944k593082M29678L767515L723784
45555G728230J509483P23622J471720P72702j774415k997509j451287L26106K72393
45546F581045j75192N59252J230859N61070j45135R5962n94272l319667m964049
$$ plain form
45537 -170127 -2596218 -899801 1300787 321294 -2503808 -3460425 -2096012 -1096095 -1605507
45528 -1605507 -1867107 -535431 1338401 2361609 2881353 3913420 5184749 5476282 4543183
45519 4543183 3649226 3818319 4107852 2573046 -774556 -3057248 -1754666 1822613 3942915
45510 3942915 3159986 1695522 1853396 3218422 4403555 5555252 7421344 9237702
45502 9237702 9332309 7256978 4184925 1847889 1693814 3698946 5117268 2394965 -3891095
45493 -3891095 -7872718 -4721785 3092502 8631701 8663157 5898158 3567973 1596534
45485 1596534 -862446 -2482234 -1614195 735350 1825300 322170 -2578310 -4382429
45477 -4382429 -3037282 1418445 6267669 8324605 7277096 5534668 4436910 2666184
$$ packed form
45537a70127k426091J696417K200588r79493k825102r56617J364413R99917n09412
45528a605507k61600J331676J873832J023208N19744J032067J271329K91533r33099
45519D543183q93957J69093K89533j534806l347602k282692J302582L577279K120302
45510C942915p82929j464464J57874J365026J185133J151697J866092J816358
45502I237702R4607k075331l072053k337036j54075K005132J418322k722303o286060
45493c891095l981623L150933P814287N539199L1456k764999k330185j971439
45485A596534k458980j619788Q68039K349545J089950j503130k900480j804119
45477d382429J345147M455727M849224K056936j047509j742428j097758j770726
$$ plain form
45469 2666184 -599876 -3310329 -3329683 -1803226 -1151752 -838252 1813678 6616948 9302248
45460 9302248 6577155 689776 -2537356 251130 6519225 10188206 7395772 413263
45452 413263 -4403072 -3197505 1398733 3844880 2331132 -141239 -845719 -597131 -1042260
45443 -1042260 -1424854 -142359 2225622 3785564 4146753 4060133 3059204 137399 -3331157
45434 -3331157 -4055741 -934289 3383211 5816345 5879864 4641178 2726554 653788 -588894
45425 -588894 -788836 -971568 -1398323 -776118 1073592 1771701 -190237 -2430547 -1959987
45416 -1959987 3611 50189 -1438686 -486938 4012158 8201663 8916682 7585966 6450070
45407 6450070 4463656 47847 -4688259 -6114101 -4190560 -2218756 -2107981 -2621841
$$ packed form
45469B666184l266060k710453j9354J526457O51474L13500K651930M803270K685300
45460I302248k725093n887379l227132K788486O268095L668981k792434o982509
45452D13263m816335J205567M596238K446147j513748k472371p04480K48588m45129
45443a042260l82594J282495K367981J559942L61189q6620j000929k921805l468556
45434c331157p24584L121452M317500K433134O3519j238686j914624k072766j242682
45425e88894j99942j82732m26755O22205J849710O98109j961938k240310M70560
45416a959987J963598M6578j488875R51748M499096M189505P15019j330716j135896
45407F450070j986414m415809m736106j425842J923541J971804J10775n13860
$$ plain form
45399 -2621841 -2008608 -8437 2593836 4428882 3861246 777497 -2253233 -2462238 -189831
45390 -189831 1992950 2732831 2343935 687769 -2437895 -4976032 -3993042 -208893 1815562
45381 1815562 -486411 -4010928 -3940717 335965 5104251 6932841 5614875 3154064
45373 3154064 1435763 952369 985886 831539 746189 1273751 2021265 2219797 2358979 3785076
45363 3785076 6398622 8230838 7902308 6278649 5096035 5010261 5459478 5426164 4090362
45354 4090362 1883444 885755 2572514 5108128 4982429 1831109 -676793 266605 3118419
45345 3118419 4762567 4525285 3521531 1968094 -412204 -2520860 -2816530 -1579744
45337 -1579744 -447289 -224276 -595546 -1227895 -1790888 -1887092 -2312146 -4933937 -9510392
$$ packed form
45399b621841O13233K000171K602273J835046n67636l083749l030730k09005K272407
45390a89831K182781P39881l88896j656166l125664k538137R82990L784149K024455
45381A815562k301973l524517P0211M276682M768286J828590j317966k460811
45373C154064j718301m83394L3517j54347q5350N27562P47514J98532J39182J426097
45363C785076K613546J832216l28530j623659j182614q5774M49217l3314j335802
45354D090362k206918r97689J686759K535614j25699l151320k507902R43398K851814
45345C118419J644148k37282j003754j553437k380298k108656k95670J236786
45337a579744J132455K23013l71270o32349n62993r6204m25054k621791m576455
$$ plain form
45328 -9510392 -12245782 -10019271 -4788566 -929850 784063 3122547 6705244 8300763
45320 8300763 5794498 1569766 -758603 -586561 397541 1149109 1534765 1078985 -486169
45311 -486169 -1932784 -1358177 1657780 5398268 7448952 6725252 4528585 3390544 4089507
45302 4089507 4339998 1873549 -1715388 -2471917 492951 3794416 4840970 5138455 6595953
45293 6595953 7286983 4166853 -1456499 -4876878 -4351438 -3165020 -4441291 -6725780
45285 -6725780 -6519113 -3300600 196410 1877776 2282358 2590118 2469938 926466 -1580516
45276 -1580516 -3096805 -2349147 -214119 1375211 1548688 947663 234551 -997953 -3319188
45267 -3319188 -5908428 -6732573 -4542233 -342046 3404119 4892547 4177947 2580106
$$ packed form
45328i510392k735390K226511N230705L858716J713913K338484L582697J595519
45320H300763k506265m224732k328369J72042R84102P51568L85656m55780j565154
45311d86169j446615N74607L015957L740488K050684p23700k196667j138041O98963
45302D089507K50491k466449l588937p56529K964868L301465J046554K97485J457498
45293F595953O91030l120130n623352l420379N25440J186418j276271k284489
45285f725780K06667L218513L497010J681366M04582L07760j20180j543472k506982
45276a580516j516289P47658K135028J589330J73477o01025p13112j232504k321235
45267c319188k589240q24145K190340M200187L746165J488428p14600j597841
$$ plain form
45259 2580106 1369100 1019018 1248839 1495044 1558839 1927023 3139849 4750560 5492822
45250 5492822 4768450 3224903 1394713 -1115792 -4028075 -5300037 -3706949 -1747421
45242 -1747421 -3201512 -7663679 -10484571 -9042791 -5990475 -4583668 -3958707 -1904025
45234 -1904025 332735 -60464 -2245674 -2688266 -964214 -436423 -2592475 -4643537 -4158279
45225 -4158279 -2679633 -2701041 -3726256 -3704387 -2508277 -1579643 -1149929 134556 3110478
45216 3110478 6719535 8472918 6248501 826639 -3446669 -2630604 1730769 3974385
45208 3974385 1670411 -1271825 -576705 2281322 2786985 -13305 -3066981 -4232812
45200 -4232812 -4166454 -3699053 -2518336 -742781 644834 1218899 1025132 -704647 -4481803
$$ packed form
45259B580106j211006l50082K29821K46205O3795L68184J212826J610711P42262
45250E492822p24372j543547j830190k510505k912283j271962J593088J959528
45242a747421j454091m462167k820892J441780L052316J406807O24961K054682
45234a904025K236760l93199k185210m42592J724052N27791k156052k051062M85258
45225d158279J478646k1408j025215K1869J196110R28634M29714J284485K975922
45216C110478L609057J753383k224417n421862m273308Q16065M361373K243616
45208C974385k303974k942236O95120K858027N05663k800290l053676j165831
45200d232812O6358M67401J180717J775555J387615N74065j93767j729779l777156
$$ plain form
45191 -4481803 -8337351 -9225648 -6979810 -4476196 -3398644 -2333637 49187 2352354
45183 2352354 2454034 363295 -2398065 -4850340 -6597947 -7041913 -6025007 -4461411
45175 -4461411 -3148750 -1733071 91191 1294942 826383 -394482 -304478 1570537 3440558
45166 3440558 3437712 1501716 -1124250 -3350221 -4663170 -4782873 -3818428 -2721207 -2670612
45157 -2670612 -3479768 -3303466 -929719 2002931 2500801 108633 -2283671 -2220077 -586167
45148 -586167 492757 926547 1804059 2600084 1904241 340675 -92962 388760 -625834
45139 -625834 -3504274 -5238386 -3742598 -1048836 -372460 -1855814 -3232011 -3340025 -2902410
45130 -2902410 -2648031 -2567067 -2657530 -2986475 -3313420 -3606103 -4259376 -4885151 -3927661 -782693
$$ packed form
45191d481803l855548q88297K245838K503614J077552J065007K382824K303167
45183B352354J01680k090739k761360k452275j747607m43966J016906J563596
45175d461411J312661J415679J824262J203751m68559j220865R0004J875015J870021
45166C440558k846j935996k625966k225971j312949j19703R64445J097221N0595
45157b670612q09156J76302K373747K932650M97870k392168k392304O3594J633910
45148e86167J078924M33790Q77512P96025o95843j563566m33637M81722j014594
45139f25834k878440j734112J495788K693762O76376j483354j376197j08014M37615
45130b902410K54379Q0964r0463l28945l26945k92683o53273o25775R57490L144968
$$ plain form
45120 -782693 2667207 4129480 3647585 2640637 1100022 -2048565 -6000874 -7743729
45112 -7743729 -5336878 -181886 4466579 6307725 5251543 3045234 1894838 2470328
45104 2470328 3041006 1380331 -2430447 -5903737 -6799565 -5073613 -2340343 -319019
45096 -319019 281267 197478 842133 2463881 3613452 3302102 2828899 4062487 6670060
45087 6670060 8794117 9827800 10419641 10203431 8101525 4968052 3290884 3764201 4696957
45078 4696957 5391229 7199666 10152969 11645789 10297148 8236147 7288713 5745026
45070 5745026 1882959 -1914001 -2398091 -937812 -1385470 -3502180 -3292500 57072 2451720
45061 2451720 1372222 -311856 788379 3564110 5017657 4927400 4748948 4098474 1809274
$$ packed form
45120g82693L449900J462273m81895j006948j540615l148587l952309j742855
45112g743729K406851N154992M648465J841146j056182k206309j150396N75490
45104B470328N70678j660675l810778l473290q95828J725952K733270K021324
45096c19019O00286q3789O44655J621748J149571l11350m73203J233588K607573
45087F670060K124057J033683N91841k16210k101906l133473j677168M73317R32756
45078D696957O94272J808437K953303J492820j348641k061001r47434j543687
45070E745026l862067l796960m84090J460279m47658k116710K09680L349572K394648
45061B451720j079498j684078J100235K775731J453547r0257j78452o50474k289200
$$ plain form
45052 1809274 -837965 -1345151 126102 1157576 1109318 1790494 3896114 5629487 5663443
45043 5663443 4977302 4540148 3310147 271131 -2966056 -3580055 -1151101 1619246 1905724
45034 1905724 -335211 -2563557 -2328374 319557 2992603 3628978 2750012 2520598 3758315
45025 3758315 4845886 3873315 958066 -2074385 -3598807 -3204436 -1440572 699343
45017 699343 2301269 3062837 3208127 2824888 1811772 551320 -280783 -967980 -2729667
45008 -2729667 -5652760 -7761261 -7468193 -6075699 -6016467 -6993208 -6082424 -2148886 1953556
44999 1953556 2826401 572191 -2147337 -3736442 -4263994 -3362315 -371929 3076364 3375980
44990 3375980 -623388 -5371307 -6664032 -4613530 -2555454 -2144252 -2256867 -2416181 -4036056
$$ packed form
45052A809274k647239n07186J471253J031474m8258O81176K105620J733373L3956
45043E663443o86141m37154j230001l039016l237187o13999K428954K770347K86478
45034A905724k240935k228346K35183K647931K673046O36375q78966k29414J237717
45025C758315J087571r72571k915249l032451j524422L94371J763864K139915
45017F99343J601926P61568J45290l83239j013116j260452q32103o87197j761687
45008b729667k923093k108501K93068J392494N9232r76741R10784L933538M102442
44999A953556Q72845k254210k719528j589105n27552R01679K990386L448293K99616
44990C375980l999368m747919j292725K050502K058076M11202j12615j59314j619875
$$ plain form
44981 -4036056 -7152611 -8685949 -6170255 -1648081 458886 -1378526 -4678054 -6625022
44973 -6625022 -6753406 -5880207 -4403784 -2495629 -705663 543344 1464942 2419057 3367850
44964 3367850 4032900 4166504 3688200 3021918 2997725 3681226 3715764 1953789 -501895
44955 -501895 -1257709 325029 2470489 3619063 4140232 4714975 4477761 2087555 -2010163
44946 -2010163 -5542286 -6570268 -5200787 -3245540 -2316043 -2109321 -898911 1837386
44938 1837386 4021779 3325979 240746 -2861993 -5228747 -7977030 -10776410 -11069976
44930 -11069976 -7822325 -3738739 -1959207 -2144692 -1684121 327134 2080342 1456645
44922 1456645 -1753735 -5536880 -7001732 -5002391 -1727515 -201961 -109842 1408597
$$ packed form
44981d036056l116555j533338K515694M522174K106967j837412l299528j946968
44973f625022j28384Q73199J476423J908155J789966J249007R21598R54115R48793
44964C367850O65050J33604m78304o66282k4193O83501L4538j761975k455684
44955e01895p55814J582738K145460J148574N21169N74743k37214k390206m097718
44946b010163l532123j027982J369481J955247R29497K06722J210410K736297
44938A837386K184393o95800l085233l102739k366754k748283k799380k93566
44930a1069976L247651M083586J779532j85485M60571K011255J753208o23697
44922A456645l210380l783145j464852J999341L274876J525554R2119J518439
$$ plain form
44914 1408597 4229736 4069018 -1021810 -6334749 -6169898 -1507151 1857936 1281278 -745177
44905 -745177 -1746222 -2133873 -2741733 -3223692 -3656836 -4795182 -6067217 -5781596 -3627780
44896 -3627780 -670899 2883277 7118951 9951542 8704819 4418166 1142757 396604
44888 396604 -246507 -2375243 -4259602 -4331000 -3562424 -2861878 -1469562 421788 846299
44879 846299 -274805 -44268 2691697 4901289 4170773 2711794 3573091 5643685 5632990
44870 5632990 2790656 -1242870 -5053143 -7174324 -5784199 -1829120 101851 -2485458
44862 -2485458 -5883339 -5665892 -3703029 -4943655 -9141772 -11225042 -9145267 -6057760
44854 -6057760 -4613392 -4019493 -3386006 -3432234 -3848377 -3027318 -1487199 -1707301 -3475502
$$ packed form
44914A408597K821139j60718n090828n312939J64851M662747L365087n76658k026455
44905g45177j001045l87651o07860m81959m33144j138346j272035K85621K153816
44896c627780K956881L554176M235674K832591j246723m286653l275409p46153
44888C96604o43111k128736j884359p1398P68576P00546J392316J891350M24511
44879H46299j121104K30537K735965K209592p30516j458979Q61297K070594j0695
44870E632990k842334m033526l810273k121181J390125L955079J930971k587309
44862b485458l397881K17447J962863j240626m198117k083270K079775L087507
44854f057760J444368N93899O33487m6228m16143Q21059J540119k20102j768201
$$ plain form
44845 -3475502 -3337724 -125808 2808413 2722219 1220804 658456 235293 -1458412 -2794704
44836 -2794704 -1353831 1866703 3605513 2806565 1269948 280284 -954287 -3116058
44828 -3116058 -4768398 -3635951 378268 4252247 4756296 2329153 770300 2482191
44820 2482191 5778172 8135313 9694530 11043063 10086840 5231387 -14614 -658067
44812 -658067 2175995 2714914 -188432 -1286682 2090171 5488166 4721552 2234722 2123626
44803 2123626 3599732 3972461 4032550 5418052 6034117 3535433 740393 1966904 5844081
44794 5844081 7263847 5012262 1926143 -1226902 -5801850 -9632397 -8003308 -1487010
44786 -1487010 3032343 1170959 -4013471 -7861867 -10017341 -11789274 -12053846 -9494528
$$ packed form
44845c475502J37778L211916K934221q6194j501415n62348m23163j693705j336292
44836b794704J440873L220534J738810p98948j536617r89664j234571k161771
44828c116058j652340J132447M014219L873979N04049k427143j558853J711891
44820B482191L295981K357141J559217J348533r56223m855453n246001o43453
44812f58067K834062N38919k903346j098250L376853L397995p66614k486830j11096
44803B123626J476106L72729O0089J385502O16065k498684k795040J226511L877177
44794E844081J419766k251585l086119l153045m574948l830547J629089O516298
44786a487010M519353j861384n184430l848396k155474j771933k64572K559318
$$ plain form
44778 -9494528 -6043203 -4679219 -5643044 -7273280 -8619002 -8980877 -6979082 -2616513
44770 -2616513 1346493 2370915 1181560 85012 -109134 229582 981252 1321479 -715705
44761 -715705 -5314125 -9177970 -9235555 -6577279 -4330851 -3293475 -2398169 -1796756 -2157201
44752 -2157201 -2247117 -893985 -311691 -3314760 -7760938 -8500979 -5219343 -3252017 -5115134
44743 -5115134 -6471380 -3588442 -57303 -1313408 -5674105 -6528239 -2222515 1804526
44735 1804526 1103842 -2466742 -4847577 -4988349 -3865245 -1808552 446434 652988 -1971561
44726 -1971561 -4360529 -3060426 1051583 4063098 3956175 1640285 -1781469 -5523711
44718 -5523711 -7442001 -5473939 -1208950 1210627 557262 -168548 1109765 2364760
$$ packed form
44778i494528L451325J363984r63825j630236j345722l61875K001795M362569
44770b616513L963006J024422j189355j096548j94146L38716P51670L40227k037184
44761g15705m598420l863845n7585K658276K246428J037376Q95306O01413l60445
44752b157201q9916J353132N82294l003069m446178p40041L281636J967326j863117
44743e115134j356246K882938L531139j256105m360697q54134M305724M027041
44735A804526p00684l570584k380835j40772J123104K056693K254986K06554k624549
44726a971561k388968J300103M112009L011515j06923k315890l421754l742242
44718e523711j918290J968062M264989K419577o53365p25810J278313J254995
$$ plain form
44710 2364760 1193785 -1272855 -2539109 -2360623 -1701530 -320943 1815932 2743746 1262098
44701 1262098 -224217 890645 2632076 1137295 -2693454 -3813933 -565191 2909818
44693 2909818 3004621 1268452 684025 919579 11591 -1865285 -3198682 -3945397 -4964177
44684 -4964177 -5939487 -6073593 -5697013 -5257361 -3981975 -1555491 183222 -481718 -2191543
44675 -2191543 -2218637 -366872 1265525 1920528 2998416 5168719 6980929 6914760 5182054
44666 5182054 3058367 1611015 1125221 738061 -895531 -3327856 -3734291 -671983 2571092
44657 2571092 1415016 -3470302 -6562490 -5027028 -2058162 -985706 46329 4053943
44649 4053943 8624570 8067367 1604410 -4847418 -5934805 -2587507 885459 2509580
$$ packed form
44710B364760j170975k466640j266254J78486O59093J380587K136875R27814j481648
44701A262098j486315J114862J741431j494781l830749j120479L248742L475009
44693B909818R4803j736169n84427K35554r07988j876876j333397p46715j018780
44684d964177r75310j34106L76580M39652J275386K426484J738713o64940j709825
44675b191543k7094J851765J632397O55003J077888K170303J812210o6169j732706
44666E182054k123687j447352m85794l87160j633592k432325m06435L062308L243075
44657B571092j156076m885318l092188J535462K968866J072456J032035M007614
44649D053943M570627n57203o462957o451828j087387L347298L472966J624121
$$ plain form
44641 2509580 3195156 3517301 2804611 1078677 -297981 -281418 842577 2278855 3418298
44632 3418298 3587239 2323705 289639 -1152065 -1678256 -2199192 -2824707 -2113148 511211
44623 511211 2973226 2991225 1391062 762901 1300363 746885 -1183385 -1473777 1492691
44614 1492691 4635355 4234372 1401507 256497 1633205 2259732 350294 -1652563
44606 -1652563 -1270287 162847 61961 -1190682 -1246403 219508 1213380 804433 473903
44597 473903 1739481 4059631 5561770 4804100 1660015 -2563852 -5777385 -6675710 -5631692
44588 -5631692 -3564151 -777794 2033623 3003803 1578533 837705 4051770 8858168
44580 8858168 8817424 2369261 -3610521 -2369117 3555098 6022553 2507636 -1364835
$$ packed form
44641B509580O85576L22145p12690j725934j376658J6563J123995J436278J139443
44632C418298J68941j263534k034066j441704n26191n20936o25515P11559K624359
44623E11211K462015J7999j600163o28161N37462n53478j930270k90392K966468
44614A492691L142664m00983k832865j145010J376708O26527j909438k002857
44606a652563L82276J433134j00886j252643n5721J465911R93872m08947l30530
44597D73903J265578K320150J502139p57670l144085m223867l213533q98325J044018
44588e631692K067541K786357K811417R70180j425270p40828L214065M806398
44580H858168m0744o448163n979782J241404N924215K467455l514917l872471
$$ plain form
44572 -1364835 -495267 3501763 6478894 7791231 9018520 9604897 7662089 3975169
44564 3975169 1728970 2193183 3238628 2546061 379335 -1306609 -1062317 1141209 3980550
44555 3980550 5448487 4536050 2549232 1815428 2871209 3894615 3222122 1522685 991458
44546 991458 2941638 6516666 9381678 9546535 6904772 3123260 -107490 -2511014
44538 -2511014 -4814033 -7454765 -10017906 -11318154 -9801357 -4998502 787272 3678512
44530 3678512 2351248 -311283 -1113418 -541410 -789878 -1423253 -207027 2466426 3631947
44521 3631947 2513690 1752987 2968517 4373022 4241271 3718695 4309568 5238986 5384097
44512 5384097 5358466 5403118 3665816 -572563 -4025475 -3115242 685434 2509366 378728
$$ packed form
44572a364835Q69568L997030K977131J312337J227289N86377j942808l686920
44564C975169k246199M64213J045445o92567k166726j685944K44292K203526K839341
44555C980550J467937r12437j986818p33804J055781J023406o72493j699437n31227
44546I91458J950180L575028K865012J64857k641763l781512l230750k403524
44538b511014k303019k640732k563141j300248J516797M802855N785774K891240
44530C678512j327264k662531q02135N72008k48468o33375J216226K673453J165521
44521C631947j118257p60703J215530J404505j31751n22576N90873R29418J45111
44512E384097k5631M4652j737302m238379l452912R10233L800676J823932k130638
$$ plain form
44503 378728 -3239231 -5654755 -6560939 -6438520 -5459468 -4569934 -5048621 -6171043 -5483378
44494 -5483378 -2203686 1558697 3711490 4463590 4874808 4908780 4132674 3097011 2781565
44485 2781565 3268665 3701122 3161924 1358877 -1080624 -3040784 -4153805 -5184032 -6500656
44476 -6500656 -7039150 -5993889 -4544656 -4115670 -3814895 -1962034 376498 241733 -2611243
44467 -2611243 -4768330 -3646326 -542099 1740334 2098165 987958 -675817 -1225063
44459 -1225063 1044851 5288365 7886176 6264403 1629770 -3015682 -5829492 -6157446
44451 -6157446 -3899968 -539150 1127834 153202 -1218996 -901120 302994 1078544 2356806
44442 2356806 5081585 7290581 6683466 4645198 4178236 4791638 3338794 -248089 -2085940
$$ packed form
44503C78728l617959k415524r06184J22419R79052Q89534m78687j122422O87665
44494e483378L279692L762383K152793P52100M11218L3972p76106j035663l15446
44485B781565M87100M32457n39198j803047k439501j960160j113021j030227j316624
44476f500656n38494J045261J449233M28986L00775J852861K338532j34765k852976
44467b611243k157087J122004L104227K282433L57831j110207j663775n49246
44459a225063K269914M243514K597811j621773m634633m645452k813810l27954
44451f157446K257478L360818J666984r74632j372198L17876J204114P75550J278262
44442B356806K724779K208996o07115k038268m66962O13402j452844l586883j837851
$$ plain form
44433 -2085940 -39992 3202536 4199646 3028750 1775815 1139816 615666 447384 1351248
44424 1351248 3125494 5000181 6642484 7647438 6880987 3730682 -371085 -2872138
44416 -2872138 -2597236 -731162 603854 426940 -239862 556366 3452552 6623211 7406600
44407 7406600 5092375 1607723 -377592 560644 3951041 7567370 8583792 6238407
44399 6238407 3503482 4429330 9254583 13649954 13598718 9717252 5894610 4942961 6639686
44390 6639686 8872263 9353691 6987503 2924302 -42114 -97896 1864456 3736705 4677198
44381 4677198 5243528 5852683 6348308 6669204 6767388 6116036 4382529 2398103 1398918
44372 1398918 1403954 1351050 771952 265732 190867 -81964 -1163269 -2461048 -2371307 397821
$$ packed form
44433b085940K045948L242528R97110j170896j252935o35999n24150j68282R03864
44424A351248J774246J874687J642303J004954p66451l150305m101767k501053
44416b872138K74902J866074J335016j76914o66802P96228K896186L170659P83389
44407G406600k314225l484652j985315R38236L390397L616329J016422k345385
44399F238407k734925R25848M825253M395371n1236l881466l822642r51649J696725
44390F639686K232577M81428k366188m063201k966416n5782J962352J872249R40493
44381D677198N66330O09155M95625L20896R8184o51352j733507j984426r99185
44372A398918N036n2904n79098n06220p4865k72831j081305j297779Q9741K769128
$$ plain form
44362 397821 5316806 9525014 9750390 5948603 2395993 3356013 7683134 9807303 6742856
44353 6742856 1911118 351329 2014021 2581910 193090 -2071238 -1324637 602068
44345 602068 304078 -1403516 -388342 4108262 7200895 4594864 -1342002 -4546123
44337 -4546123 -3170280 -1319429 -2645556 -5370249 -5445245 -2458556 267296 617601 15775
44328 15775 531735 1956181 2846432 2841358 2385319 1107992 -1687259 -5004696 -6293850
44319 -6293850 -4309187 -841054 1254165 1154983 318132 51571 84530 -267143 -786953
44310 -786953 -1121951 -2022422 -4400368 -7231834 -7887957 -5326738 -2023784 -1603959 -4768477
44301 -4768477 -8438202 -8977918 -5673647 -1038141 1669844 1092398 -1440865 -3435872
$$ packed form
44362C97821M918985M208208K25376l801787l552610R60020M327121K124169l064447
44353F742856m831738j559789J662692N67889k388820k264328P46601J926705
44345F02068k97990j707594J015174M496604L092633k606031n936866l204121
44337d546123J375843J850851j326127k724693p4996K986689K725852L50305o01826
44328A5775N15960J424446Q90251n074m56039j277327k795251l317437j289154
44319f293850J984663L468133K095219r9182q36851k66561L2959l51673n19810
44310g86953l34998r00471k377946k831466o56123K561219L302954M19825l164518
44301d768477l669725n39716L304271M635506K707985n77446k533263j995007
$$ plain form
44293 -3435872 -3817761 -3991206 -5820217 -8647083 -9399761 -6285436 -1477556 1011477 -225689
44284 -225689 -2848684 -4014919 -3481899 -3038670 -3986523 -6054740 -8083743 -8791190 -7292015
44275 -7292015 -3945959 -681460 395289 -1047924 -3385054 -4611724 -3617009 -428975
44267 -428975 3615250 6043982 5044329 1639497 -1003987 -1069828 111749 447904 52559
44258 52559 540526 2172115 3360409 2957937 1679850 981818 1435152 2390758 2537399
44249 2537399 862765 -2072504 -3940879 -2849748 173083 2071971 1363286 -427009
44241 -427009 -1273842 -1047081 -548038 249634 1460972 1982053 903179 -413333 93556
44232 93556 1602703 870147 -2959823 -6348251 -5820879 -2640933 -763667 -1225799 -1311687
$$ packed form
44293c435872l81889j73445j829011k826866p52678L114325M807880K489033j237166
44284b25689k622995j166235N33020M43229r47853k068217k029003p07447J499175
44275g292015L346056L264499J076749j443213k337130j226670R94715L188034
44267d28975M044225K428732r99653l404832k643484o5841J181577L36155l95345
44258E2559M87967J631589J188294m02472j278087o98032M53334R55606J46641
44249B537399j674634k935269j868375J091131L022831J898888p08685j790295
44241d27009q46833K26761M99043P97672J211338N21081j078874j316512N06889
44232I3556J509147p32556l829970l388428N27372L179946J877266m62132q5888
$$ plain form
44223 -1311687 793311 3267801 3467469 1322057 -1345639 -3159770 -3419961 -1618109
44215 -1618109 1349599 2619473 155988 -4377094 -7303023 -6946351 -4315930 -794590
44207 -794590 2459708 3613739 1780996 -514809 235587 3220773 3916755 947783 -1465186
44198 -1465186 243434 3986698 5873876 5535099 4263255 1178591 -4296356 -8565998
44190 -8565998 -7583295 -3257598 -1241251 -2953835 -4677858 -4257357 -3369060 -2627444 41335
44181 41335 4494461 6898832 5545241 3739078 4237780 4919249 3119925 590181 473097
44172 473097 2218890 3131611 2690489 1965246 796249 -1195095 -2638919 -2434888 -1807651
44163 -1807651 -1640415 -304845 2694821 3935746 1147391 -1710654 353864 5128604
$$ packed form
44223a311687K104998K474490J99668k145412k667696j814131k60191J801852
44215a618109K967708J269874k463485m533082k925929L56672K630421L521340
44207g94590L254298J154031j832743k295805P50396K985186O95982k968972k412969
44198a465186J708620L743264J887178l38777j271844l084664n474947m269642
44190h565998R82703M325697K016347j712584j724023M20501Q88297P41616K668779
44181D1335M453126K404371j353591j806163M98702O81469j799324k529744j17084
44172D73097J745793R12721m41122p25243j168997j991344j443824K04031O27237
44163a807651J67236J335570K999666J240925k788355k858045K064518M774740
$$ plain form
44155 5128604 6046595 2192258 -889883 -507513 -453494 -3708761 -7366401 -7692511 -5703594
44146 -5703594 -4495012 -4416759 -3979581 -2985906 -2011362 -722686 1093621 2548130 3376506
44137 3376506 4844504 7479173 9753178 10308070 9616840 8442451 6761782 5076274
44129 5076274 4361165 3901037 1987863 -395198 -21680 3139043 4753351 2401349 -843633
44120 -843633 -1677934 -1436971 -2335806 -2663345 -75525 3371481 4279518 3648876 4554572
44111 4554572 5977761 4502830 1206833 983826 4565980 6593305 3181659 -2891191
44103 -2891191 -6488836 -6278981 -4635899 -3806193 -3895034 -3248361 -174419 4408015 6455969
44094 6455969 3052136 -3385166 -7718236 -8218022 -6943724 -4874306 -1054336 3234458
$$ packed form
44155E128604R17991l854337l082141L82370N4019l255267l657640l26110J988917
44146e703594J208582P8253M37178R93675R74544J288676J816307J454509Q28376
44137C376506J467998K634669K274005N54892o91230j174389j680669j685508
44129E076274p15109m60128j913174k383061L73518L160723J614308k352002l244982
44120h43633q34301K40963q98835l27539K587820L447006R08037o30642R05696
44111D554572J423189j474931l295997k23007L582154K027325l411646o072850
44103b891191l597645K09855J643082Q29706q8841O46673L073942M582434K047954
44094F455969l403833o437302m333070m99786J274298K069418L819970M288794
$$ plain form
44086 3234458 4341685 1884784 271699 2416296 5630007 6261524 5103929 5270013
44078 5270013 7318877 9447949 10544669 10425317 8754774 6047321 4147069 3770360
44070 3770360 3358533 2061874 1509846 2611911 3315086 2147730 1260902 2776277 4750896
44061 4750896 4582255 4019927 6170319 9246532 8581723 4238225 1218904 1734638 2561530
44052 2561530 1440908 1065878 4189201 8858844 11578936 12081296 11819882 10312580 6493532
44043 6493532 2067612 73037 808742 2008784 2546077 3277324 4383375 4491627 2922685
44034 2922685 796365 -745195 -1914056 -3329859 -4941985 -6361741 -7212934 -6898774
44026 -6898774 -5237347 -3632664 -4145252 -6684430 -8553086 -7870589 -6100009 -5618489 -5978061
$$ packed form
44086C234458J107227k456901j613085K144597L213711O31517j157595J66084
44078E270013K048864K129072J096720j19352j670543k707453j900252l76709
44070C770360m11827j296659n52028J102065P03175j167356q86828J515375J974619
44061D750896j68641n62328K150392L076213o64809m343498l019321N15734Q26892
44052B561530j120622l75030L123323M669643K720092N02360k61414j507302l819048
44043F493532m425920j994575P35705J200042N37293P31247J106051J08252j568942
44034B922685k126320j541560j168861j415803j612126j419756q51193L14160
44026f898774J661427J604683n12588k539178j868656O82497J770580M81520l59572
$$ plain form
44017 -5978061 -4908898 -2554730 -1829066 -3841027 -5688224 -4520021 -1607432 -20240
44009 -20240 31562 549899 1517822 888876 -1271049 -2337447 -1622247 -1634287 -3252744 -3348652
43999 -3348652 16535 3189389 1523000 -3658433 -6831227 -5973376 -4324414 -4625799
43991 -4625799 -5695657 -5541262 -4361110 -3042265 -1372486 819184 2839817 4520711
43983 4520711 6417638 7827165 6934794 3999984 2004519 2726064 4351036 4482031 3337881
43974 3337881 2234612 998578 -1018105 -3079610 -4326299 -5384082 -6738657 -7106166
43966 -7106166 -5549978 -3557288 -2611043 -1423423 1500662 4150806 3525393 930891
43958 930891 654684 3342376 4889575 2885628 167736 56950 1504297 1678821 793228
$$ packed form
44017e978061J069163K354168P25664k011961j847197J168203K912589J587192
44009b0240N1802N18337R67923o28946k159925j066398P15200j2040j618457r5908
43999c348652L365187L172854j666389n181433l172794Q57851J648962l01385
43991d625799j069858J54395J180152J318845J669779K191670K020633J680894
43983D520711J896927J409527q92371k934810j995465P21545J624972J30995j144150
43974C337881j103269j236034k016683k061505j246689j057783j354575l67509
43966g106166J556188J992690R46245J187620K924085K650144o25413k594502
43958I30891k76207K687692J547199k003947k717892j10786J447347J74524q85593
$$ plain form
43949 793228 1135548 2764303 3353967 1862663 -352691 -2135869 -3910772 -5969932 -7347212
43940 -7347212 -7369139 -6985663 -7366462 -7867829 -6615509 -3145003 405429 1299105 -803262
43931 -803262 -3413552 -3985501 -2598861 -1321857 -1373591 -2088426 -2800443 -4251437 -6966524
43922 -6966524 -9154668 -8033218 -3471168 1146335 2554720 1195642 60531 527375
43914 527375 904773 -679750 -3568510 -5837068 -7092249 -8354985 -9755636 -10397591 -10616410
43905 -10616410 -12103568 -14765927 -15502673 -11953733 -6136688 -2241637 -1579256 -1906298
43897 -1906298 -1312804 -237578 659431 2066222 4276537 5818621 5412161 4070493 3739660
43888 3739660 4712103 5876652 6902281 8498554 10521435 11262693 9178080 4649074
$$ packed form
43949G93228L42320J628755N89664j491304k215354j783178j774903k059160j377280
43940g347212k1927L83476l80799n01367J252320L470506L550432Q93676k102367
43931h03262k610290n71949J386640J277004n1734p14835p12017j450994k715087
43922f966524k188144J121450M562050M617503J408385j359078j135111M66844
43914E27375L77398j584523k888760k268558j255181j262736j400651o41955k18819
43905a0616410j487158k662359p36746L548940N817045L895051O62381l27042
43897a906298N93494J075226Q97009J406791K210315J542084m06460j341668l30833
43888C739660R72443J164549J025629J596273K022881P41258k084613m529006
$$ plain form
43880 4649074 -292000 -3559025 -4288325 -3184960 -2007096 -2340697 -4291257 -6191394
43872 -6191394 -5894654 -2832396 1067922 2908719 1643283 -854525 -1889138 -806670
43864 -806670 691781 710786 -1040341 -3285571 -4221144 -2826653 -96463 1351705 127103
43855 127103 -1704534 -843930 2714474 5328927 4530032 2103380 948370 760336 -854449
43846 -854449 -4020421 -6050542 -5276610 -2994319 -865195 1501400 4892497 7885710
43838 7885710 8018459 5316967 2739391 2482197 3341789 2954023 1470372 917789 1195340
43829 1195340 -550919 -5359093 -9762930 -10184815 -8330616 -8792046 -11899990 -12980257
43821 -12980257 -9474331 -4760203 -2781887 -2462171 -752979 1511521 1154832 -1234346
$$ packed form
43880D649074m941074l267025p29300J103365J177864l33601j950560j900137
43872f191394K96740L062258L900318J840797j265436k497808j034613J082468
43864h06670J498451J9005j751127k245230r35573J394491K730190J448168j224602
43855A27103j831637Q60604L558404K614453p98895k426652j155010j88034j614785
43846h54449l165972k030121P73932K282291K129124K366595L391097K993213
43838G885710J32749k701492k577576k57194Q59592l87766j483651n52583K77551
43829A195340j746259m808174m403837m21885J854199m61430l107944j080267
43821a2980257L505926M714128J978316L19716J709192K264500l56689k389178
$$ plain form
43813 -1234346 -1351847 2353290 6237735 6728687 4847084 3754878 4221085 4511224 3224512
43804 3224512 541893 -2239807 -3163000 -795628 3776061 7227335 7453032 5714282
43796 5714282 4359105 3886356 3731056 4381282 6435180 8444237 8181090 5818590 3521667
43787 3521667 1872522 -767292 -4768307 -7743538 -8003122 -7309865 -8061673 -9240462 -7752782
43778 -7752782 -3186460 1381673 3469417 3687451 3515136 2897865 1454153 250607 470908
43769 470908 1407277 1625796 1299281 1376339 1033733 -1571833 -5780348 -7989906 -5719473
43760 -5719473 -509277 4090828 5941001 4881910 1637980 -2258910 -4527512 -3866475
43752 -3866475 -1446006 268049 -89876 -2007800 -3942874 -4389429 -3012927 -1303828
$$ packed form
43813a234346j17501L705137L884445M90952j881603j092206M66207K90139j286712
43804C224512k682619k781700r23193K367372M571689L451274K25697j738750
43796E714282j355177m72749j55300O50226K053898K009057k63147k362500k296923
43787C521667j649145k639814m001015k975231k59584O93257p51808j178789J487680
43778g752782M566322M568133K087744K18034j72315o17271j443712j203546K20301
43769D70908R36369K18519l26515P7058l42606k605566m208515k209558K270433
43760e719473N210196M600105J850173j059091l243930l896890k268602O61037
43752c866475K420469J714055l57925j917924j935074m46555J376502J709099
$$ plain form
43744 -1303828 -1099076 -2019501 -1809241 222396 2024575 2037475 1307711 794280 -866951
43735 -866951 -4329141 -6548333 -4329306 524621 3250558 2451064 658047 -769127
43727 -769127 -2981131 -5621078 -5887073 -2926796 535405 2431290 3702404 4784181
43719 4784181 3418402 -1496301 -6845550 -8887993 -7676075 -5481054 -3149707 -758384
43711 -758384 242035 -1239919 -3307710 -3024011 -151490 3258612 5843888 7263789
43703 7263789 6892977 4715443 2476860 1533827 622682 -1817459 -4353753 -4418822 -2467849
43694 -2467849 -1237861 -1459210 -1317895 130596 1923537 3411597 4727759 5128263 3629161
43685 3629161 1333104 488928 1242793 1897625 2127853 2965862 3782006 2674126 86905
$$ packed form
43744a303828K04752r20425K10260K031637J802179J2900p29764n13431j661231
43735h66951l462190k219192K219027M853927K725937p99494j793017j427174
43727g69127k212004k639947k65995K960277L462201J895885J271114J081777
43719D784181j365779m914703n349249k042443J211918K195021K331347K391323
43711g58384J000419j481954k067791K83699K872521L410102K585276J419901
43703G263789l70812k177534k238583r43033r11145k440141k536294o5069J950973
43694b467849J229988k21349J41315J448491J792941J488060J316162M00504j499102
43685C629161k296057q44176P53865O54832K30228Q38009Q16144j107880k587221
$$ plain form
43676 86905 -1441670 -1575220 -2506422 -4305598 -4124929 -1505590 -176804 -2179059 -4198938
43667 -4198938 -2880005 -171998 443365 -59902 1296577 3271143 2015631 -1856226
43659 -1856226 -3342306 -1005618 242886 -3319780 -7942366 -7337074 -1737888 2086390
43651 2086390 -180593 -4835066 -5140325 198617 5982416 7386859 5184625 3050076
43643 3050076 1960953 -109933 -3858005 -7137838 -8262922 -8046617 -7394448 -5451468
43635 -5451468 -2053131 200239 -998528 -3875223 -4720116 -3193939 -2551265 -4485662
43627 -4485662 -6680147 -6532481 -4948561 -4697805 -6479653 -8577199 -9749514 -10453574 -10927825
43618 -10927825 -9811277 -5987672 -1101005 1388501 51879 -2781087 -3927677 -3002381
$$ packed form
43676H6905j528575j33550r31202j799176J80669K619339J328786k002255k019879
43667d198938J318933K708007O15363n03267J356479J974566j255512l871857
43659a856226j486080K336688J248504l562666m622586O05292N599186L824278
43651B086390k266983m654473l05259N338942N783799J404443k202234k134549
43643C050076j089123k070886l748072l279833j125084K16305O52169J942980
43635e451468L398337K253370j198767k876695q44893J526177O42674j934397
43627d485662k194485J47666J583920K50756j781848k097546j172315p04060m74251
43618a0927825J116548L823605M886667K489506j336622k832966j146590R25296
$$ plain form
43610 -3002381 -1965338 -1808908 -1497405 -215519 1066335 923289 -716237 -2570362 -3019145
43601 -3019145 -1134088 2236984 4620938 4557157 3725540 4527963 5979088 4844533 1043101
43592 1043101 -1613678 -1303988 -1153185 -3970397 -7325680 -7136335 -3630712 -109429 2221912
43583 2221912 4151097 4667990 1875908 -2595729 -4466853 -2710437 -869931 -1623823
43575 -1623823 -3448123 -3848978 -2796140 -1462384 -213034 590400 74283 -1353434 -1729029
43566 -1729029 -428260 645492 123393 -613411 148153 1740898 2647713 3103861 4159967
43557 4159967 5345810 5242002 3606287 1252590 -1482237 -4478733 -6501265 -5819891
43549 -5819891 -2405066 1425555 2891398 1253923 -1268144 -1354675 1751700 4750386
$$ packed form
43610c002381J037043J56430L11503J281886J281854j43046j639526j854125m48783
43601c019145J885057L371072K383954o3781q31617Q02423J451125j134555l801432
43592A043101k656779L09690J50803k817212l355283J89345L505623L521283K331341
43583B221912J929185N16893k792082m471637j871124J756416J840506p53892
43575a623823j824300m00855J052838J333756J249350Q03434n16117j427717l75595
43566a729029J300769J073752n22099p36804P61564J592745R06815M56148J056106
43557D159967J185843j03808j635715k353697k734827k996496k022532O81374
43549e819891L414825L830621J465843j637475k522067q6531L106375K998686
$$ plain form
43541 4750386 3939954 220438 -1691214 509668 3710977 3831138 977677 -1688199
43533 -1688199 -2349857 -1548120 -184643 1040418 1031164 -455476 -1367732 534011 4157126
43524 4157126 5831899 3972894 1089082 390543 1934206 3282498 3030934 2264939 2565249
43515 2565249 3795905 4728977 5288083 6654751 8717924 9158944 6672906 3736204 3665389
43506 3665389 5616373 5657808 3006367 1658509 4416605 8444085 9004627 5328214 570530
43497 570530 -2071007 -1152659 2939446 7369908 8378853 5864988 4218520 5923173
43489 5923173 7171735 3794377 -1026858 -407635 5927068 10797169 9515396 5223996
43481 5223996 2681809 1652961 -697086 -4404508 -6882612 -6489480 -3685983 -181777
$$ packed form
43541D750386q10432l719516j911652K200882L201309J20161k853461k665876
43533a688199o61658Q01737J363477J225061r254j486640r12256J901743L623115
43524D157126J674773j859005k883812o98539J543663J348292k51564p65995L00310
43515B565249J230656R33072N59106J366668K063173M41020k486038k936702p0815
43506C665389J950984M1435k651441j347858K758096M027480N60542l676413m757684
43497E70530k641537R18348M092105M430462J008945k513865j646468J704653
43489E923173J248562l377358m821235O19223O334703M870101j281773m291400
43481E223996k542187j028848k350047l707422k478104L93132K803497L504206
$$ plain form
43473 -181777 1754353 1009026 -378265 786959 4016147 5211398 2840207 715447
43465 715447 2508633 6552805 8712480 7747046 5051318 1698423 -1008672 -452906 3925105
43456 3925105 7851766 6938681 3187957 2618836 6769559 10797419 10512895 7308409 4748203
43447 4748203 3613476 2363418 243591 -2166522 -4301890 -5967261 -6939459 -6955490 -5602198
43438 -5602198 -2295032 2551989 6560824 7244807 5036450 2883847 2518235 2700246 1606332
43429 1606332 -593746 -2159294 -1544680 1588309 5771493 7935358 5921789 1385512
43421 1385512 -1363933 -89294 3214941 5370723 5466302 4457586 3242606 2601937 3601670
43412 3601670 6232848 8321966 7373180 3421459 -831775 -2669182 -1822808 -610430
$$ packed form
43473a81777J936130p45327j387291J165224L229188J195251k371191k124760
43465G15447J793186M044172K159675r65434k695728l352895k707095N55766M378011
43456C925105L926661r13085l750724n69121M150723M027860k84524l204486k560206
43447D748203j134727j250058k119827k410113k135368j665371r72198j6031J353292
43438e602198L307166M847021M008835O83983k208357k152603l65612J82011j093914
43429A606332k200078j565548O14614L132989M183184K163865k013569m536277
43421A385512k749445J274639L304235K155782R5579j008716j214980o40669R99733
43412C601670K631178K089118r48786l951721m253234j837407Q46374J212378
$$ plain form
43404 -610430 -1567846 -4326267 -5342498 -2124401 2784683 4350858 1670011 -869945
43396 -869945 -46487 1777710 940271 -1597735 -1997546 385083 2372749 2001231 794367
43387 794367 589206 901005 370120 -1233587 -3373020 -5555272 -7058959 -7159812 -6212645
43378 -6212645 -5411253 -5111989 -4442472 -2759872 -442811 1790104 3252051 3201661 1788037
43369 1788037 873377 2249490 5077785 6843979 6809928 6502276 6682826 6228808 4618590
43360 4618590 3094800 2272340 822961 -2052957 -4770854 -5481384 -4384399 -2558783
43352 -2558783 -243491 2208471 3452382 2954919 2047310 1575063 455693 -1542803 -1961502
43343 -1961502 673126 3513765 3180640 1091597 938510 2209015 1174912 -2012596
$$ packed form
43404f10430r57416k758421j016231L218097M909084J566175k680847k539956
43396h69945Q23458J824197q37439k538006l99811K382629J987666l71518j206864
43387G94367k05161L11799n30885j603707k139433k182252j503687j00853R47167
43378f212645Q01392K99264O69517J682600K317061K232915J461947n0390j413624
43369A788037r14660J376113K828295J766194l4051l07652J80550m54018j610218
43360D618590j523790q22460j449379k875918k717897p10530J096985J825616
43352b558783K315292K451962J243911m97463r07609m72247j119370j998496m18699
43343a961502K634628K840639l33125k089043j53087J270505j034103l187508
$$ plain form
43335 -2012596 -2763810 325194 2794396 1744617 823796 3864700 7718028 6670820
43327 6670820 1530895 -1376455 501405 3089151 2655260 638342 -285832 -726508 -2276423
43318 -2276423 -3661968 -2588802 174540 1760160 1486782 1201977 1500953 594533 -2246800
43309 -2246800 -4646774 -4129861 -1563863 154741 -126055 -1077086 -1286382 -538005 1114674
43300 1114674 3605786 5795661 5907252 3849329 1738026 1248290 1725179 1794598 1360836
43291 1360836 797712 -229637 -1404412 -796082 2371337 5278738 4874087 2960551 4320820
43282 4320820 9564850 13673276 12888677 9420213 7228715 6490953 5256766 3944859
43274 3944859 4441022 6212341 6985248 6511352 6214694 5631666 2950660 -731439 -1528130
$$ packed form
43335b012596p51214L089004K469202j049779r20821L040904L853328j047208
43327F670820n139925k907350J877860K587746m33891k016918r24174m40676j549915
43318b276423j385545J073166K763342J585620k73378k84805K98976r06420k841333
43309b246800k399974N16913K565998J718604k80796r51031k09296P48377J652679
43300A114674K491112K189875J11591k057923k111303m89736M76889O9419m33762
43291A360836n63124j027349j174775O08330L167419K907401m04651j913536J360269
43282D320820N244030M108426p84599l468464k191498p37762j234187j311907
43274C944859M96163J771319P72907m73896k96658n83028k681006l682099p96691
$$ plain form
43265 -1528130 1707579 5261245 5629894 3904058 3008763 2973925 1671721 -1138762 -3280330
43256 -3280330 -3277761 -1839635 -276992 781172 966548 58694 -1190130 -1226073 623301
43247 623301 3127278 4248534 3105046 789972 -549266 496606 3428512 6304697
43239 6304697 7280944 5668577 2023817 -1937885 -3675002 -1491202 3272764 6628918
43231 6628918 5733596 2037688 -288837 1089497 4646003 7443375 8352501 8166221 7429932
43222 7429932 5502240 1972425 -1912871 -3989397 -3160405 -199326 3174627 5414723
43214 5414723 5626207 4088215 2673008 3637612 7083187 10310221 10695594 8731721 7216041
43205 7216041 7878024 9967374 11845837 12596881 12065245 10681270 9563214 9657379 10414737
$$ packed form
43265a528130L235709L553666L68649j725836q95295l4838j302204k810483k141568
43256c280330K569J438126J562643J058164J85376r07854j248824l5943J849374
43247F23301K503977J121256j143488k315074j339238J045872K931906K876185
43239F304697R76247j612367l644760l961702j737117K183800M763966L356154
43231F628918q95322l695908k326525J378334L556506K797372R09126j86280p36289
43222G429932j927692l529815l885296k076526Q28992K961079L373953K240096
43214E414723K11484j537992j415207R64604L445575L227034L85373j963873j515680
43205G216041O61983K089350J878463P51044n31636j383975j118056R4165P57358
$$ plain form
43196 10414737 10305306 8947677 7737789 7999424 9395420 10514041 10304139 8860774
43188 8860774 7624335 8608400 12198915 15849316 16445519 13868686 10426724 6966506
43180 6966506 2311946 -2779532 -4391724 -409994 5671964 8691147 8064117 7330506
43172 7330506 8593381 10542397 11676539 12363452 13083340 13091623 11816430 9854307 7766065
43163 7766065 5364926 2962534 1982387 3413694 6492893 9506305 11197567 11157577 9797362
43154 9797362 8307559 7779022 8009857 7873537 6928777 5813929 5114641 4953687 5707414
43145 5707414 7804992 10578054 12601116 13461494 13874449 13870817 12676471 11021035 11515198
43136 11515198 15292745 19896990 22278725 22596700 22965291 23499413 22388171 19810423
$$ packed form
43196A0414737j09431j357629j209888K61635J395996J118621k09902j443365
43188H860774j236439R84065L590515L650401N96203k576833l441962l460218
43180F966506m654560n091478j612192L981730O081958L019183o27030p33611
43172G330506J262875J949016J134142O86913P19888Q283j275193j962123k088242
43163G766065k401139k402392r80147J431307L079199L013412J691262l9990j360215
43154I797362j489803n28537K30835j36320r44760j114848o99288j60954P53727
43145E707414K097578K773062K023062Q60378M12955l632j194346j655436M94163
43136A1515198L777547M604245K381735L17975L68591N34122j111242k577748
$$ plain form
43128 19810423 18831288 21270070 24985384 27082166 28186860 31184713 36468422 41142797
43120 41142797 43438297 45586057 50811779 58885621 66524204 71756609 76242724 83119331
43112 83119331 93753719 106998385 120921925 134975679 150669768 169742129 191382321
43105 191382321 212458990 231606231 251563506 275174238 300262746 321946521 339832639
43098 339832639 358675279 380586190 400804885 413841581 420134158 423058295 422583876
43091 422583876 416595553 406253618 394492599 380018109 358570285 330772492 303271820
43084 303271820 280247541 258506403 233597171 206794002 182794169 163532958 147716090
43077 147716090 134332094 123242353 113550224 104212553 95423619 87362434 78922884 69840655
$$ packed form
43128A9810423r79135K438782L715314K096782J104694K997853N283709M674375
43120D1142797K295500K147760N225722Q073842P638583N232405M486115O876607
43112H3119331J0634388J3244666J3923540J4053754J5694089J9072361K1640192
43105A91382321K1076669J9147241J9957275K3610732K5088508K1683775J7886118
43098C39832639J8842640K1910911K0218695J3036696O292577K924137m74419
43091D22583876n988323j0341935j1761019j4474490k1447824k7797793k7500672
43084C03271820k3024279k1741138k4909232k6803169k3999833j9261211j5816868
43077A47716090j3383996j1089741r692129r337671q788934q061185q439550r082229
$$ plain form
43069 69840655 62487212 58871574 57094441 53671074 48504916 44465726 42401226 39843032
43061 39843032 35206380 30405078 27976835 27580388 26937234 25254951 24201975 25366616
43053 25366616 27512211 27245135 22951500 17276274 14085654 13309944 11375789 7333457
43045 7333457 5260605 8392766 13721943 15734052 13606788 11041646 10228175 9970411
43037 9970411 9268856 8668834 7864503 5853626 4017480 5141658 8426726 9532189 7217844
43028 7217844 5878247 8899566 13131067 13410780 9829413 6626946 5784432 5821701 5892192
43019 5892192 6791390 7892859 7112928 4886552 4691569 7915330 11025809 10162639 6524140
43010 6524140 4410809 4996714 5262704 3479708 2647239 6267384 12332749 14636845 10422037
$$ packed form
43069F9840655p353443l615638j777133l423367n166158m039190k064500k558194
43061C9843032m636652m801302k428243l96447o43154j682283j052976J164641
43053B5366616K145595k67076m293635n675226l190620p75710j934155m042332
43045G333457k072852L132161N329177K012109k127264k565142q13471k57764
43037I970411p01555o00022q04331k010877j836146J124178L285068J105463k314345
43028G217844j339597L021319M231501K79713l581367l202467q42514L7269P0491
43019E892192Q99198J101469p79931k226376j94983L223761L110479q63170l638499
43010F524140k113331N85905K65990j782996q32469L620145O065365K304096m214808
$$ plain form
43001 10422037 4041839 1407041 2854063 4230033 3953445 5225005 10273768 15746677
42993 15746677 16481665 12183323 7524348 6223950 7698781 9673479 11368141 12805704
42985 12805704 12955545 10725212 7235896 5257490 6142516 8640054 11143367 13687050
42977 13687050 16607124 18418640 17123967 13553304 11135041 11394566 11701208 9244097
42969 9244097 5607947 4751732 7061188 8301756 5000752 -1387941 -6475033 -7280942
42961 -7280942 -3987401 684216 3005951 1146854 -2340331 -2800316 653259 3735132
42953 3735132 2956839 437598 212686 1985470 2190360 144663 -943407 668383 2649601
42944 2649601 2620359 1759246 2463555 4494906 5610721 4932122 3825782 3838845 4977725
$$ packed form
43001A0422037o380198k634798J447022J375970k76588J271560N048763N472909
42993A5746677P34988m298342m658975j300398J474831J974698J694662J437563
42985A2805704J49841k230333l489316j978406Q85026K497538K503313K543683
42977A3687050K920074J811516j294673l570663k418263K59525L06642k457111
42969I244097l636150q56215K309456J240568l301004o388693n087092q05909
42961g280942L293541M671617K321735j859097l487185m59985L453575L081873
42953C735132p78293k519241k24912J772784K04890k045697j088070J611790J981218
42944B649601k9242q61113P04309K031351J115815o78599j106340J3063J138880
$$ plain form
42935 4977725 5825781 4768703 1629518 -1467862 -1722160 1181608 4385033 5186026 4275295
42926 4275295 4533600 7057585 9678658 9695391 7290358 5628700 7480197 11885488 14624195
42917 14624195 12504897 6951405 2547704 2080552 4026357 5130735 4210567 2599342
42909 2599342 1831027 2160340 3105586 4385319 6095340 8403832 11125135 13457231 14457340
42900 14457340 14036042 13095819 12418233 11930979 11409119 11163160 11326413 11086431 9639281
42891 9639281 7655814 6795873 7729666 9469814 10756997 11283770 11319168 11015895 10773499
42882 10773499 11755865 15042814 20011373 24192018 25437226 24251481 23357433 24607623
42874 24607623 26916863 28007128 27766176 28621382 32412421 38138395 43362200 46668569
$$ packed form
42935D977725Q48056j057078l139185l097380k54298K903768L203425Q00993r10731
42926D275295K58305K523985K621073J6733k405033j661658J851497M405291K738707
42917A4624195k119298n553492m403701m67152J945805J104378r20168j611225
42909B599342p68315L29313R45246J279733J710021K308492K721303K332096J000109
42900A4457340m21298r40223o77586m87254n21860k45959J63253k39982j447150
42891I639281j983467q59941R33793J740148J287183N26773L5398l03273k42396
42882A0773499R82366L286949M968559M180645J245208j185745q94048J250190
42874B4607623K309240J090265k40952Q55206L791039N725974N223805L306369
$$ plain form
42866 46668569 47886674 47120364 45056101 43525038 44048827 45904150 46978455 46447594
42858 46447594 45231432 43891050 41755922 38506284 35084852 32428044 30575543 29517064
42850 29517064 29436862 29442658 27694321 23917160 20385529 19178643 19755219 20446206 20730051
42841 20730051 20340676 17849373 12674667 7412252 5373827 6360358 7591235 8242165
42833 8242165 9760824 11817733 11911099 9965819 9366090 11445784 12598788 9712775 5344110
42824 5344110 3848858 4701734 3861065 459518 -2216964 -2074169 -392354 1641130 4562286
42815 4562286 7687739 8175826 4938665 830834 -934133 -389440 809337 2365411
42807 2365411 4602032 6541225 7056386 6846340 7245501 7954129 7797847 6929602 6371583
$$ packed form
42866D6668569J218105p66310k064263j531063N23789J855323J074305n30861
42858D6447594j216162j340382k135128l249638l421432k656808j852501j058479
42850B9517064q0202N796j748337l777161l531631j206886N76576O90987K83845
42841B0730051l89375k491303n174706n262415k038425R86531J230877O50930
42833H242165J518659K056909R3366j945280n99729K079694J153004k886013m368665
42824E344110j495252Q52876q40669l401547k676482J42795J681815K033484K921156
42815D562286L125453M88087l237161m107831j764967N44693J198777J556074
42807B365411K236621J939193N15161k10046L99161P08628j56282q68245n58019
$$ plain form
42798 6371583 5921281 4411264 1906314 49068 130801 1931601 4394232 6503100 7686497
42789 7686497 8187967 8804908 9681008 9960103 9266253 8556322 8470216 7793939 4966140
42780 4966140 533238 -3186058 -4448252 -3113012 -128691 2795683 3881924 3094847
42772 3094847 2479713 3253223 3627333 1461634 -1916773 -3056018 -1091545 1520189 2941683
42763 2941683 3882551 5108956 5729994 5121433 4412757 4689618 5261452 4848879 3204661
42754 3204661 796015 -1620109 -2378160 303058 5689754 10253393 11392355 10225615
42746 10225615 9553676 10445578 12207056 14324623 16617921 18304399 18660621 18248847 18247819
42737 18247819 19065277 20699046 23732878 28580570 34162417 38662504 41552318 44045366
$$ packed form
42798F371583m50302j510017k504950j857246Q1733J800800K462631K108868J183397
42789G686497N01470O16941Q76100K79095o93850p09931q6106o76277k827799
42780D966140m432902l719296j262194J335240K984321K924374J086241p87077
42772C094847o15134P73510L74110k165699l378407j139245J964473K611734J421494
42763B941683R40868J226405O21038o08561p08676K76861N71834m12573j644218
42754C204661k408646k416124p58051K681218N386696M563639J138962j166740
42746A0225615o71939Q91902J761478K117567K293298J686478L56222m11774j028
42737A8247819Q17458J633769L033832M847692N581847M500087K889814K493048
$$ plain form
42729 44045366 47685462 52837242 57977958 60319156 58371303 54271680 51777134 51128533
42721 51128533 48259950 40878910 32878787 29689383 30912769 31268348 28131023 24142943
42713 24142943 22053573 20961142 19130711 17224158 16599554 16790901 16780857 16856118 17189344
42704 17189344 16400771 13806363 11583184 12172607 14579480 15828763 15363653 15223822 16116236
42695 16116236 16283597 14826159 13422009 13508238 13943754 13117116 11757280 11743538 13052918
42686 13052918 13756703 12735413 10847583 9387531 8619077 8042797 7197550 5938927 4538139
42677 4538139 3630436 3588223 3998212 4267060 4569242 5518714 6999537 8072603 8080515 7165357
42667 7165357 5648009 3571960 959430 -2015353 -4999116 -7031523 -6643715 -3575654
$$ packed form
42729D4045366L640096N151780N140716K341198j947853m099623k494546o48601
42721E1128533k868583p381040q000123l189404J223386L55579l137325l988080
42713B4142943k089370j092431j830431j906553o24604J91347j0044P5261L33226
42704A7189344p88573k594408k223179N89423K406873J249283m65110j39831Q92414
42695A6116236J67361j457438j404150Q6229M35516q26638j359836j3742J309380
42686A3052918P03785j021290j887830j460052p68454n76280q45247j258623j400788
42677D538139r07703m2213M09989K68848L02182R49472J480823J073066P912r15158
42667G165357j517348k076049k612530k974783k983763k032407L87808L068061
$$ plain form
42659 -3575654 -106286 954171 -217510 -639072 1335715 3957485 5039384 4912394
42651 4912394 4851581 4416614 2627464 545354 126320 1092255 1410793 631324 247491
42642 247491 652310 308610 -1385386 -2694238 -2021382 100557 2544427 5306922 8289486
42633 8289486 9761077 7730679 2400407 -3716795 -7796171 -8519595 -6702881 -4450742
42625 -4450742 -2963318 -1326699 1366268 3294397 1697407 -2434168 -4424177 -2024579
42617 -2024579 1201835 724502 -2886549 -5350677 -4601534 -2365782 -516800 1180337
42609 1180337 3356174 5309865 5800431 4370706 1505226 -1673372 -3809850 -4189969
42601 -4189969 -3201906 -1517560 712272 3388393 5955732 7977673 9406528 9805874
$$ packed form
42659c575654L469368J060457j171681m21562J974787K621770J081899j26990
42651D912394o0813m34967j789150k082110m19034R65935L18538p79469l83833
42642B47491M04819l43700j693996j308852O72856K121939K443870K762495K982564
42633H289486J471591k030398n330272o117202m079376p23424J816714K252139
42625d450742J487424J636619K692967J928129j596990m131575j990009K399598
42617b024579L226414m77333l611051k464128P49143K235752J848982J697137
42609A180337K175837J953691M90566j429725k865480l178598k136478l80119
42601d189969R88063J684346K229832K676121K567339K021941J428855L99346
$$ plain form
42593 9805874 8504745 6184995 4843026 5193935 5607701 4722725 3471768 3196190 3479980
42584 3479980 3399032 3197129 3118024 2449765 1388349 1589840 2940613 2570100 -300187
42575 -300187 -1692229 1240555 4720673 3623140 -164710 -469706 3507107 6636422
42567 6636422 6654326 6851683 8995999 9973476 7648759 4549398 3184374 2535758 1630779
42558 1630779 1867483 3297385 3375008 1999312 2699160 5859777 6482730 2725614 751360
42549 751360 5440416 11511790 10897822 5030042 1971824 3790834 5049939 3071990
42541 3071990 1483160 2488359 2907748 254422 -3064267 -4250652 -4034653 -3514465 -1389625
42532 -1389625 2686341 5449353 3898905 -380218 -3257839 -2764946 -23175 2840434
$$ packed form
42593I805874j301129k319750j341969L50909M13766q84976j250957k75578K83790
42584C479980q0948k01903p9105o68259j061416K01491J350773l70513k870287
42575c00187j392042K932784L480118j097533l787850l04996L976813L129315
42567F636422J7904J97357K144316R77477k324717l099361j365024o48616r04979
42558A630779K36704J429902P7623j375696O99848L160617O22953l757116j974254
42549G51360M689056O071374o13968n867780l058218J819010J259105j977949
42541C071990j588830J005199M19389k653326l318689j186385K15999N20188K124840
42532a389625M075966K763012j550448m279123k877621M92893K741771K863609
$$ plain form
42524 2840434 4179519 3669024 2814315 3425058 5136650 5946210 5213927 4087914 2978814
42515 2978814 1105528 -1251141 -2675703 -3105396 -3736928 -4312050 -3529706 -2310406 -3029403
42506 -3029403 -4936263 -4383270 -840512 1470473 -176709 -3137688 -4077013 -3568647 -3151248
42497 -3151248 -1629971 1984511 4985460 4480043 2038177 953453 998890 -45201 -1506982
42488 -1506982 -906907 1185425 1695333 -45960 -1800083 -2473085 -3013153 -3587315 -3529008
42479 -3529008 -3899040 -6315381 -9125708 -8539791 -4073234 639432 2918974 3393860 2959407
42470 2959407 1565124 994109 4264054 10131755 12462850 8220944 2602483 2429743
42462 2429743 6975747 9504994 6447951 887176 -2637138 -2987756 -1667948 -324456
$$ packed form
42524B840434J339085n10495q54709O10743J711592Q09560p32283j126013j109100
42515B978814j873286k356669j424562m29693o31532n75122P82344J219300p18997
42506c029403j906860N52993L542758K310985j647182k960979r39325N08366M17399
42497c151248J521277L614482L000949n05417k441866j084724M5437j044091j461781
42488a506982O00075K092332N09908j741293j754123o73002n40068n74162N8307
42479c529008l70032k416341k810327N85917M466557M712666K279542M74886m34453
42470B959407j394283n71015L269945N867701K331095m241906n618461j72740
42462B429743M546004K529247l057043n560775l524314l50618J319808J343492
$$ plain form
42454 -324456 -45551 -1043126 -2129849 -1950954 -1058347 -1179516 -2281402 -2380213 -821851
42445 -821851 458889 171172 73121 2103945 4593080 4073477 520052 -2053356 -972495
42436 -972495 1555847 1783478 -675420 -3442923 -5407269 -7204393 -8165263 -6224117 -1807647
42427 -1807647 1226765 406011 -2012413 -2789252 -2601684 -4056682 -6344339 -5907986 -2381702
42418 -2381702 147217 -935794 -2941407 -2108104 812793 1908875 -250515 -2943721
42410 -2943721 -3030049 -419592 2402638 3107948 1535841 -359587 -479177 1311100 3324381
42401 3324381 4194217 3917530 2688555 262370 -2675096 -3990089 -2430632 419987
42393 419987 1980064 1848712 1740369 2714546 3997714 4518728 4289388 3934530 3650749
$$ packed form
42454c24456K78905r97575j086723J78895Q92607j21169j101886r8811J558362
42445h21851J280740k87717r8051K030824K489135n19603l553425k573408J080861
42436i72495K528342K27631k458898k767503j964346j797124r60870J941146M416470
42427a807647L034412q20754k418424p76839J87568j454998k287657M36353L526284
42418b381702K528919j083011k005613Q33303K920897J096082k159390k693206
42410b943721q6328K610457K822230P05310j572107j895428j19590J790277K013281
42401C324381Q69836k76687j228975k426185k937466j314993J559457K850619
42393D19987J560077j31352j08343R74177J283168N21014k29340l54858k83781
$$ plain form
42384 3650749 2988492 1532830 -45368 147228 3233759 7271295 8568671 6112558
42376 6112558 2934164 1801592 1590657 68855 -1699381 -1018505 1420910 1982035 -393500
42367 -393500 -2716042 -2732735 -1718991 -1181936 -109256 2454722 4934409 5798930 6267126
42358 6267126 7714972 8385952 5876807 1618349 -448337 831130 2859781 3485604
42350 3485604 3331988 3681897 4568382 5511858 6114499 5608771 3844800 2872486 5140235
42341 5140235 9627994 12256301 11000603 8186244 6633557 6116167 5314031 4753582 5269925
42332 5269925 5351583 3034884 -319553 -1019961 2064285 5869208 6920866 5100541 3005425
42323 3005425 2742897 4077100 5214628 5000455 4355679 5247075 8100181 10957731 11602866
$$ packed form
42384C650749o62257j455662j578198J92596L086531M037536J297376k456113
42376F112558l178394j132572k10935j521802j768236O80876K439415N61125k375535
42367c93500k322542j6693J013744N37055J072680K563978K479687Q64521M68196
42358F267126J447846O70980k509145m258458k066686J279467K028651O25823
42350C485604j53616L49909Q86485R43476O02641n05728j763971r72314K267749
42341E140235M487759K628307j255698k814359j552687n17390q02136n60449N16343
42332E269925Q1658k316699l354437p00408L084246L804923J051658j820325k095116
42323C005425k62528J334203J137528k14173o44776Q91396K853106K857550O45135
$$ plain form
42314 11602866 9657273 6174927 2508165 376292 1251376 3898422 4012773 -1156307
42306 -1156307 -8416097 -11394508 -7789141 -1780115 987552 -1064859 -5159078 -7510713
42298 -7510713 -6457803 -3673889 -2531106 -4111505 -5351676 -2946127 1665743 4032091
42290 4032091 3220750 3082263 6009709 8934241 7702856 2839801 -1583524 -3046774
42282 -3046774 -2139894 -318213 1580120 3187945 4604075 6043892 6780559 5734866
42274 5734866 3740157 3130737 4043072 3706844 978382 -1416303 -1473501 -1475353 -3575845
42265 -3575845 -4926419 -1801205 3681174 6248597 5468228 5257847 6029168 3884437 -1387794
42256 -1387794 -4148795 -1450524 2006872 1242521 -1449135 -887112 2692308 4841694
$$ packed form
42314A1602866j945593l482346l666762k131873Q75084K647046J14351n169080
42306a156307p259790k978411L605367O009026K767667k052411m094219k351635
42298g510713J052910K783914J142783j580399j240171K405549M611870K366348
42290D032091q11341j38487K927446K924532j231385m863055m423325j463250
42282c046774R06880J821681J898333J607825J416130J439817P36667j045693
42274E734866j994709o09420R12335l36228k728462k394685n7198j852k100492
42265c575845j350574L125214N482379K567423p80369k10381P71321k144731n272231
42256a387794k761001K698271L457396p64351k691656N62023L579420K149386
$$ plain form
42248 4841694 4193659 3499311 4258015 4658167 2882194 -725866 -4692822 -7098728 -5863957
42239 -5863957 -1006716 4000135 5692336 4709422 3966997 4040820 3601533 3157599 4088871
42230 4088871 4421977 539967 -5998608 -8289725 -3076367 4138068 6081473 2696115
42222 2696115 -411003 -175039 1397382 1978954 2118335 2958046 3610053 2266733 -1327498
42213 -1327498 -5429138 -7769298 -7261523 -4767128 -2152167 -278330 1568417 3820738
42205 3820738 5214770 4403256 2296652 1259111 2027776 2754598 1416928 -1726995 -4423212
42196 -4423212 -4602683 -2111037 1328915 3769723 4747425 5129028 5412354 5131106 4236483
42187 4236483 3751925 4111859 4046301 2443295 273789 -937890 -1567785 -2770081 -3651496
$$ packed form
42248D841694o48035o94348P58704M00152j775973l608060l966956k405906J234771
42239e863957M857241N006851J692201r82914p42425P3823m39287m43934R31272
42230D088871L33106l882010o538575k291117N213358P214435J943405l385358
42222B696115l107118K35964J572421N81572J39381Q39711O52007j343320l594231
42213a327498m101640k340160N07775K494395K614961J873837J846747K252321
42205C820738J394032q11514k106604j037541P68665P26822j337670l143923k696217
42196d423212j79471K491646L439952K440808R77702L81603K83326k81248q94623
42187D236483m84558L59934o5558j603006k169506j211679o29895j202296q81415
$$ plain form
42178 -3651496 -2135847 1408772 3996299 3925155 2460627 1064922 -424940 -1867821
42170 -1867821 -1877336 -523939 -421741 -2869217 -5070255 -3731080 486852 4819710 8636948
42161 8636948 12268218 13336601 8966563 1331689 -3737200 -4361903 -4320151 -5952026 -6287946
42152 -6287946 -2856161 1216500 1939454 875248 2053965 4741816 4603294 1226082
42144 1226082 -910293 380102 1704729 -180129 -3358672 -4179737 -2828507 -2289262
42136 -2289262 -3287423 -3412358 -1049845 2270516 4034656 3691876 2509355 1218766 -967791
42127 -967791 -4519188 -7573062 -7303801 -3709028 -443844 -619673 -3103503 -4729939 -4865043
42118 -4865043 -5161563 -5557052 -3881592 128517 3607979 4557790 4372947 4884583 5344066
$$ packed form
42178c651496J515649L544619K587527p1144j464528j395705j489862j442881
42170a867821r515J353397J02198k447476k201038J339175M217932M332858L817238
42161H636948L631270J068383m370038p634874n068889o24703M1752j631875l35920
42152f287946L431785M072661P22954j064206J178717K687851j38522l377212
42144A226082k136375J290395J324627j884858l178543q21065J351230N39245
42136b289262r98161j24935K362513L320361J764140l42780j182521j290589k186557
42127i67791l551397l053874K69261L594773L265184j75829k483830j626436j35104
42118d865043k96520l95489J675460M010109L479462R49811j84843N11636M59483
$$ plain form
42109 5344066 4240670 2038638 6109 -1939447 -4013377 -4753824 -2976110 -498537
42101 -498537 -234378 -1943505 -2419287 -173442 2190622 1192741 -3070523 -6627692 -5770418
42092 -5770418 -1321713 1736913 -321215 -5470306 -8451067 -7364918 -5155015 -4330406
42084 -4330406 -3749594 -2120667 -973219 -1404025 -1195573 1236750 2953700 893157 -2301434
42075 -2301434 -1991323 718369 858606 -1673593 -1902461 1231506 2582967 -457342 -3543363
42066 -3543363 -3030166 -1916066 -3521427 -4668315 -1229146 3494180 2884285 -2622860
42058 -2622860 -6216704 -5095885 -3485355 -4680822 -6455265 -6389766 -6193598 -7565147 -8168266
42049 -8168266 -5560787 -1974693 -1141777 -2450888 -2339866 -296523 725198 -213084 -186639
$$ packed form
42109E344066j103396k202032k032529j945556k073930p40447J777714K477573
42101d98537K64159j709127m75782K245845K364064r97881m263264l557169Q57274
42092e770418M448705L058626k058128n149091k980761J086149K209903Q24609
42084d330406N80812J628927J147448m30806K08452K432323J716950k060543l194591
42075b301434L10111K709692J40237k532199k28868L133967J351461l040309l086021
42066c543363N13197J114100j605361j146888L439169M723326o09895n507145
42058b622860l593844J120819J610530j195467j774443O5499J96168j371549o03119
42049h168266K607479L586094Q32916j309111J11022K043343J021721r38282K6445
$$ plain form
42040 -186639 2728540 5978964 6082639 3593549 2048462 2982640 4483340 4603379 3905874
42031 3905874 3791781 3981394 3057170 757821 -1543416 -2518618 -2286209 -2201489 -3550448
42022 -3550448 -6018025 -7304050 -5340752 -1470195 126148 -2380922 -5290925 -3692761
42014 -3692761 1926179 6236615 6036479 3479639 1733108 791962 -588836 -1623810
42006 -1623810 -804815 1207681 2499868 2675885 2662395 2721139 2559793 2443613 2353994 1132061
41996 1132061 -1605217 -3948489 -4336329 -4381857 -6275666 -8467869 -7341130 -2825008 1131870
41987 1131870 1885473 534853 -1371521 -3913081 -6467540 -6941793 -5293594 -4716095 -6936332
41978 -6936332 -9015083 -7555586 -3826619 -1590393 -1552011 -1361617 -89669 846689 1020373
$$ packed form
42040a86639K915179L250424J03675k489090j545087R34178J500700J20039o97505
42031C905874j14093J89613r24224k299349k301237r75202K32409Q4720j348959
42022c550448k467577j286025J963298L870557J596343k507070k910003J598164
42014c692761N618940M310436k00136k556840j746531r41146j380798j034974
42006a623810Q18995K012496J292187J76017j3490N8744j61346j16180q9619j221933
41996A132061k737278k343272l87840m5528j893809k192203J126739M516122L956878
41987A131870P53603j350620j906374k541560k554459m74253J648199N77499k220237
41978f936332k078751J459497L728967K236226L8382J90394J271948R36358J73684
$$ plain form
41969 1020373 1951835 4172837 5947529 5690492 3674222 885547 -1826188 -3139446
41961 -3139446 -2077959 -23879 480708 -224231 1208668 5725363 9217799 7899927
41953 7899927 4031964 2805964 4928694 6367113 5191872 4277518 6006868 8310274
41945 8310274 8407216 7297179 7279481 7282278 4543522 -132274 -2785300 -2007401 -640393
41936 -640393 -1134391 -2596524 -3638378 -4828255 -6298215 -5838552 -2208646 1697998 2127582
41927 2127582 -291469 -1632792 -337021 1274764 1098303 -99625 -749145 -709262 -424032
41918 -424032 220994 1114299 1437767 854716 -49924 -1075828 -2656180 -4115494 -3423180
41909 -3423180 26459 3730163 4671515 2744877 269421 -1097940 -1464587 -1287822 -627449
$$ packed form
41969A020373R31462K221002J774692k57037k016270k788675k711735j313258
41961c139446J061487K054080N04587p04939J432899M516695L492436j317872
41953G899927l867963j226000K122730J438419j175241r14354J729350K303406
41945H310274R6942j110037j7698K797k738756m675796k653026P77899J367008
41936f40393m93998j462133j041854j189877j469960M59663L629906L906644M29584
41927B127582k419051j341323J295771J611785j76461j197928o49520L9883K85230
41918d24032O45026Q93305L23468n83051r04640j025904j580352j459314O92314
41909c423180L449639L703704R41352j926638k475456j367361l66647J76765O60373
$$ plain form
41900 -627449 32562 -343492 -2001398 -3711491 -4010851 -2728353 -909664 369220 674288
41891 674288 102317 -667364 -154180 3013242 8044294 11472512 10140044 4834996 -312759
41882 -312759 -2344735 -1992757 -1343833 -1032115 -1033501 -2230468 -4920059 -7060068 -6535297
41873 -6535297 -4408269 -3394514 -3752821 -3533577 -2497176 -2396360 -3049374 -1721261 2363902
41864 2363902 6117482 6880157 5753542 4743378 3453202 1179308 -206635 1289145
41856 1289145 3985439 4354586 1780536 -1324461 -3411480 -4841173 -5300668 -3230020
41848 -3230020 1402211 5884905 7368349 5648979 2949268 1660385 2286102 3081566
41840 3081566 2146664 145473 -332407 1281823 2226907 457969 -2187926 -3025543 -2507483
$$ packed form
41900f27449O60011l76054j657906j710093k99360J282498J818689J278884L05068
41891F74288n71971p69681N13184L167422N031052L428218j332468n305048n147755
41882c12759k031976L51978O48924L11718j386j196967k689591k140009N24771
41873f535297K127028J013755l58307K19244J036401J00816o53014J328113M085163
41864B363902L753580P62675j126615j010164j290176k273894j385943J495780
41856A289145K696294L69147k574050l104997k087019j429693m59495K070648
41848c230020M632231M482694J483444j719370k699711j288883O25717P95464
41840C081566r34902k001191m77880J614230R45084j768938k645895q37617N18060
$$ plain form
41831 -2507483 -2232623 -1047347 2894960 7483696 8624248 6507543 5222321 5834735
41823 5834735 4935470 1402060 -636984 1600170 4463170 3146399 -1351670 -4663899
41815 -4663899 -5840129 -7224107 -9249512 -10048993 -9685056 -10363589 -12090072 -11929938 -8455068
41806 -8455068 -3725733 146496 3459111 6677625 8459753 7690458 5480135 3457964
41798 3457964 1779629 421699 691938 3376831 6632803 7917848 7280844 6678553 6652002
41789 6652002 6024075 4765865 4641327 6309150 7910374 7720666 6622676 6653563 8336077
41780 8336077 10693165 12661214 13010169 10150938 4179101 -1548576 -3219610 -929662
41772 -929662 1811180 2874257 3373778 4396491 4767487 3475846 1838712 1283076 983161
$$ packed form
41831b507483K74860J185276L942307M588736J140552k116705j285222O12414
41823E834735q99265l533410k039044K237154K863000j316771m498069l312229
41815d663899j176230j383978k025405p99481L63937o78533j726483J60134L474870
41806h455068M729335L872229L312615L218514J782128p69295k210323k022171
41798C457964j678335j357930K70239K684893L255972J285045o37004o02291k6551
41789F652002o27927j258210j24538J667823J601224j89708j097990L0887J682514
41780H336077K357088J968049L48955k859231n971837n727677j671034K289948
41772i29662K740842J063077M99521J022713L70996j291641j637134n55636k99915
$$ plain form
41763 983161 -104150 -707277 563186 1943114 631805 -2550018 -3950190 -2476237
41755 -2476237 -897530 -1207256 -1900011 -1171271 -26888 -262970 -1360052 -1541972 -783702
41746 -783702 -861581 -2841307 -5728819 -7397348 -6406719 -3451855 -1036465 -727041 -1001215
41737 -1001215 495402 2799747 2347185 -1594171 -5120111 -4820615 -2060246 -88703
41729 -88703 668092 1719785 2834883 2445557 707959 -818375 -1919894 -3354241 -4261170
41720 -4261170 -2993703 -482921 340285 -954817 -1303174 1244332 4553106 5786922
41712 5786922 5709449 7267608 10760909 12710314 9970685 3737623 -1346740 -1841188 1307697
41703 1307697 4381543 5001956 3688663 1792244 -200748 -1719594 -1580795 -10773
$$ packed form
41763I83161j087311o03127J270463J379928j311309l181823j400172J473953
41755b476237J578707l09726o92755P28740J144383k36082j097082j81920P58270
41746g83702p7879j979726k887512j668529R90629K954864K415390L09424k74174
41737a001215J496617K304345m52562l941356l525940K99496K760369J971543
41729h8703P56795J051693J115098l89326j737598j526334j101519j434347r06929
41720d261170J267467K510782Q23206j295102l48357K547506L308774J233816
41712E786922p7473J558159L493301J949405k739629o233062n084363m94448L148885
41703A307697L073846O20413j313293j896419j992992j518846J38799J570022
$$ plain form
41695 -10773 493172 -1567309 -3900980 -3401176 -850234 391713 -89013 877040 4509445
41686 4509445 7351379 5935878 1778366 -543819 976790 3987449 5004148 2971225
41678 2971225 -263663 -2184257 -2125180 -1394536 -757375 1017550 4708328 7903027 7270956
41669 7270956 3279381 -219483 -1462313 -2797051 -6173177 -9593242 -9982461 -7369259
41661 -7369259 -4193912 -2153187 -1480947 -1723331 -1568115 427514 3363331 4193896 2169672
41652 2169672 803871 2974724 6224631 6027912 2068377 -2173792 -4828279 -6734031
41644 -6734031 -7691311 -5884325 -1832044 701533 -636724 -3659969 -4606661 -2420633
41636 -2420633 1015150 3284447 3106318 1024598 -699804 6999 2742495 5267519
$$ packed form
41695a0773N03945k060481k333671M99804K550942J241947m80726R66053L632405
41686D509445K841934j415501m157512k322185J520609L010659J016699k032923
41678B971225l234888j920594N9077P30644O37161J774925L690778L194699o32071
41669G270956l991575l498864j242830j334738l376126l420065l89219K613202
41661g369259L175347K040725O72240k42384J55216J995629K935817Q30565k024224
41652B169672j365801K170853L249907j96719l959535m242169k654487j905752
41644f734031r57280J806986M052281K533577j338257l023245r46692K186028
41636b420633L435783K269297j78129k081720j724402P06803K735496K525024
$$ plain form
41628 5267519 6397381 6752064 6664673 5326683 2593265 38325 -466165 1731986 5762069
41619 5762069 9076615 8310953 2620251 -4073127 -6661022 -4583992 -1404187 806737
41611 806737 2880575 4335504 2670766 -1433491 -3023252 24827 2982447 1084168
41603 1084168 -3363399 -5206155 -4584560 -5332387 -7286557 -6347136 -1783732 2313048 3442502
41594 3442502 3237447 2524911 -796986 -6753353 -10960439 -10441234 -8022775 -7546077 -7866235
41585 -7866235 -5526003 -1091942 1497549 903565 -262150 47770 900672 1008889 796865
41576 796865 643655 -712905 -4249503 -8136920 -8789499 -4654389 1685054 5656532 5041048
41567 5041048 1820409 -659804 -1661149 -2916582 -4950138 -5763926 -4013371 -1445618
$$ packed form
41628E267519J129862L54683q7391j337990k733418k554940n04490K198151M030083
41619E762069L314546p65662n690702o693378k587895K077030L179805K210924
41611H06737K073838J454929j664738m104257j589761L048079K957620j898279
41603A084168m447567j842756O21595p47827j954170R39421M563404M096780J129454
41594C442502k05055p12536l321897n956367m207086N19205K418459M76698l20158
41585g866235K340232M434061K589491n93984j165715L09920Q52902J08217k12024
41576G96865j53210j356560l536598l887417o52579M135110O339443L971478o15484
41567E041048l220639k480213j001345j255433k033556q13788J750555K567753
$$ plain form
41559 -1445618 -520613 -990023 -697862 1100599 3022133 3568957 2211411 -1001825 -5185647
41550 -5185647 -8282750 -8671837 -7065690 -5495728 -4761948 -4349932 -4305696 -5113896 -5790692
41541 -5790692 -4400192 -1113143 1213740 537574 -1814891 -3216912 -3093420 -2810327 -3006819
41532 -3006819 -2651186 -894745 1265900 1985211 1046900 501678 2135424 4787668 5547814
41523 5547814 3709599 1713472 1315106 930491 -1291536 -3598749 -2792304 618792 2701565
41514 2701565 1624883 -199704 -221795 828458 884611 -373880 -1831659 -2649572 -2485953
41505 -2485953 -1397449 -251138 208168 875597 2757748 3889134 984550 -4885951
41497 -4885951 -7866608 -4623029 1071512 3542594 2036581 -526081 -2548093 -3698685
$$ packed form
41559a445618R25005m69410K92161J798461J921534N46824j357546l213236m183822
41550e185647l097103l89087J606147J569962P33780M12016M4236q08200o76796
41541e790692J390500L287049K326883o76166k352465j402021J23492K83093j96492
41532c006819L55633J756441K160645P19311r38311n45222J633746K652244P60146
41523E547814j838215j996127l98366l84615k222027k307213Q06445L411096K082773
41514B701565j076682j824587k2091J050253N6153j258491j457779q17913J63619
41505b485953J088504J146311M59306O67429J882151J131386k904584n870501
41497d885951k980657L243579N694541K471082j506013k562662k022012j150592
$$ plain form
41489 -3698685 -2419848 1874824 5588603 4644340 700156 -885961 1050564 2389201
41481 2389201 784926 -1114217 -695876 969054 2291105 3684410 4634120 2362000
41473 2362000 -3423192 -7842943 -6599658 -1943622 723329 75632 -1259178 -2323414
41465 -2323414 -4508441 -6884713 -5787684 -627306 3753361 3153924 -56250 -165128
41457 -165128 3973227 7609995 6961962 4283825 4128406 6556102 7263196 4259729 981808
41448 981808 1178180 3492093 3979549 2312044 1941828 4491724 7399729 7685926 5215484
41439 5215484 1503643 -2015510 -3646132 -2125381 1029868 2347146 925498 -311602
41431 -311602 727155 2194096 1848333 958880 1908582 3978709 4523323 3016968 1244796
$$ packed form
41489c698685J278837M294672L713779r44263l944184j586117J936525J338637
41481B389201j604275j899143M18341J664930J322051J393305R49710k272120
41473B362000n785192m419751J243285M656036K666951o47697j334810j064236
41465b323414k185027k376272J097029N160378M380667n99437l210174j08878
41457a65128M138355L636768o48033k678137j55419K427696P07094l003467l277921
41448I81808J96372K313913M87456j667505l70216K549896K908005K86197k470442
41439E215484l711841l519153j630622J520751L155249J317278j421648j237100
41431c11602J038757J466941l45763q89453R49702K070127N44614j506355j772172
$$ plain form
41422 1244796 485370 831904 2269588 4271701 5403453 5203853 4994816 4994592 2831077
41413 2831077 -2496834 -7525939 -8573654 -7053218 -6715433 -7422182 -6203409 -3252844
41405 -3252844 -1771159 -2156805 -1465136 911008 1925686 229406 -1699388 -1998927 -1736443
41396 -1736443 -1568740 -480645 762302 -417937 -3137771 -2635173 2280465 6142775
41388 6142775 4490709 146106 -2010138 -2271798 -3457929 -4698364 -3308047 -393613
41380 -393613 832235 688424 1808062 3533007 2762882 -172180 -1529481 -64016 1635876
41371 1635876 1892957 1706307 1544609 668492 26705 1450337 3338825 1723125 -3201986
41362 -3201986 -6155006 -4169416 -699758 -103921 -1915956 -3267942 -3527847 -3458378 -2615103
$$ packed form
41422A244796p59426L46534J437684K002113J131752j99600k09037k24k163515
41413B831077n327911n029105j047715J520436L37785p06749J218773K950565
41405c252844J481685l85646O91669K376144J014678j696280j928794k99539K62484
41396a736443J67703J088095J242947j180239k719834N02598M915638L862310
41388F142775j652066m344603k156244k61660j186131j240435J390317K914434
41380c93613J225848j43811J119638J724945p70125k935062j357301J465465J699892
41371A635876K57081j86650j61698q76117o41787J423632J888488j615700m925111
41362c201986k953020J985590L469658N95837j812035j351986k59905O9469Q43275
$$ plain form
41353 -2615103 -764555 378499 -140377 -89639 2611697 5867964 5876825 2359882 -1671884
41344 -1671884 -4330430 -6007453 -6837587 -6093838 -4122532 -2427249 -1699233 -1616229 -2238580
41335 -2238580 -3540564 -3901313 -1365308 3486611 7845641 9858309 9707358 7847727
41327 7847727 4587719 1667378 1670032 4715118 7596134 7503189 5258263 3605856 3392650
41318 3392650 2960170 955027 -1607994 -2525453 -1163019 526600 86517 -2481927 -4504356
41309 -4504356 -3602626 -108499 3858617 6623148 7425445 5888422 2559620 -672623
41301 -672623 -2250442 -2643044 -3062182 -3197584 -1968698 102136 1459600 2207089 3805754
41292 3805754 5930258 6287659 4419258 3148081 4711015 7452220 8196350 6445192
$$ packed form
41353b615103J850548J143054n18876N0738K701336L256267Q861l516943m031766
41344a671884k658546j677023q30134P43749J971306J695283P28016Q3004o22351
41335b238580j301984l60749K536005M851919M359030K012668j50951j859631
41327G847727l260008k920341K654L045086K881016r2945k244926j652407k13206
41318C392650m32480k005143k563021r17459J362434J689619m40083k568444k022429
41309d504356R01730L494127L967116K764531Q02297j537023l328802l232243
41301f72623j577819l92602m19138j35402J228886K070834J357464P47489J598665
41292C805754K124504L57401j868401j271177J562934K741205P44130j751158
$$ plain form
41284 6445192 4302293 3234482 2847236 2437209 2099977 2263804 3103937 4318555 4977488
41275 4977488 4220147 2716070 2493040 4353462 6379916 6249906 4301539 2863335 2940792
41266 2940792 3023015 1237488 -2321156 -5508986 -5862068 -2790643 1373869 3148976 1425960
41257 1425960 -1510584 -3116243 -3404936 -3427605 -2636497 -196520 2035850 919962 -3338822
41248 -3338822 -6691648 -6227589 -3390229 -1235793 -714380 -1117793 -2184664 -3694109 -4291411
41239 -4291411 -2928464 -867565 -341357 -1529558 -2566103 -2343308 -1547655 -776117 637852
41230 637852 3242666 6187368 8203196 9110197 9572017 9806974 9204194 7078766 3544623
41221 3544623 -106429 -1846669 -411798 3155553 5938800 5737665 2999067 -240670
$$ packed form
41284F445192k142899j067811l87246m10027l37232J63827Q40133J214618O58933
41275D977488p57341j504077k23030J860422K026454j30010j948367j438204P7457
41266B940792Q2223j785527l558644l187830l53082L071425M164512J775107j723016
41257A425960k936544j605659k88693k2669P91108K439977K232370j115888m258784
41248c338822l352826M64059K837360K154436N21413m03413j066871j509445n97302
41239d291411J362947K060899N26208j188201j036545K22795P95653P71538J413969
41230F37852K604814K944702K015828R07001M61820K34957o02780k125428l534143
41221C544623l651052j740240J434871L567351K783247k01135k738598l239737
$$ plain form
41213 -240670 -2765693 -4602514 -5458727 -4396188 -1669986 575275 797603 266069 1028239
41204 1028239 2311877 1366474 -1904770 -3944790 -2550890 -277624 -331298 -1116836 1416070
41195 1416070 6656165 8772173 4417406 -2472636 -5740036 -4335291 -1978755 -1264212
41187 -1264212 -1224557 -294030 1159026 1890509 1565137 698549 -177133 -762387 -965976
41178 -965976 -836913 -305755 620707 1137841 121858 -1822440 -1981951 1193926 5210697
41169 5210697 5900505 2545555 -1204894 -1692043 1181013 5005207 7679117 8398226 7308527
41160 7308527 5289826 3417318 2080400 1164261 960979 1654975 1915091 -176864 -4101738
41151 -4101738 -6551815 -5363749 -2509327 -1682786 -3715137 -5856266 -5296107 -2244784
$$ packed form
41213b40670k525023j836821q56213J062539K726202K245261K22328n31534P62170
41204A028239J283638r45403l271244k040020J393900K273266n3674p85538K532906
41195A416070N240095K116008m354767o890042l267400J404745K356536P14543
41187a264212L9655R30527J453056P31483l25372q66588q75682n85254k03589
41178i65976J29063N31158R26462N17134j015983j944298j59511L175877M016771
41169E210697O89808l354950l750449m87149K873056L824194K673910P19109j089699
41160G308527k018701j872508j336918r16139k03282O93996K60116k091955l924874
41151d101738k450077J188066K854422Q26541k032351k141129N60159L051323
$$ plain form
41143 -2244784 458979 207874 -2681775 -4875389 -3264262 1429953 5291023 5856434
41135 5856434 4762924 4910356 6541804 7706624 7468316 6709987 6284315 6170439 6242532
41126 6242532 6287804 5464364 3296478 1013884 279054 746010 645559 -339342 -897486
41117 -897486 -915330 -1932089 -3921513 -4265267 -1726732 766516 -180936 -3472199 -5201018
41108 -5201018 -4491826 -4250089 -5802197 -6396675 -3880324 -957193 -1709967 -5416443 -7373546
41099 -7373546 -5670627 -3541806 -3903049 -4932220 -3587016 -1013022 -816174 -3009788
41091 -3009788 -3739421 -1516533 132322 -1882190 -5205184 -5402745 -2485287 -798600
41083 -798600 -2965251 -6819466 -8573747 -6744484 -2531776 1680348 3564201 2325982
$$ packed form
41143b244784K703763k51105k889649k193614J611127M694215L861070N65411
41135E856434j093510J47432J631448J164820k38308p58329m25672j13876P2093
41126F242532M5272q23440k167886k282594p34830M66956j00451r84901n58144
41117h97486j7844j016759j989424l43754K538535K493248r47452l291263j728819
41108e201018P09192K41737j552108n94478K516351K923131p52774l706476j957103
41099g373546J702919K128821l61243j029171J345204K573994J96848k193614
41091c009788p29633K222888J648855k014512l322994j97561K917458J686687
41083g98600k166651l854215j754281J829263M212708M212124J883853j238219
$$ plain form
41075 2325982 -193205 -1086334 400610 2341267 3057985 3020294 3239897 3431734 2888120
41066 2888120 1945773 1362399 1089073 704799 287132 -131703 -1165928 -3001851 -4351447
41057 -4351447 -3705370 -1369512 741545 1217084 292788 -1012210 -2261541 -3983125 -6736504
41048 -6736504 -9630645 -10244414 -7088437 -1992347 1450531 1982146 1437670 1070204 -331302
41039 -331302 -3267354 -5103812 -3432059 -74118 1225450 -75954 -1567227 -2283753
41031 -2283753 -3266496 -4067894 -2703672 227679 1171947 -1243435 -4066086 -4644401 -4045270
41022 -4045270 -3814166 -2885863 -744177 -319453 -3481858 -6021333 -2293678 5930270 10496684
41013 10496684 7396480 1555840 -549686 1073507 1978517 236831 -2058179 -2721297
$$ packed form
41075B325982k519187q93129J486944J940657P16718l7691K19603J91837n43614
41066B888120r42347n83374k73326l84274m17667m18835j034225j835923j349596
41057d351447O46077K335858K111057M75539r24296j304998j249331j721584k753379
41048f736504k894141o13769L155977N096090L442878N31615n44476l67466j401506
41039c31302k936052j836458J671753L357941J299568j301404j491273p16526
41031b283753r82743q01398J364222K931351R44268k415382k822651n78315N99131
41022d045270K31104R28303K141686M24724l162405k539475L727655Q223948M566414
41013A0496684l100204n840640k105526J623193R05010j741686k295010o63118
$$ plain form
41005 -2721297 -1824757 -508481 361382 394758 -6910 295056 1740709 3092013 2882781
40996 2882781 1349799 -50549 -462030 92480 1634362 4093727 6433583 7074965 5377473
40987 5377473 2138534 -1275384 -3905253 -5599530 -6694751 -6939131 -5063052 -700345
40979 -700345 3462668 3774726 655638 -1066357 1353616 4332962 3080894 -1164982
40971 -1164982 -2931763 -451529 2637841 3628349 4142375 5684514 5999966 2824247 -1496016
40962 -1496016 -2472672 701976 4504946 5592874 3806840 1066717 -899582 -1681863
40954 -1681863 -2134850 -3205163 -4532475 -4952096 -4553960 -4842079 -6336279 -7644254 -7651380
40945 -7651380 -6836468 -5560634 -3209595 -260639 1222477 877436 1270602 3613345 5017048
$$ packed form
41005b721297Q96540J316276Q69863L3376m01668L01966J445653J351304k09232
40996B882781j532982j400348m11481N54510J541882K459365K339856O41382j697492
40987E377473l238939l413918k629869j694277j095221k44380J876079M362707
40979g00345M163013L12058l119088j721995K419973K979346j252068m245876
40971a164982j766781K480234L089370R90508N14026J542139L15452l175719m320263
40962a496016r76656L174648L802970J087928j786034k740123j966299p82281
40954a681863m52987j070313j327312m19621L98136k88119j494200j307975p126
40945g651380Q14912J275834K351039K948956J483116l45041L93166K342743J403703
$$ plain form
40936 5017048 3152066 1042915 2972546 7300092 8209758 4095792 -565419 -1976142
40928 -1976142 -1074530 -19713 883753 1246977 -224299 -2549440 -2240557 1337828 3815598
40919 3815598 1764356 -2338305 -4166773 -3682050 -3606592 -4173301 -3600455 -2387322 -2839031
40910 -2839031 -4709886 -5177335 -3336716 -1358844 -737863 -449601 485206 1420887 1983366
40901 1983366 3036811 4703126 5656814 5456938 5348949 5476554 3631036 -1266927 -6309092
40892 -6309092 -7671668 -5502137 -3365046 -3406596 -4505165 -5099199 -5180125 -4693626 -2440625
40883 -2440625 1645262 4813153 4401512 1657693 241930 1027502 1006960 -1790672 -4776550
40874 -4776550 -4080572 275274 4699228 6583721 6283721 5106493 3820060 3290849 4250472
$$ packed form
40936E017048j864982k109151J929631M327546R09666m113966m661211j410723
40928a976142R01612J054817R03466L63224j471276k325141L08883L578385K477770
40919C815598k051242m102661j828468M84723P5458n66709N72846J213133m51709
40910b839031j870855m67449J840619J977872O20981K88262R34807R35681N62479
40901A983366J053445J666315R53688j99876j07989J27605j845518m897963n042165
40892f309092j362576K169531K137091m1550j098569n94034q0926M86499K253001
40883b440625M085887L167891m11641k743819j415763P85572k0542k797632k985878
40874d776550O95978M355846M423954J884493l00000j177228j286433n29211R59623
$$ plain form
40865 4250472 5696231 5352273 2563405 -657362 -2030014 -1082143 1501477 4848796
40857 4848796 7556564 8075609 6352907 3796137 1146127 -1971876 -5006982 -6213221
40849 -6213221 -5319528 -4259264 -4091779 -3465052 -1532615 757 -406333 -1579253 -1797848
40840 -1797848 -1350158 -759593 1161373 4723849 6981610 5204702 1156009 -1290761
40832 -1290761 -1289875 -469668 1045647 3922604 6033928 4218564 -458084 -3493763 -3287439
40823 -3287439 -2571896 -3051695 -2945308 -1020425 996771 1674976 1952885 2313868 1363210
40814 1363210 -971937 -2264077 -1686483 -1934728 -4639584 -7127730 -6679894 -5085516 -5541105
40805 -5541105 -7349935 -7397847 -5280233 -3305514 -2452015 -1851398 -1675712 -2999562 -4702346
$$ packed form
40865D250472J445759l43958k788868l220767j372652R47871K583620L347319
40857D848796K707768N19045j722702k556770k650010l118003l035106j206239
40849f213221Q93693J060264J67485O26727J932437J533372m07090j172920k18595
40840a797848M47690N90565J920966L562476K257761j776908m048693k446770
40832a290761Q86Q20207J515315K876957K111324j815364m676648l035679K06324
40823c287439P15543m79799J06387J924883K017196O78205K77909L60983r50658
40814A363210k335147j292140N77594k48245k704856k488146M47836J594378m55589
40805e541105j808830m7912K117614J974719Q53499O00617J75686j323850j702784
$$ plain form
40796 -4702346 -3746986 621570 5369299 7346937 6703445 5675963 5345478 4818583 3166746
40787 3166746 1177918 648304 1927754 2964103 1833698 -212416 74256 3506166
40779 3506166 6968905 6957835 3018850 -2763627 -7726161 -9475168 -7232671 -3572975
40771 -3572975 -2490281 -4316906 -5042270 -2360400 529045 -236992 -3247368 -4204911 -2351306
40762 -2351306 -711121 -1020943 -2134223 -2979712 -3658606 -3731325 -2492282 -842892 -33913
40753 -33913 1074298 4288133 7913887 8073074 4633140 2048714 3052507 4872605 3520990
40744 3520990 -836027 -4698767 -5381229 -2750137 1281639 3540313 1761674 -2476598
40736 -2476598 -4722978 -3005649 -315887 -25586 -955245 268212 3313185 4037063 488052
$$ packed form
40796d702346R55360M368556M747729J977638o43492j027482l30485n26895j651837
40787C166746j988828n29614J279450J036349j130405k046114K86672L431910
40779C506166L462739j1070l938985n782477m962534j749007K242497L659696
40771c572975J082694j826625p25364K681870K889445p66037l010376r57543J853605
40762b351306J640185l09822j113280q45489o78894p2719J239043J649390Q08979
40753c3913J108211L213835L625754J59187l439934k584426J003793J820098j351615
40744C520990m357017l862740o82462K631092M031776K258674j778639m238272
40736b476598k246380J717329K689762K90301r29659J223457L044973P23878l549011
$$ plain form
40727 488052 -3925888 -4693448 -1852317 489251 -339187 -2475652 -2544057 -366231 912902
40718 912902 -878535 -4202416 -5947806 -4972883 -2612154 -788306 -739596 -2612256 -4958947
40709 -4958947 -5415342 -3246775 -516681 639400 1009365 2788382 5702119 6755257
40701 6755257 3990795 -990686 -4454449 -3678216 792801 5179305 5739797 2947982
40693 2947982 842849 1093816 396864 -3730346 -7561763 -5932277 -502554 2044911
40685 2044911 -435282 -3249659 -2702811 -863802 -865812 -2290149 -3519606 -4507735 -4808478
40676 -4808478 -2797770 583169 1233374 -2009462 -4471754 -2260364 1809595 2866791
40668 2866791 1322165 912396 1898829 1369849 -963178 -2220994 -1256609 218940 1465191
$$ packed form
40727D88052m413940p67560K841131K341568q28438k136465o8405K177826J279133
40718I12902j791437l323881j745390R74923K360729J823848M8710j872660k346691
40709d958947m56395K168567K730094J156081L69965J779017K913737J053138
40701F755257k764462m981481l463763P76233M471017M386504N60492k791815
40693B947982k105133K50967o96952m127210l831417J629486N429723K547465
40685B044911k480193k814377N46848J839009k010j424337j229457r88129l00743
40676d808478K010708L380939O50205l242836k462292K211390M069959J057196
40668B866791j544626m09769R86433n28980k333027j257816R64385J475549J246251
$$ plain form
40659 1465191 3767328 7157221 9319158 8470451 4998799 180534 -4411496 -6523078
40651 -6523078 -4921694 -1555477 274067 -229237 -1386433 -2201331 -2805089 -2323363 519153
40642 519153 4500584 6450637 5148351 2398485 135005 -1268028 -1907600 -1992801 -2461806
40633 -2461806 -3670257 -4030910 -2612582 -2099783 -5469768 -10275181 -10706021 -5734003 -603486
40624 -603486 878541 830518 2220894 4025730 4373222 4346675 4952280 3753739 -1151947
40615 -1151947 -6308239 -6659009 -2730674 276078 -188003 -1756970 -2026168 -1620226 -1681264
40606 -1681264 -1738697 -1327059 -1116800 -1249150 -768743 148317 -460345 -3323652 -6066869
40597 -6066869 -6087602 -3971744 -2170586 -1205316 598211 3723734 6096920 6045658 4922320
$$ packed form
40659A465191K302137L389893K161937q48707l471652m818265m592030k111582
40651f523078J601384L366217J829544n03304j157196q14898o03758M81726K842516
40642E19153L981431J950053j302286k749866k263480j403033o39572q5201m69005
40633b461806j208451l60653J418328N12799l369985m805413m30840M972018N130517
40624f03486J482027m8023J390376J804836L47492k6547O05605j198541m905686
40615a151947n156292l50770L928335L006752m64081j568967k69198M05942o1038
40606a681264n7433M11638K10259j32350M80407R17060o08662k863307k743217
40597f066869k0733K115858J801158R65270J803527L125523K373186n1262j123338
$$ plain form
40588 4922320 5076564 6103672 5291720 1956438 -889102 -376551 2468161 4599587 5189673
40579 5189673 5567515 5744877 4095249 842226 -1142391 -346255 1011940 391214 -1250430
40570 -1250430 -1200266 766453 2159394 1169057 -1619185 -4502027 -5935314 -4833505 -1350250
40561 -1350250 2445067 3959584 2515433 -186603 -1882947 -1517259 243312 1504637
40553 1504637 686599 -1790549 -4089031 -5669441 -7901099 -10851894 -11438374 -7224600
40545 -7224600 -900899 2056166 113697 -2743830 -2720253 -907299 -1036402 -4428439 -8750325
40536 -8750325 -10890132 -9965722 -7845814 -6978015 -7328820 -6161344 -2101277 1670655 931172
40527 931172 -3287956 -5479261 -3477590 -1473461 -3000797 -4850770 -1995442 4102155
$$ packed form
40588D922320J54244J027108q11952l335282k845540N12551K844712K131426N90086
40579E189673L77842J77362j649628l253023j984617P96136J358195o20726j641644
40570a250430N0164J966719J392941r90337k788242k882842j433287J101809L483255
40561a350250L795317J514517j444151k702036j696344L65688J760571J261325
40553A504637q18038k477148k298482j580410k231658k950795n86480M213774
40545g224600O323701K957065j942469k857527K3577J812954j29103l392037m321886
40536h750325k139807R24410K119908Q67799l50805J167476M060067L771932p39483
40527I31172m219128k191305K001671K004129j527336j849973K855328O097597
$$ plain form
40519 4102155 7163764 5101279 2179788 1766166 1908825 -36457 -2664004 -3291232 -2361766
40510 -2361766 -1917704 -1922388 -1234716 -445968 -538138 -250013 1734887 3273566 1542854
40501 1542854 -1349811 -351165 4376495 6313284 1705671 -4663791 -6153482 -3098167
40493 -3098167 -760252 -1063345 -1425488 -759451 -1289230 -3603053 -4493786 -1826958 1726426
$$ packed form
40519D102155L061609k062485k921491m13622J42659j945282k627547o27228R29466
40510b361766M44062m684O87672P88748r2170K88125J984900J538679j730712
40501A542854k892665R98646M727660J936789m607613o369462j489691L055315
40493c098167K337915l03093l62143O66037n29779k313823q90733K666828L553384
$$ [...]
##END NTUPLES=NMR SPECTRUM
##END=
