##TITLE=31Pdec_SR13_K+TFA
 CDCl3, 24 sc
 28.2.2020
##JCAMPDX= 6.0         $$ Bruker NMR JCAMP-DX V2.0
##DATA TYPE= NMR SPECTRUM
##DATA CLASS= NTUPLES
##ORIGIN= UXNMR, Bruker Analytische Messtechnik GmbH
##OWNER= root
$$ XWIN-NMR		Version 3.5
$$ Fri Feb 28 14:36:02 2020 Russian Standard Time (UT+4h)  she@DPX200
##.OBSERVE FREQUENCY= 81.013821
##.OBSERVE NUCLEUS= ^31P
##.ACQUISITION MODE= SIMULTANEOUS
##.ACQUISITION SCHEME= undefined
##.AVERAGES= 24
##.DIGITISER RES= 17
##SPECTROMETER/DATA SYSTEM= spect
##.PULSE SEQUENCE= zgpg30
##.SOLVENT NAME= CDCl3
##.SHIFT REFERENCE= (INTERNAL, CDCl3, 0, 182.463)
##AUDIT TRAIL= $$ (NUMBER, WHEN, WHO, WHERE, WHAT)
$$ ##TITLE= Audit trail, XWIN-NMR		Version 3.5
$$ ##JCAMPDX= 5.01
$$ ##ORIGIN= Bruker BioSpin GmbH
$$ ##OWNER= she
$$ F:/spectra/data/she/nmr/P31/1/pdata/1/auditp.txt
$$ ##AUDIT TRAIL=  $$ (NUMBER, WHEN, WHO, WHERE, WHAT)
(   1,<2020-02-28 14:34:51.14 +0400>,<she>,<DPX200>,
      <created by zg, POWCHK disabled, PULCHK disabled
       configuration hash MD5:
       00 E9 B6 7A A2 85 ED C7 34 08 36 98 17 FE 4E 26
       data hash MD5: 32K
       E2 EF 17 15 D5 55 E7 18 15 AA 1A C2 AF 79 D8 CB>)
(   2,<2020-02-28 14:34:56.00 +0400>,<she>,<DPX200>,
      <Start of raw data processing
       efp BC_mod = 2 LB = 1 FT_mod = 6 PKNL = 1 PHC0 = -1606.397 PHC1 = 663.0013 SI = 64K 
       data hash MD5: 64K
       57 12 3D 89 71 FA C2 EF 9A 87 24 64 8E 0C A6 2E>)
(   3,<2020-02-28 14:35:21.73 +0400>,<she>,<DPX200>,
      <pk PHC0 = 109.4801 PHC1 = 0 
       data hash MD5: 64K
       36 E7 D3 35 FC 31 88 DA 11 FD 9D 28 22 7D D3 9C>)
(   4,<2020-02-28 14:35:35.73 +0400>,<she>,<DPX200>,
      <abs ABSG = 5 
       data hash MD5: 64K
       69 90 9E 72 DE 4D 1B 09 0E 32 19 C6 12 EA 99 CB>)
$$ ##END=
$$ 
$$ hash MD5
$$ 17 1B 7F BF EA 13 0E 5D CD 1C 79 C3 19 D2 61 F3
##$RELAX= 
##$RELAX= 
##$RELAX= 
##$RELAX= 
##$RELAX= 
##$RELAX= 
##$RELAX= 
##$RELAX= 
$$ Bruker specific parameters
$$ --------------------------
##$DU= <F:/spectra>
##$EXPNO= 1
##$NAME= <P31>
##$PROCNO= 1
##$TYPE= <nmr>
##$USER= <she>
##$AMP= (0..31)
100 100 100 100 100 100 100 100 100 100 100 100 100 100 100 100 100 100 
100 100 100 100 100 100 100 100 100 100 100 100 100 100 
##$AQSEQ= 0
##$AQ_mod= 1
##$AUNM= <au_zg>
##$AUTOPOS= <>
##$BF1= 81.014009
##$BF2= 200.13
##$BF3= 200.13
##$BF4= 200.13
##$BF5= 200.13
##$BF6= 200.13
##$BF7= 200.13
##$BF8= 200.13
##$BYTORDA= 1
##$CFDGTYP= 0
##$CFRGTYP= 5
##$CHEMSTR= <none>
##$CNST= (0..31)
1 1 145 1 1 1 1 1 1 1 1 1 1 1 1 1 1 1 1 1 1 1 1 1 1 1 1 1 1 1 1 1 
##$CPDPRG= <waltz16>
##$CPDPRG1= <>
##$CPDPRG2= <waltz16>
##$CPDPRG3= <>
##$CPDPRG4= <mlev>
##$CPDPRG5= <mlev>
##$CPDPRG6= <mlev>
##$CPDPRG7= <mlev>
##$CPDPRG8= <mlev>
##$CPDPRGB= <>
##$CPDPRGT= <>
##$D= (0..31)
0 1 0 0 0 0 0 0 0 0 0 0.03 2e-05 3e-06 0 0 0 0 0 0 0 0 0 0 0 0 0 0 0 0 
0 0 
##$DATE= 1582886090
##$DBL= (0..7)
120 120 120 11 120 120 24 19 
##$DBP= (0..7)
150 150 150 150 150 150 150 150 
##$DBP07= 0
##$DBPNAM0= <>
##$DBPNAM1= <>
##$DBPNAM2= <>
$$ [...]
##$SUBNAM3= <"">
##$SUBNAM4= <"">
##$SUBNAM5= <"">
##$SUBNAM6= <"">
##$SUBNAM7= <"">
##$SUBNAM8= <"">
##$SUBNAM9= <"">
##$SW= 369.568048894756
##$SWIBOX= (0..15)
0 1 3 0 0 0 0 0 0 0 0 0 0 0 0 0 
##$SW_h= 29940.119760479
##$TD= 32768
##$TD0= 1
##$TE= 0
##$TE2= 300
##$TE3= 300
##$TEG= 300
##$TL= (0..7)
0 120 53 12 22 120 120 120 
##$TP= (0..7)
150 150 150 150 150 150 150 150 
##$TP07= 0
##$TPNAME0= <>
##$TPNAME1= <>
##$TPNAME2= <>
##$TPNAME3= <>
##$TPNAME4= <>
##$TPNAME5= <>
##$TPNAME6= <>
##$TPNAME7= <>
##$TPOAL= (0..7)
0.5 0.5 0.5 0.5 0.5 0.5 0.5 0.5 
##$TPOFFS= (0..7)
0 0 0 0 0 0 0 0 
##$TUNHIN= 0
##$TUNHOUT= 0
##$TUNXOUT= 0
##$USERA1= <user>
##$USERA2= <user>
##$USERA3= <user>
##$USERA4= <user>
##$USERA5= <user>
##$V9= 5
##$VALIST= <valist>
##$VCLIST= <CCCCCCCCCCCCCCC>
##$VD= 0
##$VDLIST= <DDDDDDDDDDDDDDD>
##$VPLIST= <PPPPPPPPPPPPPPP>
##$VTLIST= <TTTTTTTTTTTTTTT>
##$WBST= 1024
##$WBSW= 4
##$XGAIN= (0..3)
0 0 0 0 
##$XL= 0
##$YL= 0
##$YMAX_a= 20688
##$YMIN_a= -9076
##$ZGOPTNS= <>
##$ZL1= 120
##$ZL2= 120
##$ZL3= 120
##$ZL4= 120
##$ABSF1= 182.463
##$ABSF2= -187.1042
##$ABSG= 5
##$ABSL= 3
##$ALPHA= 0
##$AQORDER= 0
##$ASSFAC= 0
##$ASSFACI= 0
##$ASSFACX= 0
##$ASSWID= 0
##$AUNMP= <proc_1d>
##$AZFE= 0.1
##$AZFW= 0.5
##$BCFW= 0
##$BC_mod= 2
##$BYTORDP= 0
##$COROFFS= 0
##$CY= -3
##$DATMOD= 1
##$DC= 0
##$DFILT= <>
##$DTYPP= 0
##$F1P= 0
##$F2P= 0
##$FCOR= 1
##$FTSIZE= 65536
##$FT_mod= 6
##$GAMMA= 0
##$GB= 0
##$INTBC= 1
##$INTSCL= 5.30512e-09
##$ISEN= 30
##$LB= 1
##$LEV0= 0
##$LPBIN= 0
##$MAXI= 10000
##$MC2= 0
##$MEAN= 0
##$ME_mod= 0
##$MI= 50
##$NCOEF= 0
##$NC_proc= -7
##$NLEV= 6
##$NOISF1= 182.463
##$NOISF2= 159.3651
##$NSP= 0
##$NTH_PI= 0
##$NZP= 0
##$OFFSET= 182.463
##$PC= 4
##$PHC0= -1496.917
##$PHC1= 663.0013
##$PH_mod= 1
##$PKNL= yes
##$PPARMOD= 0
##$PSCAL= 0
##$PSIGN= 0
##$REVERSE= no
##$SF= 81.0140089999434
##$SI= 65536
##$SIGF1= 159.3651
##$SIGF2= -187.1042
##$SINO= 113.3802
##$SIOLD= 16384
##$SREGLST= <1H.CDCl3>
##$SSB= 0
##$STSI= 65536
##$STSR= 0
##$SW_p= 29940.119760479
##$SYMM= 0
##$S_DEV= 0
##$TDeff= 32768
##$TDoff= 0
##$TI= <>
##$TILT= no
##$TM1= 0
##$TM2= 0
##$TOPLEV= 0
##$USERP1= <user>
##$USERP2= <user>
##$USERP3= <user>
##$USERP4= <user>
##$USERP5= <user>
##$WDW= 1
##$XDIM= 65536
##$YMAX_p= 359483497
##$YMIN_p= -41826612
$$ End of Bruker specific parameters
$$ ---------------------------------
##NTUPLES= NMR SPECTRUM
##VAR_NAME=  FREQUENCY,     SPECTRUM/REAL,   SPECTRUM/IMAG
##SYMBOL=    X,             R,               I
##VAR_TYPE=  INDEPENDENT,   DEPENDENT,       DEPENDENT
##VAR_FORM=  AFFN,          ASDF,            ASDF
##VAR_DIM=   65536,         65536,           65536
##UNITS=     HZ,            ARBITRARY UNITS, ARBITRARY UNITS
##FACTOR=    0.456856943014862, 1,           1
##FIRST=     14782.0589164792, 0,            0
##LAST=      -15158.0608439998, 0,           0
##MIN=       -15158.0608439998, -41826612,   0
##MAX=       14782.0589164792, 359483497,    0
$$ Real data points
##PAGE= N=1
##DATA TABLE= (X++(R..R)), XYDATA
$$ [...]
46390b972296M725988K055341k096251j594017J877135J955095j516167k774778
46382c39950l57141P59185j986776m577479l173338L90062K356392K084444Q99143
46373c945458o19027j796452j123472J386797L255968K743573J028327j71358
46365G58898r36551j657926j539897l98274J33052q22629j428049J06857K319181
46356c465338K368675J45291j704084j352581M88595K180181K872756K580072
46348D113567J688399N88049o16667j809299k327094j701850r43781j451636k292257
46339d752569q24218K846692M595317J699136k602814l059963M02486K953917
46331A257984J867197m17684p78253M79161J415098J556021J296337L45946j163140
$$ plain form
46390 -2972296 1753692 3809033 1712782 118765 1995900 3950995 2434828 -339950
46382 -339950 -697091 62094 -1924682 -6502161 -9675499 -9285437 -6929045 -4844601 -3945458
46373 -3945458 -4564485 -6360937 -7484409 -6097612 -2841644 -98071 930256 758898
46365 758898 -177653 -1835579 -3375476 -3773750 -3640698 -4463327 -5891376 -5784519 -3465338
46356 -3465338 -1096663 -951372 -2655456 -4008037 -3519442 -1339261 1533495 4113567
46348 4113567 5801966 6390015 5773348 3964049 1636955 -64895 -1008676 -2460312 -4752569
46339 -4752569 -5576787 -2730095 1865222 3564358 961544 -2098419 -1695933 1257984
46331 1257984 3125181 2707497 1929244 2408405 3823503 5379524 6675861 7021807 5858667
46322E858667j676127m56040N17879p85729k912714k735896l72305P24192q94612
46313b732685k247928n63792K070356J526114k002552l754802j010288K968348
46305e747229L365822K09120k151040j038177J805102L525312L484302K317993
46297E771205J75853k254212k900689r42975R36248l05604l274836l527330O3575
46288f258765L422746K841020l02820k110217j241848O91115K145951K686441
46280A873623K029039L50250r84301r38676n15999j094672j813874r53792N94840
46271a453562J41731k217770k806534N25638M858174N660588K309545j755070
46263E262740l482914k913001j655698m53483R61601K307793K177383k48703l163516
$$ plain form
46322 5858667 4182540 3726500 4244379 3458650 545936 -2189960 -2562265 -1838073 -2732685
46313 -2732685 -4980613 -5544405 -3474049 -1947935 -3950487 -7705289 -8715577 -5747229
46305 -5747229 -2381407 -2172287 -4323327 -5361504 -3556402 -31090 3453212 5771205
46297 5771205 5947058 3692846 792157 -150818 785430 479826 -2795010 -6322340 -6258765
46288 -6258765 -2836019 5001 -297819 -2408036 -3649884 -2958769 -812818 1873623
46280 1873623 3902662 4252912 3268611 2329935 1813936 719264 -1094610 -2048402 -1453562
46271 -1453562 -1311831 -3529601 -6336135 -5810497 -952323 4708265 7017810 5262740
46263 5262740 1779826 -1133175 -2788873 -3242356 -2280755 27038 2204421 1955718 -1207798
46254a207798l211465M25232M143572L830800N5101k687853j769137P86911J724745
46245B090108N65610p79269o95113Q66960K552534K426922n7442k677221k715911
46236A577178p12766L18588m12797n56272Q42057J398774k53682j608718l88717
46227B03645J469871J033417q96648j578949p74608l193P49436J998821K121861
46218D323653m13120l456385l635369j353098L64109Q17840J450499J879165N77459
46209E54753j223556q94667P91448Q00018o88488q02941M28082L55793n90022
46200a269580O02312L014134K224809j696770l371429j059882N54644r27822j460752
46191c390336J247664K737869l4037k482383m33318J979060l74824l946511k339364
$$ plain form
46254 -1207798 -4419263 -3994031 149541 3980341 4035442 1347589 -421548 365363 2090108
46245 2090108 2655718 1876449 1181336 2048296 4600830 7027752 6970310 4293089 1577178
46236 1577178 864412 1183000 770203 213931 1055988 2454762 2201080 592362 203645
46227 203645 1673516 2706933 1810285 231336 -543272 -546465 202971 2201792 4323653
46218 4323653 3910533 454148 -3181221 -4534319 -4170210 -3352370 -1901871 -22706 554753
46209 554753 -668803 -1563470 -772022 27996 -660492 -1463433 -1035351 -679558 -1269580
46200 -1269580 -667268 2346866 4571675 2874905 -496524 -1556406 -1001762 -1929584 -3390336
46191 -3390336 -2142672 595197 561160 -1921223 -2354541 -375481 -750305 -4696816 -7036180
46182g036180K510310L804429J477149J091095K898895J586557l053697m452810
46174a174252l6747M362762L625480K41874r42095N71088K413070L063678J687057
46165A3811915j745121m434432l006876Q27078J519036j822192l390668L64824
46157B123564M900188M314735l04659l477458l198946j945198j649975j542815
46149g80564m43408J360247K446603J482882j205272l195128k592882p64136k31186
46140c922844n81364K63036J408041R1269k588127k281696J321559L376454J827548
46131a086124O50923K376937L292423K06017l345897k780845M1246O43707l50123
46122c51736N37697K308382R86753k721073l619983j20317L266555K630811m02242
$$ plain form
46182 -7036180 -4525870 -721441 755708 1846803 4745698 6332255 3278558 -1174252
46174 -1174252 -1210999 3151763 6777243 7019117 6077022 6648110 9061180 12124858 13811915
46165 13811915 12066794 7632362 4625486 5452564 6971600 5149408 1758740 2123564
46157 2123564 7023752 11338487 11033828 7556370 4357424 2412226 762251 -780564
46149 -780564 -1223972 136275 2582878 4065760 2860488 -334640 -2927522 -3691658 -3922844
46140 -3922844 -4504208 -4241172 -2833131 -2741862 -5329989 -7611685 -6290126 -2913672 -1086124
46131 -1086124 -435201 1941736 5234159 5440176 2094279 -686566 -645320 -1613 -351736
46122 -351736 185961 2494343 3481096 760023 -2859960 -2980277 286278 2917089 2514847
46113B514847j965734j117218o6769q39758k763476l035068k27659L000438K841624
46104a658773J63298k19605K663387L581919n04828m622633l111042J437311K592011
46095C21045K30323o37341Q50149Q29280j129355r12413K055244K687968j427736
46086B867164n479598m293897P35005M513098M509860J688745j729334l268209
46078d57166j607679J357939K271170R31354K17788R21121N12416j877494l437834
46069a168385k416311r23596q61619p94109O91720K021085J692325J062936J343238
46060F47284R52493j174094k673390j449553M41497J66539r90716M0180K694053
46051a345707L624404J847774o22610k448319l742414l763558j446697J715531
$$ plain form
46113 2514847 549113 -568105 -634874 -1474632 -4238108 -7273176 -7500835 -4500397 -1658773
46104 -1658773 -1495475 -1715080 948307 4530226 4025398 -597235 -3708277 -2270966 321045
46095 321045 551368 -85973 764176 1593456 464101 -448312 1606932 4294900 2867164
46086 2867164 -2612434 -6906331 -6171326 -1658228 2851632 4540377 2811043 -457166
46078 -457166 -2064845 -706906 1564264 2495618 2713406 3634527 4146943 2269449 -1168385
46069 -1168385 -3584696 -4508292 -5369911 -6164020 -5472300 -3451215 -1758890 -695954 647284
46060 647284 1599777 425683 -2247707 -3697260 -3255763 -3089224 -4079940 -4039760 -1345707
46051 -1345707 2278697 4126471 3503861 1055542 -2686872 -6450430 -7897127 -6181596
46043f181596K612103Q62147n39472L92031K055907K042540M42873r17535j214714
46034d45716j210960j575478j686698m71386J758087K942901J543468j086103
46026b31885j918817j58249J549840O38208j953303l082537j322226J586002K836050
46017b056917J426892q16692j002687J475092L694277K525422j187761l578136
46009D79490k759806o94035J43320m63303j540380k249113j444796J384147L885861
46000c258615K634534j552776l440736m70227L333101L175001O4309j709742r59455
45991b184606L49012J374282K619891L070361J090263k191501l691588k407809
45983a971695p1073J679319K348627J679956J80641m20615M10110O02510r64530
$$ plain form
46043 -6181596 -3569493 -2707346 -3246818 -2854787 -798880 1243660 1686533 768998 -445716
46034 -445716 -1656676 -3232154 -4918852 -5390238 -3632151 -689250 854218 -231885
46026 -231885 -2150702 -2308951 -759111 -120903 -2074206 -5156743 -6478969 -4892967 -2056917
46017 -2056917 -630025 -1446717 -2449404 -974312 2719965 5245387 4057626 479490
46009 479490 -2280316 -2974351 -2831031 -3294334 -4834714 -7083827 -8528623 -7144476 -3258615
46000 -3258615 -624081 -2176857 -5617593 -6087820 -2754719 420282 484591 -1225151 -2184606
45991 -2184606 -1835594 -461312 2158579 5228940 6319203 4127702 436114 -1971695
45983 -1971695 -2042768 -363449 1985178 3665134 3845775 3425160 3835270 4437780 3473250
45974C473250j635691Q23038L440984K058643j564866k134372M93496J123688
45966F078170j801249l337798k03468L781673L608545J42924k185796j583962
45958D499039M07709J913944J660650q61724l740036l353472Q97882M704576L979134
45949A0107702j72485l747636m820031l809967j172825K123964L553211J601229
45941C663162j623641k902799j983594q87786m65579r6370L42956O00885J019311
45932b333455J287997q0867k618319k507853K150023O721456N306745n15369l482364
45923C927994j130471J249289m49728k988389j817111J439695K171312L83909
45915B786500j14331J243849Q68933k470029m941503l372132j17214O43967p37724
$$ plain form
45974 3473250 1837559 2660597 6101581 8160224 6595358 4460986 4954482 6078170
45966 6078170 4276921 939123 735655 4517328 8125873 8268797 6083001 4499039
45958 4499039 4906748 6820692 8481342 7619618 3879582 526110 1423992 6128568 10107702
45949 10107702 9935217 6187581 1367550 -2442417 -3615242 -1491278 2061933 3663162
45941 3663162 2039521 -863278 -2846872 -3734658 -4200237 -4296607 -3953651 -3352766 -2333455
45932 -2333455 -1045458 -1126325 -3744644 -6252497 -4102474 2618982 7925727 7410358 3927994
45923 3927994 2797523 4046812 3597084 608695 -1208416 231279 2402591 2786500
45915 2786500 2672169 3916018 4784951 2314922 -2626581 -5998713 -6115927 -5471960 -6209684
45906f209684j73077L600844O596047M803895m47851m281015m235051k273659
45898b619551j102760q69202m58867j19122q14046j830202j236549J089379K753203
45889e207717J955250o1321p90102K35112J268480J093272M75502N49906R10848
45880D29230K71426j346963k111963n24002K372775L661948J742876j551226k697963
45871B46138m93942K357558K360070m54750k530267j462089P02399K53666k859063
45862a880280m635220k305920K080350M601663M265747K957129J814844K06763
45854G105076j946072l337980l277044k502724j442098L77190K477461L123806
45846E77615J956530Q49566P96204K01061j809773k754925m17810K684100K164251
$$ plain form
45906 -6209684 -6382761 -2781917 3814130 8618025 8170174 3889159 -345892 -2619551
45898 -2619551 -3722311 -4591513 -5050380 -5169502 -5983548 -7813750 -9050299 -7960920 -5207717
45889 -5207717 -3252467 -3313788 -4103890 -3868778 -2600298 -1507026 -1031524 -481618 429230
45880 429230 700656 -646307 -2758270 -3282272 -909497 2752451 4495327 2944101 246138
45871 246138 -247804 2109754 4469824 4015074 1484807 22718 725117 978783 -1880280
45862 -1880280 -6515500 -8821420 -6741070 -2139407 2126340 5083469 6898313 7105076
45854 7105076 5159004 1821024 -1456020 -3958744 -5400842 -5023652 -2546191 577615
45846 577615 2534145 3383711 4179915 4380976 2571203 -183722 -601532 2082568 4246819
45837D246819j669563m047890k655152l43444M3722l59599L40241J072169K43591
45828c129106o63808O21591K905169L088170J110072j98358N4012k65709k008279
45819A513754k790679q62739J776399K113715J46822j711866j917220p80673P04046
45810a808441J424666N18961j299932j747025J64672K271812K017354O1862r22900
45801F81029k39247M89193M93812O64940J091170N70992p86682j121813p172M58914
45791B295136q62318k019619j190113K37498K08171k78663R93723L090199K788096
45782E262110l39784k906439k455233n07598L54695K29450R22660K568290L166560
45773F294711J271166k151001m738479m975119l223378q68982J133841K551952
$$ plain form
45837 4246819 2577256 -1470634 -4125786 -4469230 -4425508 -4785107 -4444866 -3372697 -3129106
45828 -3129106 -3792914 -3171323 -266154 2822016 3932088 3733730 3787742 3522033 1513754
45819 1513754 -1276925 -2139664 -363265 1750450 1897272 185406 -1731814 -2512487 -1808441
45810 -1808441 -383775 135186 -1164746 -2911771 -2747099 -475287 1542067 1603929 681029
45801 681029 441782 930975 1424787 2089727 3180897 3751889 2965207 1843394 1836222 2295136
45791 2295136 1432818 -586801 -1776914 -1539416 -1331245 -1609908 -616185 2474014 5262110
45782 5262110 4922326 2015887 -439346 -946944 -592249 -362799 559861 3128151 6294711
45773 6294711 7565877 5414876 676397 -4298722 -7522100 -8391082 -7257241 -4705289
45765d705289L000494J834060n12260k014551j062399J405727K834545J934011
45757B714338k37975j756232j473820M04977K322914K313035J12947j989631j631274
45748G79279O69061K320779J968591M23169j295213k911817l929646l630346k269780
45739g875923o36232J438055M090334N253562K456631k627097m686559j443154
45731d030383L025764L787209J331507m24355l15503n22557j886837k339134m79553
45722a853842K120463L188453K332830M51120j728661l418423l428419j415417
45714c751896J159299K415090K093893J357517P84828l53167k468641m230801
45706b993878l803540j306538J089226J807263J479010J306106J121260L46980
$$ plain form
45765 -4705289 -1704795 129265 -382995 -2397546 -3459945 -2054218 780327 2714338
45757 2714338 2476363 720131 -753689 -348712 1974202 4287237 4400184 2410553 779279
45748 779279 1448340 3769119 5737710 6160879 4865666 1953849 -1975797 -5606143 -7875923
45739 -7875923 -8512155 -7074100 -2983766 2269796 4726427 2099330 -2587229 -4030383
45731 -4030383 -1004619 2782590 4114097 3689742 3374239 2851682 964845 -1374289 -1853842
45722 -1853842 266621 3455074 5787904 6239024 4510363 1091940 -2336479 -3751896
45714 -3751896 -2592597 -177507 1916386 3273903 4058731 3705564 1236923 -2993878
45706 -2993878 -6797418 -8103956 -7014730 -5207467 -3728457 -2422351 -1301091 -954111
45698i54111k42416M23266J511254J208597l40237j107850l13813N85569L94368
45689A164627l00477n87657m16246N5014N65312J90759j295756j853838K29304
45680b248958K505931R54078l318519m607382j168414J855070N92389j664701
45672g100506n90368K004931K214720J120358J800801K542854n8907l378057j685596
45663c129770L885677N891302J720143l007672l690119k436726k101200j290647
45655d159012J119734K318813O36945o29924J037082K218913p96718m815570l844428
45646f914165J780799N790125M498313L25727k674236k872335r27737J121583
45638A28074R30191j380875k425203j07678K576789J608468j716295k614801j50624
$$ plain form
45698 -954111 -1196527 -773261 737993 1946590 1606353 498503 184690 770259 1164627
45689 1164627 864150 276493 -139753 -84739 480573 671332 -624424 -2478262 -2248958
45680 -2248958 256973 1211051 -2107468 -6714850 -7883264 -6028194 -5435805 -7100506
45672 -7100506 -7690874 -5685943 -3471223 -2350865 -550064 1992790 1933883 -1444174 -3129770
45663 -3129770 755907 6647209 8367352 5359680 1669561 -767165 -2868365 -4159012
45655 -4159012 -3039278 -720465 -83520 -713444 323638 2542551 1745833 -3069737 -6914165
45646 -6914165 -5133366 656759 5155072 5480799 2806563 -65772 -993509 128074
45638 128074 1058265 -322610 -2747813 -2855491 -278702 1329766 -386529 -3001330 -3151954
45629c151954J741557O65346j126642r85520M73209J343216J116757R9314j407000
45620a231717k330345j547524p4429o5652j105857n16913J750270K065492j137397
45611d194072l922210k129180K375501M262078K163526j35493L10561J872223
45603F02934J570969n11023j819200j110380J57607K15995n41311l85013Q56576
45594i62846J113262r53079l405268l114411j3075K659772K584580Q35729n28417
45585a783753j175154j411405m53204J944118L497198J835670j479774k211992
45577a238296Q08623L741946K747874j087722l569951k762966m85574R22135J137212
45568B13281R15952N19795M0851K7017N59970M96187j010716k633997k092527
$$ plain form
45629 -3151954 -1410397 -745051 -1871693 -2857213 -2384004 -1040788 75969 175283 -1231717
45620 -1231717 -3562062 -5109586 -5184015 -5249667 -6355524 -6872437 -5122167 -3056675 -4194072
45611 -4194072 -8116282 -10245462 -7869961 -3607883 -1444357 -1579850 -1269289 602934
45603 602934 2173903 1662880 -156320 -1266700 -1109093 -893098 -1434409 -1819422 -962846
45594 -962846 150416 -802663 -4207931 -7322342 -7335417 -4675645 -2091065 -1255336 -1783753
45585 -1783753 -2958907 -4370312 -4823516 -2879398 617800 2453470 973696 -1238296
45577 -1238296 -429673 3312273 6060147 4972425 1402474 -1360492 -1846066 -923931 213281
45568 213281 1129233 1649028 1689879 1716896 2276866 2773053 1762337 -871660 -2964187
45559b964187N79566K554914J797771k23216p64777K19626L24450j206749j886450
45550a569052L68298L627609L944612M35914l574527m716248l107513r57039O52816
45541d895130J914592K326601R53155j270398j756700K54215K226521J726570
45533A479426j55060n54640J034431K480750K348278J311977K81351p38998j576622
45524E910893j665781j384043j710920k103216r15327J375014J961614K1076j543535
45515e4225p18536M8554k015979m611582l252659J558360M615483L604614J871860
45506A045890K296282K745079M14267k660714k353797R20892K382339k97696l800676
45497F91866l975662j266161P40150P04971P46127K142070K577845l32560m352386
$$ plain form
45559 -2964187 -2384621 170293 1968064 1744848 980071 1199697 1524147 317398 -1569052
45550 -1569052 -1200754 2426855 6371467 6807381 3232854 -1483394 -4590907 -5547946 -4895130
45541 -4895130 -2980538 -653937 299218 -971180 -2727880 -2473665 -247144 1479426
45533 1479426 1324366 769726 1804157 4284907 6633185 7945162 8226513 7487515 5910893
45524 5910893 4245112 2861069 1150149 -953067 -1868394 -493380 1468234 1489310 -54225
45515 -54225 -772761 -724207 -2740186 -7351768 -10604427 -9046067 -4430584 -825970 1045890
45506 1045890 3342172 6087251 6501518 3840804 1487007 2407899 4790238 4492542 691866
45497 691866 -3283796 -4549957 -3809807 -3104836 -2358709 -216639 2361206 2028646 -2323740
45488b323740m575279k21348L708936L097775J61073m32403J409027J839717l94631
45479B269127k366770k049793q55279j29232R34043K251624J578952j298480k623294
45470b289102r2133K772925J488721k464377l868850j428949J316890K046934
45462b517941J976439J954020Q17650j201421j495749P01118K470020J538858
45454D242994m67316j129307q00606p63891m10845R95765J858750N09746j666883
45445B368407k291736j773921j988037k414896j076591J396380K356678J718039
45437a705677K140051M039493M213267R41396k833723l542825j652214n7154J16613
45428A659227k16137m04848l45174L12408J190435O61257j645214l138332j465396
$$ plain form
45488 -2323740 -6899019 -7120367 -3411431 -313656 -152583 -584986 824041 2663758 2269127
45479 2269127 -97643 -2147436 -3002715 -3131947 -2197904 53720 1632672 334192 -2289102
45470 -2289102 -2381235 391690 1880411 -583966 -4452816 -5881765 -4564875 -2517941
45462 -2517941 -541502 1412518 2230168 1028747 -467002 234116 2704136 4242994
45454 4242994 3775678 2646371 1845765 1081874 671029 1666794 3525544 4035290 2368407
45445 2368407 76671 -1697250 -3685287 -6100183 -7176774 -5780394 -3423716 -1705677
45437 -1705677 434374 4473867 8687134 9628530 6794807 3251982 1599768 1542614 1659227
45428 1659227 1443090 1038242 693068 1005476 2195911 2857168 1211954 -1926378 -3391774
45419c391774J714265K813892J322564j83290m84836q92564j836749j656322J98372
45410b396442J632235J025509m07329q65523n68869n44839n32834K29410J416910
45401a011772K233985K472050J872863j12954k733018l707393k080418J92124
45393b874533J038390J049469J663470K234749J267861o31330j539292j162135
45385A046649o43980j71795P43217J216053o736j712517j283178J127336K297256
45376B612305O30145j412491r23587J348716K159421R95l156488m079973j693926
45367d514883J635001K516856M82926j523844j290750k00233k97669n39858J107700
45358b624754L344978L059724N14375r49245k81066L11812M1424P28306K398568
$$ plain form
45419 -3391774 -1677509 1136383 2458947 2275657 1790821 898257 -938492 -2594814 -2396442
45410 -2396442 -764207 261302 -146027 -1011550 -1580419 -2125258 -2658092 -2428682 -1011772
45401 -1011772 1222213 3694263 5567126 5454172 2721154 -986239 -3066657 -2874533
45393 -2874533 -1836143 -786674 876796 3111545 4379406 3748076 2208784 1046649
45385 1046649 402669 230874 974091 2190144 2183408 470891 -812287 315049 2612305
45376 2612305 3242450 1829959 906372 2255088 4414509 4415504 1259016 -2820957 -4514883
45367 -4514883 -2879882 -363026 119900 -1403944 -2694694 -2894927 -3192596 -3732454 -2624754
45358 -2624754 720224 3779948 4294323 3345078 3064012 3375824 3417248 4145554 6544122
45349F544122K246877m52173k780499l221446l569118l826590q05871M881469
45341i83229O387773L42466o199419n033632J116881L335419L07484j248196J238676
45332g35777K687675J30528k410531j518352K67841J26672j35761J362432K474240
45323B248967J427399M79129J156098O77618k347748l533179L31341M237856J716087
45314F393568m433264n791518j185525K124889L59309j654299M78358L582276
45306a26206K782945p51394k539317j644776k81878R01295K661112L797322K270763
45297G069866p72856j827916q4925J430066L08403k265640l777238l409950j831225
45288e161415J95290J774881J850064M86046p13262n44180K09097J54871m68170
$$ plain form
45349 6544122 8790999 8338826 5558327 2336881 -1232237 -5058827 -5864698 -983229
45341 -983229 5404544 5747010 -452409 -5486041 -4369160 -1033741 -726257 -1974453 -735777
45332 -735777 1951898 2082426 -328105 -1846457 -1578616 -1451944 -1587705 -225273 2248967
45323 2248967 3676366 4155495 5311593 5989211 3641463 108284 439625 4677481 6393568
45314 6393568 1960304 -3831214 -5016739 -2891850 -2532541 -4186840 -3708482 -126206
45306 -126206 2656739 1905345 -633972 -2278748 -2560626 -1659331 1001781 4799103 7069866
45297 7069866 6297010 4469094 4384169 5814235 6122638 3856998 79760 -3330190 -5161415
45288 -5161415 -4966125 -3191244 -1341180 -855134 -1568396 -2112576 -1903479 -1748608 -2216778
45279b216778k32517J096642J931921Q54880j632526l660607l750902j889236
45271i499123N87374J998717J706474O39965P1605N8042j67876n19443j27352
45262e251617P04198L36625j445046k218305k20368K460104K388941j75655j544108
45253d965231l3735J783433J322769k01883r3320J698008L019584K818993J765286
45244G113904L97951j160243k086096j491815k9614Q54666J011510J206722J045668
45235F862653n89209l017327l874650k224885K90739J858642K255686J814142
45227C375791O14218o26689p73742j32384k10041r96335p39919P26017J153901
45218B390817k11026q80851N22884J238610j078946l519765k000405J673718K053418
$$ plain form
45279 -2216778 -2449295 -1352653 579268 1434148 -198378 -3858985 -7609887 -9499123
45271 -9499123 -8911749 -6913032 -5206558 -4566593 -4494988 -4436946 -4604822 -5124265 -5251617
45262 -5251617 -4547419 -4210794 -5655840 -7874145 -8094513 -5634409 -3245468 -3421123 -4965231
45253 -4965231 -4998966 -3215533 -1892764 -2094647 -2187967 -489959 2529625 5348618 7113904
45244 7113904 7511855 6351612 4265516 2773701 2744087 3598753 4610263 5816985 6862653
45235 6862653 6273444 3256117 -618533 -2843418 -2552679 -694037 1561649 3375791
45227 3375791 3990009 3363320 2589578 2457194 2247153 1250818 510899 1236916 2390817
45218 2390817 2179791 1298940 1821824 3060434 1981488 -1538277 -3538682 -1864964 188454
45209A88454j208705k517724P45098L948563K475020j317182k194089N8711J144462
45200A322608r31596l543298l621722j187602J415333J949343K04750j269787
45192e661971N36522M728991O336093K622743k575007l844814j499250N5985l81183
45183C18109j69817J086167N33028j915638k237289P81938K595458K26323k252883
45174a034604j29467L904500L669899r21572m103824l144993j254380j233259
45166d247700j484499M0968K084984K465169J374787L93602K28371P42577J495579
45157C093838J547199N46726J19905J739082L340847J494967k664312l886915
45149E331337o37566J984256j63399l954065m141398j353210j13820j197899j312591
$$ plain form
45209 188454 -1020251 -3537975 -2792877 1155686 3630706 2313524 119435 178146 1322608
45200 1322608 391012 -3152286 -6774008 -7961610 -6546277 -4596934 -4392184 -5661971
45192 -5661971 -5125449 -396458 5939635 8562378 5987371 2142557 643307 699292 318109
45183 318109 148292 1234459 1767487 -148151 -2385440 -1603502 991956 1218279 -1034604
45174 -1034604 -1164071 2740429 6410328 5488756 1384932 -1760061 -3014441 -4247700
45166 -4247700 -5732199 -5691231 -3606247 -1141078 233709 627311 855682 1598259 3093838
45157 3093838 4641037 5187763 5307668 7046750 10387597 11882564 9218252 5331337
45149 5331337 4693771 6678027 6514628 2560563 -1580835 -2934045 -3047865 -4245764 -5558355
45140e558355N28648J594324O90977J29621J316885K331753J460410o3651n07048
45131A923564j87661m1254N3571J17955n93084j781926j765672k40289Q04007
45122a710789L07491o9166R29444J664836M82011j089395p12262Q65284J210923
45113A878377K35001k76561k88615j319048k851029k404892K33911K049476J239248
45104a504132k12037q7638M67584o55837k357311j664904J263090K616333K90380
45095a844472k706980k145060J498537L527998J452896j639715j568963J024746
45087b401013J891309l64071k228388o35628K445800K985843O50413j181972m81540
45078F80753J091856J186639j64469j353854j540681j115915o15375J1087J201834
$$ plain form
45140 -5558355 -5029707 -3435383 -2744406 -2614785 -1297900 1033853 2494263 2430612 1923564
45131 1923564 1735903 1694649 1748220 1866175 1273091 -508835 -2274507 -2514796 -1710789
45122 -1710789 -1403298 -1472464 -543020 1121816 1603827 514432 -197830 667454 1878377
45113 1878377 2113378 1836817 1548202 229154 -2621875 -5026767 -4792856 -2743380 -1504132
45104 -1504132 -1716169 -1803807 -1336223 -1992060 -4349371 -6014275 -4751185 -2134852 -1844472
45095 -1844472 -4551452 -6696512 -5197975 -1669977 -217081 -1856796 -3425759 -2401013
45087 -2401013 -509704 -873775 -3102163 -3737791 -1291991 1693852 2344265 1162293 680753
45078 680753 1772609 2959248 2794779 1440925 -99756 -1215671 -1831046 -1819959 -618125
45069f18125K937500M003091K814967l59751l011992l416593k914674l363977
45061c929554l528493q91407L414994N044537K485468p90141j704157j686831
45053a585584k954073l769545j179746L296581M960646K687623N20224J599093
45045C575219L690088K641283j691751n188300m522815p99003K130924K076941
45037A912586N01327K5414P47497L36090k092465l972111k554909R96151K768404
45028a332016J044047j836357k857317j904120j047951j277209j235404N98204
45020i848123L217330L682539R34690k132273k118298Q0939O65084q45734o31311
45011f995157K581158M060867K70268m127437k197978M218274O179468O28965
$$ plain form
45069 -618125 2319375 6322466 9137433 8777682 5765690 2349097 -565577 -3929554
45061 -3929554 -7458047 -8349454 -4934460 110077 2595545 1805404 101247 -1585584
45053 -1585584 -4539657 -8309202 -9488948 -6192367 -1231721 1455902 1976126 3575219
45045 3575219 7265307 9906590 8214839 3026539 -1496276 -2295279 -164355 1912586
45037 1912586 2413913 2439327 3186824 3522914 1430449 -2541662 -5096571 -4100420 -1332016
45028 -1332016 -287969 -2124326 -4981643 -6885763 -7933714 -9210923 -10446327 -9848123
45020 -9848123 -6630793 -2948254 -2013564 -4145837 -6264135 -6183196 -5518112 -6363846 -6995157
45011 -6995157 -4413999 -353132 -82864 -4210301 -6408279 -2190005 3989463 4618428
45003D618428n181560m594274n62823M91438j182150n70816K812491L967929N79691
44994C78354l265206l077949R7533J975931R71084n55121j76648J485861K046418
44985a19743P27559p68302r02555l76478l05241L11272K762348M943208L072496
44976I344564k189793n075600k184408K578704L312819k42834l618143m111001
44968b185692k753234j054258N48288J424964J070164N12054Q99448J217683r9576
44959d20159k071785k383844q76621R28417K676913M396578M235413R98221k127639
44950E355494j140492J991082J519696k817855m742254j209407K832515K407565
44942D196344l53057j077063k81191o58374j112729Q16616L142056J878939j992905
$$ plain form
45003 4618428 -563132 -5157406 -5720229 -5228791 -6410941 -6981757 -4169266 -201337 378354
44994 378354 -2886852 -5964801 -5867268 -3891337 -2920253 -3475374 -3652022 -2166161 -119743
44985 -119743 607816 -160486 -1063041 -1439519 -1744760 -1433488 1328860 6272068 9344564
44976 9344564 7154771 2079171 -105237 2473467 5786286 5543452 1925309 -2185692
44968 -2185692 -4938926 -5993184 -5444896 -4019932 -2949768 -2437714 -1538266 -320583 -420159
44959 -420159 -2491944 -4875788 -5752409 -4823992 -2147079 2249499 6484912 7483133 5355494
44950 5355494 4215002 6206084 7725780 4907925 165671 -1043736 1788779 4196344
44942 4196344 3843287 2766224 2485033 1826659 713930 1530546 4672602 6551541 4558636
44933D558636l496730j140719J538042J884788Q61544m85156k604882m446906
44925c331383l261942Q58392L918932L396615J412137O18719L03042q65979j408189
44916A640344J56998J496303l63207l402429k773940J457717L532036M95787k949165
44907g09556j398673K786478K819769k057567n042618j750655L399650L878315
44899A925143K13669k007179r50643n2694j237301j917729M7K508719K977846
44890A459878J858626P60329k48667j257271j195869j39230j71738j618445j479175
44881b031562J485806L390885Q20913l169876l423176o73878L91107m95954P97772
44872b907963M531791N584409J866292j846115j344137Q92697N96964j494188
$$ plain form
44933 4558636 1061906 -78813 1459229 3344017 4205561 3720405 1115523 -3331383
44925 -3331383 -6593325 -5734933 -1816001 1580614 2992751 3611470 3914512 3048533 1640344
44916 1640344 1797342 3293645 2930438 -471991 -3245931 -1788214 1743822 2239609 -709556
44907 -709556 -2108229 678249 3498018 1440451 -3602167 -5352822 -1953172 1925143
44899 1925143 2138812 131633 -819010 -871704 -2109005 -4026734 -4026687 -1517968 1459878
44890 1459878 3318504 4078833 3830166 2572895 1377026 1237796 1066058 -552387 -2031562
44881 -2031562 -545756 2845129 3666042 496166 -2927010 -3600888 -3209781 -3705735 -2907963
44872 -2907963 1623828 7208237 9074529 7228414 5884277 6776974 7373938 5879750
44864E879750j919978n17968J00968p97791j707378j873793j498290j49542K141134
44855c42888L394129K104259J7765k46309Q54439J068392K97793J6041j64807
44846F998814j657969l275393k412116K17104J127345k06851m74962J464063K174725
44837C954760n03411l329894k679772l03911n8824j441103j062548R26636J068669
44828c429398q71341q37361K648250N225198L025274j375085k867634j176215
44820C41688k70780j683387k641501j054971J335016J977570Q87827m74145j479572
44811c062255j870786r26480J018241J725807j15515k252105j388372K145087
44803d726378M634855L932020J759445M29284l85227k000891l552842k818871
$$ plain form
44864 5879750 3959772 3441804 3542772 2744981 1037603 -836190 -2334480 -2484022 -342888
44855 -342888 3051241 5155500 5173265 4926956 5781395 6849787 7147580 7163621 6998814
44846 6998814 5340845 2065452 -346664 -129560 997785 790934 315972 1780035 3954760
44837 3954760 3451349 121455 -2558317 -2862228 -2921052 -4362155 -5424703 -4498067 -3429398
44828 -3429398 -4300739 -5138100 -2489850 2735348 5760622 4385537 1517903 341688
44820 341688 70908 -1612479 -4253980 -5308951 -3973935 -1996365 -1108538 -1582683 -3062255
44811 -3062255 -4933041 -5859521 -4841280 -3115473 -3230988 -5483093 -6871465 -4726378
44803 -4726378 -91523 3840497 5599942 6029226 5643999 3643108 90266 -2728605
44795b728605K02957K713006K617757R77063j8731j84240q56294j998208j935603
44786a210898l37772O03643p53703k829647k984429j209663M64539J454061K915370
44777c888499M708924M860474K643527k69684k427870l844145l941969j456231
44769c615473K172801K817225m43393k769197k70784L756495L673170J76921j223321
44760D274444P89168J810629m61255k674774j840536J43100N78697L87895J359390
44751D366758K346465J524916q1459m83105j30082n82799j604517k254174k990989
44742A11014l920911k989531P37957L757055K049246k613155m397095j332562
44734h597982K438686K913109J036118m1011N97179J770163K545043K587277J660720
$$ plain form
44795 -2728605 -2525648 187358 2805115 3782178 3763447 3579207 2722913 724705 -1210898
44786 -1210898 -1548670 -945027 -1698730 -4528377 -7512806 -8722469 -8257930 -6803869 -3888499
44777 -3888499 820425 5680899 8324426 8054742 5626872 1782727 -2159242 -3615473
44769 -3615473 -1442672 1374553 931160 -1838037 -2108821 1647674 5320844 5497765 4274444
44760 4274444 5063612 6874241 6412986 3738212 1897676 2040776 2619473 3007368 4366758
44751 4366758 6713223 8238139 8156680 7673575 7543493 6960694 5356177 3102003 111014
44742 111014 -3809897 -6799428 -6061471 -2304416 -255170 -2868325 -7265420 -8597982
44734 -8597982 -6159296 -3246187 -2210069 -2251080 -1653901 116262 2661305 5248582 6909302
44725F909302K28613o36278r12835j770249l140293l005745n84551J592949R44273
44716c74814j158968j292582P44294J563112n09686k684303j735392J502535L767092
44707a78712L871976L052124J843348l13343k412735k075392N64563K022538K37518
44698F611885k281752k291784n89292j05781r52445q15094O27903J356496R03297
44689B463433R34309J518120M94568k286529l558443j338143J826627K523972
44681B577914J123350L94034J152671J646645L60453k329225m654465m635138
44673d363761j834905J371424J863975j63731j207378N70948K768057K540312
44665A544941M78507j195199j923417k074830j097579J055239K467351J737318
$$ plain form
44725 6909302 7137915 6501637 5588802 3818553 678260 -2327485 -2912036 -1319087 -374814
44716 -374814 -1533782 -2826364 -2082070 -518958 -1028644 -3712947 -5448339 -3945804 -178712
44707 -178712 3693264 6745388 8588736 8275393 5862658 3787266 4351829 6374367 6611885
44698 6611885 4330133 2038349 1449057 1343276 390831 -424263 203640 1560136 2463433
44689 2463433 3397742 4915862 5410430 3123901 -434542 -1772685 53942 2577914
44681 2577914 3701264 4095298 5247969 6894614 7255067 4925842 271377 -4363761
44673 -4363761 -6198666 -4827242 -2963267 -3126998 -4334376 -3763428 -995371 1544941
44665 1544941 2023448 828249 -1095168 -3169998 -4267577 -3212338 -744987 992331
44657I92331L08000Q178Q1365q65949j911724j611478q18919o57711L30524L394462
44647g50921N701188L542952j540187m193619k524327J73352J027215Q13041Q88211
44638C136905O65007n24039j829493k332706k060049j054728O29765J973485K005807
44629F09954J451319J380355J167815K04676J36864K075376L132858Q2297m574174
44620E667340n226271j522939J288052P52874J66880J797364K964894J378360
44612G266554q15251j410134j962385l734050l936517j12024M810642N891285
44604E998120K566434j580770l568108k838789l45701J709867J213450p67976
44596B386527o50408K112068L414026Q17977k239490j878443J59422J3959j763111
$$ plain form
44657 992331 1300331 1308509 1389874 523925 -1387799 -2999277 -3818196 -4475907 -4145383 -750921
44647 -750921 4950267 8493219 6953032 2759413 235086 408438 1435653 2248694 3136905
44638 3136905 3801912 3277873 1448380 -884326 -2944375 -3999103 -3369338 -1395853 609954
44629 609954 2061273 3441628 4609443 4814119 4950983 7026359 10159217 10241514 5667340
44620 5667340 441069 -1081870 206182 959056 1125936 2923300 5888194 7266554
44612 7266554 6451303 5041169 3078784 -655266 -4591783 -4703807 106835 5998120
44604 5998120 8564554 6983784 3415676 576887 231186 1941053 3154503 2386527
44596 2386527 1736119 3848187 7262213 8080190 5840700 3962257 4121679 4135638 2372527
44587B372527j889219l13550L78254L2974O56559J957341J615476m13648j822153
44578B574561j839509j611458j187499K83795J791932J434084k15415j053882
44570A76609j154652j955469k474334m77466K812063L546920J212309m59118N85418
44561A812280J866776Q31481j361624k235394j385249P4350J160925J003155o27410
44552A139290j981504q69760J834679K787076Q99518j316142j902184j844527
44544a253554k080101j344329R96718K725041J874656Q7534L61236K703694M270093
44535H340988L140837K26905k228412k917142k478458k603813l587750l196342
44527e303187L90178M799983N264130Q82249l604744l768151p75309J282780J168842
$$ plain form
44587 2372527 483308 169758 548012 580986 1237545 3194886 4810362 4396714 2574561
44578 2574561 735052 -876406 -2063905 -1780110 11822 1445906 1230491 176609
44570 176609 -978043 -2933512 -5407846 -5885312 -3073249 473671 1685980 1226862 1812280
44561 1812280 3679056 4510537 3148913 913519 -471730 -397380 763545 1766700 1139290
44552 1139290 -842214 -1711974 122705 2909781 3809299 2493157 590973 -1253554
44544 -1253554 -3333655 -4677984 -3681266 -956225 918431 1005965 1367201 4070895 8340988
44535 8340988 11481825 11708730 9480318 6563176 4084718 1480905 -2106845 -5303187
44527 -5303187 -4913009 -113026 5151104 6033353 2428609 -1339542 -2114851 -832071 336771
44518C36771Q38004J317813J412214M84208j89037K90155P30974k33075j709040
44509C278987j654310m1716Q82016K8836o44217O88406K102138L54197l437439
44500A556898m229877l36264L413949K321338j577601l106832j626611o76094
44492d261094j436532j458999L08305J869114K159980K573628L578730L568699
44484F901831K169306J172891J021379j76350k809403m351194l282623j234225
44476e88388K03810J481290K414796J179698j979842l552892j702119Q04105J053820
44467f85722J27686O5138N3436j031921j326258R23630L328383K420041r21491
44458B952922k794420j685517P58097K946671M048279K889786m61983l233096
$$ plain form
44518 336771 1174775 2492588 3904802 4389010 4199973 4490128 5221102 4988027 3278987
44509 3278987 1624677 1582961 2464977 2493813 1849596 2538002 4640140 4994337 1556898
44500 1556898 -2672979 -3009243 404706 2726044 1148443 -1958389 -3585000 -4261094
44492 -4261094 -5697626 -7156625 -6848320 -4979206 -2819226 -245598 3333132 6901831
44484 6901831 9071137 10244028 11265407 11089057 8279654 3928460 645837 -588388
44476 -588388 -384578 1096712 3511508 4691206 2711364 -841528 -2543647 -1739542 -685722
44467 -685722 -558036 -492898 -439462 -1471383 -2797641 -1874011 1454372 3874413 2952922
44458 2952922 158502 -1527015 -768918 2177753 6226032 9115818 8653835 5420739
44450E420739l210976k046499k108852k005450O98047M019205L752106L09063
44442D827383j746673r57919n71051k117042k570272J56506L284698L361027J057016
44433D723673q35217j552288j899575j692103k66893J640706K596454K295381
44425E010138J339571P6166j190475j687267r45769M44123J429221J327214N5179
44416E858101j557538j861477j20172J914735J661038r87928l473119l695451
44408b261811j855166O63620K524961K683694J217973j97886m00372p08992k474208
44399h08187l538929o84466M442437O027734J973490k781915k930308N33239K895638
44390E128733K183359k563k029537l358860l285577j495719N47737R54248j87240
$$ plain form
44450 5420739 2209763 163264 -1945588 -3951038 -3252991 766214 4518320 4827383
44442 4827383 3080710 2122791 1551740 -565302 -3135574 -2979068 305630 3666657 4723673
44433 4723673 3888456 2336168 436593 -1255510 -1522403 118303 2714757 5010138
44425 5010138 6349709 6425875 5235400 3548133 2602364 3046487 4475708 5802922 5858101
44416 5858101 4300563 2439086 2318914 4233649 5894687 4906759 1433640 -2261811
44408 -2261811 -4116977 -3453357 -928396 1755298 2973271 2775385 2375013 1666021 -808187
44399 -808187 -4347116 -5031582 -589145 5438589 7412079 4630164 1699856 2233095 5128733
44390 5128733 7312092 7309529 5279992 1921132 -1364445 -2860164 -2312427 -1358179 -1545419
44381a545419j267188j333002m85659R05017K031207J828008O36359L14012J335709
44372B419044J560203l35784k154625j307118J073797J947005Q85324k84244j187176
44363B616426k716824l759126j981634J780160L562864J731604p23349p08388
44355a98267R07356J501558P46271L35601R85251J615237J033520p14548k392034
44346C819945k555714j031934O05300Q88620M64974R10359J957737J849003L57375
44337G265665p69751o37036j90960k0919L55521N24119o82567k296669j707790
44328A839613O66731Q70678k237936l934957l63799M953656N750045J826356j648699
44319G721688k161604j887558k168771j414567O70856J650538O91307J81387J332057
$$ plain form
44381 -1545419 -2812607 -4145609 -4631268 -3726251 -1695044 132964 769323 1083335 2419044
44372 2419044 3979247 3643463 1488838 181720 1255517 3202522 4087846 3803602 2616426
44363 2616426 -100398 -3859524 -5841158 -4060998 -498134 1233470 510121 -198267
44355 -198267 709089 2210647 2956918 3292519 4277770 5893007 6926527 6211979 3819945
44346 3819945 1264231 232297 837597 1726217 2191191 3101550 5059287 6908290 7265665
44337 7265665 6495914 5858878 5667918 5646999 6002520 6526639 5844072 3547403 1839613
44328 1839613 2506344 3377022 1139086 -2795871 -3159670 1793986 7544031 9370387 7721688
44319 7721688 5560084 3672526 1503755 89188 760044 2410582 3101889 3283276 4615333
44310D615333K027259Q93413k82749l32070j107584l483171m597844k336716O78038
44301c926091J204291N20233J300965K046997k64040l632158k872007K103849
44293c517961N289551L058724j089121k296878r14952m40194j663553k194513
44285c768897o54475J513213K444614K136408J671074J179073k74832k563499
44277A682679l438150j191941K065133K306515o75739k427335l12437K420956
44269D29681J845597n08813p46728O83863L84954j421130j260614J107372K147294
44260B661476P92399k38009q0343r88012k645030j260773L287587N333758J845703
44251H708756k472641k668723j098063k313874m556276k584749L220495O620807
$$ plain form
44310 4615333 6642592 7536005 7253256 6921186 5813602 2330431 -2267413 -4604129 -3926091
44301 -3926091 -2721800 -2201567 -900602 1146395 882355 -2749803 -5621810 -3517961
44293 -3517961 1771590 4830314 3741193 1444315 529363 89169 -1574384 -3768897
44285 -3768897 -4423372 -2910159 -465545 1670863 3341937 4521010 4246178 1682679
44277 1682679 -1755471 -2947412 -882279 1424236 748497 -1678838 -1991275 429681
44269 429681 2275278 1766465 1019737 1703600 2088554 667424 -593190 514182 2661476
44260 2661476 3453875 3215866 3135523 2147511 -497519 -1758292 1529295 6863053 8708756
44251 8708756 6236115 3567392 2469329 155455 -4400821 -6985570 -3765075 2855732
44243B855732L956865j736049n130017l902457K04297L239913K423233q41067
44235A070450k515944j268255L04297N90122J122152K187671J245193j487358
44227A248328j391719K576005M164865l70668m634598j595610M427582M271886
44219H696071j359914l834187j180451K4580k684389l782919m39285K551121J546225
44210d63148n72499j023634j468557k528121j383023J786793K290307o36263j420197
44201e418342J855999L030405j412040n037618j550762M580813N146223M96456
44193A691134k840711k591625j257518L37882K702050L622952J300259r82771
44185A981652K49494J954498m03661m016702k730079K145228L379083n51367l601602
$$ plain form
44243 2855732 6812597 5076548 -53469 -3955926 -3751629 -511716 1911517 1070450
44235 1070450 -1445494 -2713749 -2409452 -1819330 -697178 1490493 2735686 1248328
44227 1248328 -143391 2432614 6597479 6226811 1592213 -3397 4424185 8696071
44219 8696071 7336157 3501970 2321519 2346099 -338290 -4121209 -4560494 -2009373 -463148
44210 -463148 -1035647 -2059281 -3527838 -6055959 -7438982 -5652189 -3361882 -3998145 -5418342
44201 -5418342 -3562343 -531938 -1943978 -6981596 -8532358 -3951545 1194678 1691134
44193 1691134 -1149577 -3741202 -4998720 -4660838 -1958788 1664164 2964423 1981652
44185 1981652 2231146 4185644 3781983 -234719 -2964798 -819570 2559513 2008146 -1593456
44176a593456k268890K30062J070216J809169L265539K918698K2733k104730j440900
44167A908441k31151m19896o04991K29275K36809j563073k861489j847917j76455
44158e330447J25411k20218J70409P65690O04727J29157l6680r6574J61238J380733
44148b346554K642546J984107k91557j482322n13570N94598J97249p18907p59099
44139f93509j23225N20663R11782M45806j119084k136683r49696R39542Q26619
44130a377785m53870J87498K227603J924245p82692j329577J692297L416749M24875
44121E929343l438119k975890O61205K594368J510812n0464n84345p14680p39644
44112B192586m16321j95797k79966J71178J032521N24427j536977k450045q71301
$$ plain form
44176 -1593456 -3862346 -3632284 -2562068 -752899 2512640 5431338 5454071 3349341 1908441
44167 1908441 1677290 1257394 652403 881678 1118487 -444586 -3306075 -5153992 -5330447
44158 -5330447 -5205036 -5425254 -5254845 -4489155 -3884428 -3755271 -3791951 -3888525 -3727287 -2346554
44148 -2346554 295992 2280099 1988542 506220 -7350 587248 784497 65590 -693509
44139 -693509 -816734 -296071 615711 1061517 -57567 -2194250 -3143946 -2204404 -1377785
44130 -1377785 -1831655 -1644157 583446 2507691 1724999 395422 2087719 5504468 5929343
44121 5929343 2491224 -484666 176539 2770907 4281719 4231255 3646910 2932230 2192586
44112 2192586 1776265 1580468 1300502 1471680 2504201 3028628 1491651 -958394 -1829695
44103a829695O32507J4069n13679J357594L259945J835427j283529j840895M05138
44094B036882J956184J245590k44826j436422k111501j146044J477433K305474
44086D082770j147473m914139l141899K527634M475002M76172l070840j223457
44078a936230K530275K771563K74319q54456k55662n88112j990610j961402N4672
44069a955643J681653J164785o10564j621230o59042J729803L205134J682340
44061D617236j583992k763009o21776J383556K46008j888152j276207J238254
44053f48082J687762l80314j223293Q83111L042887K642071J079819N68661L88552
44044H041174j016620k618551k449051j003270l1757P55860K485360L468107P10695
$$ plain form
44103 -1829695 -1197188 -1183119 -1696798 -339204 2920741 4756168 3472639 1631744 2036882
44094 2036882 3993066 5238656 4993830 3557408 1445907 299863 1777296 4082770
44086 4082770 2935297 -1978842 -5120741 -2593107 1881895 2358067 -712773 -1936230
44078 -1936230 594045 3365608 3639927 2785471 2529809 1941697 -48913 -2010315 -1955643
44069 -1955643 -273990 890795 280231 -1340999 -2000041 -270238 2934896 4617236
44061 4617236 3033244 270235 -351541 1032015 1278023 -610129 -1886336 -648082
44053 -648082 1039680 659366 -563927 319184 3362071 6004142 7083961 7652622 8041174
44044 8041174 7024554 4406003 1956952 953682 921925 1677785 4163145 7631252 8341947
44035H341947m532100o679834l080997J870629K510220n70727k073203K00799
44027d013266K789847K083193p92884k032317j19062K904892M151358K545003
44019G516764o98527l189350l158069r34220J270852J418411m17796k202344j990224
44010b384503J35406K188261K490209J505345Q36753O82301l07721k337664l448750
44001f40363k326878m30525L68878P01470K007321L256741K254500m24235j874804
43992B892105j159475j38003J90587R38620K176801J811627q74048l324586l192344
43983f78716j517357o41203q30557p53452J74605J446710K290643J935405M09742
43974A835820n66821N66414K345517J945421j52006p33816L93760j78974k852190
$$ plain form
44035 8341947 3809847 -2869987 -5950984 -4080355 -1570135 -2140862 -4214065 -4013266
44027 -4013266 -1223419 859774 66890 -1965427 -2084489 820403 4971761 7516764
44019 7516764 6818237 3628887 470818 -463402 807450 2225861 1808065 -394279 -2384503
44010 -2384503 -2249097 -60836 2429373 3934718 4771471 5453772 5146051 2808387 -640363
44001 -640363 -2967241 -3397766 -3028888 -2327418 -320097 2936644 5191144 4766909 2892105
43992 2892105 1732630 1594627 1785214 2723834 4900635 6712262 5838214 2513628 -678716
43983 -678716 -2196073 -2837276 -3667833 -4421285 -4246680 -2799970 -509327 1426078 1835820
43974 1835820 1268999 1835413 4180930 6126351 5974345 5240529 5634289 5455315 2603125
43965B603125l167586N59127L291095J306011j153504Q58102L871257J773547
43957I941174k760469j763592M318567O149516Q1566n929911m485782R76720K964880
43948I492669Q04806r69491o46228P8143O77191J689713J950717M14676r84164
43939A2508032m06774r7584k769356n749569m057969J412653M434950K617429
43931G891812M38382J426135K687115N34791k778325k581033N84567J920500J7664
43922A0141608j427185l2452J732140J239062K1242N15789J487508L80287j696178
43913A2361821j469049Q67734J795281K86499q08274j7922M39903p06383j093764
43904A1655846O96925J792970k39420k661464j717922J157237J920311O45230
$$ plain form
43965 2603125 -564461 -5334 3285761 4591772 3438268 4296370 8167627 9941174
43957 9941174 7180705 5417113 9735680 15885196 15966762 10036851 5551069 6527789 9492669
43948 9492669 10297475 9327984 8681756 8759899 9437090 11126803 13077520 13492196 12508032
43939 12508032 12101258 12003674 9234318 3484749 -573220 839433 5274383 7891812
43931 7891812 8330194 9756329 12443444 12978235 10199910 7618877 8203444 10123944 10141608
43922 10141608 8714423 8681971 10414111 11653173 11674415 12190204 13677712 14057999 12361821
43913 12361821 10892772 11760506 13555787 13842286 13034012 13016090 13455993 12749610 11655846
43904 11655846 12352771 14145741 13906321 11244857 9526935 10684172 12604483 13249713
43896A3249713N60843J618557N34350k811952m319663j991145J158180J811395
43888I810278K21065j724768k779182j774420J609687M600596L566447n29405
43880A3000298k755898j276753N20060K89496K58852K142011L316504J509438
43872A7004008p10013m7559K043753J950011m74463k516282k828842j856894n8413
43863A2505306J415495N63854k105100k761064J22137K501298R20106j465399
43855A1696633L5234L492465L354296j88821j486176J240261L376372J785338
43847B3305602o39810l39441J779917L050647L145159L007724K545164J530333
43839C7385295O12247o8100j151215j949140n27516K996776N727369N797580M604436
$$ plain form
43896 13249713 13810556 15429113 15963463 13151511 8831848 6840703 7998883 9810278
43888 9810278 10031343 8306575 5527393 3752973 5362660 9963256 13529703 13000298
43880 13000298 10244400 8967647 9487707 9777203 10036055 12178066 15494570 17004008
43872 17004008 16293995 16246436 18290189 20240200 19765737 17249455 14420613 12563719 12505306
43863 12505306 13920801 14484655 12379555 9618491 9740628 12241926 13162032 11696633
43855 11696633 11731867 15224332 18578628 18389807 16903631 18143892 21520264 23305602
43847 23305602 22665792 22326351 24106268 27156915 30302074 33309798 35854962 37385295
43839 37385295 37997542 37929442 36778227 34829087 34301571 37298347 43025716 48823296 53427732
43830E3427732M106824M254782M332894M523495M750459M133064L007266L459733
43822H5996249O374761R729004J1182278J0789783J0107926J0302695J2003359
43815A56486055J5095591J7798059J8096651J6998882J7879347K1402587K3831428
43808B87588600K2068377J7657261J3658369J0251458O171480K087952q12989
43801C58670508l822956q534997j2677435j2052157o661546j400059l971j347088
43793C12170299k696859l704466n355473p172067p909184q106128r707046j3122319
43785B54396757j6358052j7597554j7411059j7453251j7773366j6878585j4435353
43778A36489537j2254364j1731576j1706123j0350906q165126p103078p260116
$$ plain form
43830 53427732 57534556 61789338 66122232 70645727 75396186 79529250 82536516 85996249
43822 85996249 92371010 102100014 113282292 124072075 134180001 144482696 156486055
43815 156486055 171581646 189379705 207476356 224475238 242354585 263757172 287588600
43808 287588600 309656977 327314238 340972607 351224065 357395545 359483497 358670508
43801 358670508 354847552 346312555 333635120 321582963 314921417 313521358 313517387 312170299
43793 312170299 309473440 305768974 300413501 293241434 285332250 277226122 267519076 254396757
43785 254396757 238038705 220441151 203030092 185576841 167803475 150924890 136489537
43778 136489537 124235173 112503597 100797474 90446568 82281442 75178364 67918248
43771F7918248o724438m771448k864466k007471j449204q51241j349252l130199
43763D4770529m190936l259087k017839k439583l606351l430787k161607j724981
43755B1939358k504808l175637l121091k757741j937501k52747J396170J677957
43747A1263960J004043P44745O44641o20412k487666k751231j087041K17160k49249
43738F678950j173469j122873p76779j234110j900686j542450j78451J265454
43730A5586K097970J806972J79907j623465j555623O50718K611753K242242L34246
43721F760306r53562q79235j11262P76088J351025R95442k6743k53915Q36762
43712H494906J625462P79490n84249r70993j059847j812620j755093O45772L168548
$$ plain form
43771 67918248 61193810 56422362 53557896 51550425 50101221 49249980 47900728 44770529
43763 44770529 40579593 37320506 35302667 32863084 29256733 25825946 23664339 21939358
43755 21939358 19434550 16258913 13137822 10380081 8442580 8189833 9586003 11263960
43747 11263960 12268003 13012748 13657389 13036977 10549311 7798080 6711039 6928199 6678950
43738 6678950 5505481 4382608 3605829 2371719 471033 -1071417 -1249868 15586
43730 15586 2113556 3920528 4100435 2476970 921347 1572065 4183818 6426060 6760306
43721 6760306 5806744 4927509 4816247 5592335 6943360 7938802 7912059 7658144 8494906
43712 8494906 10120368 10899858 10315609 9344616 8284769 6472149 4717056 5362828 8531376
43703H531376K299187j002123k238478l32951Q45958r45334k804777j931457j56597
43694B264804j47446p43066K33920J617980J510346J573778L950255N979867L503314
43685A9743752j635549l303516l63754J781939J52570j351632Q74238L961222
43677A9859270L624840J208965Q56406K387888K021324j097812l686294l456712
43669B1717875j720911n67580m47174j085542k406826l854869m367840l446880
43661C820253j431259Q35794J862380L44403k542485l326483n97446K480193K308595
43652C753945j70677j411986n66980M57079R18240J454387J275159p88430k873704
43643B047033j973293Q59910J650277M2191k04852J920797K658230J66438k021191
$$ plain form
43703 8531376 10830563 9828440 7589962 7257011 8102969 7157635 4352858 2421401 2264804
43694 2264804 2117358 1374292 1608212 3226192 4736538 6310316 10260571 16240438 19743752
43685 19743752 18108203 14804687 14440933 16222872 16375442 15023810 15898048 19859270
43677 19859270 23484110 24693075 25549481 27937369 29958693 28860881 25174587 21717875
43669 21717875 19996964 19429384 18982210 17896668 15489842 11634973 7267133 3820253
43661 3820253 2388994 3224788 5087168 5431571 2889086 -437397 -1034843 1445350 3753945
43652 3753945 3583268 2171282 1604302 2061381 2979621 4434008 5709167 4920737 2047033
43643 2047033 73740 933650 2583927 2626118 2421266 4342063 7000293 7166731 5145540
43634E145540j062423N49090l4986q79949N65171K091602N84743j828424j024933
43625D105431J876818K315813R3630n25906J726229L403229K854740K926123N299969
43616B4076076O972387N135604J907569J123964K908392M234020L161745J52571
43608D9672328l487182o348254p048004n407998l029647j687707j787291k845887
43600A8030358m211696m715176l224217n23172Q48151k79999k082019k250239
43592A591991p45807R77972J972526J832911L55243j392427j242212J077699K563237
43583F991133N90504l230059n055860l687152j054126J299659L273256L969424
43575C096779J754574k396666m402656j808588K691999M344782J905652j550301
$$ plain form
43634 5145540 4083117 4632207 4597221 3717272 4282443 6374045 6958788 5130364 4105431
43625 4105431 5982249 8298062 8391692 7865786 9592015 12995244 15849984 18776107 24076076
43616 24076076 31048463 36184067 38091636 39215600 42123992 46358012 49519757 49672328
43608 49672328 46185146 39836892 32788888 27380890 24351243 22663536 20876245 18030358
43600 18030358 13818662 9103486 5879269 5356097 6204248 5924249 3842230 1591991
43592 1591991 846184 1824156 3796682 5629593 5984836 4592409 3350197 4427896 6991133
43583 6991133 7581637 4351578 -704282 -4391434 -5445560 -4145901 -872645 3096779
43575 3096779 4851353 2454687 -1947969 -3756557 -1064558 3280224 5185876 3635575
43567C635575k696882j195148Q94563J491909J10181j896134k430907o76324J820289
43558i42878K618149J008094j373381k547903k069324p07131Q11937K004077K230632
43549A032272J267785J79941L95096J547074J486299o98704k878925k618920p93671
43540a081753k26593j003073j35479L119718M816633J809972k750459l268265
43532A280701J03401J622888j373075m680918m005963j144531L1334K25583K540834
43523e399746N711812N203081R90502j356931R34379L276565O64645m579303o168976
43514g23972k769222R16776J312335N149p3583R48333J037781l14510j678234
43505a339147j681661j14233K244667L820288K885637p27366m594158n448207
$$ plain form
43567 3635575 938693 -256455 638108 2130017 2240198 344064 -2086843 -2763167 -942878
43558 -942878 1675271 2683365 1309984 -1237919 -3307243 -4014374 -3202437 -1198360 1032272
43549 1032272 2300057 2479998 2875094 4422168 5908467 5209763 2330838 -288082 -1081753
43540 -1081753 -1308346 -2311419 -2446898 672820 5489453 7299425 4548966 1280701
43532 1280701 1384102 3006990 1633915 -3047003 -7052966 -8197497 -8166163 -7940580 -5399746
43523 -5399746 312066 5515147 6505649 5148718 6083097 9359662 10024307 5445004 -723972
43514 -723972 -3493194 -2576418 -1264083 -1258934 -1332517 -384184 653597 339087 -1339147
43505 -1339147 -3020808 -3135041 -890374 2929914 5815551 5088185 494027 -4954180
43497d954180k515115J384629K720336J097973o02045j28094J317009J238069
43489d41418k39446o58171Q18263K099042J388315m63431j795903k261214j911164
43480c465127k76663K105409L308822K878983K869741M057264L772620L28636
43472A5579685l081343k744717m70734o66770k970481l077298j88571K035660
43464D415431K100533K383177L303319J932854j619701k625627L82531K114939
43456A2387456q86828l767565j012904M085977M358642K653k399176o26945P69578
43447A2910888r53428k557510j020922J596594K087192Q20113j28964n86066j512031
43438A0655866k620652k730281j258639J537321M393596M863589J431783l692816
$$ plain form
43497 -4954180 -7469295 -6084666 -3364330 -2266357 -2868402 -2996496 -1679487 -441418
43489 -441418 -680864 -1339035 -520772 1578270 2966585 2503154 707251 -1553963 -3465127
43480 -3465127 -3741790 -1636381 1672441 4551424 7421165 11478429 15251049 15579685
43472 15579685 12498342 9753625 9282891 8616121 5645640 2568342 2379771 4415431
43464 4415431 6515964 8899141 12202460 14135314 12515613 9889986 10272517 12387456
43456 12387456 11500628 7733063 6720159 10806136 15164778 15167431 12768255 12141310 12910888
43447 12910888 11957460 9399950 8379028 9975622 12062814 12882927 12753963 12167897 10655866
43438 10655866 8035214 5304933 4046294 5583615 9977211 14840800 16272583 12579767
43430A2579767o125512m340879j049841R72332J893837K674294K546619N19856
43422I670473k311561l768365k962660o23250J853986K845581J325911j681610
43414D348505l556101k934528j164799j46705J62445J058750K731092L733726
43406D232385K669102j57779k780162l321096j888036l21630K22064N18735J423157
43397E96740K085176J422412J80333l21519m62093j173286j478535J60789K576184
43388C586201K882023O92541j498803k308824k835605l521009k793890j45448
43380e942814K069013J615571n79987j779700o14955J856857L193159J556948
43372A374092j990034l645570j270818K091968J847693j618791l565693j947458
$$ plain form
43430 12579767 6454255 2113376 1063535 2035867 3929704 6603998 9150617 9670473
43422 9670473 7358912 3590547 627887 4637 1858623 4704204 6030115 4348505
43414 4348505 792404 -2142124 -3306923 -3453628 -3291183 -2232433 498659 4232385
43406 4232385 6901487 6743708 3963546 642450 -1245586 -1567216 -1345152 -826417 596740
43397 596740 2681916 4104328 4284661 3963142 3501049 2327763 849228 1010017 3586201
43388 3586201 6468224 7160765 5661962 3353138 517533 -3003476 -5797366 -5942814
43380 -5942814 -3873801 -2258230 -2838217 -4617917 -5232872 -3376015 -182856 1374092
43372 1374092 -615942 -4261512 -5532330 -3440362 -1592669 -3211460 -6777153 -8724611
43364h724611K42712L83472k30345K48117J169566J570381J944265K068670N70251
43355g57522j612902j235659J722808K770469j97290l110699k202499J46977K12773
43346d263544p05405J57662R43363j216904l450887r85767L912214M211206q17485
43337b215547m003257j006131L897176N042841K673056k4067k246003m184825
43329b066757m107843j032180K103805J921476j93822n3502K831191M266977J446545
43320E115890k838601l699614m32124K685594J852235j726061l846044k636685
43312e525410M8820J990118K718027K054280l10516k550655j340252L040573N457213
43303E582198K790391j101534j254040N66488p49797m469579m749613l34042L121540
$$ plain form
43364 -8724611 -8481899 -8098427 -8328772 -8080655 -6911089 -5340708 -3396443 -1327773 -757522
43355 -757522 -2370424 -3606083 -1883275 887194 689904 -2420795 -4623294 -4476317 -4263544
43346 -4263544 -4968949 -4811287 -3867924 -5084828 -8535715 -9521482 -5609268 -1398062 -2215547
43337 -2215547 -6218804 -7224935 -3327759 1715082 4388138 4364071 2118068 -2066757
43329 -2066757 -6174600 -7206780 -5102975 -3181499 -3375321 -3428823 -597632 3669345 5115890
43320 5115890 2277289 -1422325 -1854449 831145 2683380 957319 -2888725 -5525410
43312 -5525410 -5476590 -3486472 -768445 1285835 975319 -1575336 -2915588 124985 5582198
43303 5582198 8372589 7271055 6017015 6583503 5833706 1364127 -3385486 -3719528 -597988
43294e97988J888361o75683m33026J226181R25344q01113j071481M54915J726248
43285B641758J626348M97248j107545k148341j366922M40376O34542j042679j257994
43276a083209J561124L712978J410958l031616m221837j272189J750417K051914
43268H78540P41360m42492j113884p17073J304810L163769J989576j556772l224076
43259A023758j161636J192242K84066k314880k676535m71302J211579R79968N33076
43250a399664Q46763L40746j897084l730298k818405j17184J615080J668225J449133
43241d042688J419998O09358p67809q81045O71216J707994O56729j084827j536132
43232c247206j086793j155506j398727m79146J380873K749259L072605K422768
$$ plain form
43294 -597988 1290373 614690 181664 1407845 2333189 1532076 460595 915510 2641758
43285 2641758 4268106 4765354 3657809 1509468 142546 582922 1217464 174785 -1083209
43276 -1083209 477915 4190893 5601851 2570235 -1651602 -2923791 -1173374 878540
43268 878540 1619900 1177408 63524 -653549 651261 3815030 5804606 4247834 1023758
43259 1023758 -137878 1054364 1338430 -976450 -3652985 -4124287 -2912708 -1932740 -1399664
43250 -1399664 -552901 -212155 -2109239 -5839537 -8657942 -8775126 -7160046 -5491821 -4042688
43241 -4042688 -2622690 -2013332 -2781141 -3662186 -2990970 -1282976 -626247 -1711074 -3247206
43232 -3247206 -4333999 -5489505 -6888232 -7367378 -5986505 -3237246 -164641 2258127
43224B258127K57280l052474m453614j292782L910313N246073R36116l923754
43216a14715l778081N43845L484196J877931j784866l072307j005896J218971
43208b630922Q29409m70091J021894M613966M716254j150367p124524n957214
43200f151595P94076M732780K215083j735075k029507k35262J124o81018M38266
43191b651128K875925L929781K904647R44159j572901m251646m987659k483864
43183e292686P37048J200599m88204q38305Q24228J452858n45878k581127j699741
43174g231208J216958K852638J776803l02274j181405o27492J97721P76458J466553
43165a055248J853682O31263j924759l116815j354180R65115P19413r94486n90167
$$ plain form
43224 2258127 2515407 -537067 -4990681 -6283463 -2373150 2872923 3809039 -114715
43216 -114715 -3892796 -3348951 135245 2013176 228310 -2843997 -3849893 -2630922
43208 -2630922 -1801513 -2271604 -1249710 3364256 8080510 6930143 -194381 -6151595
43200 -6151595 -5357519 -624739 1590344 -144731 -2174238 -2409500 -2408376 -3089394 -2651128
43191 -2651128 224797 4154578 7059225 8003384 6430483 2178837 -2808822 -5292686
43183 -5292686 -4555638 -3355039 -3843243 -4681548 -3857320 -2404462 -2950340 -5531467 -7231208
43174 -7231208 -6014250 -3161612 -1384809 -1687083 -2868488 -3495980 -3298259 -2521801 -1055248
43165 -1055248 798434 1429697 -495062 -3611877 -4966057 -4000942 -3281529 -4276015 -4866182
43156d866182K002948L151622J503429k35058m39329r24132k444312k433860J68892
43147d515982K091777Q95449q85452k52554J272146J059424K91883J087397J839055
43138B883143K27812j843124j424191j73432j292820k923929q48523L457897M129802
43129B192635J96279k915203k023844k45960p45621j996833j658222n19437m602
43120g720808M41936J153247Q56005m25740m06234J472448K362986N42026j498709
43111c222843r77637Q88429J202778j24206q24365J88664J834136K524157J573697
43102C062810j52423o53113P77880J899804N91506j128065K56488L348277K874457
43093A0877621j903210n142722l195556j83976r81685l288261j944082K187500
$$ plain form
43156 -4866182 -2863234 288388 1791817 1556759 1117430 193298 -2251014 -4684874 -4515982
43147 -4515982 -2424205 -1528756 -2414208 -2666762 -1394616 -335192 -43309 1044088 2883143
43138 2883143 3110955 1267831 -156360 -329792 -1622612 -4546541 -5395064 -1937167 2192635
43129 2192635 2388914 -526289 -2550133 -2796093 -3541714 -5538547 -7196769 -7716206 -7720808
43120 -7720808 -7278872 -6125625 -5269620 -5695360 -6101594 -4629146 -2266160 -1724134 -3222843
43111 -3222843 -4200480 -3312051 -2109273 -2233479 -3057844 -2869180 -1035044 1489113 3062810
43102 3062810 2910387 2257274 3035154 4934958 5526464 4398399 4654887 8003164 10877621
43093 10877621 8974411 3831689 636133 452157 -529528 -3817789 -5761871 -3574371
43085c574371L726429J552974k9768J085694J697710o44376l098651j888287J687115
43076E14469K851972p6517l553725l664246j103846L02813p34749j285896Q54306
43067e895419L091323J765677j652725k243891P13060K538340Q58603m45817K045638
43058G74789N028071L363336j804461m879423m001576k244980j427146p5599J949666
43049c317323J927583p97463k518423l81129L149575L806187J272299j382290
43041A759016k374155k344883j789159m50314P93854L53906j132516r38513J465439
43032d657325K816209Q09793j811437j055180J925876K348015n36983k031949
43024b192981L94728K890086J616470r13270l66019J852263J154303k074067l038232
$$ plain form
43085 -3574371 152058 1705032 1675264 2760958 4458668 3814292 715641 -1172646 514469
43076 514469 3366441 3289924 -263801 -3928047 -5031893 -4729080 -5463829 -6749725 -5895419
43067 -5895419 -2804096 -1038419 -2691144 -4935035 -4221975 -1683635 -825032 -1270849 774789
43058 774789 5802860 9166196 7361735 2482312 -1519264 -3764244 -5191390 -5266989 -3317323
43049 -3317323 -1389740 -2187203 -4705626 -5086755 -1937180 1869007 3141306 1759016
43041 1759016 -615139 -2960022 -4749181 -5199495 -4405641 -4051735 -5184251 -6122764 -4657325
43032 -4657325 -1841116 -1031323 -2842760 -3897940 -1972064 375951 -161032 -2192981
43024 -2192981 -1798253 1091833 2708303 1795033 1429014 3281277 4435580 2361513 -676719
43015f76719o91539Q73551k43581j073911P8806O49088o72202r03047J593567
43006a065987L376375J575269j048846q07649R24784Q13577o03197q01081l00285
42997B062960j095844k171830j202558R24404J652692J315222J870390K510830
42989E866266R56711j903154k922329j479042M71259K047862L304847K839109
42981I181529j80571k902000k230143o5431k63165j836316q94600J733993J432195
42972C975491j768783k691929O3878J727940j77559j904706r13381m85992k852612
42963e027653l919346j41370M416543L921265m7087j433517O42257J553505n32999
42954e68402k041354k23370K727600L184970O34241k450311l368606j363422J645928
$$ plain form
43015 -676719 -1368258 -494707 -738288 -1812199 -1733393 -1084305 -1756507 -2659554 -1065987
43006 -1065987 2310388 3885657 2836811 2029162 2953946 3767523 3164326 2363245 2062960
42997 2062960 967116 -1204714 -2407272 -1482868 169824 1485046 3355436 5866266
42989 5866266 6822977 4919823 1997494 518452 989711 3037573 6342420 9181529
42981 9181529 9000958 6098958 3868815 3803384 3540219 1703903 809303 2543296 3975491
42972 3975491 2206708 -485221 -421343 1306597 1129038 -775668 -1689049 -2175041 -5027653
42963 -5027653 -8946999 -9088369 -4671826 -750561 -797648 -2231165 -1588908 -35403 -568402
42954 -568402 -2609756 -2833126 -105526 3079444 3713685 1263374 -2105232 -3468654 -1822726
42945a822726K717087J283421j57089J30919N46735o79652k008946j222148L44325
42936h68074j59325j995621j777522Q75466K639482J804766M94002O19601J113793
42927B746568O36617m4309j73262p61982k092593j909604J171828M193013K954031
42918F720307k010622n503029m053220O8049K083112L18760k548649l012765m94650
42909h432707K308889K507808L69825r78209K81546J896613P13056k124608k129068
42900e586855J757411M773048K979130p59700j166623J219188J223370k108840
42892B330129l521299Q5085M483701M377045P22393j988722k597077l097056l749262
42883b955063k899586o88573R90396J638493J925417J267326q28922k000549L59600
$$ plain form
42945 -1822726 894361 2177782 2020693 2151612 2698347 2018695 9749 -1212399 -868074
42936 -868074 -1027399 -3023020 -4800542 -3925076 -1285594 519172 1013174 1632775 2746568
42927 2746568 3383185 3338876 3165614 2403632 311039 -1598565 -426737 3766276 6720307
42918 6720307 4709685 -793344 -4846564 -4778515 -2695403 -2376643 -4925292 -7938057 -8432707
42909 -8432707 -6123818 -3616010 -3246185 -4224394 -3942848 -2046235 -1333179 -3457787 -5586855
42900 -5586855 -3829444 943604 3922734 3163034 1996411 3215599 4438969 2330129
42892 2330129 -1191170 -1106085 3377616 7754661 8477054 6488332 3891255 794199 -2955063
42883 -2955063 -5854649 -6543222 -5552826 -3914333 -1988916 -721590 -1550512 -3551061 -3191461
42874c191461M236689M864242J400863k211982l118031k309234j379184o15198
42866b323296o91881k143818k738327K88944M888667N854800K660398M47120J749115
42857G991722K750683J96484l312205m152677l050606k089532p56352J248073
42849a174410J406749j284782l133096j098244K165989K821192J796435J680676
42841C180509J300953j324244l742972k483021P03271J598863L66933M9790M25148
42832G5230n94392j392797Q99737L817923K480791j667544k456493O92462J872287
42823C727204q14090j897435J703950N029973L151532j268087k995841j863256
42815D773950q54120o39420m42455r89573k421610k169573J146555M328866L886984
$$ plain form
42874 -3191461 1045228 5909470 7310333 5098351 1980320 -328914 -1708098 -2323296
42866 -2323296 -3015177 -5158995 -7897322 -7608378 -2719711 3135089 5795487 6242607 7991722
42857 7991722 10742405 10938889 7626684 3474007 423401 -1666131 -2422483 -1174410
42849 -1174410 232339 -1052443 -4185539 -5283783 -3117794 -296602 1499833 3180509
42841 3180509 4481462 3157218 -585754 -3068775 -2365504 -766641 -399708 -349918 75230
42832 75230 -519162 -1911959 -1012222 2805701 5286492 3618948 1162455 1854917 3727204
42823 3727204 2913114 1015679 2719629 7749602 10901134 9633047 6637206 4773950
42815 4773950 3919830 3280410 2837955 1848382 -573228 -2742801 -1596246 2732620 6619604
42806F619604J249382k8202J40349m65955j683445j635494o67221n97064j076980
42797A854974m56679O68645N56767J04381J412998L021774J199357l396699n041093
42788g5575r68766L802499K857520k896951o546046m209972P87202L192617K186259
42779a871213P24555N10588K76496j200727k776321k582446n90057J544741K374589
42770c589795J650203K49970l05462O61160J502441j44527l525120m736661j987756
42761a0225547J536509K288314J356827J774948L110263K751687R71035J68437
42753C732473N3930j533284l426643k064306J984744L824567J718510m88268p8212
42744C723511P13067j10473n15683J061502K198248J011182j46568O90675R57743
$$ plain form
42806 6619604 7868986 7840784 7981133 7515178 5831733 4196239 3529018 2931954 1854974
42797 1854974 1398295 2066940 2623707 2728088 4141086 7162860 8362217 4965518 -75575
42788 -75575 -1044341 2758158 5615678 2718727 -3827319 -8037291 -7250089 -4057472 -1871213
42779 -1871213 -1146658 -636070 -359574 -1560301 -4336622 -6919068 -7509125 -5964384 -3589795
42770 -3589795 -1939592 -1689622 -1995084 -1333924 168517 23990 -3501130 -8237791 -10225547
42761 -10225547 -8689038 -6400724 -5043897 -3268949 -158686 2593001 3564036 3732473
42753 3732473 3786403 2253119 -1173524 -3237830 -1253086 2571481 4289991 3801723 3723511
42744 3723511 4436578 4326105 3810422 4871924 7070172 8081354 7934786 8625461 9583204
42735I583204j674330m209592k822954O68555J755798J38612j088850q93112k76299
42726A181032R77752K757069K109992k457218o226798l687541K677411N204568
42718B536267J996698j313233r25849M56228k69817j665935j298411K91910J507586
42709A315444K031207J522651o08899k710634j692966K140592M489002K883352
42701I369749j55613j432242j306368j658968k473420k577060j740189m51328
42693b425439P25468Q46521l94412j203219K38513K378122K157590P6986n56457
42684A843673N03576N8882k316370k904390l44340J739893R85194K8562J063789
42675F58469J751287J81867r78735M14592J366205q55078k927607p20834L276817
$$ plain form
42735 9583204 7908874 3699282 876328 1544883 3300681 3439293 2350443 1457331 1181032
42726 1181032 2158784 4915853 7025845 4568627 -1658171 -5345712 -2668301 2536267
42718 2536267 4532965 3219732 2293883 2750111 2480294 814359 -484052 -192142 1315444
42709 1315444 3346651 4869302 4260403 1549769 -143197 1997395 6486397 9369749
42701 9369749 9214136 7781894 6475526 4816558 2343138 -233922 -1974111 -2425439
42693 -2425439 -1699971 -853450 -1247862 -2451081 -2212568 165554 2323144 2400130 1843673
42684 1843673 2347249 2406131 89761 -2814629 -3158969 -1419076 -433882 -405320 658469
42675 658469 2409756 2591623 1612888 2027480 3393685 2538607 -389000 -1109834 2166983
42666B166983L901522J737647J053225J628482k22800l728784m168363j303636
42658A064276j36780k233097l089529r9408L121782L101439J663349J462331J227826
42649F082189p74638k562477j768849m3999j59963j212494o37159R41467Q44223
42640G08300r12430j726184o45253P67851J432611J657412J340237J81718l88537
42631B415725J450130M209738L782918r25530n605811n589446j448254K447140
42623G36610L556197K897214J783452k64221l462449n842579n270375k496313
42615h362464m34091n51282j367272o77269J823114M340709M613262J852570j985038
42606g47761l236703l08966L774208M403806R77645k658219l512357k456767j201543
$$ plain form
42666 2166983 6068505 7806152 8859377 10487859 10265059 6536275 2367912 1064276
42658 1064276 927496 -1305601 -4395130 -4494538 -1372756 1728683 3392032 4854363 6082189
42649 6082189 5307551 2745074 976225 932226 772263 -440231 -1077390 -135923 708300
42640 708300 -204130 -1930314 -2575567 -1807716 -375105 1282307 2622544 2804262 2415725
42631 2415725 3865855 8075593 11858511 10932981 5327170 -262276 -1710530 736610
42623 736610 4292807 7190021 8973473 8709252 5246803 -595776 -5866151 -8362464
42615 -8362464 -8796555 -9347837 -10715109 -11392378 -9569264 -5228555 -615293 1237277 -747761
42606 -747761 -3984464 -4293430 -519222 3884584 4862229 2204010 -1308347 -3765114 -4966657
42597d966657M59704K512869K917710P33721j366765p86309Q72696O81392o01072
42588D57289k94605R81533L51584j777518j834585J146658M076959M501398K875976
42579A0484689J5545l555426n474426l413882K55919N83879k192794k412171J821634
42570c887033N135694L420154j3748p76962l50893j628384k468859J27807L245136
42561B802912K176957j336159j817399Q26002J819440R3279p76333p2317j205170
42552B511212m444682n172746j476801K427907K833032J342984N30103j17399
42544a566390r88088J5575L073061L983665J03165m789356n594679k867312o83370
42535i313729k29974K28159J080388J365136J621077K807507L486542J741350
$$ plain form
42597 -4966657 -4506953 -1994084 923626 1657347 290582 -495727 376969 1058361 457289
42588 457289 162684 1144217 1495801 -281717 -2116302 -969644 3107315 7608713 10484689
42579 10484689 10500234 6944808 1470382 -1943500 -1687581 -1103702 -3296496 -5708667 -3887033
42570 -3887033 1248661 4668815 4655067 3878105 3527212 1898828 -570031 -442224 2802912
42561 2802912 4979869 3643710 1826311 2652313 4471753 4565032 3788699 3716382 2511212
42552 2511212 -1933470 -7106216 -8583017 -6155110 -3322078 -1979094 -1448991 -1566390
42544 -1566390 -2554478 -2538903 534158 4517823 4620988 -168368 -5763047 -8630359 -9313729
42535 -9313729 -9543703 -9315544 -8235156 -6870020 -5248943 -2441436 1045106 2786456
42527B786456j071071j971551q22489K57225Q46877J857604K188012L5067k770518
42518A335612k255315J353654L149425O86179k445194k228022K5210L01847k005455
42509b082059l553564j716071K338890N091547M222810R45809j162099l84179
42501C701084P20130j113112m537084m830933p46456L305052L340084Q79342l21460
42492C96647J68542J96746o56872r42035n18408o02512r91107k29878J403979
42483a774898J851479N42054q22712j218322j479445j827634r40092J180032K005386
42474b484152J87493j722751q68152J235866Q26683k039370l121604k04825L598686
42465d592126M255207J892581n80362j847116k534542k518874r36475J359705
$$ plain form
42527 2786456 1715385 -256166 -1078655 -821430 25447 1883051 4071063 4106130 1335612
42518 1335612 -919703 433951 3583376 4269555 1824361 -403661 -378451 -76604 -2082059
42509 -2082059 -5635623 -7351694 -5012804 78743 4301553 5247362 4085263 3701084
42501 3701084 4421214 3308102 -1228982 -6059915 -6806371 -3501319 -161235 718107 396647
42492 396647 565189 761935 105063 -836972 -1355380 -1957892 -2948999 -3178877 -1774898
42483 -1774898 76581 618635 -204077 -1422399 -2901844 -4729478 -5669570 -4489538 -2484152
42474 -2484152 -2296659 -4019410 -4887562 -3651696 -2825013 -4864383 -7985987 -8190812 -4592126
42465 -4592126 -336919 1555662 975300 -871816 -3406358 -5925232 -6861707 -5502002
42457e502002K158211J137606L90481J062307J750455J211767L98216L39639P2784
42448C019464j358183k528069j617428L72964Q98663l10406j244508j075098q81733
42439d724334p38655R95745M319602N993315L307020j894149m906088l424280
42431a071824L39139K627789K003145m3994j487388j885068j903493j516396l2266
42422b970356J886515J969813n92446l203156k862334j58512J875746K067833
42414a986897J662904J147119k59876j785505j264085R37121J536371o02489k291128
42405b906465r21330J585292K284187J707596J722998J561964k16344j892515
42397B925383j005287P87323j53813l104590l550190l25810K498227J918313j40296
$$ plain form
42457 -5502002 -3343791 -2206185 -1815704 -753397 997058 2208825 2607041 2946680 3019464
42448 3019464 1661281 -866788 -2484216 -2111252 -1212589 -1522995 -2767503 -3842601 -4724334
42439 -4724334 -5462989 -4467244 -147642 5845673 9152693 7258544 2352456 -1071824
42431 -1071824 -732685 1895104 3898249 3854255 2366867 481799 -1421694 -2938090 -2970356
42422 -2970356 -1083841 885972 293526 -2909630 -5771964 -5930476 -4054730 -1986897
42414 -1986897 -323993 823126 563250 -1222255 -2486340 -1549219 -12848 -615337 -2906465
42405 -2906465 -3827795 -2242503 41684 1749280 3472278 5034242 4817898 2925383
42397 2925383 1920096 2707419 2553606 -550984 -4101174 -4426984 -1928757 -10444 -150740
42388a50740q84128n97276l93472L98237K007292K453200Q60939j22141J659287
42379E231198L760121K559952r77974k833722k159889j906266l356172m050357
42371c733109k099356P73350K048609J766280J404804J365231J294704J426426
42363D246939J861790J587514j31214k136099k725382k051214j560338j398247
42355b306251k20168K169180L795798L103000J244305M05633O12586p4870k254347
42346F474866l912222l288491j532456r87556j660362j300307J022329L298606
42338a885593L272920J325640m12121q49586o53060p54097j291455j819385j719915
42329d786652o12091R98221J845647J348333M37822K18002M61823M37164M87971
$$ plain form
42388 -150740 -1034868 -1632144 -2025616 -1627379 379913 2833113 3694052 3571911 5231198
42379 5231198 8991319 11551271 10573297 7739575 5579686 3673420 317248 -3733109
42371 -3733109 -5832465 -5059115 -3010506 -1244226 160578 1525809 2820513 4246939
42363 4246939 6108729 7696243 7565029 5428930 2703548 652334 -908004 -2306251
42355 -2306251 -2526419 -357239 3438559 6541559 7785864 8191497 8804083 8729213 6474866
42346 6474866 2562644 -725847 -2258303 -3245859 -4906221 -6206528 -5184199 -1885593
42338 -1885593 1387327 2712967 2300846 1451260 798200 44103 -1247352 -3066737 -4786652
42329 -4786652 -5398743 -4400522 -2554875 -1206542 -768720 -550718 -88895 348269 836240
42320H36240J354036K387886K136387N96147p85111j384149j872494k253204j577142
42311e61404k46967k54618j821895k100354P18595L894045L448183j68961k711572
42302A95052k009560j85845K28904n42923j143830j242762p39133R20177K980222
42293a539698K967389J12634k439724j323018K119537L224337J32006l895618
42285f42155m727309j997854J328888K673700K084085J303644J365151J404601
42277B792751J64612j638997j879824m61926k17761k693180m892404k984758J880549
42268i930938M781759L672744J266571M7871o55945j438103o75917J979467L385992
42259B433501J326614j480210j259381R72095J269500q84404k234590j356728
$$ plain form
42320 836240 2190276 4578162 6714549 7310696 6525585 5141436 3268942 1015738 -561404
42311 -561404 -808371 -1062989 -2884884 -4985238 -4266643 -372598 3075585 2906624 195052
42302 195052 -1814508 -2000353 -1771449 -2314372 -3458202 -4700964 -5440097 -4519920 -1539698
42293 -1539698 1427691 1540325 -899399 -2222417 -102880 3121457 3253463 -642155
42285 -642155 -5369464 -7367318 -6038430 -3364730 -1280645 22999 1388150 2792751
42277 2792751 2957363 1318366 -561458 -1023384 -1241145 -3934325 -8826729 -11811487 -9930938
42268 -9930938 -5149179 -1476435 -209864 -161993 -817938 -2256041 -2931958 -952491 2433501
42259 2433501 3760115 2279905 1020524 1992619 3262119 2377715 143125 -1213603
42251a213603n30608j448914k581633k021076k06695J509622K822870L692795
42243B2758L378041J576137o24718j821277j498675J5327J655214J787089j80874
42234D309022k398230k444292m91635J197771J596793J470711R70266m42668j662889
42225B104849q71524P42806j06831l177068m067037j052624J705369O41476j588522
42216e669106q48937J641851K039865P61249J119980K654133J685006j811006
42208A573035l663729k472813j578971k629369k555197N13046L179197K181453
42200e453348j4204Q03389L738301M317586J331227j991034k975400k040830m41739
42191b726052J231794K038510R94901j057578k094709j699774j143874p17320
$$ plain form
42251 -1213603 -1744211 -3193125 -5774758 -7795834 -8002529 -6492907 -3670037 22758
42243 22758 3400799 4976936 4352218 2530941 1032266 1047593 2702807 4489896 4309022
42234 4309022 1910792 -533500 -1025135 172636 1769429 3240140 4210406 3767738 2104849
42225 2104849 1233325 1976131 1869300 -1307768 -5374805 -6427429 -4722060 -4080584 -5669106
42216 -5669106 -6518043 -4876192 -2836327 -2075078 -955098 1699035 3384041 1573035
42208 1573035 -2090694 -4563507 -6142478 -8771847 -11327044 -10813998 -7634801 -5453348
42200 -5453348 -5467552 -4664163 -925862 3391724 4722951 2731917 -243483 -2284313 -2726052
42191 -2726052 -1494258 544252 1539153 481575 -1613134 -3312908 -4456782 -5174102
42183e174102M79070J818744J162519j360467k365697K17840L836985M703932
42175C318824K732854P06260j58306j063971k601711l535560k841274r27522J368945
42166c001461L189378L132675O06159k088164j702373J102781J806366j399557
42158A645804m170315k122877K173381K693884p34253j915175K011027N539041
42150E120517K658434m021727o625097k791922J815738K029033l82318q34746
42142c032088R58112J464410n99510k398190j509615O43860J341491N40116L13908
42133b277506J376175K300456J963854P90231o47138k351845l631137l001234
42125e478144n14207J449092J182383O8099L10243J529769J677042L73715r45029
$$ plain form
42183 -5174102 -4695032 -2876288 -1713769 -3074236 -5439933 -5222093 -1385108 3318824
42175 3318824 6051678 6757938 6599632 5535661 2933950 -601610 -3442884 -4370406 -3001461
42166 -3001461 187917 3320592 3926751 1838587 136214 1238995 3045361 1645804
42158 1645804 -2524511 -4647388 -2474007 219877 -514376 -2429551 -418524 5120517
42150 5120517 7778951 3757224 -2867873 -5659795 -3844057 -1815024 -2197342 -3032088
42142 -3032088 -2073976 -609566 -1209076 -3607266 -5116881 -4473021 -3131530 -2591414 -2277506
42133 -2277506 -901331 1399125 3362979 4153210 3506072 1154227 -2476910 -5478144
42125 -5478144 -5992351 -4543259 -3360876 -3292777 -2982534 -1452765 224277 597992 -347037
42116c47037j577955j870266j481631N1676J321141N15346j092029l18118K793364
42107b005509M436826K695409K26415l48131k23035j199886j962390p09524J055648
42098A965823Q05811q46481j575839j246456j067438n35733J103430J855843l83681
42089G5279l225701k391250J418423K998694L94694k530237k419390p99367k45396
42080f724251k38237O27831J601654J626283J598320K300761K469859J256357
42072D518577J84796K32809m38867k914241m249394j518416K787189L681786R68168
42063C252407q72929J55458J180338O3624j202249p77911o08192k576844m189342
42054e575640k219818J317874J654029q95746q95905L233739N596478J542322
$$ plain form
42116 -347037 -1924992 -3795258 -5276889 -5225213 -3904072 -3388726 -4480755 -4798873 -2005509
42107 -2005509 2431317 5126726 5353141 5005010 4781975 3582089 1619699 910175 1965823
42098 1965823 2771634 1925153 349314 -897142 -1964580 -2500313 -1396883 458960 75279
42089 75279 -3150422 -5541672 -4123249 -1124555 -729861 -3260098 -5679488 -6478855 -6724251
42080 -6724251 -6962488 -6334657 -4733003 -3106720 -1508400 792361 3262220 4518577
42072 4518577 4703373 4936182 4497315 1583074 -2666320 -4184736 -1397547 2284239 3252407
42063 3252407 2379478 2534936 3715274 3778898 2576649 1798738 1190546 -1386298 -5575640
42054 -5575640 -7795458 -6477584 -4823555 -5719301 -6615206 -3381467 2215011 3757333
42046C757333m437601m790929q2521K396904K97170q87610J956265L967952J069572
42037C246535k252029k62735L773750K513086l089119m959433q86550K439495
42029E23000Q63827j135724O97737K808584L82277l997753m318530l19691K997273
42020a499000K901744R65217r28368k117090j807084j27204N07439j326532k748481
42011f179359m01310L648477M178177M17969k970897k691140n38720M16649j26935
42002d247089p08546n54509J51901P86081N83050l18632n05286O61104J662697
41993b489229J234393N86170R59901R84878m81084j143918R99342K900747P32969
41984D284169k683723j286602L775397M614574r47309n082120j773303L856342
$$ plain form
42046 3757333 -680268 -5471197 -5553718 -3156814 -2859644 -3747254 -1790989 2176963 3246535
42037 3246535 994506 731771 4505521 7018607 3929488 -1029945 -1916495 523000
42029 523000 1386827 251103 948840 3757424 4139701 141948 -4176582 -4496273 -1499000
42020 -1499000 1402744 2367961 1439593 -677497 -2484581 -2611785 -2104346 -3430878 -6179359
42011 -6179359 -6580669 -2932192 1245985 1663954 -1306943 -3998083 -4536803 -4120154 -4247089
42002 -4247089 -4955635 -5510144 -5358243 -4572162 -3989112 -4307744 -4813030 -4151926 -2489229
41993 -2489229 -1254836 -668666 291235 1276113 795029 -348889 650453 3551200 4284169
41984 4284169 1600446 313844 4089241 8703815 7756506 2674386 901083 4757425
41976D757425L427720k578362o758279n524198j784210J171450K708260K608346
41968a971848Q64417m34591P78663K687030J712432j665198l156286r72930J888518
41959b69793K367723R62590l13798o71079k20786O51436Q81135o8011m39371J608857
41949D488903L987513K546847k230981m592541j586834K261976J585302j931912
41941D528273k614578M50947K712690J555932m90577p45878l29074j259390k809341
41932I99004l092385k143755j186263l56535P90205J701506J674326J307485J324683
41923A018271R39398o60241k103189j385028Q79612K085667J329630J50164m03224
41914A851060r27928j522557j075172M11984J154028M15268j45262P18106J747297
$$ plain form
41976 4757425 8185145 5606783 -1151496 -6675694 -8459904 -7288454 -4580194 -1971848
41968 -1971848 -1107431 -1542022 -763359 1923671 3636103 1970905 -1185381 -2158311 -269793
41959 -269793 2097930 3060520 2746722 2075643 1854857 2506293 3387428 3319417 2880046 4488903
41949 4488903 8476416 11023263 8792282 4199741 2612907 4874883 6460185 4528273
41941 4528273 1913695 2364642 5077332 6633264 6142687 5396809 5067735 3808345 999004
41932 999004 -2093381 -4237136 -5423399 -5779934 -4989729 -3288223 -1613897 -306412 1018271
41923 1018271 1957669 1297428 -805761 -2190789 -1311177 774490 2104120 2254284 1851060
41914 1851060 923132 -599425 -1674597 -1262613 -108585 306683 161421 879527 2626824
41905B626824J409780K68400n15628j120966j719512j234618L91332P73968j324962
41896d45382k889640n79482L549421M251028O39687k599276k160738l26801n43837
41887a105020k078649j739491R41500L007500K168240l55780j541225k67573J422126
41878D51628J032165r76869j785914l02203J319826J142790J51737j58812l90611
41869D83737r57549Q1947L281011M489994L40414m743144l354553L348498N949200
41860H919555K33875o588249o565125j729094Q44987j48055n25732J198603K287063
41851b072172J530869J013865J775563K040220O49417j002531j468559j330574
41843A136098j866154l112991l770579k310474J420960N091071N568023K684273
$$ plain form
41905 2626824 4036604 4305004 3789376 2668410 948898 -285720 105612 879580 -445382
41896 -445382 -3335022 -3914504 -365083 3885945 4525632 1926356 -234382 -561183 -1105020
41887 -1105020 -3183669 -4923160 -3981660 -974160 1194080 838300 -702925 -970498 451628
41878 451628 1483793 506924 -1278990 -1581193 -261367 881423 1033160 874348 483737
41869 483737 -473812 -391865 2889146 7379140 7719554 2976410 -378143 2970355 8919555
41860 8919555 9153430 2565181 -3999944 -5729038 -4884051 -5032106 -5557838 -4359235 -2072172
41851 -2072172 -541303 472562 2248125 4288345 4937762 3935231 2466672 1136098
41843 1136098 -730056 -3843047 -7613626 -9924100 -8503140 -3412069 2155954 4840227
41835D840227k69305j009779j100606k474716l530317j685036J835672L176917
41827b16943J126471j781799l036032k335615l43257K129052L667749L157139
41819B366765J221470o87112k032997k614992j606689P41258J912639L09223j651625
41810b042060p18676J903504K020345j099112l419590j857855J877636M208962
41802H73154L945890K432413J237513Q03349M60218o19292k016496k259866j134333
41793C722550m04785j003873j350999k86456M97483n00376j347726K22933K422035
41784A970786J934755o96518k268253k141335j963792j456333O97514K686188
41776a236988J514033j401149j984273m81604p10175k366663r65643L454027M850794
$$ plain form
41835 4840227 4570922 3561143 2460537 -14179 -3544496 -5229532 -3393860 -216943
41827 -216943 909528 -872271 -3908303 -6243918 -6587175 -4458123 -790374 2366765
41819 2366765 3588235 2901123 868126 -1746866 -3353555 -2612297 -699658 -390435 -2042060
41810 -2042060 -2760736 -857232 1163113 64001 -3355589 -5213444 -3335808 873154
41802 873154 4819044 7251457 8488970 9292319 9752537 9133245 7116749 4856883 3722550
41793 3722550 3317765 2313892 962893 676437 1173920 673544 -674182 -451249 1970786
41784 1970786 3905541 3209023 940770 -1200565 -3164357 -4620690 -3923176 -1236988
41776 -1236988 277045 -1124104 -3108377 -3589981 -4300156 -6666819 -7632462 -4178435 672359
41767F72359R10906k716894j502607J108674L97945j887298j763090p3801L62051
41758d491755O15545K719525M142716J353104l362657m610955j937223L92060
41750e179640N31898N09902J081592M88011j296830j694118K50774K360117K723617
41741b24677J674954Q8545j600643k552241k070608q97603m3577Q48118K003984
41732b773748J963039J05449j086043M64336K425870J389646j367934j847121
41724g26506N6069P40747p20326j443974l12526K92848n90495n30083J597104
41715a637142K985431J205780k039420l567912k598341k92864K221534L822469
41707I9535L463940J630535M6428p21637j496773k199317j797269o85361k56100
$$ plain form
41767 672359 1583265 -1133629 -2636236 -1527562 -1129617 -3016915 -4780005 -4853806 -4491755
41758 -4491755 -3876210 -1156685 2986031 4339135 976478 -3634477 -5571700 -5179640
41750 -5179640 -4647742 -4137840 -3056248 -2568237 -3865067 -5559185 -5308411 -2948294 -224677
41741 -224677 1450277 1538822 -61821 -2614062 -4684670 -5582273 -5625850 -4777732 -2773748
41732 -2773748 -810709 -705260 -1791303 -1326967 1098903 2488549 1120615 -726506
41724 -726506 -670437 70310 -650016 -2093990 -2406516 -2113668 -2704163 -3234246 -1637142
41715 -1637142 1348289 2554069 514649 -3053263 -5651604 -5944468 -3722934 99535
41707 99535 3563475 5194010 5240438 4518801 3022028 822711 -974558 -1659919 -1916019
41698a916019M6383J879047L893059K536902j925661m438910k140128J655754
41690d09573K879321K223298K117151J803352m84983l012946k655989j69893P10141
41681B999879j147999l072568k731566m99385K157331L941759L471087M05215
41673E523753k957648l543125j299252Q58313J080532M40576L31784K38298p62174
41664h8943j933669j836584n19413O01309P72569O90188J131595J732940J688333
41655B238325J057729M78037j34586j312244k335114j518609Q95530J956052j43008
41646A182112k997944l175615j181659k12987p90365m12914J382533J789841k54867
41637d671865j798647o64324J024349P56448j05021P37365J961557R43206j152730
$$ plain form
41698 -1916019 -1869636 9411 3902470 6439372 4513711 74801 -2065327 -409573
41690 -409573 2469748 4693046 6810197 8613549 8128566 5115620 2459631 2289738 2999879
41681 2999879 1851880 -1220688 -3952254 -4451639 -2294308 1647451 5118538 5523753
41673 5523753 2566105 -977020 -2276272 -1417959 -337427 103149 434933 673231 -88943
41664 -88943 -2022612 -3859196 -4378609 -3777300 -3004731 -2314543 -1182948 549992 2238325
41655 2238325 3296054 3774091 3639505 2327261 -7853 -1526462 -630932 1325120 1182112
41646 1182112 -1815832 -4991447 -6173106 -6386093 -7176458 -7589372 -6206839 -4416998 -4671865
41637 -4671865 -6470512 -7134836 -6110487 -5354039 -5459060 -4721695 -2760138 -1816932 -2969662
41628b969662r14155J383154J741335j117379l156633o23815M440637O618350
41620E401832L814980o13027k428642j537628j235721k998000m093769j693498
41612e383473K375139L750764J753057k011M66889R24692k48832q17425Q55237
41603C674037J882104n39743l541325k563283R23677J207650k660720n256684
41595f874287l057957P86400J958484R11714M74513Q31988L38934n94360J29059
41586e095512K559869M058268K814214L42337l99979J201272K440660O62580k896558
41577E687151m198657j775222J058697R02002r25805r09545J017884J877645P67414
41568C501564m02006j071194k573175l956055j998632K853234N136294J857271
$$ plain form
41628 -2969662 -3883817 -2500663 -759328 -1876707 -5033340 -5657155 -1216518 5401832
41620 5401832 9216812 8603785 6175143 4637515 3401794 403794 -3689975 -5383473
41612 -5383473 -3008334 742430 2495487 2493476 2960365 3885057 3636225 2818800 3674037
41603 3674037 5556141 5016398 1475073 -1088210 -164533 1043117 -1617603 -6874287
41595 -6874287 -9932244 -9145844 -7187360 -6275646 -5801133 -4969145 -4630211 -5224571 -5095512
41586 -5095512 -2535643 1522625 4336839 4679176 4279197 5480469 7921129 8583709 5687151
41577 5687151 1488494 -286728 771969 1673971 748166 -161379 856505 2734150 3501564
41568 3501564 3099558 2028364 -544811 -4500866 -6499498 -3646264 1490030 3347301
41560C347301k577398k581655O80174J943160Q6068j256677l21169O06384N0659
41551b3153r0118J678561L615627L654953K541487J975594J610693J56666j819474
41542A3300836k500015j701918j149794j860456k887623k976986k102823p99936
41534b678715Q29138K472525K836115R12757k104266l506862k087746N33889K140469
41525f52696K460704K597272K791578K148200L85738j377676j843047q58523N36199
41516F187749R57287j80186j927117k687619k215642j753753j618437l40861K331244
41507a247335L500272Q39478l087256l587105l56613K399452K326492J329716
41499B117101R26959l22687k813772l564590r25295J860892J350454p00253n33588
$$ plain form
41560 3347301 769903 -1811752 -1131578 811582 897650 -359027 -680196 -73812 -23153
41551 -23153 -113271 1565290 5180917 8835870 11377357 13352951 14963644 15120310 13300836
41542 13300836 10800821 9098903 7949109 6088653 3201030 224044 -1878779 -2678715
41534 -2678715 -1849577 622948 3459063 4371820 2267554 -1239308 -3327054 -2793165 -652696
41525 -652696 1808008 4405280 7196858 9345058 9730796 8353120 6510073 5651550 6187749
41516 6187749 7145036 6964850 5037733 2350114 134472 -1619281 -3237718 -3578579 -1247335
41507 -1247335 2252937 3092415 5159 -3581946 -3938559 -1539107 787385 2117101
41499 2117101 3044060 2721373 -92399 -3656989 -4582284 -2721392 -1370938 -2071191 -2604779
41490b604779J354583J524633m08929j631877j220484r73135j335169o99558R52323
41481e042392J657700J208909J451467K243358J180082j548038k216818O36166
41473d29566L351824K546707n7684j066832o46803r91510j943885j746727n69776
41464a554252J14900M77372J404403J699859l47348l243270l654087j332201P34248
41455e700376J202509J809877L253596L365400J061398j135541q96718J53741
41447C113886o77401k372342j639632J613802L583199J775979j775823l588776
41439C2892k937215j504967l81169O11555J279754Q90523j00527J2049J590357
41430e06748K420142N25822k655223l718398j690675R16395J818759J799843K732221
$$ plain form
41490 -2604779 -1250196 274437 -134492 -1766369 -2986853 -3959988 -5295157 -5994715 -5042392
41481 -5042392 -3384692 -2175783 -724316 1519042 2699124 1151086 -1065732 -429566
41473 -429566 2922258 5468965 5411281 4344449 3697646 2706136 762251 -984476 -1554252
41464 -1554252 -1439352 -961980 442423 2142282 1794934 -1448336 -5102423 -6434624 -5700376
41455 -5700376 -4497867 -2687990 565606 3931006 4992404 3856863 2960145 3113886
41447 3113886 2436485 64143 -1575489 38313 3621512 5397491 3621668 32892
41439 32892 -2904323 -4409290 -4790459 -4178904 -2899150 -2008627 -2109154 -2097105 -506748
41430 -506748 1913394 2439216 -216007 -3934405 -5625080 -4708685 -2889926 -1090083 1642138
41421A642138M335142M646034K953624N20845j408156k786459l790466l936424
41413B176278k691083l54652J932903K832668J761536l26030j581824j305553
41405B444243p50107j165141j913436j710756q80747p15385j109428p14919O69303
41396e846373J716065J699356J255938Q04582o1865j257047j874150j486645l28756
41387e378895J687575M244308N218679K694399j477095l220713j953125j258109
41379E57024k670711k853896N49874M117001L419093k83248k313418j500735m83452
41370a462468m84709k37073N50962Q53794J109354K354341K933979L37594l700819
41361B254955m448561j087827K025437J933170N05278K7385j59993p65099n87435
$$ plain form
41421 1642138 5977280 10623314 13576938 14097783 12689627 9903168 6112702 2176278
41413 2176278 -514805 -869457 1063446 3896114 5657650 5331620 3749796 2444243
41405 2444243 1694136 528995 -1384441 -3095197 -3975944 -4691329 -5800757 -6515676 -5846373
41396 -5846373 -4130308 -2430952 -1175014 -370432 -432297 -1689344 -3563494 -5050139 -5378895
41387 -5378895 -3691320 552988 5771667 8466066 6988971 3768258 1815133 557024
41379 557024 -2113687 -4967583 -4417709 -300708 3118385 2835137 521719 -979016 -1462468
41370 -1462468 -1947177 -2184250 -1633288 -779494 329860 2684201 5618180 5955774 2254955
41361 2254955 -2193606 -3281433 -1255996 677174 1182452 1209837 1049844 284745 -302690
41352c02690K54950p81384l892769m957893j471880L062045M098182K288092J165958
41343e37389J413659J282406M54899k68907j213117k329933j556299J849430M545905
41334C640654L399192K96860j213798j565422k884931l624836j096619K406484
41326f42416K168332j154113k526758r80968m97986k035792j582029K108746M364433
41317g78551K005220j656440k394710q47011M52133J375056K248368J647765n36932
41308A514898j533085k77000K27741j731299k986009r32771J547525R42710r05387
41299d132677n02202J013799O24051l94999J156355L932025L853014J005411j082089
41290E472688k010794m276806o870319n501308k1291M250433M125304K258404
$$ plain form
41352 -302690 -47740 -829124 -4721893 -9679786 -11151666 -8089621 -3991439 -1703347 -537389
41343 -537389 876270 2158676 2613575 2344668 1131551 -1198382 -2754681 -905251 3640654
41334 3640654 7039846 7336706 6122908 4557486 1672555 -1952281 -3048900 -642416
41326 -642416 1525916 371803 -2154955 -3135923 -3633909 -5669701 -7251730 -5142984 -778551
41317 -778551 1226669 -429771 -2824481 -3671492 -3219359 -1844303 404065 2051830 1514898
41308 1514898 -18187 -295187 -67446 -1798745 -4784754 -5717525 -4170000 -3227290 -4132677
41299 -4132677 -4634879 -3621080 -2997029 -3392028 -2235673 1696352 5549366 6554777 5472688
41290 5472688 3461894 -814912 -7685231 -13186539 -13207830 -8957397 -4832093 -2573689
41282b573689J578707J125200j97780m28055J726854L651471K608520j6802j292092
41273F182334j231666j739674k832598k761870q84569J705050L534359L350273
41265E321639P38242k474143l106493n75889J689654O54342k097606k758355o52676
41256c261285J354472J215049l5467m79799K62149J340723J906560J380755m22631
41247C260526k679149l709046k567796l13876R97287O97646J71558O37700J109210
41238b395940q8193k178716k389519m8478J959422J135255j192580k114400j041038
41229h354187O87043K324675L392688K543873k50092j877750R0789L002676K481799
41220D041514p28685j832821L69407J900122L70509j651929j613397p12296n76134
$$ plain form
41282 -2573689 -994982 130218 -67562 -495617 1231237 4882708 7491228 7474426 6182334
41273 6182334 4950668 3210994 378396 -2383474 -3268043 -1562993 1971366 5321639
41265 5321639 6059881 3585738 479245 -96644 1593010 2247352 149746 -2608609 -3261285
41256 -3261285 -1906813 -691764 -727231 -1207030 -944881 395842 2302402 3683157 3260526
41247 3260526 581377 -3127669 -5695465 -6009341 -5012054 -4314408 -4142850 -3505150 -2395940
41238 -2395940 -2484133 -4662849 -7052368 -7100846 -5141424 -4006169 -5198749 -7313149 -8354187
41229 -8354187 -7667144 -5342469 -1949781 594092 344000 -1533750 -1442961 1559715 4041514
41220 4041514 3312829 1480008 1849415 3749537 4120046 2468117 854720 142424 -433710
41211d33710l67684M87612O07726N3573J362909M432199M611456m28651n752249
41202D573181n500389j209179R23712j011553l129316k006814J715888N299594
$$ plain form
41211 -433710 -801394 -313782 293944 347517 1710426 6142625 10754081 10325430 4573181
41202 4573181 -927208 -2136387 -1212675 -2224228 -5353544 -7360358 -5644470 -344876
$$ [...]
##END NTUPLES=NMR SPECTRUM
##END=
