##TITLE=31Pdec_SR138_oil
 CDCl3, 24 sc
 20.10.2022
##JCAMPDX= 6.0         $$ Bruker NMR JCAMP-DX V2.0
##DATA TYPE= NMR SPECTRUM
##DATA CLASS= NTUPLES
##ORIGIN= UXNMR, Bruker Analytische Messtechnik GmbH
##OWNER= root
$$ XWIN-NMR		Version 3.5
$$ Thu Oct 20 15:29:26 2022 Russian Standard Time (UT+4h)  she@DPX200
##.OBSERVE FREQUENCY= 81.013821
##.OBSERVE NUCLEUS= ^31P
##.ACQUISITION MODE= SIMULTANEOUS
##.ACQUISITION SCHEME= undefined
##.AVERAGES= 24
##.DIGITISER RES= 16
##SPECTROMETER/DATA SYSTEM= spect
##.PULSE SEQUENCE= zgpg30
##.SOLVENT NAME= DMSO
##.SHIFT REFERENCE= (INTERNAL, DMSO, 0, 248.564)
##AUDIT TRAIL= $$ (NUMBER, WHEN, WHO, WHERE, WHAT)
$$ ##TITLE= Audit trail, XWIN-NMR		Version 3.5
$$ ##JCAMPDX= 5.01
$$ ##ORIGIN= Bruker BioSpin GmbH
$$ ##OWNER= she
$$ F:/spectra/data/she/nmr/P31/1/pdata/1/auditp.txt
$$ ##AUDIT TRAIL=  $$ (NUMBER, WHEN, WHO, WHERE, WHAT)
(   1,<2022-10-20 15:28:18.20 +0400>,<she>,<DPX200>,
      <created by zg, POWCHK disabled, PULCHK disabled
       configuration hash MD5:
       00 E9 B6 7A A2 85 ED C7 34 08 36 98 17 FE 4E 26
       data hash MD5: 32K
       EE AE 8E 28 DD 02 AA 68 B0 49 71 B2 31 03 72 B0>)
(   2,<2022-10-20 15:28:20.42 +0400>,<she>,<DPX200>,
      <Start of raw data processing
       efp BC_mod = 2 LB = 1 FT_mod = 6 PKNL = 1 PHC0 = -10245.86 PHC1 = 81.05658 SI = 64K 
       data hash MD5: 64K
       32 66 D9 3B D1 1C 42 7C C2 BC 0F E1 7E 70 62 33>)
(   3,<2022-10-20 15:28:50.10 +0400>,<she>,<DPX200>,
      <pk PHC0 = -176.6036 PHC1 = 417.7995 
       data hash MD5: 64K
       BF 56 70 EB B5 DA 04 EB F1 48 09 67 C3 A9 7D BD>)
(   4,<2022-10-20 15:28:54.76 +0400>,<she>,<DPX200>,
      <abs ABSG = 5 
       data hash MD5: 64K
       0A B8 4E 22 34 8A A5 9F ED DB 9E 59 04 A6 5F F7>)
$$ ##END=
$$ 
$$ hash MD5
$$ 3A 34 2E 91 8E 9F 78 23 4C 2B 70 F4 5B B2 0E A5
##$RELAX= 
##$RELAX= 
##$RELAX= 
##$RELAX= 
##$RELAX= 
##$RELAX= 
##$RELAX= 
##$RELAX= 
##$RELAX= 
$$ Bruker specific parameters
$$ --------------------------
##$DU= <F:/spectra>
##$EXPNO= 1
##$NAME= <P31>
##$PROCNO= 1
##$TYPE= <nmr>
##$USER= <she>
##$AMP= (0..31)
100 100 100 100 100 100 100 100 100 100 100 100 100 100 100 100 100 100 
100 100 100 100 100 100 100 100 100 100 100 100 100 100 
##$AQSEQ= 0
##$AQ_mod= 1
##$AUNM= <au_zg>
##$AUTOPOS= <>
##$BF1= 81.014009
##$BF2= 200.13
##$BF3= 200.13
##$BF4= 200.13
##$BF5= 200.13
##$BF6= 200.13
##$BF7= 200.13
##$BF8= 200.13
##$BYTORDA= 1
##$CFDGTYP= 0
##$CFRGTYP= 5
##$CHEMSTR= <none>
##$CNST= (0..31)
1 1 145 1 1 1 1 1 1 1 1 1 1 1 1 1 1 1 1 1 1 1 1 1 1 1 1 1 1 1 1 1 
##$CPDPRG= <waltz16>
##$CPDPRG1= <>
##$CPDPRG2= <waltz16>
##$CPDPRG3= <>
##$CPDPRG4= <mlev>
##$CPDPRG5= <mlev>
##$CPDPRG6= <mlev>
##$CPDPRG7= <mlev>
##$CPDPRG8= <mlev>
##$CPDPRGB= <>
##$CPDPRGT= <>
##$D= (0..31)
0 1 0 0 0 0 0 0 0 0 0 0.03 2e-05 3e-06 0 0 0 0 0 0 0 0 0 0 0 0 0 0 0 0 
0 0 
##$DATE= 1666265297
##$DBL= (0..7)
120 120 120 11 120 120 24 19 
##$DBP= (0..7)
150 150 150 150 150 150 150 150 
##$DBP07= 0
##$DBPNAM0= <>
##$DBPNAM1= <>
$$ [...]
##$SUBNAM3= <"">
##$SUBNAM4= <"">
##$SUBNAM5= <"">
##$SUBNAM6= <"">
##$SUBNAM7= <"">
##$SUBNAM8= <"">
##$SUBNAM9= <"">
##$SW= 501.771253377433
##$SWIBOX= (0..15)
0 1 3 0 0 0 0 0 0 0 0 0 0 0 0 0 
##$SW_h= 40650.406504065
##$TD= 32768
##$TD0= 1
##$TE= 0
##$TE2= 300
##$TE3= 300
##$TEG= 300
##$TL= (0..7)
0 120 53 12 22 120 120 120 
##$TP= (0..7)
150 150 150 150 150 150 150 150 
##$TP07= 0
##$TPNAME0= <>
##$TPNAME1= <>
##$TPNAME2= <>
##$TPNAME3= <>
##$TPNAME4= <>
##$TPNAME5= <>
##$TPNAME6= <>
##$TPNAME7= <>
##$TPOAL= (0..7)
0.5 0.5 0.5 0.5 0.5 0.5 0.5 0.5 
##$TPOFFS= (0..7)
0 0 0 0 0 0 0 0 
##$TUNHIN= 0
##$TUNHOUT= 0
##$TUNXOUT= 0
##$USERA1= <user>
##$USERA2= <user>
##$USERA3= <user>
##$USERA4= <user>
##$USERA5= <user>
##$V9= 5
##$VALIST= <valist>
##$VCLIST= <CCCCCCCCCCCCCCC>
##$VD= 0
##$VDLIST= <DDDDDDDDDDDDDDD>
##$VPLIST= <PPPPPPPPPPPPPPP>
##$VTLIST= <TTTTTTTTTTTTTTT>
##$WBST= 1024
##$WBSW= 4
##$XGAIN= (0..3)
0 0 0 0 
##$XL= 0
##$YL= 0
##$YMAX_a= 1422
##$YMIN_a= -2010
##$ZGOPTNS= <>
##$ZL1= 120
##$ZL2= 120
##$ZL3= 120
##$ZL4= 120
##$ABSF1= 248.5645
##$ABSF2= -253.2056
##$ABSG= 5
##$ABSL= 3
##$ALPHA= 0
##$AQORDER= 0
##$ASSFAC= 0
##$ASSFACI= 0
##$ASSFACX= 0
##$ASSWID= 0
##$AUNMP= <proc_1d>
##$AZFE= 0.1
##$AZFW= 0.5
##$BCFW= 0
##$BC_mod= 2
##$BYTORDP= 0
##$COROFFS= 0
##$CY= -3
##$DATMOD= 1
##$DC= 0
##$DFILT= <>
##$DTYPP= 0
##$F1P= 0
##$F2P= 0
##$FCOR= 1
##$FTSIZE= 65536
##$FT_mod= 6
##$GAMMA= 0
##$GB= 0
##$INTBC= 1
##$INTSCL= 6.047779e-11
##$ISEN= 30
##$LB= 1
##$LEV0= 0
##$LPBIN= 0
##$MAXI= 10000
##$MC2= 0
##$MEAN= 0
##$ME_mod= 0
##$MI= 50
##$NCOEF= 0
##$NC_proc= -9
##$NLEV= 6
##$NOISF1= 182.463
##$NOISF2= 159.3651
##$NSP= 0
##$NTH_PI= 0
##$NZP= 0
##$OFFSET= 248.5645
##$PC= 4
##$PHC0= -10422.46
##$PHC1= 498.8561
##$PH_mod= 1
##$PKNL= yes
##$PPARMOD= 0
##$PSCAL= 0
##$PSIGN= 0
##$REVERSE= no
##$SF= 81.0140089999694
##$SI= 65536
##$SIGF1= 159.3651
##$SIGF2= -187.1042
##$SINO= 113.3802
##$SIOLD= 16384
##$SREGLST= <1H.CDCl3>
##$SSB= 0
##$STSI= 65536
##$STSR= 0
##$SW_p= 40650.406504065
##$SYMM= 0
##$S_DEV= 0
##$TDeff= 32768
##$TDoff= 0
##$TI= <>
##$TILT= no
##$TM1= 0
##$TM2= 0
##$TOPLEV= 0
##$USERP1= <user>
##$USERP2= <user>
##$USERP3= <user>
##$USERP4= <user>
##$USERP5= <user>
##$WDW= 1
##$XDIM= 65536
##$YMAX_p= 331376964
##$YMIN_p= -55125880
$$ End of Bruker specific parameters
$$ ---------------------------------
##NTUPLES= NMR SPECTRUM
##VAR_NAME=  FREQUENCY,     SPECTRUM/REAL,   SPECTRUM/IMAG
##SYMBOL=    X,             R,               I
##VAR_TYPE=  INDEPENDENT,   DEPENDENT,       DEPENDENT
##VAR_FORM=  AFFN,          ASDF,            ASDF
##VAR_DIM=   65536,         65536,           65536
##UNITS=     HZ,            ARBITRARY UNITS, ARBITRARY UNITS
##FACTOR=    0.620285442955139, 1,           1
##FIRST=     20137.2065510682, 0,            0
##LAST=      -20513.1999529968, 0,           0
##MIN=       -20513.1999529968, -55125880,   0
##MAX=       20137.2065510682, 331376964,    0
$$ Real data points
##PAGE= N=1
##DATA TABLE= (X++(R..R)), XYDATA
$$ [...]
44811 20678478 25539987 21744772 14788796 11182893 9857848 6277446 1433040 410498
44803 410498 3485847 4936319 1350329 -3833976 -5665847 -3959596 -2334001 -3305240
44795 -3305240 -6117976 -8350233 -8679251 -8475257 -10418964 -14864079 -18727982 -19514449 -18886426
44786 -18886426 -19509571 -19570475 -14599575 -5307752 650959 -2596673 -11127805 -15036311
44778 -15036311 -9550745 -39271 4059630 -1353092 -11944942 -19808770 -20292807 -14516325
44770 -14516325 -6932863 -1888553 -1697557 -5339589 -8155431 -5422963 1892524 7295536
44762 7295536 7028312 5330320 7473200 10194427 5435508 -6674364 -15580548 -13367688
44754 -13367688 -4318773 1740213 628331 -5159105 -11511568 -14221940 -10085900 -1947466
44746 -1947466 1325771 -4265895 -10999591 -10144175 -5118677 -5127193 -9455457 -9683955 -6039179
44737 -6039179 -7872264 -15864435 -18113669 -9642332 -1954654 -4138685 -7399653 -1203675
44729 -1203675 5977067 -1357679 -19344134 -28278498 -20736129 -8996990 -3486499 -828104
44721 -828104 2662002 1926510 -5117970 -10718041 -10602895 -11816352 -18228019 -20577862 -12127375
44712 -12127375 -2692098 -3444236 -7635106 -2404233 7953957 8891975 1353486 605224
44704 605224 9500722 13338466 5859692 798057 8239972 16395567 10358597 -3294659
44696 -3294659 -6103880 5211918 16287587 16746195 10968501 7182915 6947258 7928556
44688 7928556 9251320 11069849 13386462 16513572 19365872 18247319 11725078 5298295
44680 5298295 5540058 10082815 9666781 1213704 -6942554 -5519769 4200732 12590671
44672 12590671 13078483 8149733 4331493 3687145 2367346 -2263476 -6219697 -4388442
44664 -4388442 432690 515463 -4101313 -3917371 5211749 13651809 11132916 1341784 -5272487
44655 -5272487 -7119941 -8984285 -8755465 -475851 10645645 11121619 -244066 -8433611
44647 -8433611 -3972055 4061707 3881399 -1840340 -4098107 -3069228 -4174749 -5559514
44639 -5559514 -1387116 6369259 10235777 8835504 6719293 5006243 1374049 -2824446
44631 -2824446 -4630508 -6556925 -12183763 -17010709 -14331720 -8443619 -9897232 -18044917
44623 -18044917 -21673538 -18296089 -18039028 -24096455 -24661323 -12495982 1291124 4063214
44615 4063214 542899 1821267 5246189 853974 -8504691 -10382294 -3637178 422855
44607 422855 -1682271 -416012 7890267 12238366 4630794 -5787496 -6120309 1563131
44599 1563131 5602347 3181860 2321201 7394984 12646678 11699279 6548308 3833358
44591 3833358 5618019 7000017 2643371 -5578139 -9063465 -2128255 10131295 16803215
44583 16803215 13488889 5803165 928133 859815 4549903 10379699 14334726 12235352
44575 12235352 7194686 8343357 17641675 24676249 20694174 11395226 7778097 9691646
44567 9691646 8382211 2024318 -2290535 -1353377 31164 -1018665 -1278114 150632
44559 150632 -1510275 -7325268 -9960300 -4022827 5053576 8295074 4707620 73253
44551 73253 -1726137 -591298 3269870 8714874 11546219 8771474 4229092 4826219 10947286
44542 10947286 15037470 11057907 2327129 -1983430 2834423 11470991 13830121 5807658
44534 5807658 -6481831 -14526869 -17123936 -18429470 -18405865 -12493815 -2001003 3600469
44526 3600469 -135599 -4267281 917278 10154564 10204178 331353 -5841236 -886927
44518 -886927 5241657 846312 -9333770 -11120535 -1840441 6145193 3018882 -6633007
44510 -6633007 -12900709 -13972616 -14336561 -14393521 -10106477 -2353837 1188151 -3745436 -11543521
44501 -11543521 -14419799 -12425742 -10967747 -11253494 -9066209 -2388835 4999106 8269034
44493 8269034 6172764 775056 -3780522 -2598469 5213724 12851193 12123962 4615146
44485 4615146 878209 6118794 12387711 9099358 -3289617 -15028593 -19197828 -16989881
44477 -16989881 -12991005 -10139580 -8659162 -6433562 -1145854 5631840 8513814 5109573
44469 5109573 -141820 -2564749 -4378500 -9978174 -16623676 -16672990 -8887166 -965531
44461 -965531 755918 -1265836 -1120512 2100357 4594284 4256319 3590504 6419076 12945019
44452 12945019 18345800 17059788 9412851 2604934 3026007 8731894 12180008 9461547
44444 9461547 3543172 -1226319 -3967082 -5715097 -6271226 -4619890 -1154495 1802179
44436 1802179 1636632 -1772684 -4400410 -1234878 6914733 12008034 7603439 -2409132
44428 -2409132 -8076956 -5643596 -753050 920424 855013 2926945 5662605 3554153
44420 3554153 -5106658 -15113156 -19499683 -16030446 -7947958 376850 6737533 9876167
44412 9876167 7621741 -625296 -10368913 -15063162 -13526777 -10505058 -8917837 -6643298
44404 -6643298 -3244322 -3626129 -9997556 -15591793 -13291378 -6698579 -4839597 -8190209
44396 -8190209 -8281314 -661682 9446952 14793380 12730049 4475647 -5018228 -6775291
44388 -6775291 3966230 17925315 19093813 4847114 -9529217 -10361074 -1779212 2741084
44380 2741084 -2085662 -10865623 -17266630 -19026801 -16059131 -9835811 -3768306 -319313
44372 -319313 1177123 1637819 -268281 -5237855 -10504086 -12288089 -9137046 -2047728
44364 -2047728 5603025 8210678 2972840 -4539711 -5639498 -446079 2190567 -1723996
44356 -1723996 -5908727 -4933001 -1843151 14439 3515900 9446359 10738826 3889609
44348 3889609 -1740035 3441585 13453214 14920295 6491087 -1790181 -5303369 -8397548
44340 -8397548 -12310021 -12418033 -8934367 -8629171 -12770337 -13462262 -6036123 3452960 7455522
44331 7455522 6503539 5357873 5784788 7292247 9839832 12045663 11049066 7050528 3756498
44322 3756498 2247266 -488007 -4427447 -3673330 5052682 15361246 17440460 9238771
44314 9238771 -2067841 -8380727 -7978722 -5339990 -5035525 -5886376 -2631061 5284780
44306 5284780 10022780 4839632 -5615562 -10825226 -8468756 -5381831 -5036616 -3005470
44298 -3005470 3239867 8748263 9339830 8295570 10011369 12598797 11596339 6802059
44290 6802059 1613584 -667853 2376179 10171900 15941461 12303698 2868652 240526
44282 240526 8107502 14449584 9693693 2473337 6528815 18788091 23930957 17564925
44274 17564925 10447853 9087624 6609947 -2150572 -9202340 -5963036 1601437 1298981
44266 1298981 -6532619 -9833390 -3302735 4869988 7155378 7473985 11671870 15214251
44258 15214251 10241011 934971 40822 9245614 14738015 7347007 -3361881 -3761224
44250 -3761224 3411233 5122964 -456010 -2348158 4142240 10567954 10384795 8303337
44242 8303337 9308830 9371782 4344957 -959427 -891310 948792 -1766456 -7197556 -9507819
44233 -9507819 -9321352 -11388056 -15087809 -15392068 -11012480 -4659062 2120527 7695110
44225 7695110 7488836 133087 -6645172 -4770642 1980821 3347625 -2019714 -6370767
44217 -6370767 -6836679 -8529923 -12729016 -13216954 -7939837 -4326928 -7668968 -12362573
44209 -12362573 -10976652 -5592406 -3126132 -3647046 -588998 8684863 18014104 18820471
44201 18820471 9023252 -4592667 -12518187 -11960859 -9418400 -11681474 -16045062 -14093785
44193 -14093785 -4467188 4313237 5120156 577480 -2302057 -736529 3531334 7838609
44185 7838609 8855319 3282962 -7403640 -15652001 -15304083 -8637282 -2828513 -1327097
44177 -1327097 -2050160 -2550514 -3045069 -4150195 -4538419 -2287162 2229226 5824316 5431893
44168 5431893 1338318 -3499182 -6995521 -8510594 -6248398 956722 7408843 2897118
44160 2897118 -12978394 -24991856 -19867858 -5514252 -1348907 -11148476 -18865419 -13406261
44152 -13406261 -3511617 -1449568 -4191275 -1143790 7693653 12851625 10484699 5997028
44144 5997028 4052853 3181544 159688 -5948548 -13449506 -17650331 -13197865 -1230751
44136 -1230751 8677395 8577731 1307261 -5019592 -7806237 -9378677 -9386502 -5296015 1360338
44127 1360338 6151098 8212075 9744428 10508738 8669619 5656558 4351094 3856687
44119 3856687 1557793 -1631697 -3633016 -5829177 -8967888 -8397544 -1627605 3459044
44111 3459044 -1333446 -9213401 -6259653 5906981 9956024 -1508663 -14371842 -13297586
44103 -13297586 -992505 10744153 17716754 21140369 18576909 9012079 392021 479144
44095 479144 4945573 5311432 3764021 7795055 13828296 10589194 -1312946 -7358897
44087 -7358897 59446 11050555 13423387 7763903 1144173 -4510214 -9692699 -10759429
44079 -10759429 -5660552 -1230326 -5194217 -13779703 -16308513 -10327677 -2975504 2019447
44071 2019447 8408064 16439784 18056800 8819967 -2943686 -6283110 -2005808 677086
44063 677086 -1515385 -3474032 -2470774 -2516361 -6033134 -8561508 -5489201 1251087 7043774
44054 7043774 10775108 13193851 13118916 10061109 7557967 8675642 10261022 7034649
44046 7034649 119875 -4082940 -3124065 -836335 316674 3475228 11393856 20439558
44038 20439558 23845408 18832502 8575037 -934877 -4886739 -3196543 -1382164 -5111739
44030 -5111739 -12623939 -16055560 -12146223 -7272341 -8131172 -11427628 -8754617 236881
44022 236881 6565074 4501603 -1353206 -4588374 -6347389 -10317534 -12735820 -6132617
44014 -6132617 7232815 14964444 11360020 6472200 11164773 19547503 17016551 2893963
44006 2893963 -7846605 -6924424 -3348278 -5823068 -7759689 -1007569 5967702 -475553
43998 -475553 -14716913 -16755806 -2278454 9477148 3923726 -7817292 -6496298 7423469
43990 7423469 16427969 10920649 -1045217 -7744501 -6908713 -3321010 -1227196 -2350362
43982 -2350362 -6736018 -12363528 -15735549 -14454580 -8941845 -2293372 876631 -2728810
43974 -2728810 -11694888 -20503134 -24365002 -21869026 -13458870 -1619833 6918779 5471619
43966 5471619 -2911513 -6047420 2224420 12959455 14298326 7486747 2475843 1438643
43958 1438643 -2695850 -11639827 -16643800 -11756048 -3773048 -3041403 -9488349 -13984613
43950 -13984613 -11088982 -4749320 -1556089 -2838346 -5087679 -5493505 -4195323 -1617393
43942 -1617393 2981546 8363962 9782493 4934747 -261549 2052771 9667290 12155396
43934 12155396 6849646 4037343 10610714 17235926 11379746 -2849652 -9555054 -3279989
43926 -3279989 5221529 5487173 -1250655 -8766992 -13608459 -13028773 -4726952 6758013
43918 6758013 11498312 7089593 3054509 7212352 14493811 15407295 9566086 3633679
43910 3633679 289946 -3149283 -7537463 -10237975 -10024521 -8733931 -8482991 -10295319
43902 -10295319 -13735512 -15253550 -10087176 572836 7833280 5045389 -3744702 -10159983
43894 -10159983 -12522149 -13979362 -12963498 -4693901 7768947 13156705 6102960 -5112645
43886 -5112645 -9351914 -6123099 -3171181 -4126462 -4932474 -2140986 967192 -1039907
43878 -1039907 -8261078 -15651754 -19280474 -19085778 -15546363 -7693080 3148725 10836524
43870 10836524 10124088 3947430 314523 1482416 1046228 -6267833 -16401890 -21069808
43862 -21069808 -18011532 -12173322 -8439671 -7271580 -7208544 -8127555 -10781506 -14574121
43854 -14574121 -16859452 -14918934 -9321678 -4612289 -4631914 -7520780 -8297487 -6365926
43846 -6365926 -6332076 -10200663 -13469470 -11823324 -7614865 -5847699 -6827512 -6920629 -4342132
43837 -4342132 -301074 3701960 6125741 4962932 793478 -1668603 1087611 6301535
43829 6301535 8957099 8673300 8260077 7652485 4647574 398453 -1386266 -362017 382773
43820 382773 -90814 145847 1346415 2046739 3336772 7311334 10869568 7674790 -1704274
43811 -1704274 -7864114 -4256633 4067488 7296601 2690882 -4403854 -8623932 -9623336
43803 -9623336 -10238421 -12536166 -15390674 -15105167 -9700254 -2511296 1253137 1666577 3797952
43794 3797952 9255521 12900776 10757305 6673518 6867103 11068222 13853917 12800773
43786 12800773 10513005 9401609 8879280 7812419 6098003 3457177 -119828 -2266098
43778 -2266098 105151 5659994 7874609 1708973 -10148631 -19750238 -22234495 -19794309
43770 -19794309 -16900542 -13863789 -7935367 -302664 2365118 -3569741 -11492675 -10953285
43762 -10953285 -1045805 7813591 6974342 -449415 -5552924 -5099200 -2244299 1123596
43754 1123596 6411936 12738856 15122421 10912080 4857716 4723217 12636480 22403659
43746 22403659 25157413 17259372 3555191 -6474642 -6550331 1346672 9425593 11512330
43738 11512330 7930675 3533506 1982583 2592301 2498349 983029 481433 2823043 5738680
43729 5738680 5155208 1008414 -1703623 785218 5508923 6138276 1247804 -3630718
43721 -3630718 -2983371 2060502 5987954 6307888 5816710 7279728 8985741 8062620 6406001
43712 6406001 9257641 17173926 23226133 20942085 12537105 5647622 3373840 2051727
43704 2051727 -1065645 -2881496 505488 7513861 13196836 15523894 16099252 15737220
43696 15737220 12980423 7436054 1818924 -583346 820195 3805441 5446307 4223004
43688 4223004 1542049 1612722 7940517 18486719 25758703 24113280 16650752 12166247
43680 12166247 14572776 18396132 16992885 12210748 11231485 15015399 16143494 10054884
43672 10054884 2562095 1631412 5817748 6846562 1574064 -5006490 -8268761 -9138043
43664 -9138043 -9589863 -8653505 -5439271 -1864860 337250 2040954 3955192 4651559 3483936
43655 3483936 2283967 2090325 1590709 911649 2934601 7992446 11510880 10726195 9552350
43646 9552350 11866039 13829222 9321985 591802 -3703928 -589419 3816526 3745700
43638 3745700 743352 -258869 3109482 9900327 16302479 15932045 5304861 -9062692
43630 -9062692 -14911853 -8831350 -1169787 -2296707 -9313560 -12276389 -9421990 -8566287
43622 -8566287 -14648274 -23066692 -26359022 -22174596 -13437412 -5091657 -1872094 -5055685
43614 -5055685 -9883056 -9878149 -4945689 -1267841 -2099608 -3757772 -3078771 -3165309 -7246692
43605 -7246692 -11715424 -11371366 -8112499 -7400526 -8331181 -5215358 1546919 4794849 2087881
43596 2087881 -912978 -1529050 -5255030 -14121069 -18738186 -11251044 82448 754876
43588 754876 -8583366 -13016816 -5974874 1709697 -420594 -6769760 -5423585 4330264
43580 4330264 13169599 15621148 13823509 9974267 3922085 -1681926 -1553307 4769915
43572 4769915 10707034 9773741 1624012 -9198564 -16385251 -13941013 -1114150 12830872
43564 12830872 14603823 1751781 -12454684 -13504778 -2074496 9034224 12265245
43557 12265245 13100973 19538196 29547412 33001765 23935685 7608946 -4342172 -4383674
43549 -4383674 4389027 11011853 7268334 -3089648 -7640371 6800 11269212 12637451
43541 12637451 3267797 -3688542 1386845 12291600 16356792 10536062 1702567 -5433572
43533 -5433572 -12386195 -19431215 -22434708 -19682530 -15665195 -14773756 -15892386 -16085144
43525 -16085144 -14979611 -12379500 -6489753 1289359 4461981 -312039 -6844374 -7434122
43517 -7434122 -4286404 -5675739 -12160917 -14927806 -9408166 -3203948 -6314354 -17959023
43509 -17959023 -27592104 -27019628 -18125065 -9307628 -6521793 -8060618 -7731655 -3032129
43501 -3032129 1510702 1091433 -1255273 2264179 12861883 21764297 20446308 10785487
43493 10785487 2189915 1076380 5982015 11052656 11198166 5028127 -4036874 -9745217
43485 -9745217 -8771337 -4714802 -4065626 -7716273 -8903567 -1310564 12084571 20606893
43477 20606893 16811640 4160613 -7588043 -13382673 -16386160 -20223283 -21864982 -16116757
43469 -16116757 -5265731 1184313 -2232110 -9988680 -12386769 -6565155 2089242 7414352
43461 7414352 8069096 6690392 6513612 8521313 9713158 5224336 -4964237 -12735633
43453 -12735633 -9755046 1291232 8580410 5721192 -1351657 -5276532 -8415217 -15999600
43445 -15999600 -22929706 -18038081 -1534226 12248915 13003231 6378306 2687592 2431882
43437 2431882 995388 322217 4783832 9293498 3691623 -11141382 -22381996 -21976835
43429 -21976835 -14588689 -7148304 -884937 2950503 297124 -6950716 -9062522 -2480742
43421 -2480742 3004233 -1020793 -8365353 -9284954 -6277880 -6603714 -6137750 3845571 17240173
43412 17240173 17543703 2994158 -8825510 -6215729 1364178 735951 -5160368 -5622986
43404 -5622986 -1082914 -1055348 -7750843 -13383360 -12723020 -8804019 -5592246 -2946785 -826890
43395 -826890 -2119833 -7879369 -13641968 -14142864 -10111636 -7213776 -8073237 -8158339 -2162035
43386 -2162035 6842760 9479483 3111340 -2695153 1058798 9368826 10938025 6351211
43378 6351211 7105801 15719534 19681284 10882660 -479100 -753453 7314704 11190259
43370 11190259 8984917 9952185 16676463 20210621 14948716 7017084 3699981 3641185
43362 3641185 2757824 2310389 4635204 6311393 2637642 -4193488 -8069138 -8685481 -11994533
43353 -11994533 -20448034 -28080225 -27488649 -18460115 -7374291 -152836 1942202 1095503
43345 1095503 470996 2672298 7764515 11964473 10788679 5018630 1090584 3072520
43337 3072520 6508964 4107161 -3677287 -8565550 -5337616 2098989 7293621 9391484
43329 9391484 11597281 14941852 17424482 17566259 15535712 11685900 6404753 849990
43321 849990 -3477717 -5097596 -2621820 3011134 6623175 3563671 -2558905 -2250574
43313 -2250574 7226501 17104618 18719004 14143295 10039395 6615051 202477 -7176550
43305 -7176550 -9536873 -6648180 -4104053 -4375071 -5242699 -6773171 -12075549 -20286307
43297 -20286307 -25844891 -25977106 -22728055 -17263069 -9281270 -2570721 -2742803 -7510234
43289 -7510234 -7773259 -1328065 3395204 1458837 -197922 4889682 10869021 9420797
43281 9420797 4603981 6394536 13031207 12233120 519681 -9901630 -7535774 3252517
43273 3252517 8981863 4050630 -4461008 -6785865 -828732 7173714 9421190 3181776
43265 3181776 -7949226 -17850845 -22189160 -20033136 -13783185 -8281346 -7481064 -10287684
43257 -10287684 -11725176 -9783418 -8424333 -11460473 -16355451 -17499481 -13349057 -6817571
43249 -6817571 -1113971 663980 -5114488 -17388000 -26258321 -21631138 -6519459 5517685
43241 5517685 7781074 7577487 12567479 17936047 14061491 1778956 -8241754 -9476591
43233 -9476591 -5694078 -3498402 -5094195 -9108137 -13000133 -13347016 -8611206 -3121263
43225 -3121263 -3560887 -9586648 -12731391 -7355814 1993286 7848106 9986888 13135934
43217 13135934 17699681 19003354 14639287 6979922 -1138798 -7874792 -9880637 -4487032
43209 -4487032 4679502 10125991 9983194 9125849 9316862 5836533 -2409417 -7615387 -4493796
43200 -4493796 201815 -1581861 -4785689 1060490 12987723 16687119 8053158 -514134
43192 -514134 788903 5947571 5552639 1555928 458385 502251 -3267168 -7292795 -4930687
43183 -4930687 126855 -1503552 -8307934 -9254290 -2968072 -1661678 -10867873 -18175319
43175 -18175319 -11305963 2471134 6692176 -662802 -6680222 -4327633 -867815 -3873526
43167 -3873526 -10304868 -14247602 -16445757 -19523117 -20257859 -14176264 -3930814 4000456
43159 4000456 8283792 11462781 12022071 6056197 -3259801 -6541643 -951724 5439998
43151 5439998 5601822 2792296 3026439 5110599 5136863 5308743 9352901 12646560 7256426
43142 7256426 -3865312 -8261711 -1539885 6241527 5698557 464409 -1662443 -1689926
43134 -1689926 -4810400 -8515752 -5886932 1237541 2778429 -4567754 -11652980 -9852345
43126 -9852345 -3069651 -1727569 -8685403 -16185381 -15249991 -4315840 10700083 21618525
43118 21618525 23086807 15176842 2587799 -9010205 -16401993 -19215157 -18233408 -14562432
43110 -14562432 -10074013 -6871410 -5194122 -2905762 1137253 3758025 394908 -7877133
43102 -7877133 -13877772 -13487764 -11610541 -14309993 -18224583 -15140840 -5946960 -840245
43094 -840245 -3711260 -5987548 -1147238 3698733 -1039030 -11743805 -17256971 -15455882
43086 -15455882 -12828497 -10355676 -2888143 6813414 6932130 -5567358 -17063551 -14605623
43078 -14605623 -3053760 2954644 -1853101 -10405326 -15264107 -15405541 -13132870 -11387304
43070 -11387304 -13243735 -18290195 -20518471 -15294581 -7261030 -5238027 -9711706 -12042398
43062 -12042398 -7279776 -1338973 -2305254 -9473304 -15190382 -14663519 -9779255 -4631248
43054 -4631248 -1156688 806082 2127512 3688749 4894039 2485148 -6262755 -17531699
43046 -17531699 -21439583 -12795216 150574 3561400 -4507829 -11083175 -6187453 3227409
43038 3227409 4431017 -1671686 -3175035 2916703 6470300 2461235 330244 7789153
43030 7789153 16202289 13059018 1718952 -3903062 -689631 685454 -6021830 -13655359
43022 -13655359 -13867118 -8180004 -2425947 1630979 4047901 3019009 -866102 -2162117
43014 -2162117 1970979 6523519 6427423 4791147 6585172 8465889 3811597 -4210020
43006 -4210020 -4890842 3389147 8687495 2201721 -8904027 -12524193 -9181667 -8821481
42998 -8821481 -12797291 -10444535 3813120 19550206 22849476 13712501 3722780 -2569
42990 -2569 -404023 -1113453 -30290 5103789 10762588 11391758 6194924 -619716 -4353186
42981 -4353186 -3048905 1391898 4060264 1472904 -4047867 -7320132 -7786520 -9565461
42973 -9565461 -13074848 -12436249 -4394094 5398732 9421346 7496985 4422698 2306089
42965 2306089 600499 663847 4398473 10011663 14013361 15680866 15206435 10326088 584852
42956 584852 -7433872 -6080940 2806253 9570652 8718378 3296207 -2472137 -8223383
42948 -8223383 -13698505 -15756627 -11885597 -3470169 5753327 12098790 13253186 10417871
42940 10417871 8309802 9675169 11370891 9708217 7076540 7829211 9980539 7775938
42932 7775938 1237501 -3881741 -5135913 -5563224 -7124073 -8514164 -9042695 -8372847 -3904602
42923 -3904602 4473633 9534166 5591320 -362471 2500231 10904704 11984935 5321550
42915 5321550 4209156 11727504 12917675 -1282773 -17905322 -20719052 -12447702 -6323501
42907 -6323501 -6247432 -8091610 -11672437 -17765780 -19834678 -12079622 -1178389 1901072
42899 1901072 -2230865 -4640974 -2882797 -1375985 -806016 1543380 3792282 2558172
42891 2558172 1420966 5920976 12565508 12968459 6758991 784604 -2064338 -3857264
42883 -3857264 -4318183 -1873513 1031593 2384830 5864167 12464761 13244401 1844078
42875 1844078 -12408903 -17130417 -15614179 -17444908 -17748973 -5613355 11360913 13605444
42867 13605444 588829 -7277352 -598533 7204950 5082522 -630838 -3930276 -10467368
42859 -10467368 -20935360 -22986719 -11835607 -980310 118408 1266207 10538563 16100666
42851 16100666 6454204 -6803532 -6192533 4136838 8480457 6773387 9818126 14628811
42843 14628811 7800928 -8698309 -16776874 -9064138 1748974 3849611 946997 1233139
42835 1233139 4560074 6473516 6164207 5571908 5978260 7390849 7428417 2312778 -6647703
42826 -6647703 -11636758 -9405221 -8356960 -16606180 -28495481 -32333353 -26216913 -16159418
42818 -16159418 -4547656 7572143 12561473 4971103 -5423549 -4303936 5645765 8967728
42810 8967728 1957497 -2999064 1539457 8292923 9261473 5565391 398057 -4893915
42802 -4893915 -5567449 2184722 9727685 3642159 -12243624 -18615785 -9261321 -865136
42794 -865136 -6383038 -15215280 -11473279 1723554 9740135 8240395 4178769 1975758
42786 1975758 897438 1522734 4541314 6536320 4789982 2444715 2662508 2759803 160902
42777 160902 -1688405 365360 2841331 1615081 -1690234 -4361162 -6358007 -4733114
42769 -4733114 5786719 19887139 20794558 2688015 -16256641 -15833990 -407559 10121171
42761 10121171 8683860 4926494 5501381 6892939 6722586 7383267 7799003 4313349 184634
42752 184634 1939535 6019808 1918310 -10104317 -17455401 -14010915 -7910844 -6746566
42744 -6746566 -7140919 -4581011 -2691182 -5761487 -10532061 -11964457 -10351966 -7552848
42736 -7552848 -3122443 1179302 633112 -3638350 -3077767 5186875 11729315 8578754
42728 8578754 1758973 954140 3236642 -1677768 -13512990 -20461661 -16039646 -6931789
42720 -6931789 -2192235 -2701765 -4162531 -4148783 -2791020 -1120549 -1868553 -8147194 -18127502
42711 -18127502 -24001060 -20038758 -10518438 -6243233 -12552403 -22683082 -24461595 -13448851
42703 -13448851 1671882 7755563 748014 -10923890 -16438290 -13656695 -8784289 -7205159
42695 -7205159 -7696847 -5738967 -216217 4606788 3587691 -3414241 -10854762 -13234146
42687 -13234146 -10732403 -7789692 -6934707 -6655888 -5451335 -4556247 -4960652 -4635601 -1449759
42678 -1449759 2975465 5143620 4405700 3351317 4162522 6661986 9331475 10437876
42670 10437876 8928882 5716527 2664916 -1097899 -8823696 -18944567 -22084403 -11894286
42662 -11894286 2800089 5395095 -7059369 -18473944 -14704497 -2073234 3188978
42655 3188978 -1869950 -5460371 -784217 5245992 5722547 4731573 8116257 12336318
42647 12336318 11569250 9515295 13335085 19244162 16055726 3228982 -6282216 -4609750
42639 -4609750 31462 -3001587 -10791568 -13025616 -8319784 -4548549 -5218147 -5024897
42631 -5024897 163844 6423602 7395309 2127511 -4511681 -6107359 620187 11512166
42623 11512166 15927527 7132863 -8253232 -16841914 -14669335 -9924492 -8577355 -6367433
42615 -6367433 593548 6363533 4416599 -232173 1903887 9344010 11707113 5740634
42607 5740634 -1150274 -3696084 -4534198 -5010999 -914147 7759931 12372518 7975486
42599 7975486 2328291 4500225 10821225 11459436 6195699 3100027 4008507 2554599
42591 2554599 -2950714 -5381146 -689185 4750606 3326537 -3545602 -9006405 -10104556
42583 -10104556 -9384068 -10184165 -13402716 -16692725 -15561541 -8082619 1277506 6386567
42575 6386567 7501276 9291929 11685875 10327732 6446471 6723341 10935913 10207145
42567 10207145 2204063 -2866096 1342190 5607888 -154141 -9802834 -10781277 -3630401
42559 -3630401 1893474 4502765 9972611 15303119 10616870 -2901569 -12282676 -12088800
42551 -12088800 -10198125 -11502638 -10539065 -5179417 -3201425 -8071053 -11282367 -7329248
42543 -7329248 -4135890 -8617519 -13003529 -7414955 3028324 6649695 3915174 4262453
42535 4262453 8912015 10382050 6787827 3740037 2600687 -1131662 -7041493 -8679896
42527 -8679896 -5167336 -3563373 -6563689 -7145208 233804 10680981 15627369 12467489
42519 12467489 3665846 -7600472 -16507749 -17186968 -9996727 -3901162 -5605782 -9606847
42511 -9606847 -5755300 5168737 11344412 6633391 -76734 2772060 12518387 15271415
42503 15271415 5288063 -6273414 -5650570 5950308 15173391 14123536 7945154 4771321
42495 4771321 5384933 5971830 5671328 6466577 8048140 7206971 2210284 -4409298 -7685787
42486 -7685787 -4818622 1172949 3330561 -1650585 -9007168 -11873286 -9500602 -5303208
42478 -5303208 325600 8269189 13805340 10767936 2809948 557367 5780811 8946318
42470 8946318 5391219 1878328 1727646 -3471076 -18043319 -29885157 -26294972 -13344479
42462 -13344479 -6232194 -7255079 -7402927 -4534522 -4719057 -8099404 -8386800 -5893533
42454 -5893533 -7021909 -10378700 -7355219 1728628 5877484 1255566 -2240498 2801918
42446 2801918 10299225 11901716 8834736 5860306 2587888 -1962238 -3966863 -1591865
42438 -1591865 -919049 -7624299 -17564866 -22542743 -21496659 -19384219 -17970535 -14344456
42430 -14344456 -7540557 -1367743 -68860 -3769926 -8717687 -11547573 -13408409 -18172784
42422 -18172784 -24996840 -26320195 -17844754 -6898395 -3831108 -7715887 -9272486 -6236176
42414 -6236176 -5127073 -7537261 -6786834 -1447175 -260461 -7517763 -13807371 -9148612
42406 -9148612 2585122 10333953 10618856 7913395 5340947 2449462 -1124997 -5277684
42398 -5277684 -9220787 -8286035 2755955 18712865 24321175 12813109 -3080763 -7345897
42390 -7345897 -1222598 2931408 2492750 5555850 12666590 12300494 -974601 -14963685
42382 -14963685 -14182868 268017 12789944 12914383 5994556 3331561 7159822 10121960
42374 10121960 7662525 4213803 4385865 4150832 -2674880 -12913401 -17309074 -13892261
42366 -13892261 -9405619 -7820424 -6934203 -6877714 -11057032 -16332494 -14038277 -5015783
42358 -5015783 -1427576 -7576840 -11839054 -6330185 -1452410 -8607092 -20072581 -21493966
42350 -21493966 -15493994 -15229933 -19903780 -15640830 191838 13434637 14326705 8752725
42342 8752725 4470577 297275 -5229519 -6677122 -758556 6191497 6696195 1857938
42334 1857938 -2461519 -3531035 -1768842 1810845 4790689 4769307 3698938 5699042
42326 5699042 9511916 9447202 4788231 893095 -287086 -2261454 -4667673 -1956010
42318 -1956010 4444325 3150445 -10638729 -24230190 -22239797 -6524152 7724722 11595139
42310 11595139 9023341 6362442 4794474 3317163 1676745 -1193797 -6228954 -10547643
42302 -10547643 -9440246 -3429148 814946 -1300260 -6167854 -6598161 -916224 5280100
42294 5280100 6702098 5561714 8848275 18525255 27656566 28710265 23163677 18720849
42286 18720849 18403618 17801356 13428434 7929213 4713787 2641831 -258346 -1741038
42278 -1741038 1518286 7981375 12479545 12284851 9028223 5765835 4734677 6742264
42270 6742264 10154007 11499304 9412839 6797276 6621404 6897909 3140988 -4438429
42262 -4438429 -9536187 -6762040 1889243 8848044 8286241 895220 -7512920 -10842789
42254 -10842789 -6753267 1969071 8887491 8294461 485648 -7627578 -9574675 -6918298
42246 -6918298 -6669423 -10871322 -13546277 -10267466 -5238276 -3701287 -2029852 6484839
42238 6484839 17832328 18870750 5036342 -11472302 -15895527 -7825381 1268602 3392915
42230 3392915 796527 -865849 128258 2367548 5143784 8359982 9829082 5701656
42222 5701656 -4685809 -15335431 -17851647 -10805872 -2869844 -3881436 -13598603 -22091936
42214 -22091936 -21114728 -12505567 -5096939 -5440611 -11943001 -16795460 -13998956 -6409808
42206 -6409808 -3216009 -8933019 -17682504 -21303575 -19908588 -19552633 -21899239 -22548480
42198 -22548480 -18936353 -13499310 -8500233 -3779215 -821013 -3130941 -10376961 -17005908
42190 -17005908 -18763438 -16436986 -11928727 -5531395 1267403 5242936 5662532 4613729
42182 4613729 2057184 -3912329 -10657694 -11727354 -6613291 -2682570 -3546806 -2702653
42174 -2702653 5805248 16854833 21135850 17590324 11933340 6741506 529437 -5806837
42166 -5806837 -9107859 -9950780 -12713809 -19468170 -27359182 -31219788 -26805879 -14807208
42158 -14807208 -4140423 -5684986 -18136615 -26363540 -20508308 -10118634 -9861159 -17151277
42150 -17151277 -16936060 -5910315 2934554 1463036 -2334121 509621 6009108 6362650
42142 6362650 3188762 2342521 2632831 -602871 -5413640 -6080466 -3064792 -1411716 -1164678
42133 -1164678 2049787 7508590 8757139 3364374 -3964690 -9592286 -15401272 -22339462
42125 -22339462 -25638884 -20752512 -10223687 -725433 4299109 6141262 7381620 9777626
42117 9777626 13620950 16609749 14967741 7740293 -1769061 -10302450 -17481919 -22312477
42109 -22312477 -21003677 -12632723 -3637281 -691734 -891966 4204036 14985948 21609349
42101 21609349 17403745 7798997 2326225 3329200 6993179 10515753 12546548 10334532
42093 10334532 3197969 -3077656 -2038750 3638657 4528141 -2443384 -9094342 -6572106
42085 -6572106 3555366 11849096 11960924 6237384 1647625 2204572 5521127 6611503
42077 6611503 4723552 4312685 7986011 11665510 10315877 5793804 3863836 5151054
42069 5151054 5322419 3541372 3242495 3519331 -1724910 -12165321 -16588638 -6887278
42061 -6887278 8968261 15986055 11095961 4665244 4185943 5486471 2449364 -2556551
42053 -2556551 -3723229 -2685676 -7097754 -18614822 -28430991 -27617512 -18154018 -9470024
42045 -9470024 -5762584 -2178886 5271474 11384369 7768672 -5345478 -18079406 -21257676
42037 -21257676 -14371538 -3949044 2366322 608701 -6743370 -12649848 -13148970 -12017226
42029 -12017226 -13993856 -15607219 -9462972 2892077 10713474 8868777 4913902 7120281
42021 7120281 12546389 13035817 7546232 1467979 -2650905 -6356961 -9052316 -7486779
42013 -7486779 -1843655 2794608 2324429 -1675945 -3410100 2038105 13361574 21737972
42005 21737972 18429378 6008540 -2199055 2526206 13685815 18638541 13698663 4408058
41997 4408058 -4694222 -12516914 -16251747 -12760404 -5171328 -452141 181903 1427173
41989 1427173 4068591 2889316 -3665554 -9299288 -8737991 -4608233 -1888139 -969723
41981 -969723 139914 1866885 5089699 11956592 20308379 22304700 14133876 3052160
41973 3052160 -1417303 -222278 -1809101 -8014802 -10520212 -2711279 10795588 19309407
41965 19309407 17413838 8878276 1372296 -712417 1191124 3518255 5920210 10639648
41957 10639648 16068254 15667520 7484012 382102 3295633 10466751 7256186 -8194231
41949 -8194231 -20003038 -16360449 -6038612 -4247676 -10446785 -12568084 -8066799 -5859814
41941 -5859814 -8168317 -6106592 2984852 8541391 4343093 29341 4967002 11739043
41933 11739043 8429261 -1138368 -3953558 1095437 4277328 4077031 8508041 17035871
41925 17035871 17979580 8055990 -598971 732766 4939438 3192035 -1016085 -1527467
41917 -1527467 -2209951 -8414458 -14176335 -10408761 -287287 5447479 4679841 4137659
41909 4137659 6198685 6553264 3805823 1298458 -238170 -2807537 -4459197 -1512588
41901 -1512588 2655558 173435 -9176941 -16929478 -18151431 -16265058 -14220475 -9826791
41893 -9826791 -3083555 -12157 -4393621 -11625223 -15242524 -14717731 -12736227 -9185119
41885 -9185119 -2545061 5452092 10742268 11598093 10142852 9816828 12030942 14597387
41877 14597387 14186004 11449732 11273849 15365297 18131627 14607959 8847224 7575581
41869 7575581 8415338 3489397 -6085598 -9504768 -1974452 8370432 12712084 12025295
41861 12025295 10827381 8770083 4687454 2362489 5245720 10006616 11514470 10284546
41853 10284546 9408332 8300491 5606112 4430782 7747377 11362755 8661661 939114
41845 939114 -3808559 -1932892 2356320 4782234 6210778 8453750 9732478 6899788
41837 6899788 -439113 -9587874 -16791693 -19231822 -17005052 -13327564 -11013096 -9148260
41829 -9148260 -5327483 -370456 2201476 1348054 106534 1362466 4649340 7979219
41821 7979219 10286951 10765987 8209319 3161245 -841280 -734588 1827376 2091648 -1586777
41812 -1586777 -5348322 -4797558 -612194 2616933 1953403 -1616461 -5501951 -7258104
41804 -7258104 -4551176 2795968 9927940 10135655 3088585 -3354969 -2078143 5406307
41796 5406307 12387610 14902502 13071876 7891074 880430 -5396268 -10054386 -14538802
41788 -14538802 -17641843 -14490014 -5131541 1290110 -2095124 -9218402 -10371125 -7739456
41780 -7739456 -10836269 -19251555 -22482720 -16633495 -8609122 -2610543 4254406 10276058
41772 10276058 7320416 -3959203 -10705479 -6748590 -1950759 -4600633 -8104638 -5705949
41764 -5705949 -4572916 -11099367 -14631578 -3492038 12197513 13526506 2486921 -2504108
41756 -2504108 2291137 2211330 -6911316 -9613394 2021262 12891977 8215342 -4452725
41748 -4452725 -9778898 -7419030 -5766246 -4317487 1614049 6529916 1762983 -7608856
41740 -7608856 -8877264 -2645130 -1888342 -9615474 -13167298 -5126730 3945834 1599272
41732 1599272 -7637535 -9077511 1690757 13962370 15983405 7675282 -877372 -156694
41724 -156694 9974368 20797861 24066926 20119487 15034249 11603066 7730107 3213074
41716 3213074 1721618 3961885 4765122 706767 -4077473 -4035601 -441964 1096489 -1437704
41707 -1437704 -5415763 -8011501 -7558292 -2931900 4042469 7934406 6080459 3294181
41699 3294181 5290309 9910932 10679041 6785047 2766139 55270 -3222525 -4883683
41691 -4883683 -354477 7047913 6889127 -3794891 -14700381 -15327961 -6893765 2899447
41683 2899447 9701995 12277433 9822032 5539007 6074719 11034049 10322792 -491376
41675 -491376 -10118792 -7295186 227799 -4123007 -20160104 -30298198 -24793651 -13557967
41667 -13557967 -9297722 -11206612 -11355696 -7686511 -3697011 -1720330 -2385853 -5766069
41659 -5766069 -8694924 -6025539 1590635 6575407 5049843 2986051 7034485 14383015
41651 14383015 17196773 13072020 5687981 -1483853 -6571837 -7082494 -2197417 3443557
41643 3443557 2890850 -5728698 -17281920 -24617574 -23940376 -16437385 -6352998 2811839
41635 2811839 10242178 15326950 15375667 9119938 806092 -3766723 -4100642 -2981351 214252
41626 214252 6984592 12129947 8367040 -928767 -4080000 1486177 5349612 1759858
41618 1759858 -792438 5148586 12365937 10627455 3149503 265915 3217320 5376761
41610 5376761 4501272 2891049 -283237 -5951730 -8354370 -2455015 5155446 4293269
41602 4293269 -2704639 -5104233 -1716684 -1115117 -4654806 -4203178 1143840 1301680 -6461000
41593 -6461000 -9460900 1452780 15951720 17667523 6177173 -4728933 -6087324 -1372795
41585 -1372795 2665171 3952533 3347749 1293838 -1610492 -3590740 -2995814 -428330
41577 -428330 643024 -3076077 -9253434 -9817563 -333882 12465832 18202959 16435463
41569 16435463 15334998 17331792 15689141 7682496 959587 1171897 2250332 -3059961
41561 -3059961 -10042090 -9009086 -1052833 3408588 313461 -3285768 -937542 4696043
41553 4696043 7371493 5309035 781216 -4209347 -8877538 -12339517 -13070320 -8959065
41545 -8959065 1226222 14309001 22326012 19895346 11752573 8452186 13648091 19997334
41537 19997334 19615694 14428520 12516225 16619681 20527440 16862666 5588400 -6112146
41529 -6112146 -11074130 -8648695 -4549387 -4502264 -8233278 -10562563 -8450758 -4963470
41521 -4963470 -4669052 -6817158 -6164077 -450617 6229114 8880008 7697184 6317028
41513 6317028 5990452 5049393 3840766 6232721 13957997 21525733 20192336 7944983
41505 7944983 -6512246 -12212600 -8168111 -4029705 -6921832 -11594936 -8737191 -299737
41497 -299737 2078170 -5037183 -10394341 -4678899 5463448 8511578 5469798 4822987
41489 4822987 5896847 1407619 -6080626 -6061004 892347 2423580 -3669068 -3894902 7256677
41480 7256677 15073094 7537394 -4704910 -6177076 -1473097 -4279931 -11170639 -7268147
41472 -7268147 6499878 13124217 6712766 217303 2451595 5330220 399751 -7257853
41464 -7257853 -9721930 -8399754 -7280611 -4657952 31560 364871 -7141916 -14513496
41456 -14513496 -12364918 -3067669 3638648 3571006 -89988 -3781204 -5981980 -5746104
41448 -5746104 -3898598 -2967877 -2637097 578844 5975444 6433526 -2058561 -13602785
41440 -13602785 -19536594 -17561684 -9734351 2509185 15518484 21287304 15727651 5933074
41432 5933074 2429575 6250879 9477117 6797838 1158179 -1062648 3537130 12498011
41424 12498011 18189681 13900121 2105741 -6514017 -5222677 1568992 6323196 8118803
41416 8118803 9196609 7108148 -1874097 -13862864 -19392843 -14473348 -4540394 2488771
41408 2488771 3205145 -415878 -3375078 -1601069 3471432 5385067 55557 -9217255
41400 -9217255 -16174781 -18104991 -15607715 -9750442 -2830843 1721720 3720448 6538441
41392 6538441 9587219 5837634 -7708732 -21985693 -25294354 -17555373 -8420159 -3921878
41384 -3921878 -1939289 1195807 6657742 14390761 21899122 23062576 14696360 3292890
41376 3292890 -1194338 2536642 7338838 8435684 6896627 3420514 -2866229 -8504204
41368 -8504204 -6801467 2307920 9824279 8227613 -136852 -7260926 -7690156 -1217473
41360 -1217473 7668558 11286281 4728148 -7169313 -13016190 -7596385 2034725 5334162
41352 5334162 -137452 -8109883 -11625736 -9062352 -3738432 525505 3473479 7473798
41344 7473798 11979911 11925627 4943047 -2704132 -2842754 3435491 7567082 6148659 4765536
41335 4765536 7675554 10582660 7629333 853339 -2037524 2591117 10055429 12497208
41327 12497208 7291519 474283 263656 5787317 6077382 -5075328 -17283391 -14993844
41319 -14993844 646520 11688992 7223307 -3064308 -4542116 2321759 6070717 2384346
41311 2384346 -1870630 -724926 3632243 6585969 7605634 8844130 11095325 13111964
41303 13111964 13148012 10446074 6028444 1417150 -3864198 -11199295 -18041480 -17773544
41295 -17773544 -7857863 4564558 9634857 5911937 345821 -1582678 -644189 986367
41287 986367 3611075 6986435 8012487 4904300 955507 519289 2524917 1485857
41279 1485857 -4897874 -11922314 -12974132 -7231891 -1118931 -2277835 -12429767 -25775929
41271 -25775929 -33979777 -32883465 -24838606 -15097928 -6906961 -751244 2851385 2594688
41263 2594688 -557406 -2066957 1550229 7630736 9855258 5811904 -921169 -6603812
41255 -6603812 -11416184 -15731086 -16022781 -8766103 2856652 10471686 9725218 5398264
41247 5398264 5818876 13178315 20556447 18856854 6735023 -7033391 -12329310 -8412677
41239 -8412677 -3601704 -4117496 -6839796 -5322585 346395 3989416 2487710 -35434
41231 -35434 1594408 6159625 7240355 1479383 -6117989 -6902070 966313 8918781 7260955
41222 7260955 -3582939 -14904894 -21444511 -25167768 -26680406 -20816129 -5751886 9451420
41214 9451420 13661810 7421346 1458297 2680890 7333501 7883776 2073090 -5309198
41206 -5309198 -6920702 83341 9551491 11528721 4395240 -2420540 -1614040 1840856
41198 1840856 233399 -3007396 838819 9195010 9586455 -1490759 -12290030 -11811985
41190 -11811985 -2753133 5787595 10223557 11838685 11193086 9028788 7531126 5550794
41182 5550794 -2405028 -17108629 -29386279 -30206876 -22451657 -16213431 -14856434 -12558158
41174 -12558158 -4985427 4238249 9461805 10711191 12294174 15589037 16422399 10643165
41166 10643165 700198 -6064726 -6113369 -3276363 -1507095 1577968 8820538 14802939
41158 14802939 11142089 -35568 -6545298 -2164221 5503223 6560312 1225468 -3758945
41150 -3758945 -5020297 -3521265 -418114 2652247 2887574 722779 1203120 6230784
41142 6230784 9490833 4758304 -4234110 -8592513 -6378287 -3164751 -1926386 444061
41134 444061 5984990 11341604 12653945 10258953 6271690 1023101 -5182491 -8745550
41126 -8745550 -4678598 7117642 18921369 21036681 12054011 1669710 576235 8481446
41118 8481446 15658417 15648216 11304570 7460032 3694581 -2137050 -7865799 -9172496
41110 -9172496 -5375846 478455 5349919 7439006 6115998 3138341 1562837 1500500
41102 1500500 -5712 -3147677 -3668547 244039 3872586 2408738 -2705257 -7677364
41094 -7677364 -11961371 -15166279 -13133670 -3685235 6782060 9328579 3786335 -1631918
41086 -1631918 -876778 4850189 11160898 14483660 13028436 8476870 5742507 6994436
41078 6994436 7712885 3007003 -4560512 -8624586 -8128106 -6857021 -5798017 -2585102
41070 -2585102 2285472 5213194 5581581 6567266 9878083 14500549 19812060 24860205
41062 24860205 26098733 21812840 17157490 17821642 19962892 14516229 1439003 -8686553
41054 -8686553 -8449958 -1440112 4831721 6200562 1032150 -9376685 -17690383 -16410852
41046 -16410852 -9113763 -6757033 -10455087 -9126540 955822 6714521 -2687701 -18015308
41038 -18015308 -23028886 -17516090 -13751883 -14954667 -12261386 -2602227 4431359 817084
41030 817084 -9427087 -17777744 -20492353 -16837992 -6616403 5677433 11531281 8843623
41022 8843623 5738424 8463335 11468297 6698223 -2017919 -3013118 6242193 15049890
41014 15049890 13790081 5153631 -1894663 -3841875 -4163276 -6447604 -10132659 -11976800
41006 -11976800 -9415294 -3523662 266199 -3149583 -11533481 -16222528 -12783122 -7127035
40998 -7127035 -6652791 -8772521 -4964960 5370329 13189376 12861043 8888286 6673549
40990 6673549 4524011 57499 -2539676 899338 5822215 5301949 1704078 3087014
40982 3087014 10014344 15543163 17693102 21410734 26612854 25236129 14598251 3832599
40974 3832599 692885 643348 -3125899 -6895071 -3961209 1106440 -1499258 -9021864
40966 -9021864 -7988162 4564012 14499690 10399912 -708866 -5029845 -1087497 2378357
40958 2378357 2191165 3569272 8725770 12748115 12344964 10544986 9936629 8137495 3742182
40949 3742182 823989 2552008 4911025 2646604 -1498480 100453 8538536 16006185
40941 16006185 15463401 8029698 -189701 -4457008 -3375845 1485106 6111143 7403505
40933 7403505 7504863 11274541 17845216 19154382 10324957 -2223800 -7788271 -4300323
40925 -4300323 792394 1514486 -141405 632266 4602428 8914952 11032537 9905986
40917 9905986 5748310 1226303 902193 6209527 11655366 9430690 -1264457 -11953411
40909 -11953411 -13524575 -5549237 4594069 10094734 9598831 5224825 -26302 -2446820
40901 -2446820 298162 5140027 5455337 -386117 -6188614 -7027498 -6692428 -10798791 -16664462
40892 -16664462 -17364053 -12994375 -9272073 -6585087 -645634 5724425 3168942 -8334999
40884 -8334999 -15522902 -10085947 -991063 -585829 -7106867 -10720080 -9817191 -9997338 -11575933
40875 -11575933 -9959118 -6230816 -6158976 -9135962 -8224668 -1675133 4631379 6853310
40867 6853310 6870202 5814549 2446113 -1263064 -1583895 -1167794 -6701386 -16595924 -20360804
40858 -20360804 -13287215 -2634256 4777398 11866917 22296037 30363379 27872551 16255284
40850 16255284 4796519 -228430 671740 4257225 7377805 7907222 6740080 7078502
40842 7078502 9607247 11338185 10715598 9415042 7365061 1979439 -4573681 -4185146
40834 -4185146 5675937 15033040 12928142 2117649 -4633240 -594016 8992319 15633549
40826 15633549 16317228 13647080 11797660 12764917 14182189 11622454 4684164 -1476122
40818 -1476122 -2577853 -75934 2695286 5370425 8388130 9946305 8970473 7483879
40810 7483879 6255806 2321877 -4704921 -8590606 -4767857 1285854 947735 -4988271
40802 -4988271 -7899948 -3932046 2088682 4838321 4124855 2131958 640246 1513819
40794 1513819 5448287 10069564 12762859 14242102 15860906 16124517 14626401 15891611
40786 15891611 22484524 27324810 21538679 8623201 1448103 4994564 11748653 15638181
40778 15638181 19753924 25735961 25669810 12835932 -5643885 -15670557 -13071121 -6399187
40770 -6399187 -3777831 -3434556 948756 9328736 13169379 5179176 -9799148 -17080152
40762 -17080152 -8155498 8424883 17126904 14133231 8857468 7779151 6548731 976104
40754 976104 -4036401 -3136094 -478093 -2655239 -6900904 -5567619 545348 2764422
40746 2764422 -2119722 -7662386 -7948106 -4514842 -1231461 1016353 1745799 -1135612
40738 -1135612 -7127946 -11502459 -11533612 -10520614 -12032897 -14065911 -13360580 -12010276 -13960951
40729 -13960951 -17036220 -15194885 -8808806 -6041501 -11697408 -20094454 -22518683 -17577884
40721 -17577884 -9959776 -2320016 6040846 13768023 16472676 12336505 5066596 7210
40713 7210 -542409 1759826 2512401 -2441847 -11555664 -15968184 -8501411 5598384 13081085
40704 13081085 9459641 4610316 8196473 16403759 19113437 14704695 10028508 9043044
40696 9043044 9583485 9908187 10626536 10286048 6274638 771019 -787925 1905846 3490957
40687 3490957 1717899 -633 -408902 -3438176 -10224571 -14928819 -13122789 -8891197
40679 -8891197 -8678804 -12535141 -16182600 -17471548 -15725752 -8967337 1945869 9560579
40671 9560579 7097610 -1948726 -7691101 -6375522 -2856093 -1112384 645887 3953843
40663 3953843 5740947 3512161 368286 892057 4726541 7700089 7515191 5243413
40655 5243413 2483185 74501 -933283 135772 1806146 1440618 -1468994 -4665210
40647 -4665210 -6176513 -6215527 -5458396 -3770773 -2237608 -3918958 -9292966 -12696362 -8294252
40638 -8294252 244078 1882116 -7374544 -17733388 -17911537 -9374557 -1846261 1294491
40630 1294491 3913017 5034248 -2630837 -18726680 -29921223 -25351659 -10634954 634754
40622 634754 3948667 4702561 6418032 7477580 7880019 10078614 12533235 10380638 4073984
40613 4073984 159225 1115824 1180675 -4250258 -11015148 -12535873 -9127041 -5754493 -3784602
40604 -3784602 -768716 2925781 3091897 -1532329 -5473069 -2155859 7898069 16522798
40596 16522798 16064225 7405312 -1148126 -2978600 528277 3602201 3430135 1146793
40588 1146793 -2198842 -6024593 -7338693 -2905704 4752884 8567130 5858407 1259460
40580 1259460 -1247403 -3593867 -7613200 -9661509 -6603919 -2335123 -1711951 -1579182
40572 -1579182 4652842 15674743 23496627 25168404 25069835 24975078 20343925 9148747
40564 9148747 -3060078 -10733055 -14901155 -18290485 -19472081 -16284234 -10306992 -3736622
40556 -3736622 3456512 9192254 7892384 -880823 -7909392 -5649166 530540 662741
40548 662741 -4261073 -5031487 -174833 2379396 85333 393981 7036753 12548884 10492532
40539 10492532 5985656 6401219 9045714 7189609 2885451 3442607 7936609 7951535 1867323
40530 1867323 -1714594 2441796 7981356 7404301 4012086 6353452 14350302 18764420
40522 18764420 14455492 7358941 5583178 8684711 10567679 10133269 12594928 19721556
40514 19721556 25001563 21982326 12980506 4894576 -210981 -4531528 -6926196 -3312878
40506 -3312878 5083104 10803062 9395230 4078943 -359324 -2564168 -1898793 2571281
40498 2571281 7626831 7280123 2250756 1003566 6847391 11706175 8957414 4648085
40490 4648085 7397109 13821114 14268555 8143442 2612651 -163797 -2770940 -2238194
40482 -2238194 6823847 19015209 21310740 11577721 1960763 1019808 4428020 7155880
40474 7155880 12285959 21363190 27329383 25131622 20090769 17747270 14245084 5620840
40466 5620840 -1640963 392168 7910057 11424748 9906129 8911443 9280974 8022053
40458 8022053 6534532 7372775 6179800 -1990366 -10906833 -9601837 846471 9209417
40450 9209417 12054355 16094887 21434847 18025886 4639203 -3131269 5936209 20248448
40442 20248448 20520006 6695639 -3210838 1387331 11608150 13912852 6956920 -702125
40434 -702125 -3353608 -3087070 -4367254 -8041341 -11126667 -10434703 -5256294 2876513 11439695
40425 11439695 17279294 17745836 13888782 11305376 14522030 20929749 23885119 21647159
40417 21647159 18731995 17830106 16007632 11488300 8673866 11639929 16444651 15612890
40409 15612890 8522747 2010562 1062034 3532588 4616516 2765965 -30360 -1323940
40401 -1323940 -395572 1317356 1693405 674936 784881 3736746 7937076 11099195 13492856
40392 13492856 15923644 16369601 12682175 7906758 8230540 14602620 20320818 18958872
40384 18958872 11973364 6427454 7160196 13070790 19640822 23280059 23740288 23157759
40376 23157759 22661203 21043433 18545107 20093467 30196025 44593951 52748184 51023366
40368 51023366 47937922 52360478 61915271 69235319 74978366 85594912 100198905 110425487
40360 110425487 115174492 124962166 146191529 170024820 185213885 195615785 214467184
40353 214467184 243891529 270884317 284608433 288225107 290233200 291937981 288960404
40346 288960404 280035968 268233753 255715505 242339549 229013249 219074801 215939747
40339 215939747 220298671 228621984 234156300 232088053 225117454 221282130 224500216 229781241
40331 229781241 229493388 221454374 208781172 195069149 182647340 172577805 162982355
40324 162982355 150006550 133898919 121371200 117922912 120297596 120741143 116193120 108719688
40316 108719688 99966757 91369591 87480659 91569965 98679590 100702716 98477769 100671244
40308 100671244 109449707 116236770 114942848 110416666 108171808 103904122 91374872 74941519
40300 74941519 64851647 62988693 62327451 59339040 57864621 59643287 59305801 52178482
40292 52178482 41207120 32419499 27729132 25702451 25933450 28606552 31566974 31411554
40284 31411554 27077883 20260098 12881596 6036453 1215125 891068 6831035 17426666
40276 17426666 27020860 29653307 24932506 18756379 16213468 15652284 13063344 10182845
40268 10182845 12374448 18593044 20614540 14981724 9044153 10305410 15593684 17510552
40260 17510552 17009757 20807545 28420062 31417174 26259380 18732524 13088057 5792229
40252 5792229 -4868262 -10882410 -4055968 10967812 20935837 19304353 11232327 4990528
40244 4990528 4253136 7760420 11064149 9304440 3130121 592061 8046049 21078738
40236 21078738 30661966 36050572 43035175 50243924 47989699 33783641 19150655 15365616
40228 15365616 20038702 23998767 24691657 25450761 26808608 26609568 25518097 25092982 22813199
40219 22813199 15913043 8257428 6642049 11297895 15947133 16132715 12006068 4563749
40211 4563749 -4691661 -11488642 -12276933 -9196909 -6311733 -3033714 2376131 5758624
40203 5758624 2370929 -2409282 1766042 13677662 20053160 14519886 6527208 6532126
40195 6532126 12101850 15480030 16352599 18458147 19876688 16258346 10046439 7387260
40187 7387260 7536466 3541750 -6599117 -16196604 -17987580 -10954447 1126148 13071452
40179 13071452 19754013 18916096 14218664 12431021 16157420 21348571 22805704 20311971
40171 20311971 18161589 19303949 20979724 17309097 6990652 -3216158 -5384731 158651
40163 158651 5942543 7320737 6604880 7034197 8363757 10054897 13004353 15550031 13549214
40154 13549214 7595808 4311086 6841626 10305232 10879985 12291202 17422287 20784914
40146 20784914 17185459 11446275 10352136 10607908 5417885 -1515948 -743567 6671161
40138 6671161 10299195 7185607 4875114 6619458 6325435 1229795 -2393236 -461660
40130 -461660 3056815 6151408 13204620 23349359 26009783 16667271 6843405 8097054
40122 8097054 14871087 15117894 10771188 13575514 24287576 30641336 26199082 18261073
40114 18261073 14587050 13572810 11622563 10404152 11208350 9993699 4487351 290911
40106 290911 3079572 8811335 8698547 1778210 -4085494 -3268249 1441449 4646255 5282430
40097 5282430 5522250 6448345 7880706 10292663 13660056 15496661 13295803 8740509
40089 8740509 6240307 6765838 6645059 3989103 2501458 5784800 11253747 14411914
40081 14411914 16718689 22792529 30186655 29297684 16294128 469319 -5549660 611683
40073 611683 10951862 17236638 17068188 12455241 7257485 5272662 6992216 8468774
40065 8468774 6125503 1897461 922779 5148329 12087644 18862897 24151206 26658435
40057 26658435 25259590 21338439 18450595 18705497 20759832 21641856 19788297 16623138
40049 16623138 15339681 16755723 16589663 10155557 590209 -2356491 5358052 15765046
40041 15765046 19345180 16970457 15062841 13369039 6872047 -2001143 -3879098 3088278
40033 3088278 9068833 6829910 1712996 1975747 6489772 8784510 7676051 6513641
40025 6513641 6017208 5358367 7127209 13222043 17880114 13385014 2379831 -3887065
40017 -3887065 -604750 5410720 7618061 8396488 11509646 13723246 10889401 7041571
40009 7041571 9172708 15392321 16447614 9120396 977007 -39302 5062481 10336848
40001 10336848 13766612 18039688 24611856 30756019 32550865 28978705 22727688 17286195
39993 17286195 13298071 8829510 4132116 3628344 9510138 15121508 10829372 -2455739
39985 -2455739 -11769388 -7256110 6263753 16651142 18216523 13163122 4621762 -4170708
39977 -4170708 -7099264 -464763 9593967 12976710 8989900 5914184 6966557 6200830
39969 6200830 958672 -1476742 4724209 13955728 17502178 15387522 12423758 8080887
39961 8080887 -697143 -10035714 -11884073 -5279476 3028858 8627771 12487252 14153749
39953 14153749 10244101 1783286 -3986380 -2421307 2793254 5404240 3993495 1441325
39945 1441325 716682 3070472 7033979 7959143 2327430 -6289037 -9768011 -5497047
39937 -5497047 437223 2038349 796380 1463700 4568922 6770078 5837637 2255966
39929 2255966 -1598434 -1553050 5645552 16602651 21746249 15654924 4256841 -2674343
39921 -2674343 -3854294 -5911280 -11527507 -14420627 -8112714 4646558 14433929 15244945
39913 15244945 9422287 3308212 510451 258951 741794 1794298 3892766 6518007
39905 6518007 9228431 13068295 18684415 23849155 25428263 23416616 20322018 16993687
39897 16993687 12558193 8593328 8991446 13927444 17719987 15379856 8689864 3265876
39889 3265876 1808568 2926117 4957060 8098255 13078665 19248641 23821400 23139226
39881 23139226 16377407 7968379 3882416 5230798 8370942 11371387 16100050 22478659
39873 22478659 25238515 19791363 8789354 -35998 -1271889 3921869 8820476 6382343
39865 6382343 -2988604 -9181968 -3063384 10425388 16850585 11382769 4569900 5275834
39857 5275834 7784160 3490188 -3423901 -3032992 3293083 5168083 9780 -4443146
39849 -4443146 -4259616 -4487826 -8197843 -10583119 -7724841 -2983168 -399665 1589746
39841 1589746 5473747 9016489 8720283 5521790 3751045 6471502 12877619 17801966
39833 17801966 14456887 1825908 -11363430 -15030902 -9395795 -2725110 1155017 5591497
39825 5591497 11761174 15464423 14995864 14162108 15302135 16848025 19109351 23396757
39817 23396757 23765162 11131195 -9948976 -20640518 -11521343 3764553 7705363 1791487
39809 1791487 -1172207 1050406 216066 -5199665 -7608434 -4319128 -1265923 -1721757
39801 -1721757 -1970292 142179 1681731 1639664 3375290 8054848 12544584 15124343 16816602
39792 16816602 16604404 12366607 6983107 6126169 9458989 11560273 11587199 13074341 13733235
39783 13733235 6534842 -6079485 -10670581 -1593801 8810418 6952158 -3224295 -7498308
39775 -7498308 -1361526 7213883 11326527 11742653 11339033 11356895 13146590 17035622 19593128
39766 19593128 17615318 13974894 13715245 15476608 13531416 7936772 5216009 7876762
39758 7876762 10653868 9669912 8280537 9782006 10618538 6627745 1422716 1583041 5805985
39749 5805985 6019549 -673848 -7531633 -7310868 -797970 6109224 9420568 8124455
39741 8124455 2306632 -5323914 -8556415 -3246205 7198912 15978198 21236298 25472029
39733 25472029 28036270 25102234 17903919 13687574 15544065 18001569 16672952 15358927
39725 15358927 17843188 19423398 14751485 8704665 9469903 14261469 13125069 5651430
39717 5651430 1911131 5638744 8656617 5625086 2539648 4433765 5369220 -767160
39709 -767160 -8103157 -7343630 -229510 4750754 6271916 8847636 10713652 5139137
39701 5139137 -5931957 -11023366 -5400874 857224 -3557779 -15598008 -21826148 -15057593
39693 -15057593 -1904960 5956336 4736614 1387593 4373344 13609030 21540083 22871617
39685 22871617 18926573 12315929 3805520 -2742568 100735 12315846 21061712 15210916
39677 15210916 1390724 -4217014 2216759 9055786 7467276 1508804 -2047521 -3168158
39669 -3168158 -3535434 -1265359 3811457 6793543 5035295 2777418 3651971 4575144 2151638
39660 2151638 -598755 530905 3783147 4648678 1954278 -3313183 -10089067 -14315712
39652 -14315712 -10657032 -2114142 -275373 -9130102 -16497152 -10627114 1925295 6344355
39644 6344355 1756890 80293 5691059 10399811 8812482 5257027 3129661 -305487
39636 -305487 -4698989 -3396416 5560091 14675553 18083384 18479429 18344127 13843993 3660323
39627 3660323 -5200988 -7899326 -9918547 -16425668 -21004853 -14977271 -2426458 4573106
39619 4573106 2256120 -3177468 -7479444 -11654463 -14471285 -11934691 -5433294 -1955126
39611 -1955126 -4178380 -6955084 -5143202 868961 8211864 14197655 15395117 10278685
39603 10278685 3630890 2015679 3933541 1306969 -7527211 -13466719 -8565138 3566607
39595 3566607 12809154 13210955 5869470 -3678648 -7820339 -1781976 10018466 16828132
39587 16828132 14101925 8789900 8913295 12951934 13820691 8710321 228944 -8073705
39579 -8073705 -12500144 -9682020 -1573188 3749426 1583112 -2975150 -3683695 -3435981
39571 -3435981 -8059950 -13645912 -10100449 3178683 14638634 15318834 8594405 2927249
39563 2927249 1619977 2727795 3702007 2825516 -449358 -4564775 -7678925 -9940246
39555 -9940246 -10482278 -4706108 8788824 20607899 19246727 7374122 -1165292 -2175736
39547 -2175736 -6318077 -18726816 -27251949 -20877594 -7985781 -2899192 -3469723 1780155
39539 1780155 10445340 9327588 -451297 -1577996 11546760 21600086 14431454 597851
39531 597851 -2288102 3491409 2552867 -7331056 -13190403 -8885457 -2848489 -2154763 -3397713
39522 -3397713 -3767827 -8124456 -17762342 -22770599 -15165681 -2559934 1254843 -4819397
39514 -4819397 -9192735 -4246017 5862571 13292969 14143294 7623115 -4292272 -14406824
39506 -14406824 -14694278 -6338131 367687 -754876 -4345399 -3098902 1042213 985874
39498 985874 -4515544 -10565167 -14230013 -16167840 -15376256 -9411929 -684059 3659688
39490 3659688 403622 -5677950 -8523177 -7452129 -4854758 -1417958 2638179 4426909
39482 4426909 944498 -5949441 -10562445 -9768384 -6291184 -5273529 -9014757 -15294516
39474 -15294516 -19572309 -18254367 -10769919 127893 9562459 13304845 11608874 10470840
39466 10470840 16164558 26816206 32399538 26355549 14741468 9307335 13140775 18798686
39458 18798686 20036609 18464814 17039470 14019110 7371735 -227853 -5422218 -8944231
39450 -8944231 -11946931 -11941220 -7758788 -4663077 -8095519 -15080008 -18569229 -18209411 -19257706
39441 -19257706 -21793529 -19418571 -10020675 -218092 3780098 3604120 3984328 6143609
39433 6143609 9264315 13249628 15954585 12515833 2564172 -5534099 -3324093 6818623
39425 6818623 14496037 13723749 7743135 2243415 -947614 -2504577 -2360258 -292706
39417 -292706 2267211 3020346 1101290 -1748469 -2152994 1824183 7732381 10314807 7715725
39408 7715725 4632345 6709234 12686233 15293184 10191735 1093990 -5135445 -6159090
39400 -6159090 -5162999 -5464886 -6274972 -4346590 1077424 6391991 7846686 7033968 9599929
39391 9599929 17104271 22595001 17618264 3108834 -10014103 -11883441 -2863382 8960386
39383 8960386 16423805 17461295 13455806 7357219 3065205 2962506 4600120 2347837
39375 2347837 -5526571 -13124635 -13048290 -5619206 1182487 1529675 -1629833 -1400155 4451392
39366 4451392 12373924 18213671 19885565 16357165 8541925 1325261 250288 4777698
39358 4777698 8419965 7144123 4182818 4550138 8254957 11722591 13135935 13382014
39350 13382014 13983249 16883633 23864853 32936121 37414327 32152541 19371860 5692010
39342 5692010 -4416050 -9402581 -8367345 -2888146 1395965 598521 -1677596 37095
39334 37095 3724622 3140726 -810283 -520116 5635556 9832785 6759064 648391 -3680892
39325 -3680892 -8365602 -14836380 -16196648 -6126047 9062671 16391065 12449223 5841094
39317 5841094 4311326 6747850 8175870 6207291 1564128 -2579907 -1195188 7635939
39309 7635939 17731141 19711846 11866197 1845705 -2921766 -1939972 1508359 4743743
39301 4743743 5462613 2243503 -2507028 -4267945 -2866535 -3019160 -6646518 -9314486
39293 -9314486 -7042460 -2568151 -1626394 -5923770 -12253124 -15887060 -13416873 -5848372
39285 -5848372 -172847 -3025854 -10639562 -10693406 2149191 17705443 21835155 12156741
39277 12156741 -2271253 -12100730 -13009473 -4945878 6294681 9972287 1054952 -11524888
39269 -11524888 -14777948 -8511719 -4175385 -7430902 -11184088 -7932151 -188949 5805626
39261 5805626 9774642 14829804 19399420 17894780 8651399 -2532488 -7356572 -2877707
39253 -2877707 5064749 7068395 460995 -7295895 -8228184 -4184279 -2752219 -5495894
39245 -5495894 -7391414 -6853683 -7868617 -11249136 -12252316 -9149894 -6085346 -4788366
39237 -4788366 -2017675 1506655 -665162 -8480228 -11415213 -3896611 4867227 5131271
39229 5131271 1187281 1000814 752557 -6134885 -12118649 -5059355 9236468 12867057
39221 12867057 4197457 830336 10158677 16462096 6505345 -9157518 -13498941 -8105540
39213 -8105540 -5609418 -6876002 -2862682 5850153 8283651 1132707 -6818384 -9544229
39205 -9544229 -10321585 -11250934 -8498710 -2282225 -746861 -7782571 -15640737 -16361583 -13341240
39196 -13341240 -14246044 -18451700 -19876394 -18032664 -17015601 -15515665 -7770171 4247343
39188 4247343 8791378 -564900 -13853743 -15314281 -2665036 10396227 11075849 1511247
39180 1511247 -6330759 -5633998 -152222 3828476 5558254 7902026 11139169 12489811
39172 12489811 10440783 5968481 -87121 -7172251 -12269306 -11299874 -5288544 -1300392
39164 -1300392 -3797335 -7949737 -6108189 735356 3534334 -2375203 -10906356 -13587630
39156 -13587630 -9743052 -4843387 -2368680 -1912031 -2954638 -5079191 -5228724 -397378
39148 -397378 6199298 7001747 199771 -6831497 -7156700 -2961149 -587066 -880022 -196789
39139 -196789 1461588 299151 -3448701 -4514789 -1320671 766639 -1434360 -2462060
39131 -2462060 3038805 9355630 6053462 -5275970 -9816542 1014859 16166007 18166363
39123 18166363 5904575 -4398871 -753096 10698902 16471374 12866719 6234681 1601533
39115 1601533 -650814 746146 7570138 15408917 15686692 7268917 -889254 -2174929
39107 -2174929 -709419 -2777129 -6487893 -6417219 -3188701 -877459 1101519 5324866
39099 5324866 8625680 6072317 1068150 1899100 8224965 10797603 6312850 2983257
39091 2983257 7898555 17277465 23398929 23542960 17840481 6358260 -6154667 -10481463
39083 -10481463 -4853669 185383 -3692736 -9929276 -7757661 800153 5651673 5670444
39075 5670444 8022698 12316148 9554561 -1021600 -7324472 -2027900 6164490 5928090
39067 5928090 -962872 -5614788 -6515736 -8284800 -10523650 -8553935 -4075961 -5184550
39059 -5184550 -14051051 -22533324 -23297817 -19216510 -17540844 -19205489 -19001365 -14189768
39051 -14189768 -8000608 -4642520 -4598685 -5859189 -7163123 -8361862 -8891174 -7434654
39043 -7434654 -2937533 4409088 12556885 17887455 17539642 12252790 5535323 -955577
39035 -955577 -9235087 -20139340 -28718468 -28436268 -19786597 -10726779 -7476380 -8473547
39027 -8473547 -9060242 -8301702 -8027237 -8022613 -6350316 -3339625 -1527861 -1643671 -1478916
39018 -1478916 843125 4414758 6760744 6532498 5189285 6282339 11620771 17578841
39010 17578841 17626335 9960102 -13891 -6612687 -10005700 -12741473 -14077023 -12281897
39002 -12281897 -9388583 -8045822 -6034363 -290621 5409485 4392633 -1769042 -4599693
38994 -4599693 -2523411 -4103542 -13470664 -21177898 -16546613 -3068762 6301017 5336469
38986 5336469 -1523684 -8336396 -12320844 -10733213 -2164098 7604545 8945473 761984
38978 761984 -6713369 -5117316 1610564 4504821 2347961 1063187 3405485 6145541
38970 6145541 6807711 6759081 6667628 4670740 1245161 815501 5137923 9117624 7336899
38961 7336899 1684413 -2195056 -3756366 -7184445 -12796951 -14827245 -9546791 -1190127
38953 -1190127 2811141 -27600 -5662939 -8260560 -5663167 -1732882 -2660486 -8482249
38945 -8482249 -10395059 -1795384 9668976 9340191 -4274468 -16366525 -16795750 -13619395
38937 -13619395 -17734639 -23812811 -19282484 -6656575 -1787803 -9962896 -17667640 -12155819
38929 -12155819 1663489 9580015 5588253 -4458166 -11153263 -9036260 -100696 7197571
38921 7197571 6439420 1742681 2094102 6988384 6424416 -2516799 -9287949 -5390307 3333780
38912 3333780 7384607 7893737 10808319 14041891 11681870 6258710 5142549 7528225
38904 7528225 6779561 4345417 8777693 19587418 24261319 15688588 2723862 -2119991
38896 -2119991 2153334 7717790 9397220 7518746 4000932 1095855 814018 1700172
38888 1700172 -184714 -3884027 -2239495 7508488 17057339 17225452 10647555 7074853
38880 7074853 9029098 10432945 8289776 6739023 8113966 8188903 3763319 -1596316
38872 -1596316 -3572533 -3309349 -2809578 803662 9913070 18449334 16762371 4199563
38864 4199563 -9273569 -14678250 -11994366 -5808833 956749 6126750 6195734 16038
38856 16038 -7531994 -9450187 -3675066 5620672 12394514 12952338 8044232 2815091 2568103
38847 2568103 6467754 7593502 1203828 -9675924 -18789369 -22950701 -21028739 -11774635
38839 -11774635 1770473 9757525 4818377 -7772310 -15826926 -14609741 -8789465 -2357950
38831 -2357950 4238276 7422286 1625325 -10157345 -16390304 -11657533 -3080753 1816977
38823 1816977 4570835 7669259 6615098 -1468957 -9118384 -8513248 -4568430 -7362358
38815 -7362358 -15436165 -18066101 -12432510 -6947840 -6801225 -7052850 -3052458 1539373
38807 1539373 1662624 -1132627 -2294384 -911029 1187652 2815292 2629802 -956813
38799 -956813 -5728477 -5569322 1539950 8777670 8398853 2124533 -1514592 732273 3154448
38790 3154448 965854 -1521011 2636650 11051224 13222521 5070333 -4014675 -3260079
38782 -3260079 5026377 9881896 7568193 4171008 2938628 -555135 -7782689 -12050111
38774 -12050111 -9610046 -6901045 -9152886 -9962542 -1823968 9533330 12460519 6661439
38766 6661439 1744557 1477407 1233861 -600603 -1009437 -1875034 -8431432 -16803919 -16069629
38757 -16069629 -6237767 -1478586 -9646677 -20157761 -19974923 -11689359 -6285309 -5649629
38749 -5649629 -2943520 4072088 10306171 12459299 12660999 12876750 11756806 7958021
38741 7958021 2790272 -1300866 -3322353 -4991280 -9201525 -15178940 -16302588 -7408409
38733 -7408409 5937055 11569987 5418096 -4056082 -7680252 -5123837 -636082 2987240
38725 2987240 2761103 -4344298 -15096845 -21087490 -20471273 -20580038 -24058222 -22349609
38717 -22349609 -10681763 264206 -1638291 -11895736 -17069777 -14429065 -11244646 -9006564
38709 -9006564 -2240186 8628326 16349459 18759269 19929317 19767504 14792357 9599501
38701 9599501 13953608 25736334 30213388 21207409 10384813 8672442 10311418 4909183
38693 4909183 -4264671 -5855172 1180341 6415268 3552045 -2469557 -4653368 -3097141
38685 -3097141 -2939966 -7166272 -13065457 -14620216 -9155790 -2345243 -3629157 -14396880
38677 -14396880 -23902509 -20494338 -4922620 10758597 15955958 10355940 1625336 -2558797
38669 -2558797 -676223 2532861 2403893 606687 2521380 8233711 10610207 4658468
38661 4658468 -5145356 -10183533 -7390064 -529492 5298987 7135052 4862793 1838854
38653 1838854 2291696 5125896 3846168 -3524959 -8819323 -4074827 5814307 8528642
38645 8528642 1142007 -6674014 -6973332 -3023177 -1847557 -4610179 -8791189 -13850096
38637 -13850096 -18873976 -18860341 -10140545 2225729 8634476 6436603 2254674 2333044
38629 2333044 5214528 5649463 2216463 -1374890 -916868 3855174 8625938 8319785 2990569
38620 2990569 -952957 1954473 8642156 11226408 7936640 4776594 5206997 4943696
38612 4943696 561619 -3611199 -3287160 -2797453 -7403237 -11709072 -6623119 4183122
38604 4183122 7071013 -1348097 -9492486 -9995074 -10431189 -17430858 -22445823 -15126287
38596 -15126287 -1916516 2627819 -2263982 -4887654 -1739495 -1758000 -9017741 -15748282
38588 -15748282 -16597746 -16783157 -19921646 -19568237 -11391759 -4070394 -7550302 -17039936
38580 -17039936 -19665562 -13066065 -6361960 -4300000 -1568020 5567219 11759566 11218511
38572 11218511 7112097 6696178 10619593 12395199 7455385 -1326864 -7480534 -7556674
38564 -7556674 -3003400 2584342 6332057 7016922 5284881 3438106 3304317 3543792 1102423
38555 1102423 -3350346 -4340056 871235 6233248 3686431 -4682409 -7483376 1131780
38547 1131780 12982842 15950751 8722522 935257 563750 5664417 8769016 6259040
38539 6259040 1773050 983621 4341120 6844385 5711276 5265693 10666502 19045580
38531 19045580 22548501 19748921 17441825 19522969 20662631 14512438 2850487 -7495690
38523 -7495690 -12460415 -11728909 -6545264 -924067 -677889 -6224610 -10120551 -6797042
38515 -6797042 -1052991 -1519350 -9356796 -19089091 -26518708 -29081340 -22887285 -8657901
38507 -8657901 2251728 -1452739 -14539754 -20178802 -12682019 -4095294 -4274966 -5945809
38499 -5945809 2202473 16176120 21484030 13546997 2681133 -1341006 -777769 -3261278
38491 -3261278 -10238198 -16636439 -18746307 -17863886 -16781476 -16097019 -14735269 -11913313
38483 -11913313 -7403323 -1472159 3900116 5236049 1302511 -4409075 -7611044 -8265395
38475 -8265395 -7844808 -3486411 7914021 19512403 18312008 3933903 -6129521 1104414
38467 1104414 14498238 13826722 -836064 -9805569 -2798380 8849989 12460540 10926665
38459 10926665 11350203 10018075 617386 -11209088 -14333930 -8692196 -3866603 -3681191
38451 -3681191 -3146318 -144212 365556 -4053643 -7813568 -5076886 2237920 7532885
38443 7532885 7482469 4676892 4088763 7884965 13050715 15005961 13881238 13878593 15017381
38434 15017381 11219353 1126859 -5144955 1953580 16400292 23156147 18221175 12009260
38426 12009260 12201551 14061324 11457039 7627171 8373272 11647952 11590664 8640252 8263157
38417 8263157 11783679 14956100 14983773 13614096 12890474 11849906 8498871 2905696 -2178212
38408 -2178212 -2887157 2629691 11379691 17084896 16136480 11026870 6734212 5061957
38400 5061957 3855622 619247 -4222014 -6851663 -2958304 7054419 16309968 18148175
38392 18148175 14434023 12954371 16280940 19020827 17881934 17467933 21712306 26296510
38384 26296510 26383000 26295568 32522816 40604632 39505415 28421435 18574023 16503259
38376 16503259 16123226 11610511 7923016 10943696 15439467 13070512 7267534 8495210
38368 8495210 16463104 19333102 12597820 6753489 10104393 14163510 6261969 -9697848
38360 -9697848 -17350956 -10809384 -974921 2975812 5952684 14296606 21321872 16597020
38352 16597020 4130879 -989931 6543212 15430285 13666836 2430547 -9000879 -14596879
38344 -14596879 -13790008 -8581625 -2922100 -427113 524923 4650855 10527186 10432523 3154644
38335 3154644 -1137380 4760174 13334343 13415633 6698184 3090735 4377607 4192877 1725308
38326 1725308 2981228 8295174 10527907 7632782 5889011 7642738 6747803 699994
38318 699994 -3089100 626603 5545350 3767826 -2188563 -4785420 -2793271 67537
38310 67537 2355796 3413172 -280278 -9293247 -15885649 -12610828 -3268642 2359375
38302 2359375 1821909 245285 108738 -367486 -204277 3572551 7927884 5542745 -3616059
38293 -3616059 -10278551 -8265616 -2424876 -859541 -4396549 -7423620 -5788173 -818759
38285 -818759 2734385 1522426 -2265541 -2495768 2637520 6207932 1353020 -7212547
38277 -7212547 -7330808 4520749 18254975 23399089 20719575 16754237 12193230 1859189
38269 1859189 -15219995 -30802590 -34400017 -24268150 -9970910 -2533480 -2620860 -1894983
38261 -1894983 3451901 6609680 1356788 -7199621 -10165287 -7771815 -5738920 -3381201
38253 -3381201 3123479 8573428 3835313 -6835300 -8520955 1335668 7922077 2684857
38245 2684857 -3799911 -1729347 580377 -7176464 -16720104 -13855563 -2890405 342027
38237 342027 -5024782 -4813805 4691078 10479769 5413690 -504011 1835029 6429471
38229 6429471 5073289 2140186 5551686 11821351 11494019 4120606 -2354181 -3640421
38221 -3640421 -1617411 2462118 8641752 13547315 12895565 8323346 4961348 2811323
38213 2811323 -2309287 -9161312 -10345528 -3462618 3928123 4284913 -490420 -3989068
38205 -3989068 -4955445 -6501756 -8953997 -9850559 -9744468 -11672934 -14621618 -13576809 -7638666
38196 -7638666 -2471691 -2097488 -3516600 -3011683 -2551511 -4835442 -6540691 -3083629 3150252
38187 3150252 6504697 7335777 9488268 10803609 6420264 994347 5309034 17990734
38179 17990734 23515482 14553964 3799964 4109302 8357364 2428123 -10185466 -12961293
38171 -12961293 -1847707 9891806 12244055 8921906 5127240 -838194 -8735005 -11481465
38163 -11481465 -5897849 1132510 3509687 4093295 5616748 2562425 -9099910 -20990213
38155 -20990213 -21041860 -9515031 2106710 5832053 3590984 928665 1112206 4866718
38147 4866718 10661535 15283987 16940478 16169883 12213867 3159344 -7429658 -10534509
38139 -10534509 -3935132 1834672 -2564021 -10881165 -10402449 -1368791 4093680 841814
38131 841814 -3652520 -3806399 -4133841 -8618551 -12094332 -8844170 -2435556 93615 -1152847
38122 -1152847 -661469 3733785 9642575 14797669 17520092 14920185 6184035 -3669263
38114 -3669263 -8273054 -7416659 -5860642 -5689129 -4513916 -942137 3019972 5736967
38106 5736967 7790955 8817095 6617864 1563823 -1727864 -198072 2758403 1871052
38098 1871052 -1985807 -2469378 3411761 10968196 13794409 11037222 6387402 2215331
38090 2215331 -1763905 -4816362 -4238498 379011 4369126 1776458 -8330319 -20052633
38082 -20052633 -24951481 -18766130 -5554872 4951580 6289062 1943144 886728 6271879
38074 6271879 11966013 11545064 6541438 2529277 460823 -3353299 -10224124 -16649286
38066 -16649286 -18482103 -13885318 -2972827 11235810 21853043 22975425 16682924 11488678
38058 11488678 12731666 17802408 21479060 21936422 20089113 16901896 13358203 9977679
38050 9977679 5016251 -3251750 -11322556 -12402469 -5895716 312262 719148 -41298
38042 -41298 4260535 10064893 8953563 1422209 -2932450 783087 6719337 8096747
38034 8096747 6066183 5225425 5997555 6251649 6656063 9113942 11524914 8817604 -440771
38025 -440771 -11071747 -15460906 -10031715 1489165 10512454 10859466 4750106 185339
38017 185339 1832748 6732323 9607174 8865625 5398166 -585153 -7675149 -11228961
38009 -11228961 -8170766 -2472882 -1105011 -5065055 -8916987 -8892418 -6468321 -3473108
38001 -3473108 815859 5608789 6694698 2264819 -2771573 -2319811 2958493 6720741
37993 6720741 4742006 -1322065 -6912922 -8375225 -4443059 3107225 10026242 12903793
37985 12903793 12385455 12039281 14275147 18241926 20879311 18965769 11445120 1376944
37977 1376944 -5611284 -6669141 -4442965 -2716246 -1061984 3358956 9980204 14402595
37969 14402595 13619056 8528376 1362699 -5922505 -10375361 -9153808 -3631585 752086
37961 752086 1005476 596113 4460077 11580906 15264645 10658533 349604 -7824985
37953 -7824985 -8071271 -1722431 5152901 9061005 11955810 15332092 14821026 5901328
37945 5901328 -6274894 -10092261 -2841074 3841933 -1230917 -13804099 -20537680 -16976536
37937 -16976536 -11468025 -12023830 -16854199 -19354858 -16211193 -8259098 1314223 6883748
37929 6883748 3624338 -5422308 -9871354 -4125317 4450416 4611157 -4105148 -11786539
37921 -11786539 -12005686 -8559998 -7323067 -7760468 -6200746 -3255127 -3039106 -6375762
37913 -6375762 -8959354 -6990016 -2389215 -1085630 -6158332 -13033198 -12950345 -3127024
37905 -3127024 7637734 7381001 -4388585 -15088912 -14537637 -7197679 -4294075 -7871185
37897 -7871185 -9985091 -6190234 -1418831 -731940 -1729981 -210841 2299455 1852066 -749973
37888 -749973 -1288022 1331473 4167695 4593646 2350242 -1075235 -2365393 1809593 9675428
37879 9675428 14100398 11398433 6843090 6239304 6045709 -327632 -9084684 -9072839 1116950
37870 1116950 9330096 6708066 -742462 -3049124 -954352 -2119127 -8079614 -13381611
37862 -13381611 -14875202 -14082350 -11705672 -7046896 -2638801 -2751449 -6532341 -8446285
37854 -8446285 -6533121 -4573828 -4551549 -2892601 2748601 8179074 8634694 6406847 7253891
37845 7253891 11070712 11656187 5940846 -1491030 -4940523 -4777383 -4877624 -5370593 -2523206
37836 -2523206 3974397 7921394 3465644 -7213882 -16140548 -18370435 -15486265 -10913958
37828 -10913958 -5862758 -1131942 869636 -1124260 -4650177 -6663758 -7673328 -9385655
37820 -9385655 -9407333 -2978090 8834189 16907813 13536240 2190485 -5965848 -4901454
37812 -4901454 762090 3741050 3102928 2167377 1296437 -1417205 -3832953 -1314435 4173961
37803 4173961 3829770 -5316490 -14040503 -13045758 -6001746 -3140434 -6215824 -8791645
37795 -8791645 -8650598 -9486457 -10850984 -7408205 253230 4944691 5946880 11309501
37787 11309501 21942246 25221565 13189675 -2795854 -6707236 39372 3117766 -2916973
37779 -2916973 -9929337 -10998118 -7722463 -2796703 3708943 9236217 9291760 4891840
37771 4891840 1585776 360179 -2263175 -4922638 -2005194 5086012 7678988 3676601
37763 3676601 1024495 3186748 2471975 -5281392 -10188405 -2701583 9587808 11653599
37755 11653599 2922018 -3067413 407878 4797775 1184827 -6221699 -6747681 2365975
37747 2365975 13393440 17236520 11570311 1453332 -5565741 -5493492 -663995 3138081
37739 3138081 2159475 -2719071 -7520222 -8208297 -3558849 3245426 6835966 5209947
37731 5209947 2063297 1645879 2466648 -920095 -9849587 -18338893 -19657084 -14476900
37723 -14476900 -10013486 -10729887 -12214492 -6927498 4613217 12607683 10199046 2947739
37715 2947739 1170615 5345613 6205580 -426255 -6653459 -3846057 5128868 10154476
37707 10154476 6468667 -1971843 -8925100 -10835025 -7455276 -2194429 -516434 -4008314
37699 -4008314 -7519370 -6023648 -2267104 -2740420 -7569352 -10123399 -6602857 -589037
37691 -589037 2894745 3155191 2281401 1865700 2823701 5099191 6295581 3879879 -285294
37682 -285294 -1358367 1269163 2409301 -1119677 -5435009 -5663890 -3218644 -2412792 -2583804
37673 -2583804 661937 7045595 10261540 6595325 487740 -1225392 2151465 5264083
37665 5264083 3652965 -2208617 -8921477 -13265426 -13102733 -7870859 217519 6552736
37657 6552736 7254908 2266177 -4729666 -9327309 -9724814 -7753555 -6404171 -5781007 -2472274
37648 -2472274 5489937 13950848 15798825 9346087 858750 -2583248 -559447 1769367
37640 1769367 190390 -4581934 -7691059 -4040319 6138920 15055053 14534430 6591761
37632 6591761 1613683 3730167 5029146 -633468 -5944128 -1356722 8229164 10364118
37624 10364118 5410412 5665839 13703503 16833516 7953993 -2249420 -2250725 3041300
37616 3041300 2487489 -3215711 -5853144 -5596172 -9592184 -17471383 -19997282 -12175825
37608 -12175825 746477 9954345 9400188 -1680989 -15297065 -17556950 -4046525 10957720
37600 10957720 10601824 -2441011 -11489249 -10577907 -9230736 -12636574 -13339418 -7196585
37592 -7196585 -2523605 -5497898 -9107970 -6054308 -1939941 -4954513 -11177962 -11766138
37584 -11766138 -8184841 -8291609 -11746638 -11293247 -6091585 -2410608 -1968608 -213171
37576 -213171 3479595 3755138 -1143149 -6399337 -8946942 -10721120 -11671328 -7680183 1377696
37567 1377696 8776217 9969018 8181633 7140148 4570426 -2004106 -8500983 -9573930
37559 -9573930 -7009024 -6580259 -8829474 -9104483 -5787052 -2715518 -3021351 -5239115 -6542017
37550 -6542017 -6082467 -3903018 271715 5565704 9659223 11456733 12106507 12038439 9152049
37541 9152049 2255077 -4897928 -5854957 1512132 11653909 16075404 11342993 2224073
37533 2224073 -2979501 -263774 6623503 10355862 7319560 307765 -5491174 -7420908
37525 -7420908 -5711905 -1374300 3655468 5806161 3276471 176036 2882669 11026993
37517 11026993 16996024 17018043 16920537 21542932 24338227 16931941 5659668 5755444 17531340
37508 17531340 22162431 8369461 -8819656 -7957684 8506051 18925047 14018641 7247127
37500 7247127 11540090 21167698 24092725 20331828 17719336 17199186 13491794 6533091
37492 6533091 2041272 1973664 2971972 3907035 6936596 10262501 7539162 -2630635 -12382306
37483 -12382306 -13492385 -7054486 -1025336 -429405 -3002905 -3753407 -1587913 -414136
37475 -414136 -3406897 -7217098 -4845219 4681301 13302045 13642270 8172199 4299004
37467 4299004 3861491 3736382 4153993 8119917 12999091 11620936 3812570 -1370176 1633324
37458 1633324 7451564 9465930 9514308 11567480 12030598 4970160 -6091751 -10312431
37450 -10312431 -3605166 5951563 8181198 1883261 -5759296 -8209762 -6519643 -7630136
37442 -7630136 -15581506 -25351955 -28227237 -22834324 -16082348 -12452094 -8793329 -2652362
37434 -2652362 1281795 -1205574 -5266082 -3092260 4631755 9861903 7693742 640750
37426 640750 -5169210 -4005514 5409150 15667257 15857230 6023552 -416478 4625180
37418 4625180 11195898 7034380 -2667303 -4753769 -268748 -477308 -5081638 -3208619
37410 -3208619 4826625 6537918 347762 -388235 8157802 11769120 2957645 -4740199
37402 -4740199 603256 9300849 7302022 -919205 -2821805 880536 2410633 4371129
37394 4371129 12724566 19873470 13793956 -326389 -5900628 -88695 4257020 753178
37386 753178 -3544227 -3973142 -4431682 -5211696 -218863 9555197 13679730 8240548 1815196
37377 1815196 723816 85797 -5042832 -10606196 -11720498 -10381396 -9130015 -5637649
37369 -5637649 886989 5983652 7615546 9361851 11285789 6938082 -4329099 -11290711
37361 -11290711 -5352109 6138629 9778158 3618077 -3904163 -7873723 -10271538 -11790991
37353 -11790991 -9528691 -3497858 1417583 1995325 931652 2559970 6579282 8074628
37345 8074628 3890879 -2160219 -2817826 3026245 7789828 5327404 -485885 -2688361
37337 -2688361 -2711292 -6709465 -12742527 -11706219 -1657609 8318374 10589130 6827856
37329 6827856 1479238 -3854841 -7152108 -6094599 -4289863 -8229562 -15109250 -13902596
37321 -13902596 -2749903 5508642 1104162 -9553612 -15323161 -14830630 -11674050 -5203192
37313 -5203192 4048134 8337542 3113209 -3260945 -1010259 5578647 5128429 -3319458
37305 -3319458 -11059060 -14247902 -16216288 -17365441 -13790912 -5915903 360654 1474534
37297 1474534 -1237000 -5481428 -8782654 -7966180 -3605856 -1310377 -3042141 -2794099
37289 -2794099 2450462 5107410 -89235 -3534065 5751494 20036881 21669323 8986745
37281 8986745 -2316688 -3057394 71785 574796 1874779 6401256 8600796 5103190
37273 5103190 1202621 1547348 3421247 3713862 3708717 3281795 -263609 -4008652 -289743
37264 -289743 9901847 15049329 10210322 5306535 9096467 14811013 10899713 -1533974
37256 -1533974 -11415761 -12325996 -6117380 3397143 12551655 17321855 17416192 17491928 19147344
37247 19147344 16770176 7332143 -1531136 -1232694 4455146 4660684 -2705002 -9142647
37239 -9142647 -8625803 -4173069 -698379 1558421 4191992 6185354 5216107 1343226
37231 1343226 -2207389 -1575210 3969030 10447402 12852791 10760606 8159040 7697791
37223 7697791 8329070 8826458 9534816 10064766 9723450 10429130 13504740 13536395 3524216
37214 3524216 -11958193 -18218631 -9689676 1461677 2649022 -1968011 -811263 5814932
37206 5814932 7366397 473782 -6788194 -7769789 -4843174 -2792431 -1923854 227110
37198 227110 4970094 11188093 15153816 12885993 5477985 -819906 -2964790 -4905844
37190 -4905844 -8722916 -8520885 -556759 6771208 3308625 -6677504 -10169336 -4858237
37182 -4858237 -718960 -2790569 -5322569 -4751202 -5528529 -8792602 -7272641 1937500
37174 1937500 9495101 6367875 -3496394 -10523440 -12602011 -12860297 -10476904 -3058248
37166 -3058248 5402378 8054568 5288624 3552092 4710699 3921335 -1286533 -6588041
37158 -6588041 -7843562 -7320593 -9346312 -12587995 -10740636 -1185553 9601506 11750333
37150 11750333 3432326 -5855898 -5901920 1965711 7107989 3539175 -3303911 -4993696
37142 -4993696 -282967 6058309 10293031 11435153 8802497 2640486 -3606724 -5359862
37134 -5359862 -1538277 4688694 9325314 10487922 9059397 7684763 7982358 8172981
37126 8172981 5449243 992449 -809502 605841 54400 -5350855 -10330129 -8100119
37118 -8100119 35355 7042245 10409712 14127315 20130958 23370926 18165950 6462076
37110 6462076 -3257384 -4657748 556527 5578788 6210344 4151093 2306406 -425678
37102 -425678 -6372515 -12866641 -14325280 -10957917 -9212878 -11399679 -11568483 -5920763
37094 -5920763 -634881 -2674946 -8172599 -8247701 -2829384 311892 -1720643 -4450375
37086 -4450375 -5300636 -5754915 -4199801 2953476 11204075 9832163 -2193907 -12358649
37078 -12358649 -12038334 -7936528 -9118287 -12431273 -10644987 -6916818 -8824466 -13209808
37070 -13209808 -10492566 -2118685 -48910 -7540761 -13117946 -7900380 1695915 4636207
37062 4636207 451167 -3177054 -2325915 502018 2240310 2214388 1420992 2652987 8622414
37053 8622414 16739345 19443584 13735054 6554798 5553786 7689403 3308735 -9810152
37045 -9810152 -22793039 -26513763 -21149087 -13790784 -10356998 -11283036 -12649054 -10491934
37037 -10491934 -5428285 -2644400 -5476738 -10191147 -10159570 -4610583 168264 -1458832
37029 -1458832 -8381196 -14409214 -13470447 -3792609 9551240 16553560 11171400 -657458
37021 -657458 -6065627 20135 9283472 11358371 6176571 821441 -2108979 -6305195
37013 -6305195 -12416589 -13873150 -5605725 6961465 12613788 7500794 -595478 -2518606
37005 -2518606 1151837 2606102 -1355751 -5032532 -2785071 2208302 2291428 -3748236
36997 -3748236 -9014898 -7781909 -1924553 3380407 6422889 8478039 9169835 6276566
36989 6276566 -80056 -6093620 -8129561 -6368263 -3731454 -2303728 -2008976 -2314848
36981 -2314848 -3586844 -5926044 -7752848 -7186766 -4669362 -2518512 -1675263 -935877 -135828
36972 -135828 -1522835 -5943607 -9792300 -8801989 -3971805 -726740 -2225385 -5988022
36964 -5988022 -7507408 -5309591 -1960587 -1032240 -2918724 -3504085 1074557 7561117
36956 7561117 7169960 -2873795 -13062117 -12096787 -1193014 8445475 10973865 10893864
36948 10893864 12045061 10236627 1054199 -11290875 -18294726 -16758519 -10058478 -3175150
36940 -3175150 -33673 -2348804 -7206205 -8519463 -4092024 1751664 5068542 7180128
36932 7180128 8947397 5805552 -5097873 -17027542 -20627660 -16471514 -13050955 -13767710
36924 -13767710 -14228819 -12410588 -12570033 -16505820 -18738853 -14858821 -9009045 -8039274
36916 -8039274 -11880491 -14471742 -12101628 -6761362 -2193857 299510 2174761 5204894
36908 5204894 8580941 8819958 4340534 -593101 -59193 5101264 7529033 3708562
36900 3708562 -695570 636955 4938413 4414961 -2084651 -7353563 -6017443 -1318130
36892 -1318130 339709 -1929179 -3320639 -354470 4820249 7320132 4850250 -800069
36884 -800069 -6448054 -10022602 -10437547 -7183157 -1840257 1237368 -1518772 -8337811
36876 -8337811 -13234412 -12243778 -6618590 430287 7078387 11381821 9913639 1905074
36868 1905074 -6791572 -8608745 -3710098 -288796 -3427024 -7463719 -3441268 7876396
36860 7876396 15617975 12220092 2793941 -1655632 2541377 8966830 10298015 6315733
36852 6315733 2391148 3162143 8849474 15551838 17955481 13486324 4900555 -2394698
36844 -2394698 -5791625 -6587765 -6066306 -3651466 376158 3758054 5271024 5689172 4532199
36835 4532199 -58987 -6405088 -9412828 -8830196 -11421899 -19453575 -23129142 -13295067
36827 -13295067 2468158 7768103 635268 -3502231 4827645 14789463 11634173 -1745218
36819 -1745218 -9834603 -6009986 1576525 4180398 2804903 2652372 4601994 5579033
36811 5579033 3105555 -3139071 -11219832 -16554755 -14638811 -6430124 1120802 2113684
36803 2113684 -2098782 -5476602 -4687490 -1745738 91349 418880 651530 723939 -887775
36794 -887775 -4020602 -6113652 -5788893 -5071818 -6057671 -7313390 -6649783 -5806044 -7817977
36785 -7817977 -10200877 -6468605 4034355 13522503 16062179 15027360 15823687 16640369
36777 16640369 13362528 9603977 12542136 19722702 20039552 10375467 2125366 5627807
36769 5627807 15156372 16988616 8143682 -1378790 -3601465 -1364498 -794928 -2456863
36761 -2456863 -3775312 -4760916 -6252762 -6038118 -2331232 986698 -1226774 -6345805
36753 -6345805 -6157226 636237 5331063 2388994 -1438208 2016280 8106832 6009163
36745 6009163 -3108957 -6407354 1001337 8979246 9659454 9847079 17360594 25293233
36737 25293233 22560127 13275858 10653664 14695369 12324943 887317 -5143285 3277645
36729 3277645 15466970 18580801 16783119 20655749 27333612 25916482 16964978 11429571
36721 11429571 12282692 11657853 6625621 4077570 7270616 10054988 8714605 8115266
36713 8115266 10722396 10309920 3470119 -2392321 -688376 3429104 2965568 2004152 7663772
36704 7663772 15194920 13758818 4058877 -2391981 -1011622 758790 -2649925 -7039127
36696 -7039127 -7479030 -5706323 -4582018 -3114610 -860884 -222443 -910069 808207 3921428
36687 3921428 1395365 -8487907 -16960329 -16246132 -9304334 -2601785 3391849 9486690
36679 9486690 10849261 3979264 -4678246 -6706155 -4330605 -5332474 -8787475 -6851311
36671 -6851311 850125 6046315 5548939 5345357 8981114 11835663 10027973 6012789
36663 6012789 1976953 -3544246 -8765565 -7663255 -1004622 881910 -6658507 -13110901
36655 -13110901 -7447536 4746843 9481296 4907758 1726628 4832924 6843635 1817926
36647 1817926 -5356862 -7916490 -7292333 -8261061 -9891724 -8061663 -3656837 -1630170
36639 -1630170 -3082888 -4306170 -4075817 -6241981 -12721884 -18548114 -18063331 -13157939
36631 -13157939 -10089545 -9463917 -6053469 359656 1761261 -5591049 -12332227 -8206409
36623 -8206409 1037861 -47439 -13682196 -23779151 -17530503 -2016194 7151220 5849042
36615 5849042 2180271 2750356 6712004 10616992 12020433 10063700 7755655 10582578
36607 10582578 17588267 18568553 7473445 -6076965 -8217517 -441013 3461111 -1241624
36599 -1241624 -4485188 1041780 8865513 10424599 7796074 7930625 11581265 14904911
36591 14904911 16636833 17286369 15428253 10465241 5581902 3122959 409802 -5582484
36583 -5582484 -12936312 -18147608 -20873584 -21365141 -17585033 -9575451 -2488996 -214845
36575 -214845 28433 1606070 1409095 -4775170 -13494326 -17313829 -15117098 -12412349 -13175328
36566 -13175328 -16958295 -21665122 -23425538 -16853939 -2427551 9160931 7898210 -2250402
36558 -2250402 -8916882 -8076425 -5879701 -5231833 -1970217 4071041 5540491 -568375
36550 -568375 -6990823 -7360517 -5066514 -5024598 -4049545 3122022 13324029 18040184 14421601
36541 14421601 7445153 2944327 2887455 5697266 7656489 5750640 1445380 -951627
36533 -951627 -1183498 -3975575 -10859031 -16376767 -16001669 -12504462 -9866443 -6105451 1852880
36524 1852880 10285170 12365833 7429624 864247 -3141560 -3656702 -494223 4530043
36516 4530043 5929875 305180 -7348003 -8759562 -3089217 2774658 4063364 3066905
36508 3066905 4108644 8068360 12500965 14229789 12118064 9367821 11068704 16799758
36500 16799758 18809556 11572498 106625 -6025185 -4305268 178505 2959328 3242792
36492 3242792 1060994 -2498579 -3668023 -58055 5117536 7479346 7493559 7296749 5597947
36483 5597947 1825925 684567 5089541 9479132 8958432 9622233 18621231 29079628
36475 29079628 28761513 20204080 16233714 17091403 10406552 -4359210 -11291604 -4037899
36467 -4037899 2568303 -3222578 -11484770 -9182472 -2194328 -3093995 -8700061 -7073092
36459 -7073092 1012786 4744455 2586003 2649325 6190406 5920306 527436 -2580423 -181030
36450 -181030 2562502 2368029 2439654 5048774 7766990 8586798 8155615 6642260 4254507
36441 4254507 3578792 5341102 4605319 -1564042 -6207362 -1352039 8177820 10320820
36433 10320820 3519603 -2082189 -861678 1924264 1151126 -1027154 -1119997 1107234
36425 1107234 5049616 8320426 4315179 -9365007 -21206099 -16876063 -453145 9234218
36417 9234218 5645145 2476622 9298302 15403724 8074167 -6591825 -13991750 -12020805
36409 -12020805 -7971035 -2137568 10228612 24437023 28909852 22377919 15803613 15104083
36401 15104083 13044871 2353089 -12022227 -19428333 -16706083 -9592996 -4387909 -3040198
36393 -3040198 -4925932 -9078459 -13743580 -15906131 -12983945 -5230811 3955277 10355740
36385 10355740 11362138 6496172 -2623993 -11720099 -15427913 -12207531 -6605599 -3851660
36377 -3851660 -3321733 -658032 4767667 8880609 9350481 8701438 10099741 13369993 15894648
36368 15894648 15029936 10246233 5533243 7540406 17061882 24910533 22243406 12836386
36360 12836386 7746917 9449351 10272554 6151163 1458962 -1495534 -6830952 -15086400
36352 -15086400 -19264494 -16333501 -13122175 -14395631 -14342492 -7577582 229454 1935533
36344 1935533 1248332 4731833 7974727 2228193 -8883937 -12342173 -4981045 1970298
36336 1970298 -589179 -8252001 -11137803 -5733137 4221429 12622647 14234452 8096342
36328 8096342 -111252 -3168306 -833513 951343 -401809 -1004887 1667157 3667776
36320 3667776 568534 -5763884 -10139957 -10942068 -10425599 -9926482 -8382023 -5289745 -2169164
36311 -2169164 -155505 1979697 5551578 8171268 4730901 -6066171 -17645824 -20954231
36303 -20954231 -14006823 -3646914 2367607 2403961 -72213 -1097862 1509568 7309155
36295 7309155 12551001 12433466 5971291 -2547495 -7770728 -7740131 -4300121 -860465 649599
36286 649599 2170299 7149428 13851633 14979817 8398487 3318498 8064132 15985053
36278 15985053 14491101 5727152 4552348 14954040 23392401 20341812 13880471 13970825
36270 13970825 16693711 14687687 11504731 12751038 12278789 1502011 -13755318 -19810943
36262 -19810943 -14670511 -8135456 -5405493 -3243379 -606009 -585058 -1897190 472794
36254 472794 5654187 7534548 5156848 3614212 4933835 6656624 8546104 11775141
36246 11775141 12600934 6438692 -2517612 -5582679 -3091875 -3565098 -9288346 -13048801
36238 -13048801 -10275859 -4682934 -528451 1611626 729250 -3343118 -4335968 3781359
36230 3781359 13616602 10418701 -5511237 -15441244 -7348025 7221905 9989336 483358
36222 483358 -6497909 -2563398 5357400 6704539 331469 -5940310 -5443737 29035
36214 29035 3812641 3967401 4734404 6895386 3968863 -6096677 -13073192 -8271038 64171
36205 64171 -1803476 -10559406 -10335733 1646362 11024934 9803745 6476297 7592694
36197 7592694 6385409 -1539242 -6328233 962925 12932255 16772813 11340151 3346460
36189 3346460 -4139149 -9083395 -5590696 6769730 16292430 13358784 4725161 2293571
36181 2293571 4427425 1312923 -6593942 -9891500 -7385676 -7789720 -14157908 -19202982
36173 -19202982 -17981636 -14447810 -12530595 -9832356 -3899123 2247467 4572529 3282099
36165 3282099 1170982 349747 1616335 3497805 1810118 -5730621 -14383839 -16292686
36157 -16292686 -10165747 -2950359 -750347 -1862073 -921125 2691755 3802161 -992830
36149 -992830 -7052110 -5910920 3793866 13269284 14286679 9374442 6449649 6628080
36141 6628080 4610447 -607309 -3829764 -2259460 2141387 8378991 15326175 15897307
36133 15897307 4353181 -10031863 -10853977 942480 6169416 -3649979 -13806635 -11914700
36125 -11914700 -7517484 -12089860 -16730972 -9108975 1254031 -2209275 -12369822 -8028841
36117 -8028841 9674224 16793340 4323737 -8585530 -6076679 1933808 -182782 -9071282
36109 -9071282 -11436202 -5472746 7926 61504 -3579518 -8462376 -11793979 -9996081
36101 -9996081 -4519168 -2734870 -7334136 -10837424 -6455554 1705769 5400439 3410144
36093 3410144 -153723 -2993174 -3632624 1098308 10351786 15831578 11753116 4419016
36085 4419016 4088646 10396756 14030389 10863254 5757406 2573993 -1019264 -6656858
36077 -6656858 -10169696 -7178727 333901 6394878 7590517 5048865 1970709 1161301
36069 1161301 3420536 6557805 6976073 3549287 -919921 -3059625 -2532292 -919399
36061 -919399 1655934 6261420 11685363 14106727 11512441 6391798 2599768 1591019
36053 1591019 3289255 7596417 11961544 10882979 3130874 -3140166 205857 7849780
36045 7849780 6219715 -6216517 -14173365 -6574358 6925522 9364140 -90071 -6993749
36037 -6993749 -3044680 4365087 4807971 -2034938 -8963682 -10910391 -8503163 -5173838
36029 -5173838 -3107411 -1223987 2438098 5835499 3826158 -3544839 -8323115 -5173484
36021 -5173484 -310588 -3019221 -11485336 -15498750 -12033802 -9194130 -13383706 -20353699
36013 -20353699 -22035254 -16846601 -10163673 -7727894 -10134581 -11892406 -6790685 3316758
36005 3316758 7953648 681186 -11111564 -15521594 -12175083 -10599037 -14233899 -15812924
35997 -15812924 -9637637 470337 7806958 9934802 7206804 1389270 -2296278 825410
35989 825410 6592376 5272392 -4232480 -11286112 -8131640 110337 4462266 3821418
35981 3821418 2411115 1998254 2494578 4867544 7617069 5267492 -3528886 -10650235
35973 -10650235 -7808079 1756243 7125008 3476077 -3484080 -5915264 -2162956 3057509
35965 3057509 3902717 -665077 -4976841 -2789665 3964803 6666979 1977900 -3097581
35957 -3097581 -1889066 1617765 -754424 -8260018 -11963501 -7701371 -1631999 -1584064
35949 -1584064 -7605966 -13089212 -12538668 -6819987 -2263480 -4807047 -13326489 -19057557
35941 -19057557 -14076667 -671280 10381996 12092467 9122787 10556597 16719595 18444919
35933 18444919 10698792 985616 -1044591 2120982 428367 -6742907 -9162561 -3390498
35925 -3390498 254321 -5086778 -9938619 -3417136 8059769 10421943 3891820 -203282
35917 -203282 -863900 -7963211 -20730905 -24012301 -11940958 465402 -1530756 -12146712
35909 -12146712 -16346597 -11417749 -5972239 -4405838 -3875135 -3123486 -4322579 -7303799
35901 -7303799 -9117064 -8658535 -7170593 -5778213 -5639552 -7651352 -9676819 -8292197
35893 -8292197 -5098526 -5158603 -6990060 -2581739 8268123 13127723 3810685 -10277868
35885 -10277868 -14758455 -9323732 -4223171 -3622417 -3641067 -2895336 -3323287 -2586353 3114208
35876 3114208 9388957 7595962 -1155001 -6036416 -1847464 5073127 8046812 7863050
35868 7863050 6549090 2297829 -4906580 -9960201 -9925476 -8707306 -9699031 -9431665 -4204200
$$ [...]
##END NTUPLES=NMR SPECTRUM
##END=
