##TITLE=31Pdec_SR137_rm2d
 , 24 sc
 29.7.2022
##JCAMPDX= 6.0         $$ Bruker NMR JCAMP-DX V2.0
##DATA TYPE= NMR SPECTRUM
##DATA CLASS= NTUPLES
##ORIGIN= UXNMR, Bruker Analytische Messtechnik GmbH
##OWNER= root
$$ XWIN-NMR		Version 3.5
$$ Fri Jul 29 13:49:41 2022 Russian Standard Time (UT+4h)  she@DPX200
##.OBSERVE FREQUENCY= 81.013821
##.OBSERVE NUCLEUS= ^31P
##.ACQUISITION MODE= SIMULTANEOUS
##.ACQUISITION SCHEME= undefined
##.AVERAGES= 24
##.DIGITISER RES= 16
##SPECTROMETER/DATA SYSTEM= spect
##.PULSE SEQUENCE= zgpg30
##.SOLVENT NAME= CD2Cl2
##.SHIFT REFERENCE= (INTERNAL, CD2Cl2, 0, 248.564)
##AUDIT TRAIL= $$ (NUMBER, WHEN, WHO, WHERE, WHAT)
$$ ##TITLE= Audit trail, XWIN-NMR		Version 3.5
$$ ##JCAMPDX= 5.01
$$ ##ORIGIN= Bruker BioSpin GmbH
$$ ##OWNER= she
$$ F:/spectra/data/she/nmr/P31/1/pdata/1/auditp.txt
$$ ##AUDIT TRAIL=  $$ (NUMBER, WHEN, WHO, WHERE, WHAT)
(   1,<2022-07-29 13:48:30.67 +0400>,<she>,<DPX200>,
      <created by zg, POWCHK disabled, PULCHK disabled
       configuration hash MD5:
       00 E9 B6 7A A2 85 ED C7 34 08 36 98 17 FE 4E 26
       data hash MD5: 32K
       9A 0E 7D BF F6 C6 49 34 01 E7 C8 4D 88 79 E1 B8>)
(   2,<2022-07-29 13:48:33.21 +0400>,<she>,<DPX200>,
      <Start of raw data processing
       efp BC_mod = 2 LB = 1 FT_mod = 6 PKNL = 1 PHC0 = -10392.98 PHC1 = 369.6567 SI = 64K 
       data hash MD5: 64K
       0A D0 AD 57 9E 15 21 D1 96 78 81 43 0B 54 62 6B>)
(   3,<2022-07-29 13:48:49.92 +0400>,<she>,<DPX200>,
      <pk PHC0 = 28.32259 PHC1 = -82.99999 
       data hash MD5: 64K
       15 99 68 4F 49 CD D8 18 B4 E9 71 12 3A 54 36 BD>)
(   4,<2022-07-29 13:49:10.37 +0400>,<she>,<DPX200>,
      <pk PHC0 = 127.0058 PHC1 = -291.8003 
       data hash MD5: 64K
       FD 73 1B DB F8 A2 C1 60 F8 3E F4 08 71 7B 9A 66>)
(   5,<2022-07-29 13:49:13.03 +0400>,<she>,<DPX200>,
      <abs ABSG = 5 
       data hash MD5: 64K
       C4 1F F4 52 63 67 70 AE 90 14 5F 47 EA 3D 27 14>)
$$ ##END=
$$ 
$$ hash MD5
$$ 0A 4C 64 65 EC A3 D6 1A CF 17 84 26 C4 7A 8F D3
##$RELAX= 
##$RELAX= 
##$RELAX= 
##$RELAX= 
##$RELAX= 
##$RELAX= 
##$RELAX= 
##$RELAX= 
$$ Bruker specific parameters
$$ --------------------------
##$DU= <F:/spectra>
##$EXPNO= 1
##$NAME= <P31>
##$PROCNO= 1
##$TYPE= <nmr>
##$USER= <she>
##$AMP= (0..31)
100 100 100 100 100 100 100 100 100 100 100 100 100 100 100 100 100 100 
100 100 100 100 100 100 100 100 100 100 100 100 100 100 
##$AQSEQ= 0
##$AQ_mod= 1
##$AUNM= <au_zg>
##$AUTOPOS= <>
##$BF1= 81.014009
##$BF2= 200.13
##$BF3= 200.13
##$BF4= 200.13
##$BF5= 200.13
##$BF6= 200.13
##$BF7= 200.13
##$BF8= 200.13
##$BYTORDA= 1
##$CFDGTYP= 0
##$CFRGTYP= 5
##$CHEMSTR= <none>
##$CNST= (0..31)
1 1 145 1 1 1 1 1 1 1 1 1 1 1 1 1 1 1 1 1 1 1 1 1 1 1 1 1 1 1 1 1 
##$CPDPRG= <waltz16>
##$CPDPRG1= <>
##$CPDPRG2= <waltz16>
##$CPDPRG3= <>
##$CPDPRG4= <mlev>
##$CPDPRG5= <mlev>
##$CPDPRG6= <mlev>
##$CPDPRG7= <mlev>
##$CPDPRG8= <mlev>
##$CPDPRGB= <>
##$CPDPRGT= <>
##$D= (0..31)
$$ [...]
##$SUBNAM3= <"">
##$SUBNAM4= <"">
##$SUBNAM5= <"">
##$SUBNAM6= <"">
##$SUBNAM7= <"">
##$SUBNAM8= <"">
##$SUBNAM9= <"">
##$SW= 501.771253377433
##$SWIBOX= (0..15)
0 1 3 0 0 0 0 0 0 0 0 0 0 0 0 0 
##$SW_h= 40650.406504065
##$TD= 32768
##$TD0= 1
##$TE= 0
##$TE2= 300
##$TE3= 300
##$TEG= 300
##$TL= (0..7)
0 120 53 12 22 120 120 120 
##$TP= (0..7)
150 150 150 150 150 150 150 150 
##$TP07= 0
##$TPNAME0= <>
##$TPNAME1= <>
##$TPNAME2= <>
##$TPNAME3= <>
##$TPNAME4= <>
##$TPNAME5= <>
##$TPNAME6= <>
##$TPNAME7= <>
##$TPOAL= (0..7)
0.5 0.5 0.5 0.5 0.5 0.5 0.5 0.5 
##$TPOFFS= (0..7)
0 0 0 0 0 0 0 0 
##$TUNHIN= 0
##$TUNHOUT= 0
##$TUNXOUT= 0
##$USERA1= <user>
##$USERA2= <user>
##$USERA3= <user>
##$USERA4= <user>
##$USERA5= <user>
##$V9= 5
##$VALIST= <valist>
##$VCLIST= <CCCCCCCCCCCCCCC>
##$VD= 0
##$VDLIST= <DDDDDDDDDDDDDDD>
##$VPLIST= <PPPPPPPPPPPPPPP>
##$VTLIST= <TTTTTTTTTTTTTTT>
##$WBST= 1024
##$WBSW= 4
##$XGAIN= (0..3)
0 0 0 0 
##$XL= 0
##$YL= 0
##$YMAX_a= 10384
##$YMIN_a= -14878
##$ZGOPTNS= <>
##$ZL1= 120
##$ZL2= 120
##$ZL3= 120
##$ZL4= 120
##$ABSF1= 248.5645
##$ABSF2= -253.2056
##$ABSG= 5
##$ABSL= 3
##$ALPHA= 0
##$AQORDER= 0
##$ASSFAC= 0
##$ASSFACI= 0
##$ASSFACX= 0
##$ASSWID= 0
##$AUNMP= <proc_1d>
##$AZFE= 0.1
##$AZFW= 0.5
##$BCFW= 0
##$BC_mod= 2
##$BYTORDP= 0
##$COROFFS= 0
##$CY= -3
##$DATMOD= 1
##$DC= 0
##$DFILT= <>
##$DTYPP= 0
##$F1P= 0
##$F2P= 0
##$FCOR= 1
##$FTSIZE= 65536
##$FT_mod= 6
##$GAMMA= 0
##$GB= 0
##$INTBC= 1
##$INTSCL= 5.30512e-09
##$ISEN= 30
##$LB= 1
##$LEV0= 0
##$LPBIN= 0
##$MAXI= 10000
##$MC2= 0
##$MEAN= 0
##$ME_mod= 0
##$MI= 50
##$NCOEF= 0
##$NC_proc= -8
##$NLEV= 6
##$NOISF1= 182.463
##$NOISF2= 159.3651
##$NSP= 0
##$NTH_PI= 0
##$NZP= 0
##$OFFSET= 248.5645
##$PC= 4
##$PHC0= -10237.65
##$PHC1= -5.143585
##$PH_mod= 1
##$PKNL= yes
##$PPARMOD= 0
##$PSCAL= 0
##$PSIGN= 0
##$REVERSE= no
##$SF= 81.014009
##$SI= 65536
##$SIGF1= 159.3651
##$SIGF2= -187.1042
##$SINO= 113.3802
##$SIOLD= 16384
##$SREGLST= <1H.CDCl3>
##$SSB= 0
##$STSI= 65536
##$STSR= 0
##$SW_p= 40650.406504065
##$SYMM= 0
##$S_DEV= 0
##$TDeff= 32768
##$TDoff= 0
##$TI= <>
##$TILT= no
##$TM1= 0
##$TM2= 0
##$TOPLEV= 0
##$USERP1= <user>
##$USERP2= <user>
##$USERP3= <user>
##$USERP4= <user>
##$USERP5= <user>
##$WDW= 1
##$XDIM= 65536
##$YMAX_p= 417246185
##$YMIN_p= -212413059
$$ End of Bruker specific parameters
$$ ---------------------------------
##NTUPLES= NMR SPECTRUM
##VAR_NAME=  FREQUENCY,     SPECTRUM/REAL,   SPECTRUM/IMAG
##SYMBOL=    X,             R,               I
##VAR_TYPE=  INDEPENDENT,   DEPENDENT,       DEPENDENT
##VAR_FORM=  AFFN,          ASDF,            ASDF
##VAR_DIM=   65536,         65536,           65536
##UNITS=     HZ,            ARBITRARY UNITS, ARBITRARY UNITS
##FACTOR=    0.620285442955139, 1,           1
##FIRST=     20137.2065510759, 0,            0
##LAST=      -20513.1999529892, 0,           0
##MIN=       -20513.1999529892, -212413059,  0
##MAX=       20137.2065510759, 417246185,    0
$$ Real data points
##PAGE= N=1
##DATA TABLE= (X++(R..R)), XYDATA
$$ [...]
$$ plain form
13033 -3155394 -3654175 -4748423 -2787222 1583728 4541956 4703049 4312974 5024197 5493899
13024 5493899 3995761 1350197 69853 1511682 4546059 6618590 6105170 4081275
13016 4081275 3350712 5036400 6902430 6264681 3732310 2155967 2288043 1928338 -262609
13007 -262609 -2606390 -3092600 -1901543 168451 3327883 6666011 6875601 2558235 -1884647
12998 -1884647 -1081512 3071125 3006713 -3677794 -10154689 -9824245 -5138413 -2675315 -3103215
12989 -3103215 -1859366 1988522 4003366 1938818 -652300 -221395 1903697 2842851
12981 2842851 2671482 2922348 3513226 3860504 4689127 6277570 7124391 6670438 6926075
12972 6926075 8851937 9750901 7396209 4201495 3455905 3674252 1353199 -2198724 -2173627
$$ packed form
13033c155394m98781j094248J961201M370950K958228J61093l90075P11223M69702
13024E493899j498138k645564j280344J441829L034377K072531n13420k023895
13016D081275p30563J685688J866030o37749k532371j576343J32076l59705k190947
13007b62609k343781m86210J191057K069994L159432L338128K09590m317366m442882
12998a884647Q03135M152637o4412o684507o476895L30444M685832K463098m27900
12989c103215J243849L847888K014844k064548k591118M30905K125092R39154
12981B842851j71369K50866N90878L47278Q28623J588443Q46821m53953K55637
12972F926075J925862Q98964k354692l194714p45590K18347k321053l551923K5097
$$ plain form
12963 -2173627 1899522 5072468 4568920 3353730 4434432 6351607 6922139 7365086 9405805
12954 9405805 11445841 11190825 9823276 10074956 11772805 12581211 11928065 11013034 9841263
12945 9841263 7460560 4727932 3794225 4735744 5244244 3892955 1602925 -155106 -583778
12936 -583778 832041 3674943 5633728 4613669 1892199 632090 1136168 674936 -1290960
12927 -1290960 -1360118 2338976 6173473 5677278 2021270 85233 1107439 1269883 -2008005
12918 -2008005 -5998859 -6561620 -3613341 -568746 227228 -717851 -2246420 -4354444 -7229215
12909 -7229215 -9749654 -9964260 -7081962 -2735944 85338 -36256 -1065894 380394
12901 380394 4418626 6699302 3468718 -3034887 -6722100 -5314011 -3051876 -4467585
$$ packed form
12963b173627M073149L172946n03548j215190J080702J917175N70532M42947K040719
12954I405805K040036k55016j367549K51680J697849Q08406o53146r15031j171771
12945I841263k380703k732628r33707R41519N08500j351289k290030j758031m28672
12936e83778J415819K842902J958785j020059k721470j260109N04078m61232j965896
12927a290960o9158L699094L834497m96195l656008j936037J022206J62444l277888
12918b008005l990854n62761K948279L044595P95974r45079j528569k108024k874771
12909g229215k520439k14606K882298M346018K821282j21594j029638J446288
12901C80394M038232K280676l230584o503605l687213J408089K262135j415709
$$ plain form
12893 -4467585 -8155802 -9319235 -6606642 -3007357 -768172 779054 2016769 1506986
12885 1506986 -853255 -2431837 -1802449 -1317032 -3068779 -4717093 -2831108 1107057
12877 1107057 1952909 -2088424 -7158129 -8898758 -7070870 -4392400 -3246434 -4286544
12869 -4286544 -6220378 -6408684 -3666595 -745513 -1677388 -6245133 -9738597 -8918601 -5394808
12860 -5394808 -2037236 849373 3992537 6699644 8245959 9280706 9555704 6899049
12852 6899049 1366068 -2237603 -30108 4434312 3940508 -2510684 -8120684 -7285126
12844 -7285126 -2128438 1501367 1221399 -914367 -2241139 -1750988 275796 2770686
12836 2770686 4349262 4554732 4304559 4275351 3452139 417984 -4030515 -6635518 -4754708
$$ packed form
12893d467585l688217j163433K712593L599285K239185J547226J237715n09783
12885A506986k360241j578582O29388M85417j751747j648314J885985L938165
12877A107057Q45852m041333n069705j740629J827888K678470J145966j040110
12869d286544j933834j88306K742089K921082r31875m567745l493464Q19996L523793
12860e394808L357572K886609L143164K707107J546315J034747K74998k656655
12852F899049n532981l603671K207495M464420m93804o451192n610000Q35558
12844g285126N156688L629805k79968k135766j326772M90151K026784K494890
12836B770686J578576K05470k50173k9208q23212l034155m448499k605003J880810
$$ plain form
12827 -4754708 454720 4668329 4816592 2395587 1285830 2653135 3968151 3473122
12819 3473122 3086997 5089789 7909474 7879985 4364404 597277 -535657 380498 667343
12810 667343 -1128458 -3570713 -3928180 -2108221 -2229709 -7537528 -13870493 -12895821 -3847993
12801 -3847993 3323717 897352 -5499526 -5274193 1382329 4684904 768654 -3435291
12793 -3435291 -2276088 399101 -1260262 -6330276 -10212722 -11194521 -9762441 -5879714
12785 -5879714 -822840 2243063 2832054 4165810 6775519 6216197 909670 -3229505
12777 -3229505 -1060928 3768309 4804441 2455596 1337023 1631068 122537 -2648209
12769 -2648209 -3320963 -2292309 -2687770 -3712876 -1451586 4013317 8119616 8420247 6552792
$$ packed form
12827d754708N209428M213609J48263k421005j109757J367305J315016m95029
12819C473122l86125K002792K819685k9489l515581l767127j132934R16155K86845
12810F67343j795801k442255l57467J819959j21488n307819o332965R74672R047828
12801c847993P171710k426365o396878K25333O656522L302575l916250m203945
12793c435291J159203K675189j659363n070014l882446r81799J432080L882727
12785e879714N056874L065903N88991J333756K609709n59322n306527m139175
12777c229505K168577M829237J036132k348845j118573K94045j508531k770746
12769b648209o72754J028654l95461j025106K261290N464903M106299L00631j867455
$$ plain form
12760 6552792 4078220 1404225 192698 1697176 3429753 2529231 1145562 2841738
12752 2841738 5302697 3417657 -1597985 -3842999 -2983413 -4453744 -8914571 -10472595
12744 -10472595 -7281431 -4912807 -5991030 -5228383 701437 6386599 6327599 3410580
12736 3410580 2722171 2972359 457108 -3543820 -5655615 -6267187 -6584367 -4402401 911060
12727 911060 3866647 556748 -3082284 1104077 10325499 13941153 8558346 1633974
12719 1633974 -231708 1237069 1720401 711953 -269512 -793963 -539743 1000644 2395159
12710 2395159 1321264 -1460739 -2760264 -2064807 -2118757 -3902532 -5263368 -5435153 -6504317
12701 -6504317 -8802575 -9055144 -5466801 -1226761 -273070 -2021739 -2775067 -657831 2856171
$$ packed form
12760F552792k474572k673995j211527J504478J732577r00522j383669J696176
12752B841738K460959j885040n015642k245014Q59586j470331m460827j558024
12744a0472595L191164K368624j078223P62647N929820N685162n9000k917019
12736C410580o88409K50188k515251m000928k111795o11572l17180K181966N313461
12727I11060K955587l309899l639032M186361R221422L615654n382807o924372
12719A633974j865682J468777M83332j008448r81465n24451K54220J540387J394515
12710B395159j073895k782003j299525O95457n3950j783775j360836j71785j069164
12701f504317k298258k52569L588343M240040R53691j748669p53328K117236L514002
$$ plain form
12692 2856171 5115732 4598670 2084744 304043 1332151 4129088 6070615 6657618
12684 6657618 7514617 8744439 8097338 4629218 722156 -893019 -408535 -57828 -1202971
12675 -1202971 -3146604 -4026902 -2700536 -458097 -218969 -2827037 -5348268 -4959832 -3063750
12666 -3063750 -2749494 -3553157 -2482415 506146 2363785 2285265 2670718 4033839 3489661
12657 3489661 -251676 -4614248 -7503485 -9637276 -10692354 -7947213 -1651929 2994460
12649 2994460 3125751 3109614 7373762 12257280 11077840 4615240 -299425 -1354086 -2588095
12640 -2588095 -5340157 -4993832 527428 5596212 4734514 849488 295878 2939415 3119651
12631 3119651 -892329 -4577118 -4881754 -4565214 -6406681 -7710211 -4700073 357642
$$ packed form
12692B856171K259561n17062k513926j780701J028108K796937J941527N87003
12684F657618Q56999J229822o47101l468120l907062j615175M84484L50707j145143
12675a202971j943633q80298J326366K242439K39128k608068k521231L88436J896082
12666c063750L14256q03663J070742K988561J857639p8520L85453J363121n44178
12657C489661l741337m362572k889237k133791j055078K745141O295284M646389
12649B994460J31291j6137M264148M883518j179440o462600m914665j054661j234009
12640b588095k752062L46325N521260N068784q61698l885026n53610K643537J80236
12631C119651m011980l684789l04636L16540j841467j303530L010138N057715
$$ plain form
12623 357642 1389795 -2587288 -5374227 -1720154 5897309 10838854 10260794 6857055
12615 6857055 4144667 2973025 2326654 912658 -2326203 -7006632 -10126728 -8391001
12607 -8391001 -2770411 1345279 248812 -3350279 -3768069 361615 4584692 4365588
12599 4365588 21246 -4873967 -7968777 -9262402 -9021140 -7135313 -4819895 -4663153
12591 -4663153 -7500717 -10553608 -10467365 -7560039 -5145898 -4823512 -4600543 -2306289 1127060
12582 1127060 3109830 2728035 1079458 -820362 -2715101 -3854265 -2642048 1686583
12574 1686583 7438514 11177644 10724896 7688098 6114469 7703554 9400149 7456147
12566 7456147 2844804 -118141 -2243 598896 545139 2279203 6509774 9182987 7292297
$$ packed form
12623C57642J032153l977083k786939L654073P617463M941545n78060l403739
12615F857055k712388j171642o46371j413996l238861m680429l120096J735727
12607h391001N620590M115690j096467l599091m17790M129684M223077k19104
12599D365588m344342m895213l094810j293625K41262J885827K315418J56742
12591d663153k837564l052891Q6243K907326K414141L22386K22969K294254L433349
12582A127060J982770l81795j648577j899820j894739j139164J212217M328631
12574A686583N751931L739130m52748l036798j573629J589085J696595j944002
12566G456147m611343k962945J15898O01139n3757J734064M230571K673213j890690
$$ plain form
12557 7292297 4203515 4813254 7946176 8409460 5011416 1537684 524568 1031268 2477735
12548 2477735 5661546 9181491 9560809 6542656 4359435 5842368 8435643 7938104
12540 7938104 3713985 -1287639 -3552694 -1193084 4478817 8886269 8204635 3898787
12532 3898787 614122 -336161 -1704070 -4333229 -5073107 -2115996 1883570 3970785
12524 3970785 4251121 3323116 756473 -1665159 -63969 5022271 7108384 2767282
12516 2767282 -2478916 -2146867 1704504 2898310 1373942 1997285 5529593 8173452
12508 8173452 8933777 9999483 10229277 6193679 508538 789702 7661684 11806875 7380931
12499 7380931 1119383 1793786 6459853 5417653 -2282292 -7182982 -3284648 4287042
$$ packed form
12557G292297l088782O09739L132922M63284l398044l473732j013116N06700J446467
12548B477735L183811L519945L79318l018153k183221J482933K593275m97539
12540G938104m224119n001624k265055K359610N671901M407452o81634m305848
12532C898787l284665r50283j367909k629159p39878K957111L999566K087215
12524C970785K80336r28005k566643k421632J601190N086240K086113m341102
12516B767282n246198L32049L851371J193806j524368O23343L532308K643859
12508H173452P60325J065706K29794m035598n685141K81164O871982M145191m425944
12499G380931o261548O74403M666067j042200p699945m900690L898334P571690
$$ plain form
12491 4287042 7747910 6572214 5211785 5267242 4612992 2331712 158428 -855027 -1862458
12482 -1862458 -3640932 -4654073 -2944948 945218 3868074 2815668 -2195131 -7715906
12474 -7715906 -9762218 -7712366 -4770169 -3741596 -3354956 -597830 3947811 5966253
12466 5966253 3236513 -1292167 -3937958 -5180114 -7498218 -10426746 -11290331 -9788999
12458 -9788999 -8020625 -6199551 -2479990 2222776 3506522 -280422 -4606034 -4610774 -1837033
12449 -1837033 -1490001 -4411164 -5742822 -1838605 4630848 7786094 5091618 -432221
12441 -432221 -3912979 -3729173 -2743405 -4367491 -7841362 -8722520 -4518272 1714623 4767135
12432 4767135 3274259 625957 340923 2383920 4422857 5131472 4968999 4249193 2050200
$$ packed form
12491D287042L460868j175696j360429N5457o54250k281280k173284j013455j007431
12482a862458j778474j013141J709125L890166K922856j052406n010799n520775
12474g715906k046312K049852K942197J028573L86640K757126M545641K018442
12466E966253k729740m528680k645791j242156k318104k928528q63585J501332
12458i788999J768374J821074L719561M702766J283746l786944m325612m740K773741
12449a837033L47032k921163j331658L904217O469453L155246k694476n523839
12441d32221l480758J83806R85768j624086l473871q81158M204248O232895L052512
12432D767135j492876k648302k85034K042997K038937P08615j62473p19806k198993
$$ plain form
12423 2050200 -2073749 -6191704 -7481221 -5667404 -3176840 -1484488 141911 1036450
12415 1036450 -2210597 -10168946 -16641184 -15354499 -8879502 -5073485 -5516476 -4496831
12407 -4496831 -42309 2272405 -364149 -1990710 2186782 6694118 4128985 -2460806
12399 -2460806 -4223084 -522024 874774 -3197671 -7030754 -5958603 -2698096 -1268024
12391 -1268024 -1006013 267418 2202650 4009707 6366857 8598523 7774369 3130296
12383 3130296 -2012747 -4824915 -6029028 -6653855 -5760150 -3623588 -2957399 -4067723 -2909464
12374 -2909464 2378022 6699658 4262047 -2951621 -7549269 -6117728 -2154572 -471571
12366 -471571 -2287111 -5591668 -7535617 -6519649 -3732243 -2005320 -2015802 -1372975 1169491
$$ packed form
12423B050200m123949m117955j289517J813817K490564J692352J626399Q94539
12415A036450l247047p958349o472238J286685O474997L806017m42991J019645
12407d496831M454522K314714k636554j626561M177492M507336k565133o589791
12399b460806j762278L701060J396798m072445l833083J072151L260507J430072
12391a268024K62011J273431J935232J807057K357150K231666q24154m644073
12383C130296n143043k812168j204113o24827Q93705K136562O66189j110324J158259
12374b909464N287486M321636k437611p213668m597648J431541L963156J683001
12366d71571j815540l304557j943949J015968K787406J726923j0482O42827K542466
$$ plain form
12357 1169491 3286416 3027348 2108943 2249276 1560336 -1157227 -1678592 4258121 12669096
12348 12669096 15065683 10294010 6023504 7268299 9874527 8102024 3054447 -275384
12340 -275384 -90751 2117317 5109084 7287747 5374647 -1589473 -8586087 -9500439 -4819180
12331 -4819180 -364704 916613 1402614 3020076 3887630 2308932 72857 -711496 -1065744
12322 -1065744 -2601279 -3722534 -1574254 3243886 6876112 7027594 5291799 4463261
12314 4463261 5433821 7250566 8705406 9008820 7749228 5060572 1841552 -341001
12306 -341001 98669 3322507 7036365 8219076 6741366 5782945 7251508 8579176 6589533
12297 6589533 3105169 3048359 7255218 11206867 11685037 10638159 10757842 11278818 10925486
$$ packed form
12357A169491K116925k59068r18405J40333o88940k717563n21365N936713Q410975
12348A2669096K396587m771673m270506J244795K606228j772503n047577l329831
12340b75384J84633K208068K991767K178663j913100o964120o996614r14352M681259
12331d819180M454476J281317M86001J617462Q67554j578698k236075p84353l54248
12322a065744j535535j121255K148280M818140L632226J51482j735795q28538
12314D463261R70560J816745J454840L03414j259592k688656l219020k182553
12306c41001M39670L223838L713858J182711j477710r58421J468563J327668j989643
12297F589533l484364n6810M206859L951649M78170j046878J19683N20976l53332
$$ plain form
12288 10925486 11245070 13104310 12928974 7328839 -374078 -3497842 -1133196 1392927
12280 1392927 1258719 1659137 5019164 8059412 6793885 2542365 -578581 -1361901 -1259622
12271 -1259622 -649094 1007539 2588214 2293016 634221 -285365 5356 270708 195806
12262 195806 651026 1611524 2094668 2050056 2245337 2476298 2062186 1989008 4064973 7464099
12252 7464099 8490130 5020918 -335763 -2798332 -408795 4221779 6619051 4594454
12244 4594454 221900 -2312429 -1287446 715325 466111 -1462114 -1931076 -401816
12236 -401816 61026 -2210228 -4278852 -2555373 1798084 4092476 2104737 -1767151
12228 -1767151 -4449457 -5601990 -5942718 -4680285 -1199664 2043079 1751248 -878603
$$ packed form
12288A0925486L19584J859240j75336n600135p702917l123764K364646K526123
12280A392927j34208M00418L360027L040248j265527m251520l120946p83320J02279
12271a259622O10528J656633J580675k95198j658795r19586K90721K65352p4902
12262A95806M55220R60498M83144m4612J95281K30961m14112p3178K075965L399126
12252G464099J026031l469212n356681k462569K389537M630574K397272k024597
12244D594454m372554k534329J024983K002771k49214j928225m68962J529260
12236d01816M62842k271254k068624J723479M353457K294392j987739l871888
12228a767151k682306j152533l40728J262433L480621L242743k91831k629851
$$ plain form
12220 -878603 -674071 3899411 7055439 3124006 -4746322 -8274597 -5647148 -3597695
12212 -3597695 -6621594 -10128126 -8058627 -2400800 425021 -400517 -10687 3341313
12204 3341313 5709431 4247911 999522 -1584890 -3985623 -6419061 -6779495 -4456128
12196 -4456128 -2412028 -2548555 -2393188 460586 3796112 4238115 2533365 1529783 1328318
12187 1328318 663856 918080 3828300 6683431 5232794 796243 -1179028 191144
12179 191144 102216 -3061754 -4252303 -414970 3297694 1075973 -4166077 -5140780 -1298772
12170 -1298772 1113008 -646602 -2202283 -52986 2791215 2212194 -400264 -904505
12162 -904505 954114 1783927 113615 -2106007 -3244337 -3760303 -3757908 -1938200 1609753
$$ packed form
12220h78603K04532M573482L156028l931433p870328l528275K627449K049453
12212c597695l023899l506532K069499N657827K825821q25538L89830L352000
12204C341313K368118j461520l248389k584412k400733k433438l60434K323367
12196d456128K044100j36527J55367K853774L335526M42003j704750j003582k01465
12187A328318o64462K54224K910220K855131j450637m436551j975271J370172
12179A91144q8928l163970j190549L837333L712664k221721n242050r74703L842008
12170a298772K411780j759610j555681K149297K844201n79021k612458n04241
12162i04505J858619Q29813j670312k219622j138330n15966K395J819708L547953
$$ plain form
12153 1609753 4014832 3013198 184542 -1279271 -998238 -1255988 -2852689 -3749215 -2483551
12144 -2483551 -654375 -646663 -2551732 -4860788 -6696464 -7430946 -5499948 -409716 4576881
12135 4576881 4920276 630959 -3058103 -1979264 2316889 5489344 5615851 3628143
12127 3628143 760735 -1851938 -2539876 -864600 810173 99141 -1727285 -1471897 1165146
12118 1165146 3440874 4050859 4549247 5879116 6687147 6141574 5521236 5572301 4925371
12109 4925371 2905103 1568407 2813133 5215828 5857568 4034633 1400505 -383667
12101 -383667 -596194 684994 2242867 2529811 1893730 2183953 3154530 2139933 -798019
12092 -798019 -965487 4179181 9504766 8490293 2976199 630872 3316781 4746004
$$ packed form
12153A609753K405079j001634k828656j463813K81033k57750j596701q96526J265664
12144b483551J829176P712j905069k309056j835676p34482J930998N090232M986597
12135D576881L43395m289317l689062J078839M296153L172455J26507j987708
12127C628143k867408k612673o87938J675276J674773p11032j826426K55388K637043
12118A165146K275728O09985M98388J329869Q08031n45573o20338N1065o46930
12109D925371k020268j336696J244726K402695O41740j822935k634128j784172
12101c83667k12527J281188J557873K86944o36081K90223R70577j014597k937952
12092g98019j67468N144668N325585j014473n514094k345327K685909J429223
$$ plain form
12084 4746004 1199188 -2038322 1167881 8082318 10693393 6490619 691451 -1453998
12076 -1453998 -331866 434235 -1115308 -3873646 -5477223 -4704141 -2724415 -1862980 -2594263
12067 -2594263 -2656981 -284153 2648872 2500202 -1370499 -5476847 -6281167 -4108741 -2101868
12058 -2101868 -1859879 -1421036 1630329 5848796 6864588 3460747 302335 2073489
12050 2073489 6713322 8316729 5902491 4341128 5846885 6013636 1057535 -5762010
12042 -5762010 -9027972 -8805283 -8731846 -9288914 -8160764 -5507955 -3626863 -2422884 -371040
12033 -371040 887389 -1395950 -4624800 -2739499 4351446 9384350 8012226 4666076
12025 4666076 4919528 7338390 7390867 5232464 4254633 4440519 2500684 -2228552 -6273922
$$ packed form
12084D746004l546816l237510L206203O914437K611075m202774n799168k145449
12076a453998J122132P66101j549543k758338j603577P73082J979726Q61435p31283
12067b594263o2718K372828K933025j48670l870701m106348q04320K172426K006873
12058b101868K41989M38843L051365M218467J015792l403841l158412J771154
12050B073489M639833J603407k414238j561363J505757J66751m956101o819545
12042e762010l265962K22689P3437n57068J128150K652809J881092J203979K051844
12033c71040J258429k283339l228850J885301P090945N032904j372124l346150
12025D666076K53452K418862N2477k158403r77831J85886j939835m729236m045370
$$ plain form
12016 -6273922 -6395914 -2792484 1582083 3093667 314122 -3337999 -2174941 4206391
12008 4206391 8933095 6697952 1291590 -318957 1614704 1381180 -1828433 -2715443
12000 -2715443 613773 3193640 1472644 -1268525 -1105744 224363 -597036 -2138506
11992 -2138506 -639696 3697110 7013996 6923604 4088191 167335 -2798048 -2384677 1692596
11983 1692596 5852123 5999070 1999232 -2949133 -6084370 -6374079 -3866354 -207696
11975 -207696 1720547 1076171 305404 810145 -85425 -4293550 -7604207 -4350530 3588841
11966 3588841 8124999 5839517 2095329 2423141 4742137 3559265 -1428569 -4932572
11958 -4932572 -2957604 3005330 8316319 9656034 7228380 3792792 1709055 901514
$$ packed form
12016f273922j21992L603430M374567J511584k779545l652121J163058O381332
12008D206391M726704k235143n406362j610547J933661k33524l209613q87010
12000b715443L329216K579867j720996k741169J62781J330107q21399j541470
11992b138506J498810M336806L316886r0392k835413l920856k965383M13371M077273
11983A692596M159527J46947l999838m948365l135237k89709K507725L658658
11975b07696J928243o44376p70767N04741q95570m208125l310657L253677P939371
11966C588841M536158k285482l744188L27812K318996j182872m987834l504003
11958d932572J974968N962934N310989J339715k427654l435588k083737q07541
$$ plain form
11950 901514 242457 167339 1870149 4041395 3341987 -693049 -3908942 -2749113 817592
11941 817592 2093775 -4233 -2228160 -2061590 -543085 500121 1420262 3253449 4825231
11932 4825231 3806603 705045 -516172 2659602 7279502 8394826 6202111 6330146
11924 6330146 11614722 16876545 15133092 7105461 630396 1075929 5973742 9439507
11916 9439507 8492627 4034293 -1409570 -5224914 -5854987 -3817000 -866738 1581792
11908 1581792 1997344 -1555857 -7948692 -10642877 -3972768 7882713 13737949 9033850
11900 9033850 1348553 -513069 2349783 3032757 -373602 -3717098 -3952279 -1849620
11892 -1849620 1220919 4397033 5964466 5225990 5161015 9032031 14619238 15977966 11247778
$$ packed form
11950I01514o59057p5118J702810K171246o99408m035036l215893J159829L566705
11941H17592J276183k098008k223927J66570J518505J043206R20141J833187J571782
11932D825231j018628l101558j221217L175774M619900J115324k192715J28035
11924F330146N284576N261823j743453q027631o475065M45533M897813L465765
11916I439507r46880m458334n443863l815344o30073K037987K950262K448530
11908A581792M15552l553201o392835k694185O670109J1855481N855236m704099
11900I033850p685297j861622K862852O82974l406359l343496k35181K102659
11892a849620L070539L176114J567433p38476o4975L871016N587207J358728m730188
$$ plain form
11883 11247778 5089864 2808694 5075532 8854131 10773280 9279605 5883493 4208554
11875 4208554 5539110 6139021 1994529 -4686435 -7595400 -4756204 -746130 -6583
11867 -6583 -1978172 -3987271 -5078615 -5124119 -3344166 14481 2711166 3035972 1584705
11858 1584705 -643006 -3875186 -7946442 -10868334 -10511672 -6673027 -905047 4344584
11850 4344584 6330538 3920481 -316142 -1751301 1614007 7135036 10302579 8520525
11842 8520525 2938150 -1800524 -970553 4512575 7300631 2081572 -6540780 -9223019
11834 -9223019 -4058419 2038155 4156347 4991656 7828871 10585369 10538653 9450329 9410047
11825 9410047 8064021 3044068 -2302850 -2858625 903336 4180259 4504474 2822538
$$ packed form
11883A1247778o157914k281170K266838L778599J919149j493675l396112j674939
11875D208554J330556N99911m144492o680964k908965K839196M010074P39547
11867f583j971589k009099j091344m5504J779953L358647K696685L24806j451267
11858A584705k227711l232180m071256k921892L56662L838645N767980N249631
11850D344584J985954k410057m236623j435159L365308N521029L167543j782054
11842H520525n582375m738674Q29971N483128K788056n219059q622352k682239
11834i223019N164600O096574K118192Q35309K837215K756498m6716j088324m0282
11825I410047j346026n019953n346918n55775L761961L276923L24215j681936
$$ plain form
11817 2822538 -45340 -3380745 -4558997 -1739688 2401292 3805739 2771722 2352645
11809 2352645 2428319 410961 -2883277 -3590955 -1347494 -106935 -1247546 -1009444 2961783
11800 2961783 6978282 6424405 2418802 -118425 548788 1071739 -1994574 -7204864 -9048065
11791 -9048065 -3947438 4645428 8659610 4332206 -2878875 -4853458 -859189 2669264
11783 2669264 1688738 -989771 -1827234 -2161005 -4613935 -7524554 -7081324 -3313504 -133758
11774 -133758 145849 -808461 -711559 159053 81765 -1401725 -3018387 -3349100 -2092034
11765 -2092034 18489 1892232 2509427 1310225 -931300 -1782894 806469 5452766
11757 5452766 7899898 6074756 3107560 3150926 5451599 5732178 3119224 1908245 5219245
$$ packed form
11817B822538k867878l335405j178252K819309M140980J404447j034017m19077
11809B352645P5674k017358l294238p07678K243461J240559j140611K38102L971227
11800B961783M016499n53877m005603k537227O67213N22951l066313n210290j843201
11791i048065N100627Q592866M014182m327404p211081j974583L994269L528453
11783B669264r80526k678509q37463l33771k452930k910619M43230L767820L179746
11774a33758K79607r54310R6902Q70612p7288j483490j616662l30713J257066
11765b092034K110523J873743O17195j199202k241525q51594K589363M646297
11757E452766K447132j825142k967196M3366K300673K80579k612954j210979L311000
$$ plain form
11748 5219245 10154197 11542770 8342090 3851772 984046 -140935 -554767 -814751
11740 -814751 -1198530 -1852434 -2372688 -2295477 -2126551 -2849508 -4187983 -4379303 -2291040
11731 -2291040 912292 3107596 3979608 5202921 7266008 7524319 3494185 -2269861
11723 -2269861 -3474698 2446260 10577830 14273879 12573593 9301007 6945419 5325036
11715 5325036 4969095 6849790 8539241 5703044 -1037115 -5397226 -3974413 -1138119
11707 -1138119 -2107925 -5145617 -5109694 -1830021 320017 -301833 -1093167 -797584 -1692162
11698 -1692162 -5185533 -9105356 -10761597 -9845882 -7298329 -4008910 -1552679 -1495687 -2866081
11689 -2866081 -2801351 -769188 360509 -1381468 -4238245 -5642192 -5520374 -4977625 -3897929
$$ packed form
11748E219245M934952J388573l200680m490318k867726j124981m13832k59984
11740h14751l83779o53904n20254P7211J68926p22957j338475j91320K088263
11731b291040L203332K195304Q72012J223313K063087K58311m030134n764046
11723b269861j204837N920958Q131570L696049j700286l272586k355588j620383
11715E325036l55941J880695J689451k836197o740159m360111J422813K836294
11707a138119r69806l037692L5923L279673K150038o21850p91334K95583q94578
11698a692162l493371l919823j656241R15715K547553L289419K456231N6992j370394
11689b866081O4730K032163J129697j741977k856777j403947J21818N42749J079696
$$ plain form
11680 -3897929 -1849203 316413 1545780 1856973 1325679 -324402 -1995952 -1602698 243426
11671 243426 -143017 -3945630 -7013488 -5718867 -2574224 -1879359 -2498089 -350880 3510874
11662 3510874 3577829 -1184045 -5031020 -3622470 615465 3494845 4910080 6807456
11654 6807456 8876261 9394408 8031590 5463846 2266027 -230660 -511516 294565 -798366
11645 -798366 -3536043 -3761437 124274 4003791 4037797 1796733 188932 -1493569 -4353302
11636 -4353302 -5849213 -4026113 -2108054 -3155682 -3496772 1817115 9562291 11797528
11628 11797528 7288761 1855848 -1737081 -5801779 -9542886 -8234316 -2818234 -1240551
11620 -1240551 -6108523 -9239736 -4044998 3890596 5546551 2053577 1397738 5011325
$$ packed form
11680c897929K048726K165616J229367L11193n31294j650081j671550L93254J846124
11671B43426l86443l802613l067858J294621L144643O94865o18730K147209L861754
11662C510874O6955m761874l846975J408550M237935K879380J415235J897376
11654F807456K068805N18147j362818k567744l197819k496687k80856Q06081j092931
11645g98366k737677k25394L885711L879517L4006k241064j607801j682501k859733
11636d353302j495911J823100J918059j047628l41090N313887P745176K235237
11628A1797528m508767n432913l592929m064698l741107J308570N416082J577683
11620a240551m867972l131213N194738P935594J655955l492974o55839L613587
$$ plain form
11612 5011325 6202187 1334182 -4747907 -5896544 -2262865 1229305 1148374 -1229317
11604 -1229317 -1884751 1015297 4122306 2486691 -3513772 -7784998 -6266301 -1458570
11596 -1458570 2765555 6536649 10746211 12674370 9836377 5197797 3235953 3023380
11588 3023380 773926 -2394033 -1388665 4451483 9647397 10040749 7168353 4272039
11580 4272039 2377163 1676135 2913275 5578985 7488594 7516434 6561112 5102271 2161191
11571 2161191 -2464754 -6858336 -8686913 -7258542 -4044465 -1889520 -2457676 -3551682
11563 -3551682 -1309038 3512891 5062382 1007977 -2718302 -535482 3618285 2442158
11555 2442158 -2651622 -4131520 -1586289 -2623267 -9265517 -13076638 -7863401 721228
$$ packed form
11612E011325J190862m868005o082089j148637L633679L492170q0931k377691
11604a229317o55434K900048L107009j635615o000463m271226J518697M807731
11596a458570M224125L771094M209562J928159k837993m638580j961844k12573
11588C023380k249454l167959J005368N840148N195914L93352k872396k896314
11580D272039j894876p01028J237140K665710J909609K7840r55322j458841k941080
11571B161191m625945m393582j828577J428371L214077K154945n68156j094006
11563c551682K242644M821929J549491m054405l726279K182820M153767j176127
11555B442158n093780j479898K545231j036978o642250l811121N213237Q584629
$$ plain form
11547 721228 3738551 1115309 -730616 867450 3045515 3518403 3168984 3293094 3808160
11538 3808160 3856279 2449941 -376224 -2337125 -1025018 2341880 4436710 5214928 7272062
11529 7272062 9339745 6647831 -19656 -2558197 2758867 8183122 5309233 -2126088
11521 -2126088 -3859519 1654875 5754317 2507693 -4171780 -7277148 -4946384 -505979
11513 -505979 1694577 -604685 -5679025 -8717395 -7030166 -3646528 -3077215 -5040534
11505 -5040534 -5991259 -5318232 -5463835 -6691182 -6598863 -4844793 -3677810 -3298541 -1208947
11496 -1208947 2892030 5813968 5770695 4718644 4376636 3606068 1536273 -90955 96825
11487 96825 485454 -935620 -3455459 -5117133 -5601529 -5770637 -5588843 -4180377 -1417237
$$ packed form
11547G21228L017323k623242j845925J598066K178065M72888l49419J24110N15066
11538C808160M8119j406338k826165j960901J312107L366898K094830P78218K057134
11529G272062K067683k691914o667487k538541N317064N424255k873889p435321
11521b126088j733431N514394M099442l246624o679473l105368K330764M440405
11513e05979K200556k299262n074340l038370J687229L383638N69313j963319
11505e040534r50725O73027j45603j227347R2319J754070J166983L79269K089594
11496a208947M100977K921938m3273j052051l42008p70568k069795j627228J87780
11487I6825L88629j421074k519839j661674m84396j69108J81794J408466K763140
$$ plain form
11478 -1417237 1421794 2340597 310822 -2873814 -3459329 -273500 2698859 958823
11470 958823 -4129150 -6961892 -5317763 -2424294 -1136900 -490451 540715 219635 -2425324
11461 -2425324 -4832221 -4832314 -4564574 -7010300 -10682506 -11529467 -9061431 -6852879 -6903928
11452 -6903928 -6797375 -3728909 692011 1641812 -3012595 -9299846 -10911557 -6460195
11444 -6460195 -1256384 -564791 -3008791 -3426955 -772788 1079782 223290 -591923 371821
11435 371821 356358 -2791647 -6204259 -6487525 -5266111 -5879367 -7237809 -5945224 -2820689
11426 -2820689 -2038743 -4398229 -6474480 -6468497 -5948752 -5220960 -2117925 2951707 5564957
11417 5564957 3577131 856826 1480554 3519503 2540162 -1073441 -2826399 -1277371
$$ packed form
11478a417237K839031R18803k029775l184636n85515L185829K972359j740036
11470I58823n087973k832742J644129K893469J287394O46449J031166l21080k644959
11461b425324k406897r3K67740k445726l672206q46961K468036K208552n1049
11452f903928J06553L068466M420920R49801m654407o287251j611711M451362
11444f460195N203811O91593k444000m18164K654167J852570q56492q15213R63744
11435C71821j5463l148005l412612k83266J221414o13256j358442J292585L124535
11426b820689P81946k359486k076251N983N19745P27792L103035N069632K613250
11417E564957j987826k720305O23728K038949r79341l613603j752958J549028
$$ plain form
11409 -1277371 -90001 -2227089 -5552933 -5932911 -2659676 1051439 2075733 389842
11401 389842 -1785873 -2801158 -3000100 -3538617 -4456366 -4630527 -3509607 -1895567 -674738
11392 -674738 168735 590015 -319373 -2889378 -5441458 -6010244 -5206224 -5397520 -6682225
11383 -6682225 -5873431 -1065272 4396137 5170878 1048229 -1997688 682210 6036507
11375 6036507 7148819 2424373 -2604833 -3277812 -1868556 -3067627 -6279712 -6700567
11367 -6700567 -3146888 -51973 -502572 -1411755 1628951 7425312 10558849 8572099
11359 8572099 4621617 2948132 4151980 5654953 5365117 4047194 4360416 7486079
11351 7486079 10796688 10203876 5528408 1703221 2843319 6687216 7546911 3854178
$$ packed form
11409a277371J187370k137088l325844l79978L273235L711115J024294j685891
11401C89842k175715j015285j98942n38517r17749j74161J120920J614040J220829
11392f74738Q43473M21280r09388k570005k552080n68786Q04020j91296j284705
11383f682225Q08794M808159N461409P74741m122649l045917K679898N354297
11375F036507J112312m724446n029206o72979J409256j199071l212085m20855
11367f700567L553679L094915m50599r09183L040706N796361L133537j986750
11359H572099l950482j673485J203848J502973k89836j317923L13222L125663
11351G486079L310609n92812m675468l825187J140098L843897Q59695l692733
$$ plain form
11343 3854178 -353273 -1398474 -148853 677605 456809 90595 -480175 -2029392 -4222394
11334 -4222394 -5750666 -5988263 -5505366 -5168171 -5213208 -4846881 -2763869 1079139 4344506
11325 4344506 4444309 2027739 596960 1944997 3775378 3099680 424583 -1235472 -670369
11316 -670369 12147 -1853120 -6353147 -10760138 -11927562 -9034777 -4205768 -261401
11308 -261401 1843737 2731440 2501628 670737 -1879624 -3067142 -2475517 -2120231 -3188016
11299 -3188016 -3731718 -1240759 3594044 7330941 7564186 5140981 2814708 2350137 2950469
11290 2950469 2624087 1153041 487359 1255418 948854 -1872743 -3657361 -479719 4571626
11281 4571626 4367315 -1446433 -4957090 -1438599 4133292 5701686 4983619 6214861
$$ packed form
11343C854178m207451j045201J249621Q26458k20796l66214n70770j549217k193002
11334d222394j528272k37597M82897L37195m5037L66327K083012L843008L265367
11325D344506R9803k416570j430779J348037J830381o75698k675097j660055N65103
11316f70369O82516j865267m500027m406991j167424K892785M829009L944367
11308b61401K105138Q87703k29812j830891k550361j187518N91625L55286j067785
11299c188016n43702K490959M834803L736897K33245k423205k326273m64571O00332
11290B950469l26382j471046o65682P68059l06564k821597j784618L177642N051345
11281D571626k04311n813748l510657L518491N571891J568394p18067J231242
$$ plain form
11273 6214861 7445820 4209882 -1738280 -4947522 -5317774 -6973753 -9427991 -8055926
11265 -8055926 -3581053 -2822320 -7892384 -11912727 -8819320 -1613882 2816391 2382773
11257 2382773 -352953 -3038244 -4463370 -3562910 -894436 846768 86117 -1819034
11249 -1819034 -3376042 -4845685 -6139172 -6257128 -6337807 -9339513 -14607658 -16963848 -14021987
11240 -14021987 -10168291 -9617776 -9649693 -5596704 746692 3599097 2442456 2830702 7822907
11231 7822907 13660074 15222971 12040668 7287411 3484572 920866 -1109308 -2815020
11223 -2815020 -3364519 -1845124 887347 2259103 943491 -1080500 -666153 2985378
11215 2985378 7890061 11381287 11735835 9048470 5665370 4374312 4980641 4301146 840380
$$ packed form
11273F214861J230959l235938n948162l209242l70252j655979k454238J372065
11265h055926M474873P58733n070064m020343L093407P205438M430273m33618
11257B382773k735726k685291j425126R00460K668474J741204p60651j905151
11249a819034j557008j469643j293487j17956q0679l001706n268145k356190K941861
11240a4021987L853696N50515l1917M052989O343396K852405j156641L88246M992205
11231G822907N837167J562897l182303m753257l802839k563706k030174j705712
11223b815020n49499J519395K732471J371756j315612k023991M14347L651531
11215B985378M904683L491226L54548k687365l383100j291058O06329o79495l460766
$$ plain form
11206 840380 -2623159 -3022162 -1445585 -1023024 -2100457 -2517836 -1522181 -344279 348285
11197 348285 569448 -716357 -4068429 -6567250 -4194325 1889118 5026820 1008308
11189 1008308 -6372948 -10166103 -8659957 -5847691 -4562587 -3103854 209401 2668315
11181 2668315 662358 -4054814 -5683740 -2318849 1364525 1006246 -1645194 -2687388
11173 -2687388 -2171104 -1916704 -268953 5049035 10507835 10105189 5096855 3122024 6223879
11164 6223879 7406366 2332253 -3157717 -2538578 962373 434406 -3168502 -3655755 -739735
11155 -739735 42647 -2364253 -2542775 2080107 6967877 7617044 5252878 2983249 1166240
11146 1166240 -529288 -415400 2598729 6220419 7327413 5655502 3120375 1132687
$$ packed form
11206H40380l463539l99003J576577M22561j077433m17379R95655J177902O92564
11197C48285K21163j285805l352072k498821K372925O083443L137702m018512
11189A008308p381256l793155J506146K812266J285104J458733L313255K458914
11181B668315k005957m717172j628926L364891L683374l58279k651440j042194
11173b687388N16284K54400J647751N317988N458800m02646n008334j974831L101855
11164F223879J182487n074113n489970O19139L500951n27967l602908m87253K916020
11155g39735P82382k406900j78522M622882M887770O49167k364166k269629j817009
11146A166240j695528J13888L014129L621690J106994j671911k535127j987688
$$ plain form
11138 1132687 192768 629449 2085600 3103387 2291674 -531453 -4478766 -8051000 -9684984
11129 -9684984 -8959688 -7000118 -4885507 -2750790 -1555638 -3565255 -8546754 -11628231
11121 -11628231 -8756891 -2862022 -85742 -839286 -238811 2337583 905402 -7120937
11113 -7120937 -14744102 -14318792 -8482388 -6035255 -9132056 -11224481 -7810166 -2852159
11105 -2852159 -2073333 -4780054 -6322368 -5647240 -5671401 -7221048 -7454657 -5132353 -3149980
11096 -3149980 -3583272 -3793709 -912253 2564056 2326865 -68589 1278147 7031019 10384291
11087 10384291 6755356 557244 -1542330 -31675 -271627 -3442739 -5379727 -3772546
11079 -3772546 -1416702 -1373642 -2666736 -2419436 -151816 1426943 -653644 -5879153 -9428060
$$ packed form
11138A132687r39919M36681J456151J017787q11713k823127l947313l572234j633984
11129i684984P25296J959570K114611K134717J195152k009617m981499l081477
11121a1628231K871340N894869K776280p53544O00475K576394j432181q026339
11113g120937p623165M25310N836404K447133l096801k092425L414315M958007
11105b852159P78826k706721j542314O75128k4161j549647k33609K322304J982373
11096c149980m33292k10437K881456L476309k37191k395454J346736N752872L353272
11087A0384291l628935o198112k099574J510655k39952l171112j936988J607181
11079c772546K355844M3060j293094K47300K267620J578759k080587n225509l548907
$$ plain form
11070 -9428060 -6936215 -777421 1591105 -2328758 -5568338 -1345727 6314705 7865932
11062 7865932 2301680 -1581731 1334289 5168402 2435673 -5018543 -9164688 -6373523
11054 -6373523 -248525 4246928 5405150 4162771 2114016 410179 -1142291 -3850929
11046 -3850929 -7915269 -11079708 -10847738 -7623118 -4382773 -3339692 -3954262 -4414131 -4255178
11037 -4255178 -4657802 -5971975 -6000563 -2419390 3105861 5582632 2828727 -1175556 -1345846
11028 -1345846 1747579 3139549 514945 -3452145 -5812728 -6905758 -8039648 -8412270
11020 -8412270 -6357115 -2279429 1343416 2436669 970889 -1385998 -2609863 -1635116
11012 -1635116 947436 3072011 2328834 -1844334 -6233062 -5689422 763448 6846368
$$ packed form
11070i428060K491845O158794K368526l919863l239580M222611P660432J551227
11062G865932n564252l883411K916020L834113k732729p454216m146145K791165
11054f373523O124998M495453J158222j242379k048755j703837j552470k708638
11046c850929m064340l164439K31970L224620L240345J043081o14570m59869J58953
11037d255178m02624j314173k8588L581173N525251K476771k753905m004283j70290
11028a345846L093425J391970k624604l967090k360583j093030j133890l72622
11020h412270K055155M077686L622845J093253j465780k356887j223865R74747
11012a635116K582552K124575p43177m173168m388728N43640O452870O082920
$$ plain form
11004 6846368 5575487 -1553816 -6412644 -5532321 -3767754 -4843033 -5029270 -755450
10996 -755450 3639483 2478565 -1333511 -605243 4699844 8210913 7789699 7367630 8487803
10987 8487803 8001063 5107251 3267011 3417656 2103569 -1569979 -3559319 -1807062
10979 -1807062 648681 2044385 5001119 9916223 11497201 6466816 -412246 -2942101
10971 -2942101 -1864956 -1600667 -2343947 -1149627 1373314 1185126 -2805752 -6825123 -7020172
10962 -7020172 -3454426 685953 2111452 147617 -2338927 -1673464 2191833 5542154
10954 5542154 5791750 4186414 2701264 1066407 -1461164 -3958468 -5487618 -6758979
10946 -6758979 -8226294 -8396384 -5873993 -1651869 1927489 3192019 1726413 -1085528
$$ packed form
11004F846368j270881p129303m858828Q80323J764567j075279j86237M273820
10996g55450M394933j160918l812076P28268N305087L511069m21214m22069J120173
10987H487803m86740k893812j840240J50645j314087l673548j989340J752257
10979a807062K455743J395704K956734M915104J580978n030385o879062k529855
10971b942101J077145K64289p43280J194320K522941j88188l990878m019371j95049
10962g020172L565746M140379J425499j963835k486544O65463L865297L350321
10954E542154K49596j605336j485150j634857k527571k497304j529150j271361
10946f758979j467315j70090K522391M222124L579358J264530j465606k811941
$$ plain form
10938 -1085528 -2041820 597641 3645585 2168106 -3432127 -7356401 -6205707 -2558804
10930 -2558804 395435 2893581 5153049 4976180 2166516 977884 4191656 8318244
10922 8318244 8775324 6698743 6219649 7518243 7282160 4573510 1868440 871807 878183
10913 878183 1089100 1752295 2906824 3713029 2919005 -486865 -5817567 -9747672 -9243052
10904 -9243052 -5815491 -3745378 -3594847 -1710541 2580721 4432973 944413 -3683573
10896 -3683573 -4258385 -1661133 332184 1187855 1732395 -37420 -5360667 -9613786 -7102407
10887 -7102407 371193 5509569 5308375 3303397 2415185 1331523 -1058787 -2673996
10879 -2673996 -1610171 965224 2964564 3921208 4268627 4204066 4111973 4477510 5006182
$$ packed form
10938a085528r56292K639461L047944j477479n600233l924274J150694L646903
10930b558804K954239K498146K259468j76869k809664j188632L213772M126588
10922H318244M57080k076581m79094J298594k36083k708650k705070r96633O376
10913H78183K10917O63195J154529Q06205p94024l405870n330702l930105N04620
10904i243052L427561K070113J50531J884306M291262J852252l488560m627986
10896c683573n74812K597252J993317Q55671N44540j769815n323247m253119K511379
10887g102407P473600N138376k01194k004978q88212j083662k390310j615209
10879b673996J063825K575395J999340R56644L47419o4561r2093L65537N28672
$$ plain form
10870 5006182 5133153 5060934 4831647 3278383 -38157 -2713319 -1845776 1868510 4831897
10861 4831897 5221164 4587446 4570173 4346668 2394918 -590589 -1873930 202827 3820752
10852 3820752 5224769 3129646 455373 285882 1503288 1103814 -285597 767065
10844 767065 4172498 5427938 2298694 -1998467 -4122603 -4714560 -4755741 -2393900 3004261
10835 3004261 7438884 7035308 3395191 455548 -1201852 -2976941 -3901276 -2253493
10827 -2253493 172946 -189490 -3489125 -6492487 -7025440 -5514699 -3171311 -1248445
10819 -1248445 -878894 -1360386 -170902 3253463 5928658 5764438 4995012 6431118 8887048
10810 8887048 9445584 7984534 6470440 5980322 7009304 9921189 12399049 9950203
$$ packed form
10870E006182J26971p2219k29287j553264l316540k675162Q67543L714286K963387
10861D831897L89267o33718j7273k23505j951750k985507j283341K076757L617925
10852C820752J404017k095123k674273j69491J217406l99474j389411J052662
10844G67065L405433J255440l129244m297161k124136n91957m1181K361841N398161
10835C004261M434623m03576l640117k939643j657400j775089r24335J647783
10827b253493K426439l62436l299635l003362n32953J510741K343388J922866
10819a248445L69551m81492J189484L424365K675195j64220p69426J436106K455930
10810H887048N58536j461050j514094m90118J028982K911885K477860k448846
$$ plain form
10802 9950203 2359823 -3971171 -4058448 -990783 -81812 -370640 2165333 6020772 5594845
10793 5594845 -59242 -5916222 -7824128 -5677541 -814214 4516440 5859988 189443
10785 189443 -8887404 -13910357 -11833197 -6227494 -1967380 -1166593 -3354950 -6049437
10777 -6049437 -5981884 -2710734 521970 2024014 4575083 9572665 12297422 8346675
10769 8346675 1308417 -2219032 -2356731 -3835932 -6621397 -6450885 -3572097 -2989365 -5855146
10760 -5855146 -7872237 -6889534 -5382216 -4705555 -3493422 -2614434 -4983545 -9054133 -9142683
10751 -9142683 -4329364 -856863 -2992991 -6995004 -7282644 -4074817 -1586216 -1906188
10743 -1906188 -3530802 -3950201 -2094773 308928 -196001 -4498741 -8815722 -9468404 -7787622
$$ packed form
10802I950203p590380o330994q7277L067665R08971k88828K535973L855439m25927
10793E594845n654087n856980j907906K146587M863327N330654J343548n670545
10785A89443r076847n022953K077160N605703M260114Q00787k188357k694487
10777f049437O7553L271150L232704J502044K551069M997582K724757l950747
10769H346675p038258l527449j37699j479201k785465J70512K878788N82732k865781
10760e855146k017091R82703J507318O76661J212133Q78988k369111m070588q8550
10751i142683M813319L472501k136128m002013k87640L207827K488601l19972
10743a906188j624614m19399J855428K403701n04929m302740m316981o52682J680782
$$ plain form
10734 -7787622 -6783246 -5710200 -2911855 -1110406 -3155877 -4818841 -105724 7111003
10726 7111003 6086016 -4888287 -14590929 -13922941 -6790026 -1901870 -983328 -524626
10718 -524626 326887 -317549 -2433927 -4277799 -5467889 -6626724 -7596540 -8214829 -9092768
10709 -9092768 -10139293 -10184640 -8876899 -6989329 -4967713 -3659083 -5410444 -10655541
10701 -10655541 -14566779 -12131188 -6008464 -3638344 -6452833 -8189322 -4856518 50717
10693 50717 2160505 1909222 1017466 -1112725 -4304935 -5638534 -3808469 -1657389 -1732215
10684 -1732215 -2855499 -3258393 -3523453 -4403298 -5102469 -5342358 -5827687 -5678737 -3152969
10675 -3152969 330369 1081393 -1205888 -3108816 -3338814 -4023234 -5487708 -5187080 -2887169
$$ packed form
10734g787622J004376J073046K798345J801449k045471j662964M713117P216727
10726G111003j024987j0974303r702642O67988P132915M888156R18542M58702
10718e24626Q51513o44436k116378j843872j190090j158835r69816o18289q77939
10709i092768j046525m5347J307741J887570K021616J308630j751361n245097
10701a0655541l911238K435591O122724K370120k814489j736489L332804M907235
10693E0717K109788k51283q91756k130191l192210j333599J830065K151080p4826
10684a732215j123284m02894k65060q79845o99171k39889m85329J48950K525768
10675c152969L483338P51024k287281j902928k29998o84420j464474L00628K299911
$$ plain form
10666 -2887169 -1405378 -1108384 486921 2529784 875418 -3911014 -5655702 -2458564
10658 -2458564 -436567 -3842271 -8144642 -7703888 -4455127 -3522044 -4927978 -5300518 -4305746
10649 -4305746 -4027224 -4284132 -3127422 -540825 1602748 1990860 377204 -2474304 -4176739
10640 -4176739 -2589851 854927 2607269 2066650 1623391 1794976 962241 -56233 1312057
10631 1312057 3703244 2865138 -772839 -2092320 -46725 674680 -1415533 -1612027 2185222
10622 2185222 5317025 4799234 4526110 7386525 9050139 5098143 -1430447 -5097672
10614 -5097672 -5642358 -5374036 -3902661 -850305 478599 -2424482 -6458690 -7245490 -5268446
10605 -5268446 -3807303 -3877530 -4683326 -5956427 -6899663 -6066998 -4542354 -5402464 -8179126
$$ packed form
10666b887169J481791K96994J595305K042863j654366m786432j744688L197138
10658b458564K021997l405704m302371M40754L248761R33083j405934l72540R94772
10649d305746K78522k56908J156710K586597K143573L88112j613656k851508j702435
10640d176739J586888L444778J752342n40619m43259J71585q32735j018474J368290
10631A312057K391187q38106l637977j319481K045595P21405k090213j96494L797249
10622B185222L131803n17791k73124K860415J663614l951996o528590l667225
10614e097672n44686K68322J471375L052356J328904k903081m034208p86800J977044
10605e268446J461143p0227q05796j273101r43236Q32665J524644q60110k776662
$$ plain form
10596 -8179126 -8470287 -4932056 -1492515 -686064 -513859 40047 -1118229 -3174278 -1198938
10587 -1198938 5531459 10625624 9724945 6126684 3711471 1264811 -2013927 -2673492
10579 -2673492 80780 328515 -5891576 -13456333 -15286129 -11795037 -8353277 -7798040
10571 -7798040 -9603976 -12180924 -12811697 -9730440 -6047957 -6217738 -8131245 -6161872
10563 -6161872 -2182794 -3658372 -9775611 -11395507 -7369400 -7420276 -14087594 -16287971
10555 -16287971 -8330269 -1097228 -4249827 -10336671 -8567296 -3026282 -3838145 -9336194
10547 -9336194 -10738869 -7754122 -6626089 -7898522 -7667066 -6527045 -7280268 -8250791 -7369058
10538 -7369058 -7422663 -9583241 -8671264 -2804188 152740 -5663911 -14066092 -17110564 -16717438
$$ packed form
10596h179126k91161L538231L439541Q06451J72205N53906j158276k056049J975340
10587a198938O730397N094165r00679l598261k415213k446660l278738o59565
10579b673492K754272K47735o220091p564757j829796L491092L441760N55237
10571g798040j805936k576948o30773L081257L682483j69781j913507J969373
10563f161872L979078j475578o117239j619896M026107n0876o667318k200377
10555a6287971P957702P233041l152599o086844J769375N541014q11863n498049
10547i336194j402675K984747J128033j272433K31456J140021p53223r70523Q81733
10538g369058n3605k160578R11977N867076K956928n816651q402181l044472L93126
$$ plain form
10529 -16717438 -17330170 -16687723 -13327797 -13062129 -17970087 -19625615 -13597671 -8959104
10521 -8959104 -12196894 -14613298 -8694240 -3653999 -9716589 -19540941 -21228156 -17857755
10513 -17857755 -17973511 -18805121 -15507610 -14513656 -20709653 -24608510 -19492871 -16286354
10505 -16286354 -23111490 -27444165 -19303385 -12956611 -21868768 -32828758 -31731434 -32001514
10497 -32001514 -46341523 -56172444 -46606851 -43052456 -66663931 -85376974 -70648865
10490 -70648865 -70697163 -140287114 -212413059 -149150226 56389224 233504427 242091242
10483 242091242 139924468 73725911 80020189 85765329 55675154 32351376 41692101
10476 41692101 52304706 42155395 33934188 43934454 51515249 41090960 30036264
$$ packed form
10529a6717438o12732O42447L359926K65668m907958j655528O027944M638567
10521h959104l237790k416404N919058N040241o062590r824352j687215L370401
10513a7857755j15756q31610L297511R93954o195997l898857N115639L206517
10505a6286354o825136m332675Q140780O346774q912157j0959990J097324k70080
10497c2001514j4340009r830921R565593L554395k3611475j8713043J4728109
10490g0648865m8298o9589951p2125945O3262833K05539450J77115203Q586815
10483B42091242j02166774o6198557O294278N745140l0090175k3323778R340725
10476D1692101J0612605j0149311q221207J0000266P580795j0424289j1054696
$$ plain form
10469 30036264 33683040 38614981 30449237 18635450 16073279 18524629 18926763 20804565
10461 20804565 25298850 24160348 15720569 10258599 12015656 13168180 10962284 12326634
10453 12326634 16677209 13877707 4851733 4013534 14432339 20644743 14290177 7427538
10445 7427538 10713385 16534419 14891944 9996260 9447255 10530566 8356026 6007970
10437 6007970 6829877 7160137 5089278 6031355 12044148 16042180 13717083 10792740 11796771
10428 11796771 12391150 9497724 7875929 9475063 7509958 -847734 -6683452 -3040692
10420 -3040692 3404846 3495785 -416835 -970087 1447309 1867430 534582 818702 2155542
10411 2155542 2297819 2241786 3189946 3346037 2426908 3881617 8399102 11370432 10695870
$$ packed form
10469C0036264L646776M931941q165744j1813787k562171K451350M02134J877802
10461B0804565M494285j138502q439779n461970J757057J152524k205896J364350
10453A2326634M350575k799502r025974q38199J0418805O212404o354566o862639
10445G427538L285847N821034j642475m895684n49005J083311k174540k348056
10437F007970Q21907L30260k070859R42077O012793L998032k325097k924343J004031
10428A1796771N94379k893426j621795J599134j965105q357692n835718L642760
10420c040692O445538R0939l912620n53252K417396M20121j332848K84120J336840
10411B155542J42277n6033R48160J56091r19129J454709M517485K971330o74562
$$ plain form
10402 10695870 10025381 10357761 6910672 -549143 -3433047 2613588 8840901 5963193
10394 5963193 -1503503 -2625304 3648094 8863081 8230009 4889036 2927209 3082355
10386 3082355 4337021 4875014 2888256 -287555 -561042 2697426 4802931 2998788
10378 2998788 788713 1713443 3919655 4631903 4764914 5162897 3747142 617155 268490
10369 268490 4127504 6753370 4536136 2137201 4455958 8062961 7298893 3714928
10361 3714928 2344174 3015022 2583413 1929872 3378730 4394302 1272071 -3350913 -3845971
10352 -3845971 -606846 1085506 -155526 -673166 1296690 3339552 3321888 1519329 -1230219
10343 -1230219 -3753881 -4097518 -2183250 -1007328 -2065740 -2511572 -429989 841323
$$ packed form
10402A0695870o70489L32380l447089p459815k883904O046635O227313k877708
10394E963193p466696j121801O273398N214987o33072l340973j961827J55146
10386C082355J254666N37993j986758l175811k73487L258468K105505j804143
10378B998788k210075R24730K206212P12248J33011L97983j415755l129987l48665
10369B68490L859014K625866k217234k398935K318757L607003p64068l583965
10361C714928j370754O70848m31609o53541J448858J015572l122231m622984m95058
10352c845971L239125J692352j241032n17640J969856K042862j7664j802559k749548
10343a230219k523662l43637J914268J175922j058412m45832K081583J271312
$$ plain form
10335 841323 -1665405 -4386515 -2260425 3333830 7443184 9070362 9568962 6981988
10327 6981988 -347865 -6932617 -5325747 2738550 8412181 8544254 8219344 10237320
10319 10237320 10917139 8435815 6969985 8934688 10284383 7935814 5726224 7888094
10311 7888094 11493256 10904591 6278202 2288805 827202 135942 -295422 924692 3074653
10302 3074653 3074879 131779 -2557662 -1903611 1451772 4592649 5676578 4781923 2745995
10293 2745995 407639 -1614684 -3362446 -5417193 -7573151 -8020646 -5019918 429066
10285 429066 4773076 5562874 4095941 3377461 4207657 4877091 4395176 3887634 4169179
10276 4169179 3934552 1885716 -631226 -1045168 798996 2303129 1782865 820096 1693785
$$ packed form
10335H41323k506728k721110K126090N594255M109354J627178M98600k586974
10327F981988p329853o584752J606870Q064297N673631J32073l24910K017976
10319A0237320O79819k481324j465830J964703J349695k348569k209590K161870
10311G888094L605162n88665m626389l989397j461603o91260m31364J220114K149961
10302C074653K26k943100k689441O54051L355383L140877J083929q94655k035928
10293B745995k338356k022323j747762k054747k155958m47495L000728N448984
10285D29066M344010P89798j466933p18480Q30196O69434m81915n07542K81545
10276D169179k34627k048836k516942m13942J844164J504133n20264r62769Q73689
$$ plain form
10267 1693785 3431914 2561378 -1681464 -5035425 -3231349 1880416 4318303 2101795
10259 2101795 -180307 1708440 5712780 7131377 5256917 2896154 1531883 981584
10251 981584 2249502 6238432 10394739 11088067 9042378 7974913 7969340 5183510 -1164833
10242 -1164833 -6672369 -8275138 -8085639 -8322779 -6915524 -1585758 5101405 8623180
10234 8623180 8404032 7463425 7426608 6905265 4644511 2306901 3437840 9326441 15542444
10225 15542444 14552407 4502194 -6268214 -7871969 -1335632 3011689 -96170 -4703965
10217 -4703965 -4129632 -777218 -579353 -2848096 -2011982 3198855 8183487 9076750 6398810
10208 6398810 2810078 901942 2420158 6402089 8916515 7490554 4555989 3716814
$$ packed form
10267A693785J738129q70536m242842l353961J804076N111765K437887k216508
10259B101795k282102J888747M004340J418597j874460k360763j364271n50299
10251I81584J267918L988930M156307O93328k045689j067465n573k785830o348343
10242a164833n507536j602769J89499k37140J407255N329766O687163L521775
10234H623180k19148r40607l6817n21343k260754k337610J130939N888601O216003
10225A5542444r90037j0050213j0770408j603755O536337M347321l107859m607795
10217d703965N74333L352414J97865k268743Q36114N210837M984632Q93263k677940
10208F398810l588732j908136J518216L981931K514426j425961k934565q39175
$$ plain form
10200 3716814 4403625 3704274 1773932 1180784 1821511 941126 -1862099 -3788481 -3366522
10191 -3366522 -1932686 123936 4588936 11202203 15642831 14321305 9087014 4777035
10183 4777035 3607806 4365533 5869261 8042804 9475378 7304751 1509625 -2979709
10175 -2979709 -1568874 3518009 5610426 2633813 -290377 1155759 4242778 4304325
10167 4304325 2274891 2258255 4343331 5701239 7116373 11635476 16975000 16526548 9399517
10158 9399517 2681291 1225929 1642040 -222756 -2133154 -486380 2887105 4480670
10150 4480670 5506013 8688195 11809362 10515065 5691038 2367364 2207731 2108412 -102204
10141 -102204 -2910745 -4072151 -2943638 -128308 2427821 1798990 -2644855 -7286104
$$ packed form
10200C716814O86811o99351j930342n93148O40727q80385k803225j926382M21959
10191c366522J433836K056622M465000O613267M440628j321526n234291m309979
10183D777035j169229P57727J503728K173543J432574k170627n795126m489334
10175b979709J410835N086883K092417k976613k924190J446136L087019O1547
10167D304325k029434j6636K085076J357908J415134M519103N339524m48452p127031
10158I399517o718226j455362M16111j864796j910398J646774L373485J593565
10150D480670J025343L182182L121167j294297m824027l323674j59633r9319k210616
10141a02204k808541j161406J128513K815330K556129o28831m443845m641249
$$ plain form
10133 -7286104 -8320504 -6635239 -5907693 -7172844 -8210063 -7111050 -3587706 2017907
10125 2017907 8193474 12012925 12146524 10706218 9671828 7692506 3485672 -175633
10117 -175633 -40550 1969723 1266288 -2373823 -4717368 -3392694 -163562 2674852 4204120
10108 4204120 3451397 -56818 -4102027 -5384146 -3548181 -1186179 -378249 -1489192
10100 -1489192 -3992725 -5815438 -3845578 1518321 4484841 626798 -6474626 -9838389
10092 -9838389 -8279298 -5845497 -4130527 -1489152 1196687 930775 -1117477 -525853
10084 -525853 2441841 2564936 -1333939 -4018951 -2703941 -1480800 -3604613 -5684227
10076 -5684227 -3888347 -560868 325578 57593 2251161 5987065 6900476 3475656 -1642818
$$ packed form
10133g286104j034400J685265P27546j265151j037219J099013L523344N605613
10125B017907O175567L819451J33599j440306j034390j979322m206834l661305
10117a75633J35083K010273p03435l640111k343545J324674L229132K838414J529268
10108D204120p52723l508215m045209j282119J835965K362002Q07930j110943
10100a489192k503533j822713J969860N363899K966520l858043p101424l363763
10092i838389J559091K433801J714970K641375K685839k65912k048252N91624
10084e25853K967694J23095l898875k685012J315010J223141k123813k079614
10076e684227J795880L327479Q86446k67985K193568L735904R13411l424820n118474
$$ plain form
10067 -1642818 -5245037 -5527233 -2293974 2056078 3697908 2016577 749662 2114996
10059 2114996 2958874 50076 -4127149 -5392216 -4949023 -6856915 -9901008 -8316410
10051 -8316410 -1202689 4651846 3781079 -538814 -1316613 2450493 5000616 1944456
10043 1944456 -4275446 -7943906 -6817143 -3496764 -1072873 217516 1405200 2051041
10035 2051041 1104962 -639293 -1434262 -1589755 -2949935 -5147554 -5331533 -2765912 -913719
10026 -913719 -2883539 -6809485 -8163495 -5532870 -1914314 -783488 -2512208 -4354387
10018 -4354387 -2995781 2192608 7734820 9140467 6268209 3832727 5229351 7997390
10010 7997390 7634957 3870266 -6656 -2451173 -4111420 -3518964 2454693 12016531
$$ packed form
10067a642818l602219k82196L233259M350052J641830j681331j266915J365334
10059B114996Q43878k908798m177225j265067M43193j907892l044093J584598
10051h316410P113721N854535q70767m319893p77799L767106K550123l056160
10043A944456o219902l668460J126763L320379K423891J290389J187684O45841
10035B051041r46079j744255p94969j55493j360180k197619j83979K565621J852193
10026i13719j969820l925946j354010K630625L618556J130826j728720j842179
10018d354387J358606N188389N542212J405647k872258k435482J396624K768039
10010G997390l62433l764691l876922k444517j660247N92456N973657R561838
$$ plain form
10002 12016531 16929154 11545093 949506 -4239210 -394354 5956971 7740366 5655449
9994 5655449 4709180 6045269 6195091 3017508 -1683586 -5588067 -8327764 -9487419 -7344339
9985 -7344339 -1715927 4058883 6296544 4897015 2305903 -5679 -1875234 -2610872
9977 -2610872 -1666562 -692143 -2044875 -4930814 -5577237 -2194118 2222459 3364568 668088
9968 668088 -2403990 -2593821 -316974 1216795 -68517 -2553056 -2807405 140454 3533859
9959 3533859 4248766 2162099 -573979 -2240412 -2382235 -1264172 -20325 -289247 -2108344
9950 -2108344 -3112946 -1499398 1019440 917641 -2991434 -8358772 -11559981 -10297590
9942 -10297590 -5259106 -70779 2178892 3083454 6720759 12251078 13191887 6992239
$$ packed form
10002A2016531M912623n384061j0595587n188716L844856O351325J783395k084917
9994E655449r46269J336089J49822l177583m701094l904481k739697j159655K143080
9985g344339N628412N774810K237661j399529k591112k311582j869555p35638
9977b610872R44310R74419j352732k885939o46423L383119M416577J142109k696480
9968F68088l072078j89831K276847J533769j285312k484539k54349K947859L393405
9959C533859P14907k086667k736078j666433j41823J118063J243847k68922j819097
9950b108344j004602J613548K518838j01799l909075n367338l201209J262391
9942a0297590N038484N188327K249671R04562L637305N530319R40809o199648
$$ plain form
9934 6992239 326565 -230587 1771292 -995910 -6835179 -7593867 -2583013 177413 -2280314
9925 -2280314 -3000121 2534530 8512380 8629315 5712441 4939109 4482176 776269 -2530908
9916 -2530908 115031 5535923 5642796 568 -4256680 -4227443 -3967144 -4840329 -2327732
9907 -2327732 4642279 9184380 5939597 -858288 -3816665 -2391176 -1304746 -2379931
9899 -2379931 -3490625 -3790289 -4657716 -5895798 -5568735 -3968380 -3788744 -5442274 -5790256
9890 -5790256 -3221364 -871448 -2082064 -4835775 -4348931 -467581 1762306 99735
9882 99735 -617793 4035619 9366477 6781048 -1938257 -2883349 12441731 32502408 36314464
9873 36314464 18212117 -5057324 -14180239 -8088843 -638044 -1483092 -7393074 -11161169
$$ packed form
9934F992239o665674n57152K001879k767202n839269p58688N010854K760426k457727
9925b280314p19807N534651N977850J16935k916874p73332m56933l705907l307177
9916b530908K645939N420892J06873n642228m257248K9237K60299q73185K512597
9907b327732O970011M542101l244783o797885k958377J425489J086430j075185
9899b379931j110694k99664q67427j238082L27063J600355J79636j653530l47982
9890e790256K568892K349916j210616k753711M86844L881350K229887j662571
9882I9735p17528M653412N330858k585429q719305r45092J5325080K0060677L812056
9873C6314464j8102347k3269441r122915O091396P450799q45048n909982l768095
$$ plain form
9865 -11161169 -11296243 -10072116 -7622895 -3020493 1453983 2302297 477098 520330 3656478
9856 3656478 6113435 5653626 5281305 7526304 8952712 4947174 -2308010 -5900216 -3658634
9847 -3658634 -511882 -750694 -2666707 -2643005 -551706 1402129 2139504 1504555 -811731
9838 -811731 -3652786 -3981928 -580063 3847521 6456275 7743185 8777279 7939966 4157532
9829 4157532 869109 1986368 5237263 4589452 -1009706 -6301381 -7548189 -6691242 -6313983
9820 -6313983 -5309954 -2183958 1221913 2512151 2450369 2785598 2686765 649022 -1724984
9811 -1724984 -1323274 1791399 4219967 3503906 306771 -3252784 -5311374 -4821860 -2625885
9802 -2625885 -1512726 -2954597 -4380795 -2463350 1265984 1598583 -2931630 -7490200
$$ packed form
9865a1161169j35074J224127K449221M602402M474476Q48314j825199M3232L136148
9856C656478K456957m59809l72321K244999J426408m005538p255184l592206K241582
9847c658634L146752k38812j916013K3702K091299J953835P37375o34949k316286
9838h11731k841055l29142L401865M427584K608754J286910J034094q37313l782434
9829D157532l288423J117259L250895o47811n599158n291675j246808Q56947L77259
9820f313983J004029L125996L405871J290238o1782L35229r8833k037743k374006
9811a724984M01710L114673K428568p16061l197135l559555k058590M89514K195975
9802b625885J113159j441871j426198J917445L729334L32599m530213m558570
$$ plain form
9794 -7490200 -7596687 -5035209 -4249658 -5344076 -4504411 -406597 3632150 4244499 1651961
9785 1651961 -2096742 -5724761 -8101331 -7321549 -2624083 3766880 8419152 9794326
9777 9794326 8579018 5975613 3116965 1352041 1356890 2179499 2503386 2504926 3083182 3770483
9767 3770483 3295067 2097684 2112157 3511116 3771712 1126560 -2824260 -5533054 -7138984
9758 -7138984 -9573503 -12658331 -13457000 -10075036 -4446205 -294568 807280 430748 956052
9749 956052 3274342 6591200 9421181 10450251 9179515 6276411 2947253 -281281
9741 -281281 -3562241 -6274271 -6772646 -4682608 -2362670 -2299635 -3746771 -4214004 -3808624
9732 -3808624 -4866100 -6856624 -5759409 -715816 2626048 -567857 -6395296 -6719421
$$ packed form
9794g490200j06487K561478P85551j094418Q39665M097814M038747O12349k592538
9785A651961l748703l628019k376570P79782M697466O390963M652272J375174
9777I794326j215308k603405k858648j764924M849Q22609L23887J540N78256O87301
9767C770483m75416j197383J4473J398959K60596k645152l950820k708794j605930
9758g138984k434519l084828p98669L381964N628831M151637J101848l76532N25304
9749I56052K318290L316858K829981J029070j270736k903104l329158l228534
9741b81281l280960k712030m98375K090038K319938O3035j447136m67233M05380
9732c808624j057476j990524J097215N043593L341864l193905n827439l24125
$$ plain form
9724 -6719421 -375338 5578322 5935352 3118159 1385730 619989 -1033577 -2622446 -2506415
9715 -2506415 -2107797 -3440616 -4864764 -3316144 489864 2868358 2349622 528494 -1467407
9706 -1467407 -3558092 -4248860 -1817356 1737458 2170176 -637189 -2003477 265342 2329283
9697 2329283 790213 -1471548 -145515 2946689 2487853 -1536840 -3350558 -71391
9689 -71391 4347180 5577932 4739074 4916738 5603212 4460564 2229810 1617479 2340409
9680 2340409 1366789 -1954369 -4625597 -4323582 -1771435 1745715 5765871 8474489 6917222
9671 6917222 1659686 -1968632 -281225 3604596 4287633 1575093 -506225 -644317 -1412053
9662 -1412053 -3652478 -4544787 -2637233 -721062 -1392666 -2829485 -1683642 1886221 4659149
$$ packed form
9724f719421O344083N953660L57030k817193j732429p65741j653566j588869J16031
9715b506415L98618j332819j424148J548620L806008K378494n18736j821128j995901
9706a467407k090685o90768K431504L554814M32718k807365j366288K268819K063941
9697B329283j539070k261761J326033L092204m58836m024693j813718L279167
9689g1391M418571J230752q38858J77664O86474j142648k230754o12331P22930
9680B340409r73620l321158k671228L02015K552147L517150M020156K708618j557267
9671F917222n257536l628318J687407L885821O83037k712540k081318j38092p67736
9662a412053k240425q92309J907554J916171o71604j436819J145843L569863K772928
$$ plain form
9653 4659149 4416946 1316263 -3479402 -8050412 -9513788 -6401644 -1366911 875000
9645 875000 -961436 -3098959 -1559679 2772429 5428236 3928709 267280 -2346582
9637 -2346582 -3366161 -4236548 -5213061 -5159388 -4208277 -3861118 -3652366 -627994 5810506
9628 5810506 11028067 10191962 4642100 -121459 -1760708 -2560384 -3925521 -3828608 -872649
9619 -872649 2817394 4516719 3865413 1485748 -2380425 -6178183 -7015550 -4495789 -1934521
9610 -1934521 -1656446 -1895008 -743090 -17363 -1898298 -4602471 -5426913 -5661594 -7722091
9601 -7722091 -9283837 -6031567 329199 3101511 753092 -101549 5263282 12039820
9593 12039820 12759550 7943325 4386673 4836777 5288695 2591501 -775879 -1411043 -187189
$$ packed form
9653D659149k42203l100683m795665m571010j463376L112144N034733K241911
9645H75000j836436k137523J539280M332108K655807j499527l661429k613862
9637b346582j019579q70387r76513N3673R51111L47159K08752L024372O438500
9628E810506N217561q36105n549862m763559j639249p99676j365137R6913K955959
9619h72649L690043J699325o51306k379665l866173l797758q37367K519761K561268
9610a934521K78075k38562J151918P25727j880935k704173q24442k34681k060497
9601g722091j561746L252270O360766K772312k348419q54641N364831O776538
9593A2039820P19730m816225l556652M50104M51918k697194l367380o35164J223854
$$ plain form
9584 -187189 132067 -517458 -514613 -10988 151690 1440671 5378881 8859974 6510466
9575 6510466 -1202702 -6724357 -4576737 2053534 6786688 8342993 9231342 9298062 6145221
9566 6145221 623508 -3674283 -6143444 -8990905 -11079226 -7942072 188677 5906623
9558 5906623 3485327 -3793757 -8411077 -7405473 -3364414 183682 1003949 -1504504
9550 -1504504 -4786243 -4230962 999067 5538222 4497489 169747 -1731446 -366621
9542 -366621 175636 -2104285 -4630494 -4734261 -2864799 -914338 -99635 -667514 -1605902
9533 -1605902 -1073947 1108415 2741740 3090460 5146340 10644817 15013585 12142727 3400660
9524 3400660 -3112662 -2662076 1327507 3436088 2749369 1364726 222780 -738117 -496425
$$ packed form
9584a87189L19256o49525K845N03625J62678J288981L938210L481093k349508
9575F510466p713168n521655K147620O630271M733154J556305Q88349O6720l152841
9566F145221n521713m297791k469161k847461k088321L137154Q130749N717946
9558E906623k421296p279084m617320J005604M041059L548096Q20267k508453
9550a504504l281739N55281N230029M539155j040733m327742j901193J364825
9542c66621N42257k279921k526209j03767J869462J950461Q14703n67879r38388
9533a605902N31955K182362J633325L48720K055880N498477M368768k870858q742067
9524C400660o513322M50586L989583K108581o86719j384643j141946r60897K41692
$$ plain form
9515 -496425 2221737 6683346 10328737 11117027 9193141 6406778 4208496 2192303 -438482
9506 -438482 -2384458 -1519951 1084684 1692235 -322169 -1140308 841730 1594764 -1615255
9497 -1615255 -4536123 -2438395 1778660 2452485 735056 1794004 4947886 5063185 2520071
9488 2520071 2756510 5870609 5942201 1929049 -55151 2345866 3734427 1227698 -282764
9479 -282764 2394272 4519844 2007624 -1603908 -2481703 -3151943 -5600325 -5541226 -940117
9470 -940117 1416050 -3319726 -7770093 -3148098 5509166 6637027 527249 -2268997
9462 -2268997 1139915 2816395 -932168 -4130509 -3339071 -3452842 -6980825 -8054675 -2883609
9453 -2883609 2660646 2348728 -911591 -1675115 -1692985 -5443701 -10582423 -10814685 -5844698
$$ packed form
9515d96425K718162M461609L645391P88290j923886k786363k198282k016193k630785
9506d38482j945976Q64507K604635O07551k014404q18139J982038P53034l210019
9497a615255k920868K097728M217055O73825j717429J058948L153882J15299k543114
9488B520071K36439L114099P1592m013152j984200K401017J388561k506729j510462
9479b82764K677036K125572k512220l611532q77795o70240k448382N9099M601109
9470i40117K356167m735776m450367M621995Q657264J127861o109778k796246
9462b268997L408912J676480l748563l198341P91438j13771l527983j073850N171066
9453b883609N544255l11918l260319p63524j7870l750716n138722k32262M969987
$$ plain form
9444 -5844698 -1328422 24136 1126346 4338393 7701856 8244534 5754295 2602235
9436 2602235 1723242 4364031 8145680 8435080 3480269 -3078537 -6498325 -5961522 -3498169
9427 -3498169 -369109 2604270 3331512 814740 -2050153 -1708775 839501 1711828 352799
9418 352799 -142229 884279 -189822 -5172480 -9777046 -8383300 -1117441 6495440 9889954
9409 9889954 9236311 7594748 7506795 9240947 10483651 7751643 171409 -7701005 -9168346
9400 -9168346 -2953299 4491519 6373997 3553788 2031527 3619738 3656179 -1249261 -7874418
9391 -7874418 -11254027 -10904835 -8839663 -5084168 194892 3056065 142098 -4853153
9383 -4853153 -5294970 -1697830 -1066061 -5465884 -8346777 -4828128 801211 1819149 -1879170
$$ packed form
9444e844698M516276J352558J102210L212047L363463N42678k490239l152060
9436B602235q78993K640789L781649K89400m954811o558806l419788N36803K463353
9427c498169L129060K973379P27242k516772k864893L41378K548276Q72327j359029
9418C52799m95028J026508j074101m982658m604566J393746P265859P612881L394514
9409I889954o53643j641563q7953J734152J242704k732008p580234p872414j467341
9400i168346O215047P444818J882478k820209j522261J588211L6441m905440o625157
9391g874418l379609L49192K065172L755495N279060K861173k913967m995251
9383d853153m41817L597140O31769m399823k880893L518649N629339J017938l698319
$$ plain form
9374 -1879170 -5736841 -7050517 -5087221 990354 9079732 12601861 7759340 -205421
9366 -205421 -3425314 -1586976 16900 -18886 1244907 3418660 2428015 -1671036 -3678069
9357 -3678069 -1532828 854699 938894 1429601 4330239 7025150 7398715 7301207 7512311
9348 7512311 4878513 -1282117 -5329297 -3118898 1046345 1210428 -782532 325036
9340 325036 2809481 509623 -5569735 -7316566 -2436516 1085883 -3113206 -10259533
9332 -10259533 -11639373 -6369653 -586166 1964231 2952986 4285769 4777783 2606389
9324 2606389 -1822310 -6069287 -7277537 -4118813 1268606 4151720 1932926 -2743631
9316 -2743631 -5490018 -5609145 -5335577 -4607112 -641037 6335660 10790556 8163725 1295793
$$ packed form
9374a879170l857671j313676J963296O077575Q089378L522129m842521p964761
9366b05421l219893J838338J603876l5786J263793K173753r90645m099051k007033
9357c678069K145241K387527Q4195M90707K900638K694911L73565r7508K11104
9348G512311k633798o160630m047180K210399M165243J64083j992960J107568
9340C25036K484445k299858o079358j746831M880050L522399m199089p146327
9332a0259533j379840N269720N783487K550397R88755J332783M92014k171394
9324B606389m428699m246977j208250L158724N387419K883114k218794m676557
9316b743631k746387j19127K73568P28465L966075O976697M454896k626831o867932
$$ plain form
9307 1295793 -2628454 -702841 3281820 5036259 4922236 5242616 5214255 2010741 -3934143
9298 -3934143 -8081089 -7189941 -3100303 402091 2474554 4701018 6923487 6567571 2582473
9289 2582473 -2140941 -3631966 -1358310 987396 -809542 -6976446 -12924707 -13734788
9281 -13734788 -9896596 -7110621 -9138929 -12771452 -12486894 -8476684 -5943714 -6741448
9273 -6741448 -6590243 -2122451 3842881 6887486 7085272 6962022 6541944 4715455 3191685
9264 3191685 4336457 6579829 6831312 6304420 8447740 11566881 9915551 3214095 -1500635
9255 -1500635 -211470 2191969 581701 -1725673 730621 4862400 2711248 -5606965
9247 -5606965 -10827800 -7655818 -1819195 -924589 -4055527 -5072419 -2387907 -109923
$$ packed form
9307A295793l924247J925613L984661J754439j14023L20380k8361l203514n944884
9298c934143m146946Q91148M089638L502394K072463K226464K222469l55916l985098
9289B582473m723414j491025K273656K345706j796938o166904n948261q10081
9281a3734788L838192K785975k028308l632523K84558M010210K532970p97734
9273f741448J51205M467792N965332L044605J97786j23250m20078j826489j523770
9264C191685J144772K243372K51483n26892K143320L119141j651330o701456m714730
9255a500635J289165K403439j610268k307374K456294M131779k151152q318213
9247e606965n220835L171982N836623Q94606l130938j016892K684512K277984
$$ plain form
9239 -109923 -1076982 -3611115 -5138942 -5147368 -3817431 -844789 3033444 5484001 4979668
9230 4979668 2453385 -308158 -2419016 -3070505 -826546 4225771 8718842 8902146 5245313
9221 5245313 1904008 1234814 1262642 -236479 -1619208 116249 4108451 6116524 4265239
9212 4265239 1435406 1012252 2671793 3945209 4124871 4566265 5999660 7359814 7024663
9203 7024663 4122464 -832941 -5593427 -7301872 -5321650 -2340980 -1405054 -2555506
9195 -2555506 -3697841 -3741315 -3013024 -1526439 699329 2140520 1420297 343372 1992797
9186 1992797 5200733 4694535 -1212867 -6481917 -4358625 3452063 8490512 5779882
9178 5779882 -1269228 -6369275 -7152288 -5076259 -1665004 2326204 5316790 5412473 2947707
$$ packed form
9239a09923r67059k534133j527827q426J329937K972642L878233K450557n04333
9230D979668k526283k761543k110858o51489K243959N052317M493071J83304l656833
9221E245313l341305o69194K7828j499121j382729J735457L992202K008073j851285
9212D265239k829833m23154J659541J273416J79662M41394J433395J360154l35151
9203G024663k902199m955405m760486j708445J980222K980670R35926j150452
9195b555506j142335m3474P28291J486585K225768J441191p20223j076925J649425
9186A992797L207936n06198n907402n269050K123292P810688N038449k710630
9178E779882p049110n100047p83013K076029L411255L991208K990586R5683k464766
$$ plain form
9169 2947707 788068 1233593 3414296 4439217 2645109 -956688 -4132802 -5424887
9161 -5424887 -4622689 -2317743 180860 1114552 -319232 -2757969 -3771166 -2325733 536700
9152 536700 3325155 5287370 5989452 5177826 3453590 1638140 -898070 -5302309 -9888508
9143 -9888508 -10456401 -6076643 -1994019 -3308601 -7508825 -7785838 -3245038 -508388 -3795356
9134 -3795356 -8622403 -8655593 -4626956 -1789084 -1372737 -269755 1811720 937344 -4163431
9125 -4163431 -8920957 -9069400 -6070034 -3633858 -2230890 -487791 726902 -179304 -1637754
9116 -1637754 -1065613 -116306 -2934036 -8717497 -10910554 -5815237 1932907 5226932 2807880
9107 2807880 -1149397 -3045166 -1965893 2056590 7668574 10992594 8992170 4166041
$$ packed form
9169B947707k159639M45525K180703J024921j794108l601797l176114j292085
9161e424887Q02198K304946K498603R33692j433784k438737j013197J445433K862433
9152E36700K788455J962215P02082q11626j724236j815450k536210m404239m586199
9143i888508n67893M379758M082624j314582m200224k77013M540800K736650l286968
9134c795356m827047l3190M028637K837872M16347J102982K081475q74376n100775
9125d163431m757526j48443K999366K436176J402968J743099J214693r06206j458450
9116a637754N72141R49307k817730n783461k193057N095317P748144L294025k419052
9107B807880l957277j895769J079273M022483N611984L324020k000424m826129
$$ plain form
9099 4166041 2269944 4919225 7853127 7162098 3660749 -38093 -3006107 -4512017
9091 -4512017 -2619819 2553774 6655307 5648713 1086632 -2369799 -3496032 -4989951
9083 -4989951 -7753084 -8435969 -4002094 3559627 8796924 8451377 4739764 2818976 4748335
9074 4748335 6626953 3563930 -2755218 -5061279 -614830 3958314 1828251 -3751826
9066 -3751826 -4286873 967186 4267818 1799175 -1080416 263953 1909032 -1366081
9058 -1366081 -6480727 -6502078 -1766727 451490 -3130074 -7362488 -6408429 -1290504 2490097
9049 2490097 2029563 -467973 -980283 1928862 5712649 6698716 4475188 2417194 3173519
9040 3173519 5303418 5866459 4537088 3007366 2032723 1774728 3540895 7862258 11780441
$$ packed form
9099D166041j896097K649281K933902o91029l501349l698842k968014j505910
9091d512017J892198N173593M101533j006594m562081l456431j126233j493919
9083d989951k763133o82885M433875P561721N237297l45547l711613j920788J929359
9074D748335J878618l063023o319148k306061M446449M573144k130063n580077
9066c751826n35047N254059L300632k468643k879591J344369J645079l275113
9058a366081n114646k1351M735351K218217l581564m232414R54059N117925L780601
9049B490097m60534k497536n12310K909145L783787R86067k223528k057994P56325
9040C173519K129899N63041j329371j529722r74643k57995J766167M321363L918183
$$ plain form
9031 11780441 11531505 7525309 3453912 1047854 -720136 -1857832 -1198399 -136961
9023 -136961 -1763893 -5281522 -6035841 -2802460 -267994 -1694192 -3700677 -1955517 1796881
9014 1796881 2680843 -194227 -3920157 -6870473 -9155593 -9675306 -7255834 -3706798 -1487066
9005 -1487066 660930 5128248 9309082 7615124 180120 -6009758 -6526982 -4956827
8997 -4956827 -6146429 -8682763 -8248935 -5027022 -2755141 -2217617 -757459 2058726 3025401
8988 3025401 525603 -2673242 -3510134 -2432783 -1101691 917751 4248839 6441349
8980 6441349 4444223 26022 -1127984 2949985 6913543 4682002 -2343373 -6867661
8972 -6867661 -4887128 95877 2720037 2427143 2342653 3716801 4702830 4257264 4167494
$$ packed form
9031A1780441k48936m006196m071397k406058j767990j137696O59433J061438
9023a36961j626932l517629p54319L233381K534466j426198k006485J745160L752398
9014A796881Q83962k875070l725930k950316k285120n19713K419472L549036K219732
9005a487066K147996M467318M180834j693958p435004o189878n17224J570155
8997d956827j189602k536334M33828L221913K271881N37524J460158K816185R66675
8988C025401k499798l198845q36892J077351J331092K019442L331088K192510
8980F441349j997126m418201j154006M077969L963558k231541p025375m524288
8972f867661J980533M983005K624160k92894q4490J374148R86029m45566q9770
$$ plain form
8963 4167494 6026128 8169066 7495792 3681750 -113033 -955526 683546 2184071 2313738
8954 2313738 2114513 2281387 1355641 -2177077 -6897680 -9399701 -8296932 -5692919 -4228998
8945 -4228998 -4270921 -4907011 -6099289 -8063541 -9367703 -7808954 -3511582 365182 805220
8936 805220 -1898858 -4738698 -5267024 -3701176 -1976377 -1414691 -1793256 -2436540 -3261991
8927 -3261991 -4099939 -3713651 -872710 3488101 6391730 5610445 1589250 -3527819 -7618683
8918 -7618683 -9040837 -6998089 -2647985 1115748 2170775 967710 -729083 -1820377
8910 -1820377 -1755318 136330 3528537 6134888 5665556 2565180 -497992 -1553527 -523163
8901 -523163 1953709 5229919 8227501 9763320 9537195 7871662 4697058 11429 -4763267
$$ packed form
8963D167494J858634K142938o73274l814042l794783q42493J639072J500525J29667
8954B313738j99225J66874r25746l532718m720603k502021J102769K604013J463921
8945d228998m1923o36090j192278j964252j304162J558749M297372L876764M40038
8936H05220k704078k839840n28326J565848J724799N61686l78565o43284q25451
8927c261991q37948L86288K840941M360811K903629p81285m021195n117069m090864
8918g618683j422154K042748M350104L763733J055027j203065j696793j091294
8910a820377O5059J891648L392207K606351m69332l100376l063172j055535J030364
8901e23163K476872L276210K997582J535819k26125j665533l174604m685629m774696
$$ plain form
8892 -4763267 -7201149 -5901649 -1381851 4669419 9935853 11857668 9327342 4294363
8884 4294363 285178 -1019967 -635460 208247 1614202 3487870 4218959 2441431 -588475
8875 -588475 -1863408 -35555 2975573 4307734 3563337 2918441 3691044 4186372 2309582
8866 2309582 -750105 -1905755 -1071837 -1553357 -4541976 -6561945 -4697330 -1357022 -414617
8857 -414617 -893168 1173073 5701140 8050985 5749894 1542824 -1145877 -2095848 -2409073
8848 -2409073 -2118733 -1348327 -1208581 -2051764 -3029852 -4180076 -6236640 -7700433 -5644112
8839 -5644112 -825501 1819398 -12531 -2395434 -1191242 2036910 3806055 4909309
8831 4909309 7861082 10558770 8363368 1894991 -2827941 -2635325 -576826 225991 1194689
$$ packed form
8892d763267k437882J299500M519798O051270N266434J921815k530326n032979
8884D294363m009185j305145L84507Q43707J405955J873668P31089j777528l029906
8875e88475j274933J827853L011128J332161p44397o44896P72603M95328j876790
8866B309582l059687j155650Q33918m81520k988619k019969J864615L340308R42405
8857d14617m78551K066241M528067K349845k301091m207070k688701r49971l13225
8848b409073K90340P70406J39746q43183r78088j150224k056564j463793K056321
8839e644112M818611K644899j831929k382903J204192L228152J769145J103254
8831D909309K951773K697688k195402o468377m722932J92616K058499Q02817R68698
$$ plain form
8822 1194689 4238683 7298753 7758576 7584385 10575558 15377487 15692425 8623923 -418661
8813 -418661 -3532286 552041 5783322 6817029 4750779 3618951 3897286 2799460 203652
8804 203652 249478 5476437 12239142 14555026 11150747 6295293 4205447 4616258 3883285
8795 3883285 -692352 -7473245 -11043052 -7420660 599666 5367740 3135775 -1441376
8787 -1441376 -1924058 1366346 3251074 2224414 1766863 3206456 2982810 -827053 -3955326
8778 -3955326 -1444806 5337354 10848946 12453072 11530801 8823503 3119141 -4755265
8770 -4755265 -10301538 -9951799 -5618429 -2517541 -2966014 -4220511 -2902902 81025 773997
8761 773997 -2154916 -5287927 -4969281 -1802461 1323380 3743688 6324463 7481030 4387784
$$ packed form
8822A194689L043994L060070M59823j74191K991173M801929L14938p068502r042584
8813d18661l113625M084327N231281J033707k066250j131828K78335j097826k595808
8804B03652M5826N226959O762705K315884l404279m855454k089846M10811p32973
8795C883285m575637o780893l569807L622392Q020326M768074k231965m577151
8787a441376m82682L290404J884728j026660m57551J439593k23646l809863l128273
8778c955326K510520O782160N511592J604126r22271k707298n704362p874406
8770d755265n546273L49739M333370L100888m48473j254497J317609K983927O92972
8761G73997k928913l133011L18646L166820L125841K420308K580775J156567l093246
$$ plain form
8752 4387784 -1358402 -3991741 -1536074 787807 -1695281 -5829245 -5554149 -1159697
8744 -1159697 1951309 2088352 2479320 3615147 1205765 -5793352 -10948196 -8293424 -528672
8735 -528672 5141124 6345410 5905377 5013455 1758239 -3665367 -7445387 -7255668 -5117685
8726 -5117685 -3664995 -2788744 -1734846 -1556561 -3112271 -4798559 -4754391 -3788575 -3765011
8717 -3765011 -4341225 -3836434 -2529862 -2373456 -3479407 -3494772 -1291978 688112 -735674
8708 -735674 -5073088 -7903207 -5405997 1154451 6121275 5283023 643126 -2002345 -268043
8699 -268043 2197951 1355278 -1421268 -1752302 1115448 3480101 2671058 78564 -1774146
8690 -1774146 -2130055 -932581 2262325 6547638 9044529 8016596 5137752 3163690
$$ packed form
8752D387784n746186k633339K455667K323881k483088m133964K75096M394452
8744a159697L111006J37043L90968J135827k409382o999117n154844K654772P764752
8735e28672N669796J204286m40033q91922l255216n423606l780020J89719K137983
8726e117685J452690Q76251J053898J78285j555710j686288M4168R65816K3564
8717c765011n76214N04791J306572J56406j105951j5365K202794J980090j423786
8708g35674m337414k830119K497210O560448M966824q38252m639897k645471J734302
8699b68043K465994q42673k776546l31034K867750K364653q09043k592494j852710
8690a774146l55909J197474L194906M285313K496891j027933k878844j974062
$$ plain form
8682 3163690 3026009 4685237 8490355 13091793 14040345 8211155 -1002028 -6542489 -5926587
8673 -5926587 -3224939 -2247049 -1621479 1306866 5047516 5882780 3446517 753900 -769811
8664 -769811 -2716896 -5619302 -6742978 -3777089 1424110 4968398 5569978 4907735 4059357
8655 4059357 2095586 -1316533 -4003410 -3460227 -163967 2586278 2217901 -377109 -1926155
8646 -1926155 -384053 2940255 5138838 5145538 4382690 3939602 2843119 353412 -1586371
8637 -1586371 -458814 2936438 5153509 4589221 2886749 1734841 1033946 917497 2608743
8628 2608743 5759615 7552397 6356968 4128329 3414497 4312677 6268694 10031123 14995731
8619 14995731 17271311 14066515 8167523 4404408 3313955 2105962 169149 -907648
$$ packed form
8682C163690j37681J659228L805118M601438R48552n829190r213183n540461O15902
8673e926587K701648R77890O25570K928345L740650Q35264k436263k692617j523711
8664g69811j947085k902406j123676K965889N201199L544288O01580o62243q48378
8655D059357j963771l412119k686877N43183L296260K750245l68377k595010j549046
8646a926155J542102L324308K198583O700p62848m43088j096483k489707j939783
8637a586371J127557L395252K217071n64288j702472j151908p00895j16449J691246
8628B608743L150872J792782j195429k228639p13832Q98180J956017L762429M964608
8619A4995731K275580l204796n898992l763115j090453j207993j936813j076797
$$ plain form
8611 -907648 -1473039 -2936994 -3578544 -692090 3387841 3455923 121811 -250685 4095182
8602 4095182 6958835 4387045 1462586 3857935 8208955 7299306 1080076 -4148309
8594 -4148309 -5315041 -4885392 -4719899 -3885325 -2711991 -3470131 -6009029 -7326532 -6670438
8585 -6670438 -6893235 -9155098 -10115705 -6791112 -1428624 1170063 -329066 -2846755 -3350820
8576 -3350820 -2171629 -1383818 -1193539 475537 4360989 7372996 5806961 585225 -3362150
8567 -3362150 -3291223 -1268508 211321 1587883 3293969 3326836 1024925 -126048 2341828
8558 2341828 4721164 2147712 -3269313 -5111089 -2579197 -1597756 -5354756 -9591645
8550 -9591645 -9338294 -5480697 -1872095 323630 2363382 4665548 6691134 8429295
$$ packed form
8611i07648n65391j463955o41550K886454M079931O8082l334112l72496M345867
8602D095182K863653k571790k924459K395349M351020r09649o219230n228385
8594d148309j166732M29649J65493Q34574J173334p58140k538898j317503O56094
8585f670438k22797k261863r60607L324593N362488K598687j499129k517689n04065
8576c350820J179191P87811J90279J669076L885452L012007j566035n221736l947375
8567c362150P0927K022715J479829J376562J706086L2867k301911j150973K467876
8558B341828K379336k573452n417025j841776K531892R81441l757000m236889
8550i591645K53351L857597L608602K195725K039752K302166K025586J738161
$$ plain form
8542 8429295 9822651 9915751 8081658 5089930 2249753 756597 1827195 5177936 7235235
8533 7235235 4032169 -2986037 -7118489 -4209579 2194307 5404194 3042338 -2100636
8525 -2100636 -6439735 -8154709 -6777979 -3033003 1067496 3639774 4407482 4165833 3694633
8516 3694633 3833404 5184102 6653881 5682114 1237820 -4477565 -8366441 -9294553 -7797886
8507 -7797886 -4732887 -1673141 -862098 -2608317 -3883133 -1824799 1981816 3046722
8499 3046722 -258568 -4607253 -5886190 -3751935 -1166686 -633896 -2095765 -4030725
8491 -4030725 -5357961 -5943712 -6014101 -5745518 -5157015 -3860553 -1331734 1681923 2532204
8482 2532204 -812079 -6393569 -9374313 -7405428 -3089021 -49964 1268837 2225479
$$ packed form
8542H429295J393356R3100j834093k991728k840177j493156J070598L350741K057299
8533G235235l203066p018206m132452K908910O403886L209887k361856n142974
8525b100636m339099j714974J376730L744976M100499K572278P67708k41649m71200
8516C694633J38771J350698J469779r71767m444294n715385l888876r28112J496667
8507g797886L064999L059746Q11043j746219j274816K058334L806615J064906
8499C046722l305290m348685j278937K134255K585249N32790j461869j934960
8491d030725j327236n85751p0389K68583N88503J296462K528819L013657Q50281
8482B532204l344283n581490k980744J968885M316407L039057J318801R56642
$$ plain form
8474 2225479 2739705 2057805 1014286 637433 -133438 -2389245 -4328361 -3795378 -2482619
8465 -2482619 -3615341 -6206823 -5991614 -1996330 2213251 4217467 5316379 6703545
8457 6703545 7403106 7070393 6654008 5249204 816186 -4733848 -6239073 -2992421 -411361
8448 -411361 -1317161 -1202303 3796785 9636102 10574268 8255445 8015207 9094946 5905048
8439 5905048 -1864206 -7539543 -6963163 -3831078 -3309830 -4821881 -4270724 -718719 2482812
8430 2482812 2626379 1317647 2204252 5722850 7854784 5424910 1151118 385438 3353787
8421 3353787 4860310 2451366 -173189 -231813 -947486 -5188099 -8700947 -5853569 822121
8412 822121 3636902 1041010 -824346 1984239 6117443 7199419 5829479 4973500 5247666
$$ packed form
8474B225479N14226o81900j043519l76853p70871k255807j939116N32983J312759
8465b482619j132722k591482K15209L995284M209581K004216J098912J387166
8457F703545O99561l32713m16385j404804m433018n550034j505225L246652K581060
8448d11361r05800J14858M999088N839317R38166k318823k40238J079739l189898
8439E905048p769254n675337N76380L132085N21248j512051N51157L552005L201531
8430B482812J43567j308732Q86605L518598K131934k429874m273792p65680K968349
8421C353787J506523k408944k624555n8624p15673m240613l512848K847378O675690
8412H22121K814781k595892j865356K808585M133204J081976j369940q55979K74166
$$ plain form
8403 5247666 5099623 3132395 -1012611 -5784310 -7512453 -4146981 660341 1021641 -2981721
8394 -2981721 -4740634 -266811 6163297 7900801 4064226 -1096563 -4326259 -5516585
8386 -5516585 -5159808 -2938577 888797 4503229 5700786 3951931 1224093 154867
8378 154867 977741 1422001 451612 4838 1195214 1492082 -917929 -2442552 1375503
8369 1375503 8127660 10986523 8378646 5240295 4505224 3985250 2822268 3762634 6413422
8360 6413422 5530145 25437 -3279203 -91757 3771492 1755795 -2526404 -1815188 2264884
8351 2264884 2647953 -363943 -125408 3614391 3786308 -976543 -2858999 2128076 7009445
8342 7009445 4887894 -716269 -2777638 -1562151 -1471611 -2087399 -57575 3278491 3795875
$$ packed form
8403E247666j48043j967228m145006m771699j728143L365472M807322L61300m003362
8394b981721j758913M473823O430108J737504l836575n160789l229696j190326
8386e516585L56777K221231L827374L614432J197557j748855k727838j069226
8378A54867Q22874M44260r70389m46774J190376K96868k410011j524623L818055
8369A375503O752157K858863k607877l138351p35071n19974j162982R40366K650788
8360F413422q83277n504708l304640L187446L863249k015697m282199P11216M080072
8351B264884L83069l011896K38535L739799J71917m762851j882456M987075M881369
8342G009445k121551n604163k061369J215487R0540o15788K029824L336066N17384
$$ plain form
8333 3795875 2382361 3621274 7428645 8899809 6598502 4343268 3846124 2148425
8325 2148425 -1650629 -3392757 -831364 1728647 -156171 -4208402 -5368093 -3213133
8317 -3213133 -736858 1667871 5764829 10308474 11422197 8136460 3433879 -354600
8309 -354600 -3346782 -5068154 -3743328 153281 3142559 3215992 2330834 2909431 4421419
8300 4421419 5146971 5010001 4747800 4192363 3275261 3078118 4028587 4542779 3302094
8291 3302094 1544974 1320187 2756480 4771697 6941579 8574345 7582644 3212845 -1089000
8282 -1089000 -982621 2494090 3318472 -1662972 -8068343 -9273333 -4586371 500304 1691834
8273 1691834 711204 1649379 4612278 5606934 2474014 -1830214 -3131364 -1040329 1984760
$$ packed form
8333C795875j413514J238913L807371J471164k301307k255234m97144j697699
8325B148425l799054j742128K561393K560011j884818m052231j159691K154960
8317c213133K476275K404729M096958M543645J113723l285737m702581l788479
8309c54600k992182j721372J324826L896609K989278P3433q85158N78597J511988
8300D421419P25552j36970k62201n55437r17102j97143R50469N14192j240685
8291C302094j757120k24787J436293K015217K169882J632766r91701m369799m301845
8282a089000J06379L476711Q24382m981444o405371j204990M686962N086675J191530
8273A691834r80630R38175K962899R94656l132920m304228j301150K091035L025089
$$ plain form
8264 1984760 4730398 7343386 8470020 6172465 1886723 -420105 -61171 -718787 -3930814
8255 -3930814 -5450801 -1246199 5891838 9461549 7091404 1876156 -2500885 -4498022
8247 -4498022 -3865991 -1755393 -1052010 -3310705 -5882145 -5225664 -2365844 -1443596 -3147667
8238 -3147667 -3567538 -211529 4423425 6516128 5289093 2470122 -157665 -1361798
8230 -1361798 -593985 1235320 2434149 2548962 2429361 2329540 1707512 813343 412827
8221 412827 -45288 -1715044 -3696874 -3537398 -821145 2023222 3051013 2829522 2653728
8212 2653728 2808745 3154584 3549965 3229302 1446746 -1039129 -2660359 -3016377 -2674266
8203 -2674266 -1928132 -1687314 -3994314 -8707138 -11349954 -8237101 -2418038 139638 -798867
$$ packed form
8264A984760K745638K612988J126634k297555m285742k306828L58934o57616l212027
8255c930814j519987M204602P138037L569711k370145n215248m377041j997137
8247d498022O32031K110598P03383k258695k571440O56481K859820R22248j704071
8238c147667m19871L356009M634954K092703j227035k818971k627787j204133
8230a361798P67813J829305J198829J14813j19601r9821o22028q94169m00516
8221D12827m58115j669756j981830J59476K716253K844367J027791k21491j75794
8212B653728J55017L45839L95381l20663j782556k485875j621230l56018L42111
8203b674266P46134K40818k307000m712824k642816L112853N819063K557676r38505
$$ plain form
8194 -798867 -523200 1698303 1274727 -3081603 -6393891 -5639301 -4417037 -5922144 -7297452
8185 -7297452 -5314151 -2351911 -1925312 -2858534 -2680349 -2370110 -2813452 -1158895 3726944
8176 3726944 6765834 4075453 608351 3006749 8533914 9571913 6370368 5771201
8168 5771201 8492747 7973682 2687144 -589986 1434920 2963474 -401078 -4043708
8160 -4043708 -2935488 -644276 -2874486 -7488502 -8425484 -5826431 -4693054 -5592650 -4100897
8151 -4100897 957380 5369854 6450842 6511575 7824868 8719926 7000823 3978624 2643677
8142 2643677 3764927 5637062 6334595 4978183 2111080 -80775 746648 4161741 6643408
8133 6643408 5613988 2966664 2886581 6339327 9446481 7990260 2297406 -3454827 -6040840
$$ packed form
8194g98867K75667K221503m23576m356330l312288P54590J222264j505107j375308
8185g297452J983301K962240M26599r33222J78185L10239m43342J654557M885839
8176C726944L038890k690381l467102K398398N527165J037999l201545n99167
8168E771201K721546n19065n286538l277130K024906J528554l364552l642630
8160d043708J108220K291212k230210m614016r36982K599053J133377q99596J491753
8151d100897N058277M412474J080988O0733J313293Q95058j719103l022199j334947
8142B643677J121250J872135O97533j356412k867103k191855Q27423L415093K481667
8133F643408j029420k647324q0083L452746L107154j456221n692854n752233k586013
$$ plain form
8124 -6040840 -5873489 -5100636 -4624730 -3567615 -625118 4420105 9432496 10326030 5136776
8115 5136776 -1590062 -1765687 6425449 14617348 13977947 6586539 2118109 4401001 7508679
8106 7508679 5971453 2264284 958940 958105 -1543678 -5889890 -7927744 -6273266 -3154567
8097 -3154567 -383971 1335108 293105 -4539977 -10103058 -11717081 -9116571 -6382680
8089 -6382680 -5892020 -6095181 -5374027 -4009266 -1809715 1996071 5617043 5819660 3433269
8080 3433269 2973378 4896184 3683113 -2910234 -8202270 -5758312 31280 -238282 -6793826
8071 -6793826 -10378474 -6428462 -1542242 -2827148 -7531994 -8447455 -5165586 -3618059
8063 -3618059 -5961059 -6967591 -1704567 7251651 12656289 10892894 5442061 2489083
$$ packed form
8124f040840J67351P72853M75906J057115K942497N045223N012391Q93534n189254
8115E136776o726838j75625Q191136Q191899o39401p391408m468430K282892L107678
8106G508679j537226l707169j305344q35k501783m346212k037854J654478L118699
8097c154567K770596J719079j042003m833082n563081j614023K600510K733891
8089f382680M90660k03161P21154J364761K199551L805786L620972K02617k386391
8080C433269m59891J922806j213071o593347n292036K443958N789592k69562o555544
8071f793826l584648L950012M886220j284906m704846r15461L281869J547527
8063c618059k343000j006532N263024Q956218N404638j763395n450833k952978
$$ plain form
8055 2489083 4394092 7919205 8342033 4380378 -1262077 -5071720 -5111062 -1141448 5286557
8046 5286557 10676231 11829214 9119020 5809118 3795219 2478333 2250388 5206338
8038 5206338 10230364 11359030 5217578 -2487779 -2912235 4501406 11404232 11274104 6063727
8029 6063727 1487890 362383 2265404 5552460 7160369 3810470 -3606529 -9220568
8021 -9220568 -8476306 -3388616 758296 1857994 1419462 397866 -1993775 -5707901 -8738918
8012 -8738918 -8897390 -5552473 -138139 4192317 4656102 1795809 -894905 -1197100 -159339
8003 -159339 981656 2802145 4600215 2839954 -3623314 -9514871 -8952540 -3592064 -180445
7994 -180445 -1198689 -3261778 -4268653 -5941441 -8159236 -6941390 -1047029 4254500
$$ packed form
8055B489083J905009L525113M22828l961655n642455l809643l9342L969614O428005
8046E286557N389674J152983k710194l309902k013899j316886k27945K955950
8038E206338N024026J128666o141452p705357m24456P413641O902826j30128n210377
8029F063727m575837j125507J903021L287056J607909l349899p416999n614039
8021i220568P44262N087690M146912J099698m38532j021596k391641l714126l031017
8012h738918j58472L344917N414334M330456M63785k860293k690714l02195J037761
8003a59339J140995J820489J798070j760261o463268n891557N62331N360476L411619
7994a80445j018244k063089j006875j672788k217795J217846N894361N301529
$$ plain form
7986 4254500 3726978 -928475 -4179595 -3804971 -1458828 1363961 3989913 4735410 2210257
7977 2210257 -2053053 -5059617 -5888203 -5582519 -4620649 -2972944 -1632207 -1452709 -1321591
7968 -1321591 -22348 1105781 203787 -1425802 -978309 1203081 2336664 2307870 3846129
7959 3846129 6896885 7175121 2368747 -3750588 -6052339 -4215734 -1464060 549240
7951 549240 2329385 3469709 2580809 280511 -504148 2071243 6586514 9839930 9466280
7942 9466280 5403176 121230 -2780191 -1528045 2255182 5681158 7492877 7638651
7934 7638651 5374983 479685 -4107431 -4204247 65422 3532393 2553647 -159507 185061
7925 185061 3294666 4411740 1521358 -1852399 -2034818 -116675 655664 -41120 -185962
$$ packed form
7986D254500n27522m655453l251120L74624K346143K822789K625952P45497k525153
7977B210257m263310l006564q28586L05684R61870J647705J340737J79498J31118
7968a321591J299243J128129r01994j629589M47493K181390J133583k8794J538259
7959C846129L050756K78236m806374o119335k301751J836605K751674K013300
7951E49240J780145J140324q88900k300298p84659K575391M515271L253416l73650
7942I466280m063104n281946k901421J252146L783227L425976J811719J45774
7934G638651k263668m895298m587116r6816M269669L466971r78746k713154L44568
7925A85061L109605J117074k890382l373757j82419J918143P72339o96784j44842
$$ plain form
7916 -185962 266892 -663112 -2536137 -1667372 3523624 9208220 10828486 9064604 7909585
7907 7909585 8109528 6582300 2403047 -934411 -735240 1252474 2818569 5282579 9731467
7898 9731467 12089800 7247784 -2478845 -8156055 -4738702 3029374 6786217 3548785
7890 3548785 -3014981 -7383136 -6296685 -582352 4941456 5253723 656938 -3336452
7882 -3336452 -3076573 -1032160 -829014 -1302285 603967 3287575 1902498 -3989454 -8859158
7873 -8859158 -8381516 -4543974 -1980181 -1927848 -1812272 625367 4343363 5767108 2436882
$$ packed form
7916a85962M52854r30004j873025Q68765N190996N684596J620266j763882j155019
7907G909585J99943j527228m179253l337458J99171J987714J566095K464010M448888
7898I731467K358333m842016r726629n677210L417353P768076L756843l237432
7890C548785o563766m368155J086451N714333N523808L12267m596785l993390
7882c336452K59879K044413K03146m73271J906252K683608j385077n891952m869704
7873h859158M77642L837542K563793N2333J15576K437639L717996J423745l330226
$$ [...]
##END NTUPLES=NMR SPECTRUM
##END=
