##TITLE=31Pdec_SR136_rm2d
 , 24 sc
 29.7.2022
##JCAMPDX= 6.0         $$ Bruker NMR JCAMP-DX V2.0
##DATA TYPE= NMR SPECTRUM
##DATA CLASS= NTUPLES
##ORIGIN= UXNMR, Bruker Analytische Messtechnik GmbH
##OWNER= root
$$ XWIN-NMR		Version 3.5
$$ Fri Jul 29 13:44:53 2022 Russian Standard Time (UT+4h)  she@DPX200
##.OBSERVE FREQUENCY= 81.013821
##.OBSERVE NUCLEUS= ^31P
##.ACQUISITION MODE= SIMULTANEOUS
##.ACQUISITION SCHEME= undefined
##.AVERAGES= 24
##.DIGITISER RES= 16
##SPECTROMETER/DATA SYSTEM= spect
##.PULSE SEQUENCE= zgpg30
##.SOLVENT NAME= CD2Cl2
##.SHIFT REFERENCE= (INTERNAL, CD2Cl2, 0, 248.564)
##AUDIT TRAIL= $$ (NUMBER, WHEN, WHO, WHERE, WHAT)
$$ ##TITLE= Audit trail, XWIN-NMR		Version 3.5
$$ ##JCAMPDX= 5.01
$$ ##ORIGIN= Bruker BioSpin GmbH
$$ ##OWNER= she
$$ F:/spectra/data/she/nmr/P31/1/pdata/1/auditp.txt
$$ ##AUDIT TRAIL=  $$ (NUMBER, WHEN, WHO, WHERE, WHAT)
(   1,<2022-07-29 13:44:02.23 +0400>,<she>,<DPX200>,
      <created by zg, POWCHK disabled, PULCHK disabled
       configuration hash MD5:
       00 E9 B6 7A A2 85 ED C7 34 08 36 98 17 FE 4E 26
       data hash MD5: 32K
       17 CE C2 87 74 AE F1 8D A5 5F 24 F6 8D BE 76 E6>)
(   2,<2022-07-29 13:44:05.23 +0400>,<she>,<DPX200>,
      <Start of raw data processing
       efp BC_mod = 2 LB = 1 FT_mod = 6 PKNL = 1 PHC0 = -10383.62 PHC1 = 369.6567 SI = 64K 
       data hash MD5: 64K
       32 68 76 EE 98 D2 56 EA F2 F2 FD FC 06 B3 7F 71>)
(   3,<2022-07-29 13:44:19.78 +0400>,<she>,<DPX200>,
      <pk PHC0 = -9.358916 PHC1 = 0 
       data hash MD5: 64K
       BF 81 D9 A5 A3 D5 A4 34 F3 9A 00 32 C0 65 5E EF>)
(   4,<2022-07-29 13:44:22.79 +0400>,<she>,<DPX200>,
      <abs ABSG = 5 
       data hash MD5: 64K
       04 B0 A7 5D A7 00 FD B3 88 2E CE 67 7B 4C 10 40>)
$$ ##END=
$$ 
$$ hash MD5
$$ C3 0D 82 D7 09 63 05 61 58 58 62 BB 6A 47 8C 3B
##$RELAX= 
##$RELAX= 
##$RELAX= 
##$RELAX= 
##$RELAX= 
##$RELAX= 
##$RELAX= 
##$RELAX= 
$$ Bruker specific parameters
$$ --------------------------
##$DU= <F:/spectra>
##$EXPNO= 1
##$NAME= <P31>
##$PROCNO= 1
##$TYPE= <nmr>
##$USER= <she>
##$AMP= (0..31)
100 100 100 100 100 100 100 100 100 100 100 100 100 100 100 100 100 100 
100 100 100 100 100 100 100 100 100 100 100 100 100 100 
##$AQSEQ= 0
##$AQ_mod= 1
##$AUNM= <au_zg>
##$AUTOPOS= <>
##$BF1= 81.014009
##$BF2= 200.13
##$BF3= 200.13
##$BF4= 200.13
##$BF5= 200.13
##$BF6= 200.13
##$BF7= 200.13
##$BF8= 200.13
##$BYTORDA= 1
##$CFDGTYP= 0
##$CFRGTYP= 5
##$CHEMSTR= <none>
##$CNST= (0..31)
1 1 145 1 1 1 1 1 1 1 1 1 1 1 1 1 1 1 1 1 1 1 1 1 1 1 1 1 1 1 1 1 
##$CPDPRG= <waltz16>
##$CPDPRG1= <>
##$CPDPRG2= <waltz16>
##$CPDPRG3= <>
##$CPDPRG4= <mlev>
##$CPDPRG5= <mlev>
##$CPDPRG6= <mlev>
##$CPDPRG7= <mlev>
##$CPDPRG8= <mlev>
##$CPDPRGB= <>
##$CPDPRGT= <>
##$D= (0..31)
0 1 0 0 0 0 0 0 0 0 0 0.03 2e-05 3e-06 0 0 0 0 0 0 0 0 0 0 0 0 0 0 0 0 
0 0 
##$DATE= 1659087841
##$DBL= (0..7)
120 120 120 11 120 120 24 19 
##$DBP= (0..7)
150 150 150 150 150 150 150 150 
##$DBP07= 0
##$DBPNAM0= <>
##$DBPNAM1= <>
##$DBPNAM2= <>
$$ [...]
##$SUBNAM3= <"">
##$SUBNAM4= <"">
##$SUBNAM5= <"">
##$SUBNAM6= <"">
##$SUBNAM7= <"">
##$SUBNAM8= <"">
##$SUBNAM9= <"">
##$SW= 501.771253377433
##$SWIBOX= (0..15)
0 1 3 0 0 0 0 0 0 0 0 0 0 0 0 0 
##$SW_h= 40650.406504065
##$TD= 32768
##$TD0= 1
##$TE= 0
##$TE2= 300
##$TE3= 300
##$TEG= 300
##$TL= (0..7)
0 120 53 12 22 120 120 120 
##$TP= (0..7)
150 150 150 150 150 150 150 150 
##$TP07= 0
##$TPNAME0= <>
##$TPNAME1= <>
##$TPNAME2= <>
##$TPNAME3= <>
##$TPNAME4= <>
##$TPNAME5= <>
##$TPNAME6= <>
##$TPNAME7= <>
##$TPOAL= (0..7)
0.5 0.5 0.5 0.5 0.5 0.5 0.5 0.5 
##$TPOFFS= (0..7)
0 0 0 0 0 0 0 0 
##$TUNHIN= 0
##$TUNHOUT= 0
##$TUNXOUT= 0
##$USERA1= <user>
##$USERA2= <user>
##$USERA3= <user>
##$USERA4= <user>
##$USERA5= <user>
##$V9= 5
##$VALIST= <valist>
##$VCLIST= <CCCCCCCCCCCCCCC>
##$VD= 0
##$VDLIST= <DDDDDDDDDDDDDDD>
##$VPLIST= <PPPPPPPPPPPPPPP>
##$VTLIST= <TTTTTTTTTTTTTTT>
##$WBST= 1024
##$WBSW= 4
##$XGAIN= (0..3)
0 0 0 0 
##$XL= 0
##$YL= 0
##$YMAX_a= 4513
##$YMIN_a= -5860
##$ZGOPTNS= <>
##$ZL1= 120
##$ZL2= 120
##$ZL3= 120
##$ZL4= 120
##$ABSF1= 248.5645
##$ABSF2= -253.2056
##$ABSG= 5
##$ABSL= 3
##$ALPHA= 0
##$AQORDER= 0
##$ASSFAC= 0
##$ASSFACI= 0
##$ASSFACX= 0
##$ASSWID= 0
##$AUNMP= <proc_1d>
##$AZFE= 0.1
##$AZFW= 0.5
##$BCFW= 0
##$BC_mod= 2
##$BYTORDP= 0
##$COROFFS= 0
##$CY= -3
##$DATMOD= 1
##$DC= 0
##$DFILT= <>
##$DTYPP= 0
##$F1P= 0
##$F2P= 0
##$FCOR= 1
##$FTSIZE= 65536
##$FT_mod= 6
##$GAMMA= 0
##$GB= 0
##$INTBC= 1
##$INTSCL= 5.30512e-09
##$ISEN= 30
##$LB= 1
##$LEV0= 0
##$LPBIN= 0
##$MAXI= 10000
##$MC2= 0
##$MEAN= 0
##$ME_mod= 0
##$MI= 50
##$NCOEF= 0
##$NC_proc= -8
##$NLEV= 6
##$NOISF1= 182.463
##$NOISF2= 159.3651
##$NSP= 0
##$NTH_PI= 0
##$NZP= 0
##$OFFSET= 248.5645
##$PC= 4
##$PHC0= -10392.98
##$PHC1= 369.6567
##$PH_mod= 1
##$PKNL= yes
##$PPARMOD= 0
##$PSCAL= 0
##$PSIGN= 0
##$REVERSE= no
##$SF= 81.014009
##$SI= 65536
##$SIGF1= 159.3651
##$SIGF2= -187.1042
##$SINO= 113.3802
##$SIOLD= 16384
##$SREGLST= <1H.CDCl3>
##$SSB= 0
##$STSI= 65536
##$STSR= 0
##$SW_p= 40650.406504065
##$SYMM= 0
##$S_DEV= 0
##$TDeff= 32768
##$TDoff= 0
##$TI= <>
##$TILT= no
##$TM1= 0
##$TM2= 0
##$TOPLEV= 0
##$USERP1= <user>
##$USERP2= <user>
##$USERP3= <user>
##$USERP4= <user>
##$USERP5= <user>
##$WDW= 1
##$XDIM= 65536
##$YMAX_p= 242868360
##$YMIN_p= -359485033
$$ End of Bruker specific parameters
$$ ---------------------------------
##NTUPLES= NMR SPECTRUM
##VAR_NAME=  FREQUENCY,     SPECTRUM/REAL,   SPECTRUM/IMAG
##SYMBOL=    X,             R,               I
##VAR_TYPE=  INDEPENDENT,   DEPENDENT,       DEPENDENT
##VAR_FORM=  AFFN,          ASDF,            ASDF
##VAR_DIM=   65536,         65536,           65536
##UNITS=     HZ,            ARBITRARY UNITS, ARBITRARY UNITS
##FACTOR=    0.620285442955139, 1,           1
##FIRST=     20137.2065510759, 0,            0
##LAST=      -20513.1999529892, 0,           0
##MIN=       -20513.1999529892, -359485033,  0
##MAX=       20137.2065510759, 242868360,    0
$$ Real data points
##PAGE= N=1
##DATA TABLE= (X++(R..R)), XYDATA
$$ [...]
13029G874954O2669k963097l615844n99200K639757K789567P00546j173760j839018
13020C876574j059016O33054M78607l520236p570686n509903J576604N453220
13012e641782K701443k10311K345753O010319L800182k538617n393272k456735
13004a383020J473044K262367L71543k042685l135618j272601K836381M856871
12996C966282J761563l121455m246873j753580l81383j455952j581445N26918
12988f285925J721078L82031n75536R77606K627279J948990Q93465K061096L684553
12979G434637K473767m94708j117739J178562K411672J81293k696744k402100
12971F968640M45065J871640O0739k513186k677450n64270J044895M67064j244707
$$ y = [7874954, 7937623, 4974526, 1358682, 759482, 3399239, 6188806, 6889352, 5715592, 3876574, 2817558, 3450612, 3929219, 408983, -7161703, -12671606, -11095002, -5641782, -2940339, -3150650, -804897, 5205422, 9005604, 6466987, 1073715, -1383020, 90024, 2352391, 2723934, 681249, -2454369, -3726970, -890589, 3966282, 5727845, 2606390, -1640483, -3394063, -3775446, -5231398, -6812843, -6285925, -4564847, -4182816, -4758352, -3780746, -1153467, 795523, 1688988, 3750084, 7434637, 9908404, 9413696, 8295957, 9474519, 11886191, 12067484, 9370740, 6968640, 7413705, 9285345, 9346084, 6832898, 4155448, 3591178, 4636073, 5103137, 3858430]
12962C858430k266193k023197p34247J418612L380353K980174k61959l001448
12954C350525j520954K735820M149538L21779m578472n618087l294121j163015
12946e616987R6589K163061M071413K710065j359763l396249j437332O19586m61278
12937b610895j794188N34661M225278L981043J96889j592075J95337R11140j937283
12928B109907m131863j961092J294213R93664q63522N51265L709212K642715k411063
12919A933436l993209Q61838M960432J449391n479444o559608r28071L360818
12911d394417J605492j664181q87246K232384K456604o91151l037324k530587
12903f910426j304182r48458Q3161K793049M635957K931501n49365j542089O82099
$$ y = [3858430, 1592237, -430960, -1165207, 253405, 3633758, 6613932, 6351973, 3350525, 1829571, 4565391, 8714929, 9036708, 4458236, -1159851, -4453972, -5616987, -5520398, -3357337, 714076, 3424141, 2064378, -1331871, -2769203, -2149617, -2610895, -4405083, -3870422, 354856, 4335899, 4532788, 2940713, 3136050, 4047190, 2109907, -2021956, -3983048, -2688835, -1695171, -2558693, -2007428, 1701784, 4344499, 1933436, -2059773, -1197935, 3762497, 5211888, -267556, -6827164, -7755235, -4394417, -2788925, -4453106, -5340352, -3107968, -651364, -1342515, -4379839, -6910426, -8214608, -9163066, -9079905, -6286856, -1650899, 1280602, 731237, -810852, -128753]
12894a28753K351405Q90555j306447p13723J742454J792061k028520o103460o207204
12885i711632k161020K849973N724291M989915Q40031m218263n967608k450063
12877a0104376K821117M186118P88994k377072j374731J550285J994416J46819
12869b368430j38050J968399K849636N78818j604089m53906J785400P89213k672936
12860G34055l402440L43414L907550K844448r19560k283668j10079K139381J922974
12851E176075L19891j037456k437009l915624l203011J335406O729976P544421
12843A0512669K618899k875195l736283j148424k96921k685626m252320j653673
12835c516874K908892N055927L862920J545668n23823k312514k908072j439054
$$ y = [-128753, 2222652, 3113207, 1806760, 1093037, 2835491, 4627552, 2599032, -3504428, -9711632, -11872652, -9022679, -3298388, 1691527, 2531558, -1686705, -7654313, -10104376, -7283259, -3097141, -2308147, -4685219, -6059950, -4509665, -2515249, -2368430, -2506480, -538081, 2311555, 2890373, 1286284, 832378, 2617778, 3406991, 734055, -2668385, -2324971, 1582579, 4427027, 3507467, 1223799, 1113720, 3253101, 5176075, 5495966, 4458510, 2021501, -1894123, -5097134, -3761728, 2968248, 10512669, 13131568, 10256373, 6520090, 5371666, 5074745, 2389119, -1863201, -3516874, -607982, 4447945, 8310865, 9856533, 9332710, 7020196, 4112124, 2673070]
12827B673070J80129q90850l560348l500057M55967M232016M217621J623509n53227
12818D877830j459905j199270P16902K987764K055039k611232n944617l854119
12810d431608O59015K345286J612010K088165K863518N2368m889015n780821j404606
12801f885688K284869J369205r54198q52187O33867J522542K571377L527528J363901
12792D581216l508299m817448M71856N657376L266061l549437n757977j666847
12784e323499K352181K720529K140335K302076J058303j580793j717447J594768
12776C546453L762572J799532j213854j847234j454935k056473j848013P75185
12768A463233K685515N60817k923227k712051P01472K338502P86394l21616Q07433
$$ y = [2673070, 2853199, 1962349, -1597999, -5098056, -4642089, -410073, 3807548, 5431057, 4877830, 3417925, 2218655, 2935557, 5923321, 7978360, 5367128, -577489, -4431608, -3772593, -1427307, 184703, 2272868, 5136386, 5188754, 299739, -5481082, -6885688, -4600819, -3231614, -4185812, -5037999, -4404132, -2881590, -310213, 3217315, 4581216, 1072917, -3744531, -3272675, 2384701, 5650762, 2101325, -3656652, -5323499, -2971318, -250789, 1889546, 4191622, 5249925, 3669132, 1951685, 3546453, 7309025, 9108557, 7894703, 6047469, 4592534, 2536061, 688048, 1463233, 4148748, 4709565, 1786338, -925713, -224241, 2114261, 2900655, 2579039, 3386472]
12759C386472J161794j230031l058687p95159K896339K150431l350065o793033
12751e631939k939402M508556P179216K463617l799230n398805k807729j55063
12743f580779J367414L134332M280564K421173j047472j530085J655624L480547
12735G181318P24535l021333l031025m56717L59717j007964j139786J241728L425917
12726D276390K725320o25707m427081o110901m004007Q31296M786233N573650
12718C025193M487521K976280l08224n675687q485853m345825L232515O275208
12710A181128L247454M05702J475083K568800p6686l551567l704338k097543k269473
12701b821440k740896K37744M988114N632646Q55364l884337l836314m32867K030288
$$ y = [3386472, 4548266, 3318235, 259548, -535611, 2360728, 4511159, 1161094, -5631939, -8571341, -4062785, 3116431, 5580048, 1780818, -3617987, -6425716, -6580779, -5213365, -2079033, 2201531, 4622704, 3575232, 2045147, 3700771, 7181318, 7905853, 4884520, 1853495, 1396778, 1756495, 748531, -391255, 850473, 4276390, 7001710, 6376003, 1948922, -4161979, -8165986, -7334690, -2548457, 3025193, 7512714, 10488994, 10180770, 4505083, -3980770, -8326595, -5094080, 1181128, 4428582, 4834284, 6309367, 8878167, 8801481, 5249914, 1545576, -551967, -2821440, -5562336, -5324592, -336478, 5296168, 6151532, 2267195, -1569119, -2001986, 28302]
12692B8302J690372m78781k717590l219355j011821K304101L462455J518635p44331
12683H31987n88783J356233K952766L689066L912929K745150m84406l765458m336572
12674F312912k696424j741550j984323j027783J518786K431182K04987j588111
12666A429676L20670K978463J334375l168719l685791J764599O556693M537504
12658A2067470j481586m191757j963943k1113k321388o448208p374352l543949
12650a5278826K038449N278257M547180J468699j175052k134265j995600j282374
12642h533532J81515J750727J831704L23399p03495q6748O01927p3930p30071
12633e438504N45303K861923L674182J990858j210483m151017m541306j243197
$$ y = [28302, 1718674, 1239893, -1477697, -4697052, -5708873, -3404772, 57683, 1576318, 831987, 243204, 1599437, 4552203, 8241269, 12154198, 14899348, 14414942, 10649484, 6312912, 3616488, 1874938, -109385, -1137168, 381618, 2812800, 3017787, 1429676, 1750346, 4728809, 6063184, 2894465, -791326, 973273, 7529966, 12067470, 10585884, 6394127, 4430184, 4409071, 2087683, -4360525, -11734877, -15278826, -13240377, -7962120, -3414940, -1946241, -3121293, -5255558, -7251158, -8533532, -8352017, -6601290, -4769586, -4446187, -5149682, -5236430, -4634503, -4708433, -5438504, -4893201, -2031278, 1642904, 3633762, 2423279, -1727738, -6269044, -7512241]
12625g512241K799609K696894j208233k682834P27998K865110r94857n015036
12617h323590j578771N478527O404714J436296l20645K829091K676801l060625
12609E541798n376947L82360N404641J586478n250710n509374r28438O90788n87721
12600d047125P10544L384653J339916m356249n767986n66211M661544M429758
12592b11156L95163l269835m153632j081157M572159P193731K697330m326859
12584A815744n493388k26414M204602L942218K422074K431120J926687l56538
12576A0666105j902346j313358m96234k51830P52087J539485m46605l175315j633056
12567C738933K881199K902361l125286p088090l534159K158954L195943J469422
$$ y = [-7512241, -4712632, -2015738, -3223971, -5906805, -5178807, -2313697, -3308554, -8323590, -9902361, -4423834, 1980880, 3417176, 3096531, 5925622, 8602423, 5541798, 164851, 547211, 5951852, 7538330, 2287620, -3221754, -4150192, -3459404, -4047125, -3336581, 48072, 1387988, -2968261, -8736247, -9302458, -4640914, -211156, 184007, -3085828, -7239460, -8320617, -3748458, 3445273, 6142603, 1815744, -3677644, -3904058, 300544, 4242762, 6664836, 9095956, 11022643, 10666105, 8763759, 7450401, 6954167, 6702337, 7454424, 8993909, 8547304, 5371989, 3738933, 6620132, 9522493, 6397207, -690883, -4225042, -2066088, 1129855, 2599277]
12559B599277J669913J918535j630102n597064l574615K923929N908358K596470
12551F814701j459721j348519J072616J438057r96920l210942k230027J610784
12543A690029M400135K733087j264084j806620K077550L937954r14134p554581
12535C299336p840104j951718K378835J127324j512422o11256K553960L287511
12527G31466K06658l223126k972204J015698M743883M633331J423472j556583
12519E002595k955972l544697k732934N63621L431768J100729m652024n567436
12511i354350J127643P198807N103167p33551j438742K252067K213621l233923
12503C134739o851759l943068J623618M218964K859444o90262m541106n731660
$$ y = [2599277, 4269190, 6187725, 4557623, -1039441, -4614056, -1690127, 4218231, 6814701, 5354980, 4006461, 5079077, 6517134, 5520214, 2309272, 79245, 1690029, 6090164, 8823251, 7559167, 5752547, 7830097, 11768051, 10853917, 3299336, -4540768, -6492486, -4113651, -2986327, -4498749, -5110005, -2556045, 731466, 938124, -2285002, -5257206, -4241508, 502375, 5135706, 6559178, 5002595, 2046623, -1498074, -4231008, -3667387, -235619, 865110, -3786914, -9354350, -8226707, -1027900, 4075267, 3341716, 1902974, 4155041, 6368662, 3134739, -3717020, -7660088, -6036470, -1817506, 1041938, 351676, -4189430, -9921090]
12495i921090j759161M935240Q125990N165157j83746l194870k965965j090041
12487h88486P64292J066255m73507j431150N45524L420943K804769j628059n512865
12478a332284n743870l267826N8142L240534M558109K557102o69174j197685J089927
12469g07025K390563Q45626j424268k406524k256363j099995J075391K352421
12461a230174R88206p83483K80408K463821J582358j461489k079387k45777R5256
12452c90261n45848J909010N445291L278117l351221m795113R35289L492666k525015
12443C452915p600434l231367L407188K017370l262072k365844K166859N93538
12435d821847m871657l081909N174620O460508k695227q638092j970366P940070
$$ y = [-9921090, -11680251, -6745011, 1380979, 6546136, 6362390, 3167520, 201555, -888486, -124194, 942061, 468554, -962596, -417072, 3003871, 5808640, 4180581, -1332284, -7076154, -10343980, -10285838, -7045304, -2487195, 69907, -599267, -1796952, -707025, 1683538, 2529164, 1104896, -1301628, -3557991, -4657986, -3582595, -1230174, -241968, -1025451, -745043, 1718778, 3301136, 1839647, -239740, -485517, -390261, -936109, 972901, 6418192, 9696309, 6345088, 1549975, 2485264, 5977930, 3452915, -4147519, -7378886, -3971698, -1954328, -5216400, -7582244, -5415385, -4821847, -9693504, -12775413, -7600793, -1140285, -3835512, -12473604, -14443970, -6503900]
12427f503900Q308638J483967j931690j26429O81581j170854j620903O5249L54587
12418d59754j062802o86496J608728J641347j691132l947604j927191J806407
12410d718497L377879K732529J830420P85641j244858l205195l070599q82243
12402d394923J353653K344863K205392R56816j368837l027141j571834K273874
12394a228137M125404J438050k312627j887061K269728M382445J328998l316662
12386D800138m505492j878649J227156K483357K082760J316170J489199K700532
12378I715171K514884j736032p888207r485999m028453K597654L615881M10446
12370d284655n65990K223819M096491K161072r59679k147718j689201p45975R50293
$$ y = [-6503900, 1804738, 3288705, 1357015, 1230586, 1912167, 741313, -879590, -814341, -459754, -1522556, -2209052, -600324, 1041023, -650109, -4597713, -6524904, -4718497, -1340618, 1391911, 3222331, 4007972, 2763114, -442081, -3512680, -4394923, -3041270, -696407, 1508985, 2465801, 1096964, -1930177, -3502011, -1228137, 2897267, 4335317, 2022690, 135629, 2405357, 6787802, 8116800, 4800138, 294646, -1584003, -356847, 2126510, 4209270, 5525440, 7014639, 9715171, 12230055, 10494023, 2605816, -6880183, -10908636, -8310982, -4695101, -4284655, -4850645, -2626826, 1469665, 3630737, 2671058, 523340, -1165861, -1911836, -961543]
12361i61543L025838L404609J319854j039039j485190m42151N41049R18047P72979
12352F054453R1419p19512r84092q14285p46749n95448j48686j80869q88865o75367
12342C91999R98004J393997j287112l438531p49672L996163M029955p02581l026480
12333A605742j31870J761946k180031p069010n657486R38146N760150N878601
12325I06188L952426K128956J1461k133299k864863k229330j595558j196888m91947
12316c512854q9585p26697j353707o55917P10222J574843K290124L036972K208550
12307C481951p34364k897933j614130J378526K598415J845559J332427J663916
12299G054367J975663K117685J523896j465118n574141n449225M82458M822837
$$ y = [-961543, 2064295, 5468904, 6788758, 5749719, 4264529, 3822378, 4363427, 5281474, 6054453, 6145872, 5426360, 4442268, 3627983, 2881234, 2285786, 2137100, 1956231, 1067366, 391999, 1390003, 2784000, 1496888, -1941643, -2691315, 1304848, 5334803, 4632222, 1605742, 1473872, 3235818, 1055787, -6013223, -11670709, -10732563, -4972413, 906188, 4858614, 6987570, 6999031, 4865732, 2000869, -228461, -1824019, -3020907, -3512854, -3602439, -4329136, -5682843, -6338760, -5628538, -4053695, -1763571, 1273401, 3481951, 2747587, -150346, -1764476, -385950, 2212465, 4058024, 5390451, 7054367, 9030030, 11147715, 12671611, 11206493, 5632352, 183127, 665585, 5488422]
12291E488422P19197o562989o229298J504157N547058J294489k906825k01997
12283a347786M069177K435576k318389k981298j36274L32711j794073j563495
12275c303851J403171K166792m74010j790266O49150L031348J847651q17875j289328
12266A422782K71981J119461m1511k285408l776936k809877M31642K907028K185999
12257e74839O83437K565837O265801N315999j612288p160212n385329l28108O37987
12248D08285k129008k593058M98672K538563J649076R91712J782080J126494j257928
12239C014888j126787K344971L431142q19509m432510j721760K861517J732620
12231E284572l139157l574651J040602L192544L56471j425878Q51101J882428
$$ y = [5488422, 6207619, -355370, -6584668, -5080511, 466547, 1761036, -1145789, -1347786, 2721391, 5156967, 2838578, -142720, -278994, 53717, -1740356, -3303851, -1900680, 266112, -207898, -1998164, -1349014, 1682334, 3529985, 2712110, 1422782, 1694763, 2814224, 2772713, 487305, -3289631, -6099508, -5667866, -2760838, -574839, 108598, 2674435, 8940236, 14256235, 12643947, 5483735, 98406, -229702, 408285, -1720723, -4313781, -3815109, -1276546, 372530, 1364242, 3146322, 4272816, 3014888, 1888101, 4233072, 7664214, 6844705, 2412195, 690435, 3551952, 5284572, 2145415, -1429236, -388634, 2803910, 3160381, 1734503, 2585604, 4468032]
12223D468032j385859l134114J014750M917892J340185n454115n903038k74330
12215d410597K273997j525434m803741k125652K989885M649186K219849j350476
12207b082983l622663k656720K269193P505023P119511P54064m715683l948753
12199F20989M03248K726237J951685O95748K78376K53914M25282J45864k052845
12190E448498n240764n146707J56614N945102O024160O42753m377651n190303
12182a738298l013681m86259J403302K549609K713618J944849N60091j258068
12174B675163k898150l200166j957303m14367O32222J628711K364081J650065
12166D80256L2835j82384P63182n05441m172162m612444J535643Q349254P451196
$$ y = [4468032, 3082173, -51941, 962809, 5880701, 7220886, 1766771, -4136267, -4410597, -2136600, -3662034, -8465775, -10591427, -7601542, -2952356, -732507, -2082983, -5705646, -8362366, -6093173, 1411850, 8531361, 9285425, 4569742, 620989, 1024237, 3750474, 5702159, 6397907, 6676283, 6930197, 7355479, 7501343, 5448498, 207734, -4938973, -4782359, 1162743, 7186903, 7829656, 3452005, -1738298, -4751979, -5238238, -3834936, -1285327, 1428291, 3373140, 3933231, 2675163, -222987, -3423153, -5380456, -5794823, -5162601, -3533890, -1169809, 480256, 513091, 330707, 1093889, 588448, -3583714, -8196158, -6660515, 1688739, 9139935]
12157I139935k79765n865732m149450J244276M599082M072675N68699l911893
12149E417827n785370k695779K044744K520839j246138k912866N19664M143101
12141B006022K947826q51600k043074n9439J657273J181538p18893k907748m210130
12132b998225l112013J76991K858218K804323R82979q58894k422768l155230j547177
12123g271796J570510K471370J68495j006918J852325M582639J979139l496160
12115H49604m990364j552883J209049L98587o63771P15689K174018J122401p72245
12106a509915r92356m11968r14360j581667o35717Q22696N11841o99315L20451
12097e090310L723995N514878K846164j743580l403075j214030J020052L62535
$$ y = [9139935, 8860170, 2994438, -1155012, 89264, 4688346, 8761021, 9329720, 5417827, -367543, -3063322, -1018578, 1502261, 256123, -2656743, -2137079, 2006022, 4953848, 4102248, 2059174, 1999735, 3657008, 4838546, 4119653, 1211905, -2998225, -6110238, -5933247, -3075029, -270706, 712273, -146621, -2569389, -5724619, -7271796, -5701286, -3229916, -3061421, -4068339, -2216014, 2366625, 4345764, 849604, -4140760, -5693643, -4484594, -4086007, -4749778, -4034089, -1860071, -737670, -1509915, -2502271, -2914239, -3828599, -5410266, -6045983, -5223287, -4711446, -5410761, -5090310, -1366315, 4148563, 6994727, 5251147, 1848072, 634042, 1654094, 2016629]
12089B016629j429053j240720L94313O15793n50723j84875K106290K934070P01875
12080E363599j709009k130942k720619m928504n145847n17742M290954K689123
12072d808987l273031n082124l51725M016196K703879q89360j372788P21931J852003
12063f484006J722712K137469K783795K343919J480790J168348K40109k099126
12055C294010l565807k032156O07826J314802O79211J085228J897218O78992j920101
12046B039223k772890j281129K34185R01833J958950K808338P17427m166788p129712
12037f690563m457227J584228N450952M643381J504637o30489j359778k584701
12029b539560m520913m114898P04301O246285O253922O17379l509386j724935
$$ y = [2016629, 587576, -653144, -258831, 356962, -193761, -378636, 1727654, 4661724, 5363599, 3654590, 1523648, -1196971, -6125475, -11271322, -11789064, -7498110, -4808987, -8082018, -13164142, -13515867, -9499671, -6795792, -7685152, -9057940, -8336009, -6484006, -4761294, -2623825, 159970, 2503889, 3984679, 5153027, 5393136, 3294010, -271797, -2303953, -1696127, -381325, 297886, 1383114, 3280332, 3959324, 2039223, -733667, -2014796, -1780611, -878778, 1080172, 3888510, 4605937, 439149, -6690563, -11147790, -9563562, -4112610, 530771, 2035408, 1404919, 45141, -2539560, -7060473, -11175371, -10471070, -4224785, 2029137, 2646516, -862870, -2587805]
12021b587805J210377o51990m519976l522889J665806M013594J976880J252145
12013a163858L551115K934838k920609o502495j766915N237278M937141j270396
12005C036099l801925K26714L796882J770163k199688k740222l93235J139504
11997H34292R57692O72110Q85427R21021M95891k87975j326644j701999r7740
11988A352075K818607M084116J862591k052405m246807l152999J59970L283953
11980D109101L784179P95933l444621m912543k070257J986325L015968O36171
11972C900256j691769j460101o2586r8525j211268p15951J765700K973758R25573
11963D325087j224578M55604L849372L046820k263066n153358j661087K718597
$$ y = [-2587805, -1377428, -2029418, -6549394, -10072283, -8406477, -4392883, -2416003, -1163858, 2387257, 5322095, 2401486, -4101009, -5867924, -630646, 4306495, 3036099, -765826, -539112, 3257770, 5027933, 2828245, 88023, -305212, 834292, 1791984, 2464094, 3349521, 4270542, 4766433, 4478458, 3151814, 1449815, 1352075, 4170682, 8254798, 10117389, 8064984, 3818177, 665178, 825148, 4109101, 7893280, 8689213, 5244592, 332049, -1738208, 248117, 3264085, 3900256, 2208487, 748386, 685800, 587275, -623993, -1339944, 425756, 3399514, 4325087, 3100509, 3556113, 7405485, 10452305, 8189239, 3035881, 1374794, 4093391]
11955D093391J276908l511739m049189N59107L793509K131748q16598j404933
11947B072204p19628m36149K17912R14389q60141m316758m079533J710956O758590
11938A261842M834595j195906l858553j729992P2468j505991l979694m296649
11930a0397880k568947j92518K173712L945187M452566L884541K702729O64984
11922D664374j807493k593687o39498J551335J037801j116964j622134j24662
11914f50928Q14688J49871q31774j625806k676611k621746N36124M978715N829677
11905C902210J701217k953597l718633j523163j12938n96880r06292M99810K472404
11896a235862K726812O94882j574690j813977o68409q30186k548576k624402L68805
$$ y = [4093391, 5370299, 1858560, -2190629, -1631522, 2161987, 4293735, 3477137, 2072204, 1352576, 916427, 1134339, 2048728, 1188587, -3128171, -7207704, -5496748, 1261842, 6096437, 4900531, 1041978, -688014, -615546, -2121537, -6101231, -10397880, -12966827, -13159345, -10985633, -7040446, -2587880, 1296661, 3999390, 4664374, 2856881, 263194, -376304, 1175031, 2212832, 1095868, -526266, -650928, 163760, 313631, -518143, -2143949, -4820560, -7442306, -6906182, -1927467, 3902210, 5603427, 2649830, -1068803, -2591966, -2704904, -3301784, -4208076, -3708266, -1235862, 1490950, 2185832, 611142, -1202835, -1871244, -2701430, -5250006, -7874408, -7505603]
11887g505603K888016J630348q02840J39436L331676L580131l7434k968983k409793
11878b155046m20350P55643J335159J110816q92759k784515j164437K547471K850532
11869A182514r58799k859661K06329L194573J533806j341173l88518K343253J646346
11860D558670k108587m419839l894736k177899N80006M206371N129273J021343
11852B894602l367524j984444K589175K602130k289791m364156n63632K798790
11844a684850R38924j787962M6920L719070L238189r27253l344273k265488p12023
11835b778746n3449J707408M770508N563759J815148l563532n752290l378149
11827a669343R86015M211803M823084K851425m37247k672390k044832L97892J383812
$$ y = [-7505603, -4617587, -2987239, -3790079, -3650643, -318967, 3261164, 3223730, 254747, -2155046, -2575396, -1819753, -484594, 626222, -266537, -3051052, -4215489, -1668018, 1182514, 223715, -2635946, -2429617, 764956, 2298762, 957589, 569071, 2912324, 4558670, 2450083, -1969756, -5864492, -8042391, -7462385, -3256014, 1873259, 2894602, -472922, -2457366, 131809, 2733939, 444148, -3920008, -4483640, -1684850, -745926, -2533888, -2486968, 1232102, 4470291, 3543038, 198765, -2066723, -2778746, -2832195, -1124787, 3645721, 9209480, 11024628, 7461096, 1708806, -1669343, -683328, 3528475, 8351559, 11202984, 10765737, 8093347, 6048515, 6446407, 7830219]
11818G830219o42866l268128l172410n66083J378835J132854M55972J036482J855704
11809F040579J109234r82458k590484k332819j43160K595551L386318R38206k423165
11800E597802l000339r00010M9199j516775k214435J59044K461454J262330j520149
11791C78121k172192j342957j819137k504587j44468M141514N613182L028001
11783E177477l8166j161624j497982j756492o74201J294535J302793j172832k838416
11774a364908j529005R05748K309542L212068M118900L294568q4734l272056l300503
11765D289620j191300k52599j349347k107987m09153K807242M337858K140641
11757H264975j832493l126661k16145K925385J781759k544497n051629l627723
$$ y = [7830219, 7187353, 3919225, 746815, 180732, 1559567, 2692421, 3148393, 4184875, 6040579, 7149813, 6167355, 3576871, 1244052, 1100892, 3696443, 7082761, 8020967, 5597802, 2597463, 1697453, 1746652, 229877, -1984558, -1825514, 635940, 1898270, 378121, -1794071, -3137028, -4956165, -7460752, -7605220, -3463706, 2149476, 5177477, 5139311, 3977687, 2479705, 723213, 49012, 1343547, 2646340, 1473508, -1364908, -2893913, -1988165, 321377, 3533445, 7652345, 10946913, 10862179, 7590123, 4289620, 3098320, 2845721, 1496374, -611613, -1020766, 1786476, 6124334, 8264975, 6432482, 3305821, 3089676, 6015061, 7796820, 5252323, 200694, -3427029]
11749c427029n87086J813155L265548L061332M34220k223149j146654K649589
11741C839926L607261l36330m462728m222439j151304Q52828J136553R93121L09822
11732E66710r65086r03814J363538L141395J995362k55563p21160l17777j674711
11723B228894l937375l791245r16144J385223J075921j93141j05214J163939J703825
11714a385317N93667r35506j080646q3772k51241k285098l167706l81599L126068
11705e851150K434656j328372j869234K361041N172855K324681j730011j305023
11697B09443J448962R88057j776353j167774L195508N038964Q90966m659159n160816
11688i92202k22034M661322M237869j535515p437396p779587k190553M041115
$$ y = [-3427029, -4014115, -2200960, 1064588, 4125920, 4560140, 2336991, 1190337, 3839926, 7447187, 7110857, 2648129, -1574310, -2725614, -1872786, -736233, 256888, 566710, -398376, -1302190, 61348, 3202743, 5198105, 4942542, 4221382, 3903605, 2228894, -1708481, -5499726, -6415870, -5030647, -3954726, -4147867, -4253081, -3089142, -1385317, -791650, -1727156, -2807802, -2891574, -3142815, -5427913, -8595619, -8977218, -5851150, -3416494, -4744866, -6614100, -4253059, 919796, 3244477, 1514466, 209443, 1658405, 2646462, 870109, -297665, 2897843, 7936807, 8827773, 4168614, -992202, -1214236, 3447086, 7684955, 6149440, -1287956, -9067543, -11258096, -7216981]
11680g216981O105572M436407K233179Q73305P9318J48635R94869R05252q17832
11671G741724j966819j112876o96807k815656m547688k155748K115002K871821
11663e67047K3800j381634N07074K127553J367047P71456J980298K281019l16968
11654F792598k885060k039232N16965O79818j767719l181281j565731J047704
11646b401938J901784R50236K15604Q86541J982383J782256K5483j798190k274748
11637A269411j498422n09428j05941m85484j119345p21177J429591L808061L825204
11628E892470J193195j553389k360069j522107Q6118K051703L089521J776007
11620H653449m35848m57994J047562j09306m253726n939490k554306P83766m33452
$$ y = [-7216981, -1111409, 3324998, 5558177, 6431482, 6510800, 6659435, 7654304, 8559556, 7741724, 5774905, 4662029, 3965222, 1149566, -3398122, -5553870, -3438868, -567047, -543247, -1924881, -1417807, 709746, 2076793, 2848249, 4828547, 7109566, 6792598, 3907538, 1868306, 2385271, 3065089, 1297370, -1883911, -3449642, -2401938, -500154, 450082, 665686, 1552227, 3534610, 5316866, 5342349, 3544159, 1269411, -229011, -738439, -844380, -1329864, -2449209, -3170386, -1740795, 2067266, 5892470, 7085665, 5532276, 3172207, 1650100, 1736218, 3787921, 6877442, 8653449, 8217601, 7759607, 8807169, 8697863, 4444137, -1495353, -4049659, -3265893, -3699345]
11611c699345k378324K37009M383220L601199p85488k031557M09727P82114j885862
11602a367307j957100K174323M490071J385174k399249j791710J118703J941182
11594C594087R47293N89138L63110j206049k612065j720915Q3110j64423k280380
11585b407094l124307r04825K531308L522612M65499l559758l302644J764255
11577e014954N280240K115888l725479m378558N19113M060199K832407L11372
11569B000228p83935j951097l267223j821290J851437K954854P30434K58299K934072
11560B905779L072663j828585n526187l204759M86444R2471j249591J220488M075345
11551D4068J754927k793952k976578k4139J25987j652003L92582N029791M725425
$$ y = [-3699345, -6077669, -5840660, -1457440, 2143759, 1358271, -673286, -263559, 518555, -1367307, -3324407, -1150084, 3339987, 4725161, 2325912, 534202, 1652905, 3594087, 4541380, 5130518, 5493628, 4287579, 1675514, -45401, 37709, -126714, -2407094, -5531401, -6436226, -3904918, -382306, 83193, -3476565, -6779209, -5014954, 265286, 2381174, -1344305, -5722863, -5203750, -1143551, 1688856, 2000228, 1216293, -734804, -4002027, -5823317, -3971880, -1017026, -286592, -28293, 2905779, 5978442, 4149857, -1376330, -4581089, -4094645, -4002174, -5251765, -4031277, 44068, 1798995, -994957, -3971535, -3995674, -3869687, -5521690, -5129108, -99317, 4626108]
11542D626108j475300n611352l145377J088994J864632P29207R09281J652998
11534F39191J395599J381377K634029L377825K220979L34388j434311l741172
11526F807905n389828l208462K383716N785869L079283k681417n659584m064275
11518b946793n18376K001651K463562J796972J971837L470705L551031l20116
11510A1470473n393918n875358r74366L502693L138370K24259j156471j158201
11502C777481j922508k652570j073099J945131K968311P03912k437680l310566
11494b001588j155820J741442J932177j447268m624463l067774K162070M909858
11486a551366J979827k539542l145299k04551J573876j0674k412263k147929J331701
$$ y = [4626108, 3150808, -2460544, -5605921, -4516927, -2652295, -1923088, -1013807, 639191, 2034790, 3416167, 6050196, 9428021, 11649000, 11983388, 10549077, 6807905, 1418077, -1790385, 593331, 6379200, 9458483, 6777066, 1117482, -2946793, -3465169, -1463518, 1000044, 2797016, 4768853, 8239558, 11790589, 11470473, 6076555, 201197, -773169, 2729524, 5867894, 6092153, 4935682, 3777481, 1854973, -797597, -1870696, 74435, 3042746, 3746658, 1308978, -2001588, -3157408, -1415966, 516211, -931057, -5555520, -8623294, -6461224, -1551366, 428461, -2111081, -5256380, -5460931, -3887055, -3897729, -6309992, -8457921, -7126220]
11477g126220N129381N307370J027650l277631k226940L284012O414356L389412
11469A1921390j679513l458577k634430k548366k549807l00332J961473J7788
11461G29626m433679n102543p51393K815082J911759L7263J054417K845564J806197
11452I12293o58261r03864O10276O41536r36665j271228K75843J453556J441630
11443A565116J737183K403011J374974j482784l157661j828720N30852J501806
11435B643777J416963J373142P18198j119946k559788k257618j628413k141933
11427c555618k011918Q99054M373462M318037J306502j02330J117060Q43970k610829
11418D577390m666277j720059K295062J626488k124469k512103J454248L905377
$$ y = [-7126220, -1996839, 3310531, 4338181, 1060550, -1166390, 2117622, 8531978, 11921390, 10241877, 6783300, 4148870, 1600504, -949303, -1249635, 711838, 729626, -3704053, -8806596, -9557989, -6742907, -4831148, -4793885, -3739468, -893904, 912293, 254032, -649832, -39556, 601980, -334685, -1605913, -1330070, 123486, 1565116, 3302299, 5705310, 7080284, 5597500, 2439839, 611119, 1141971, 2643777, 4060740, 5433882, 6152080, 5032134, 2472346, 214728, -1413685, -3555618, -5567536, -4668482, -295020, 4023017, 5329519, 5227189, 6344249, 7188219, 4577390, -88887, -1808946, 486116, 2112604, -11865, -2523968, -1069720, 2835657]
11410B835657J565889j438037o00477K104784K040410q64589k866118k422537
11402C54982j379732r39826j93638J144079J655799O68971n82965j155456j752134
11393b179920k769157k719145k90594K910220L504999M62987l092892l052536
11385g226038R25435M693604M220768L17811k460807j541327Q05130J098104o96727
11376A35953j880201j041878Q68741K678307L711106K809972n41448l988546m163622
11367a411616j431338K48892p39519j258845J095537L553400K468199o51772j528736
11358C44202J28583Q03829m60280o29321J593412K928661M74197l595777m753267
11349c165761j740668K565391M762912L805514J036225j410317k405428k345556
$$ y = [2835657, 4401546, 2963509, 2363032, 4467816, 6508226, 5643637, 2777519, 354982, -1024750, -1964576, -2158214, -1014135, 641664, 1310635, 727670, -427786, -2179920, -4949077, -7668222, -7958816, -5048596, -1543597, -1080610, -4173502, -7226038, -6300603, -1606999, 2613769, 2931580, 470773, -1070554, -265424, 832680, 135953, -1744248, -2786126, -1917385, 760922, 4472028, 7282000, 6740552, 2752006, -1411616, -2842954, -2594062, -3333581, -4592426, -3496889, 56511, 2524710, 1872938, 344202, 472785, 1276614, 816334, 187013, 1780425, 4709086, 5183283, 1587506, -3165761, -4906429, -2341038, 2421874, 6227388, 7263613, 5853296, 3447868, 1102312]
11341A102312j785290m16004J636857K786014K050004Q64904N88946j65096k627923
11332D034724m208962k137453P67837l80525m046119m089376k97487Q90801j981882
11323a1448442j956616L961021P945075L622594k700223j875367L305017L437494
11315D290553j698697l875334q70673J124589m49017q76651J786413K934501M12917
11306B778601j595831q37697p36492k384989j240130L702739N650297O91327m628245
11297A399580l196427J468715J539838k508121l847930p58995K000386J919471
11289a983483J456067K060551J762724l25828j912031j164185Q66410K247301
11281C007526K205481J010135l47255p54976n88391j461417l164312l077817l85931
$$ y = [1102312, -682978, -1098982, 537875, 3323889, 5373893, 6238797, 6827743, 6662647, 4034724, -174238, -2311691, -1543854, -1924379, -5970498, -10059874, -10357361, -9466560, -11448442, -13405058, -9444037, -1498962, 2123632, -576591, -2451958, 853059, 4290553, 2591856, -1283478, -2154151, -1029562, -1478579, -2355230, -568817, 2365684, 2778601, 1182770, 345073, -391419, -2776408, -4016538, -313799, 5336498, 6027825, 1399580, -1796847, -328132, 1211706, -1296415, -5144345, -5903340, -3902954, -1983483, -527416, 1533135, 3295859, 2970031, 1058000, -106185, 760225, 3007526, 5213007, 6223142, 5875887, 5120911, 4532520, 3071103, -93209, -3171026, -3556957]
11272c556957J818315R95926j005110j295849l47683k2953o796N03876L98874
11263b518357n76292J60853L211560L948399p23839n649543l927715K185940M260747
11254C71753N84585j927165M62667K639298j28722m070127k913130K446785N524510
11245B990454L266029r88353k749905j169038J393472K214911L22984k812630
11237B467924m405903k892593N71436L411776M124200L106949J361605q53350
11229F892044l538023n490524m735235j314002J645426J486747k38908k284K350836
11220b943923L581647K356382R51303R06761O70030r95555k682087l087310k891098
11211d133850k390013o87902J356764J317517j82121L49046K721842K286163j702879
$$ y = [-3556957, -1738642, -742716, -1747826, -3043675, -3391358, -3414311, -3421107, -2917231, -2518357, -3094649, -2933796, 277764, 4226163, 3502324, -2147219, -6074934, -3888994, 371753, 956338, -970827, -508160, 2131138, 2002416, -2067711, -4980841, -2534056, 2990454, 6256483, 5268130, 2518225, 1349187, 2742659, 4957570, 5280554, 2467924, -1937979, -4830572, -4259136, -847360, 3276840, 6383789, 7745394, 6892044, 3354021, -2136503, -6871738, -8185740, -6540314, -5053567, -5292475, -5294759, -2943923, 637724, 2994106, 3945409, 4852170, 5522200, 4526645, 1844558, -1242752, -4133850, -6523863, -7211765, -5855001, -4537484, -4719605, -4370559, -1648717, 637446, -1065433]
11202a065433l359236K14552L370564J536018m13008L111621P329450M157696
11194A4882224l778697o492377j970959J933116M98038k529930l275597k601203
11186c335385j240642J845887M473623K134732l975149o759521l276918J396731
11178h736642K411469J003088O156m74647p23517j85170q6952j838479k370701
11169a0995395K153244P623957N535866l095043o935456r97227N615480M088444
11161B993870j203448j648018J587165J557050j915605l084899n61523J714112
11153e61296K098652K591847L507911K877522N24312k005535m302942n813164
11145a082693m139301P12989L290244m19033n491458l881628L787997Q882994
$$ y = [-1065433, -4424669, -4210117, -839553, 696465, 283457, 3395078, 10724528, 14882224, 11103527, 4611150, 2640191, 4573307, 5071345, 2541415, -734182, -3335385, -4576027, -2730140, 1743483, 3878215, -96934, -6856455, -10133373, -8736642, -6325173, -5322085, -5315929, -5790576, -6514093, -6699263, -6786215, -8624694, -10995395, -8842151, -1218194, 4317672, 1222629, -5712827, -6710054, -1094574, 2993870, 1790422, 142404, 1729569, 3286619, 1371014, -1713885, -2275408, -561296, 1537356, 4129203, 7637114, 10514636, 11038948, 9033413, 4730471, -1082693, -5221994, -4509005, -1218761, -1637794, -7129252, -11010880, -7222883, 1660111]
11137A660111O665773J071872k695760m010723l867802j795501J651009L373139
11129B052118J496133j761306k927541j306605J016029J851563Q78436k65504
11121A033323N4415J043432M25634j479154j353953J536187K737452r12263n328246
11112b243173m636804l06961J183291j210289j732315K333239O111703N006262
11104D504953J466317J45652P25182N2093j647448j579182J64512O39218p33604
11095C737693j112561Q58211K497025J012534k389808m219027l094474o36069
11087c346476J176106J737269J204783j70062j788469k899747l291410k927419
11079a0305425j163622K150835M859226M057809L37212j853160K31734L731550
$$ y = [1660111, 8325884, 9397756, 6701996, 2691273, -1176529, -2972030, -1321021, 2052118, 3548251, 1786945, -1140596, -2447201, -1431172, 420391, 1298827, 1033323, 1087738, 2131170, 2556804, 1077650, -276303, 1259884, 3997336, 3085073, -2243173, -6879977, -7186938, -6003647, -7213936, -8946251, -6613012, -501309, 4504953, 5971270, 6116922, 6842104, 6894197, 5246749, 3667567, 3832079, 4471297, 3737693, 2625132, 3483343, 5980368, 6992902, 4603094, 384067, -2710407, -3346476, -2170370, -433101, 771682, 601620, -1186849, -4086596, -7378006, -10305425, -11469047, -9318212, -4458986, -401177, -63965, -1917125, -1685391, 2046159]
11071B046159M083406J078636j796568k759320l059312l391131k578098l77984
11063f754212J456835J858679J667611J333506o3011k292860k828062j3747L994602
11054a640659N148701J970631k715483m510603k036261J287598J305630r35753
11046b126199j61836M774488P495832K920238m117524n060407k66186J932144
11038E390550j528599m308523j755995J826553J233924j067666k43533K062857
11030A609568R68193k556154k810167J246123L971615J343908l487467m853576
11022d567957j706145J988308K432717j99979k775952k820155o01557J986679
11014f264041L516943L520150K158026N54886K70844J069308O56514j718690l401914
$$ y = [2046159, 6129565, 7208201, 5411633, 2652313, -406999, -3798130, -6376228, -6754212, -5297377, -3438698, -1771087, -437581, -500592, -2793452, -5621514, -5635261, -1640659, 3508042, 5478673, 2763190, -1747413, -3783674, -2496076, -1190446, -2126199, -2288035, 2486453, 9982285, 12902523, 8784999, 3724592, 3458406, 5390550, 3861951, -446572, -2202567, -376014, 857910, -209756, -453289, 1609568, 2577761, 21607, -2788560, -1542437, 2429178, 3773086, 285619, -4567957, -6274102, -4285794, -1853077, -2053056, -4829008, -7649163, -8250720, -6264041, -2747098, 773052, 2931078, 3485964, 3756808, 4826116, 5482630, 3763940, 362026]
11005C62026k332106m72000j90829n9257J623919K215708p85790l503427r86788
10996d128544L395234K258541l224984m663063n95296J350289j469881j856663
10988h934367L552309O937026K489703l127332k130512J337881m03841m320875
10980d600008k247640M069887N388861J98698l559957j654922J390383J272409
10972B57711m53421j234389j239113p76471N95891J699716J114918N32828K070773
10963B568443L550032J750392j364515j817403j185391l722902p161150m801239
10955a2183733K850142P065991L466335k127105l199350r16901M63643L72942
10947d208036R6150p29949j748794l35533L650921N410821J611834l861778m762764
$$ y = [362026, -1970080, -2442080, -2632909, -2692166, -1068247, 1147461, 361671, -3141756, -4128544, -733310, 1525231, -1699753, -6362816, -6958112, -5607823, -7077704, -8934367, -5382058, 1554968, 4044671, 917339, -1213173, 124708, -279133, -4600008, -6847648, -2777761, 2611100, 2809798, -750159, -2405081, -1014698, 257711, -195710, -1430099, -2669212, -3445683, -2849792, -1150076, -35158, 497670, 2568443, 6118475, 7868867, 6504352, 4686949, 3501558, -221344, -7382494, -12183733, -9333591, -2267600, 1198735, -928370, -4127720, -5044621, -4580978, -4208036, -4111886, -4841835, -6590629, -6926162, -3275241, 2135580, 3747414, -114364, -4877128]
10938d877128q98346K251570J040338k620407m498040k493001J895171M973687
10930e226156M176806R37498o96450Q78464K618337J023306k836287m488124j818461
10921e431067K318503L826717K233520L75317j34854p99193k715570l658363j305281
10912e290271K276100L011884R59430j40057O35928K96047j752452j865497J067589
10903h01299K610235J32709k095978J1755K815199M78344n261971p377070l820126
10894a3308202O26807K026983J291244N80742M31750Q14772J524353J633102J242258
10885c136191K394821N231225N579703O11161n328802n802856j706729K84376
10877a873292j792777k648049J030107M719494K760335k943731n147381j062629
$$ y = [-4877128, -5775474, -3523904, -2483566, -5103973, -9602013, -12095014, -10199843, -5226156, -1049350, -111852, -808302, 70162, 2688499, 3711805, 875518, -3612606, -5431067, -3112564, 714153, 2947673, 3322990, 3188136, 2388943, -326627, -3984990, -5290271, -3014171, -2287, 957143, 817086, 1453014, 1749061, -3391, -1868888, -801299, 1808936, 1941645, -154333, -142578, 2672621, 3150965, -2111006, -9488076, -13308202, -12681395, -10654412, -9363168, -8782426, -8350676, -7535904, -6011551, -4378449, -3136191, -741370, 4489855, 10069558, 10680719, 5351917, -450939, -2157668, -1873292, -3666069, -6314118, -5284011, -564517, 2195818, -747913, -5895294, -6957923]
10869f957923L798441L011630j733849k686672K356254N537589M06462o664687
10861b932755m729786M221127O840327j155714q003602m334988K812697K697389
10853d585305k166244k414098K016583L827452J794975Q65712J688185O17362
10845A644622j715124j476406L44501j00165j432219L44987L388024L049654Q63563
10836D911437J289666K413992p3770k763432K83278M962477K393780m990849o265719
10827B160860m38263K300641j289204k983749N88706K044543j788972l376336
10819b781774R55423L480666n68670l785416j95527L628141P31104l322239m71772
10810b330064N371942N091291o69084l972264k490853l32057N25018J094412O01303
$$ y = [-6957923, -3159482, -147852, -1881701, -4568373, -2212119, 3325470, 3731932, -2932755, -7662541, -3441414, 3398913, 2243199, -5760403, -10095391, -7282694, -4585305, -6751549, -9165647, -7149064, -3321612, -1526637, -660925, 1027260, 1644622, -70502, -1546908, -1202407, -1302572, -2734791, -2389804, 998220, 4047874, 4911437, 6201103, 8615095, 8541325, 5777893, 6061171, 11023648, 13417428, 8426579, 2160860, 1722597, 4023238, 2734034, -249715, 338991, 2383534, 594562, -2781774, -1826351, 1654315, 1085645, -2699771, -2895298, 732843, 1463947, -1858292, -2330064, 3041878, 8133169, 7464085, 3491821, 1000968, 668911, 1193929, 2288341, 2889644]
10801B889644j717046k785973k13647K386409P32081k762572l083555p17644O45593
10792d626710J266555L424344M872898J418679m945771p028671k035384M690478
10784b963582O455536K511870k306826l451478j367174j19928j116784n52099
10776b910465M024099P472829L204439n932369j0162369o285240j006118K68410
10768a1326784k14966L75550L14925j258129j290306J039976K120694J228506
10760i010534K525178O148537N667038q40276n630609l140149J066886N8038l205243
10751f361134k211446J765322K996004J184780R1565j1577j272877k668584j815148
10742h303095K54843J269037J690056K288155J578116l75588k37058K533357L245882
$$ y = [2889644, 1172598, -1613375, -1827022, 559387, 1291468, -1471104, -4554659, -5272303, -4626710, -3360155, 64189, 4937087, 6355766, 1409995, -5618676, -7654060, -2963582, 3491954, 6003824, 3696998, 245520, -1121654, -1241582, -2358366, -2910465, 1113634, 8586463, 11790902, 5858533, -4303836, -10589076, -11595194, -11326784, -11541750, -11166200, -10851275, -12109404, -13399710, -12359734, -10239040, -9010534, -6485356, -336819, 5330219, 4489943, -1140666, -4280815, -3213929, -3155891, -6361134, -8572580, -6807258, -3811254, -2626474, -2534909, -2546486, -3819363, -6487947, -8303095, -8048252, -6779215, -5089159, -2801004, -1222888, -1598476, -1835534, 697823, 3943705]
10733C943705j63378k870008j434214K86005j108866j946769R64496L243395Q18577
10724A732943j824483M33793L424998Q66581l917725l301677J692881L623273
10716B730584R46841j246050p45782K37426J374087L860569N111006J507734m497009
10707I279406o875013m555789j416681N14191J829509J794319k13252j267909
10699i11219J258813M557928M538880K341930J150927o509k972761m584496j270364
10690D103129L405715L177777j224325l893186l155009k152014j858278m62475
10682b058666J541856J916081J147810R88058M20950j673575k396773R22556M828931
10673E637228L937852j008023m575599m103365j249486J331308J101704k920173
$$ y = [3943705, 3780327, 910319, -523895, -237890, -1346756, -3293525, -2329029, 914366, 1732943, -91540, 342253, 3767251, 4633832, 716107, -2585570, -892689, 2730584, 3677425, 2431375, 1685593, 1923019, 3297106, 7157675, 12268681, 13776415, 9279406, 2404393, -2151396, -3568077, -3053886, -1224377, 569942, 356690, -911219, 347594, 4905522, 9444402, 11786332, 12937259, 12930750, 9957989, 5373493, 4103129, 7508844, 10686621, 9462296, 5569110, 2414101, 262087, -1596191, -2058666, -516810, 1399271, 2547081, 3535139, 3956089, 2282514, -114259, 808297, 5637228, 9575080, 8567057, 3991458, -111907, -1361393, -30085, 1071619, -1848554]
10665a848554o521011l340601M807272P609237J073896n484089l762791J110265
10657f356376J012355j227225Q77792M057609J689131k462494k00688N709627
10649C099731N472400j172231n181508l324792r21211n49265N20945K270167J836774
10640B051010O54514J993316L143660j60060m141510k394846J993234J187706
10632D327024l348143l899576j055910j786237m685809j575673O335363Q496337
10624B807376K573073k061067o23229Q39368j466676k768642l86914J202335m6354
10615F9270j21478J605503L63736l220535j826601M954261P294856P23399n791108
10606D051303l659000K876303M860636J416772k146427k964567j784382r2276
$$ y = [-1848554, -8369565, -11710166, -6902894, 706343, 1780239, -3703850, -7466641, -6356376, -5344021, -6571246, -5693454, -1635845, 53286, -2409208, -2609896, 3099731, 8572131, 7399900, 2218392, -1106400, -2027611, -2576876, -2055931, 214236, 2051010, 2705524, 4698840, 7842500, 7682440, 3540930, 1146084, 3139318, 4327024, 978881, -2920695, -3976605, -5762842, -10448651, -12024324, -5688961, 2807376, 5380449, 3319382, 2696153, 3535521, 2068845, -699797, -1086711, 115624, 69270, -52208, 1553295, 1917031, -1303504, -3130105, 1824156, 9119012, 9842411, 4051303, 392303, 3268606, 8129242, 9546014, 7399587, 4435020, 2650638, 2558362]
10598B558362J44119k122269m169437k559641R05712J871509R90398J762906K496804
10589A878463p65688m708406k505543L375543L546021k454504m754733K54342
10581f134505M148889J169269k825173j450616K116058K177978l99612j810610
10573c008322j563724n41426J638769L912963L479693M76810j747866j867506
10565G79391j239441J00144K635472M030198K446951O74216P79472r58340o205173
10556C042890p761327p44132N982701K369056m974609k784400N996160O945112
10548H071451j037691m488717J196424N726970L177356l59513j268708l865722
10540G151850p944775o618036q9721L057640R21176K99686K403420J625715q97627
$$ y = [2558362, 2702481, 580212, -3589225, -6148866, -5243154, -3371645, -2381247, -618341, 1878463, 1112775, -3595631, -6101174, -2725631, 820390, -1634114, -6388847, -6134505, -1985616, -816347, -3641520, -5092136, -2976078, -798100, -1197712, -3008322, -4572046, -5113472, -3474703, 438260, 3917953, 4394763, 2646897, 779391, -460050, -359906, 2275566, 6305764, 8752715, 9426931, 10206403, 9248063, 3042890, -4718437, -5462569, 520132, 2889188, -2085421, -4869821, 1126339, 8071451, 7033760, 2545043, 3741467, 9468437, 12645793, 12286280, 11017572, 7151850, -792925, -7410961, -7500682, -4443042, -3521866, -3222180, -818760, 806955, -90672]
10531i0672J352082N205781J369886o880543o997947O48502L325090j016577j812449
10522d896847K415047K056014k947720k781606J227306j329214o861208k241767
10514a5359995P873419O270418m149330l813151O511561O175328n508634o910767
10506h911151M102541N687973m596500m593932O657589M528415j0205522p619566
10498a4950153J1664389J1104116j0761441j0351899J6132492J4729451k3363912
10491e796957k9385402J4636213J1864204r1744856j73041954q6016281J02961680
10484b56523353J83844633R2266066k0729109k6541049K1410399K1402851j3493672
10477A636766j5078050J0003578R288636j2899997j2601668Q177486J1316313
$$ y = [-90672, 1261410, 6467191, 7837077, 956534, -6041413, -5392911, -2067821, -3084398, -4896847, -2481800, -425786, -3373506, -6155112, -4927806, -6257020, -13118228, -15359995, -7486576, -1216158, -5365488, -9178639, -2667078, 3508250, -2000384, -8911151, -4808610, 879363, -3717137, -8311069, -1653480, 2874935, -7330587, -14950153, -3285764, 7818352, -2943089, -13294988, 2837504, 17566955, -5796957, -35182359, -20546146, -8681942, -100426798, -273468752, -359485033, -256523353, -72678720, 19587346, -1141763, -27682812, -6272413, 15130438, 1636766, -13441284, -3437706, 5850930, -7049067, -19650735, -11473249, -156936]
10470a56936m065402o029944P286849Q880255l076333n151740M262077M777428
10462F726254m110533l562752N798892M817539o565183q674141J577999O692647
10454B700722J191617j909995J807457K222047k581569k613469L093094M200095
10446H109999q30137k559084P83324J168687k598399l439698o87241k93674j945083
10437b291306q34675P58339j777530l682595J075340N859227J747369m602289
10429c748120j314685O692260N572505k646619l909087K508259L877656j902707
10421E129462l403583K137908M077573j311172m567884j090039J657833n42066
10413B088032j778727Q85512J790080j167734j960995J478539K843091o40832
$$ y = [-156936, -4222338, -10252282, -2965433, 5914822, 2838489, -2313251, 1948826, 6726254, 2615721, -947031, 4851861, 9669400, 3104217, -5569924, -3991925, 2700722, 3892339, 1982344, 3789801, 6011848, 3430279, 816810, 3909904, 8109999, 7279862, 4720778, 5504102, 6672789, 4074390, 634692, -52549, -346223, -2291306, -3125981, -2367642, -4145172, -7827767, -6752427, -893200, 854169, -3748120, -5062805, 1629455, 7201960, 4555341, 646254, 3154513, 7032169, 5129462, 1725879, 3863787, 7941360, 6630188, 2062304, 972265, 2630098, 2088032, 309305, 1194817, 2984897, 1817163, -143832, 1334707, 4177798, 3536966]
10405C536966l275442j673602L08570P05916K872601O580577O076228L90663m058706
10396A1463771m118679l833543n200545m411997j27045L353805L818474L843737
10388D787978L905889J155135l298665m294787j356338O45086M68950J582592
10380C595840L651009K246084j913200k894923q089J167160n98298n18537J812682
10371F539728J050882k627159k000545L989859O528551J127228m838788m450232
10363E319524j530805k148812m339847l425789o15796O60756J276073K968516
10355a836180L537397J275803n64061Q31232K515502J080379j111816k91351K047356
10346G484261K106077J21744j176823j585000k337175k542609r46967Q58403O64311
$$ y = [3536966, 261524, -1412078, -1103508, -397592, 2475009, 9055586, 15131814, 15522477, 11463771, 7345092, 3511549, -1688996, -6100993, -6228038, -2874233, 944241, 4787978, 8693867, 9849002, 6550337, 2255550, 899212, 1544298, 2013248, 3595840, 7246849, 9492933, 7579733, 4684810, 4676721, 5843881, 5245583, 4727046, 6539728, 7590610, 4963451, 2962906, 6952765, 13481316, 14608544, 9769756, 5319524, 3788719, 1639907, -2699940, -6125729, -6741525, -6080769, -4804696, -1836180, 1701217, 2977020, 2412959, 3244191, 5759693, 6840072, 5728256, 5436905, 7484261, 9590338, 9712082, 8535259, 6950259, 4613084, 2070475, 1123508, 1981911, 2646222]
10337B646222q22184j620476j485113p54703J136012L414799L241662J27977j963102
10328C921094k43990K090640N68983l384697m338956p41755L189194L397511N84340
10319E042364j686212j365634L04091N30143j620721l513328j759853K910411
10311a158739N478576K703388k215113l180724J111166N191713L263837l639345
10303G554759q464403o258120J9107L311859J242838j581402n09960K937797L921460
10294B173935J171880j938391k380943p47407O39421Q67651Q93942J627713K221216
10285D529017Q66967k253367m046087k342861M95874P49923p68531r9612K750204
10276a18473L226199r3197k690873j385555Q40937N93959k91081J042142K945870
$$ y = [2646222, 1824038, 203562, -1281551, -2036254, -900242, 2514557, 5756219, 5884196, 3921094, 3677104, 5767744, 6336727, 2952030, -1386926, -2128681, 1060513, 4458024, 5042364, 3356152, 1990518, 2294609, 2824752, 1204031, -2309297, -4069150, -1158739, 4319837, 7023225, 4808112, 1627388, 2738554, 7930267, 11194104, 7554759, -909644, -7167764, -7148657, -3836798, -2593960, -4175362, -4685322, -1747525, 2173935, 3345815, 1407424, -973519, -1720926, -1081505, -213854, 680088, 2307801, 4529017, 5395984, 3142617, -903470, -3246331, -2750457, -2000534, -2769065, -2868677, -118473, 3107726, 3014529, 323656, -1061899, -220962, 372997, 81916, 1124058, 4069928]
10267D069928K474952M76134q95331k183272l753792k707507K286293O505305
10259F272710M955809k06249l245954k934457j726356J6925K919370M392407K000722
10250A2444927j106854o44975R29967j882275p367403p812461j311026M817390
10242a932710M057480j494088n200387l544447J614112N283332L511982k084522
10234B10752m984664j698119L320664M385831K847602L176081M026675O39998
10226A1924820n428598p051795k340741K595512K968410Q91838j07244l07323
10218C144879j117517j777020j152434K64704J538252K068933J109136j032287
10210C046646k151030j222373n94040j940669k614680j23329K756733K383346
$$ y = [4069928, 6544880, 7021014, 6125683, 3942411, 188619, -2518888, -232595, 6272710, 11228519, 11022270, 7776316, 4841859, 3115503, 3132428, 6051798, 10444205, 12444927, 11338073, 10693098, 11623065, 9740790, 2373387, -5439074, -6750100, -1932710, 2124770, 630682, -4569705, -8114152, -6500040, -1216708, 2295274, 210752, -4773912, -6472031, -3151367, 1234464, 4082066, 7258147, 11284822, 11924820, 6496222, -555573, -2896314, -300802, 2667608, 3559446, 3452202, 3144879, 2027362, 250342, -902092, -637388, 900864, 2969797, 4078933, 3046646, 895616, -326757, -920797, -2861466, -5476146, -5599475, -2842742, -459396]
10202d59396O32227R82535J501918j206944m086488j927902K679074K882990l16426
10193F81588M45044N318162N793965j179944p633700o579502r56445L167247M497210
10184C553625L755808M40072l427128l063527J248890K452603k738308p708591
10176e486556n412834J365585M769839K860423L67636R00015L018995L144595
10168E527698k25276m545738n120888p43284L539758K618654j203061j782930
10160a935067J198965K444706L08889j234759k86495M93917L650K21496P30114
10151A945416r18180k636029J42551M824517L483360l590321o344355o30204M833318
10142A110073K430519l033479l532659J05453K438188K515983J835705l50689
$$ y = [-459396, 172831, 1155366, 2657284, 1450340, -2636148, -4564050, -1884976, 998014, 681588, 1126632, 6444794, 12238759, 11058815, 3425115, -3154387, -4110832, -943585, 3553625, 7309433, 7749505, 4322377, 1258850, 2507740, 4960343, 2222035, -5486556, -10899390, -9533805, -4763966, -1903543, -1535907, -635892, 2383103, 5527698, 5302422, 756684, -4364204, -5107488, -1567730, 1050924, -152137, -1935067, -736102, 1708604, 2017493, 782734, 496239, 990156, 993806, 1215302, 1945416, 1027236, -1608793, -1466242, 3358275, 6841635, 3251314, -3093041, -3723245, 1110073, 3540592, 507113, -3025546, -2920093, -481905, 2034078, 3869783, 3519094]
10134C519094l306852k801703J238272K103783k528515m746026Q67073O792080
10126A137206M041393l148936m519216L6005K475558O94270l37809J008978J595298
10117B982747R61647J306289J529101o43153k607651q64733J490192n03391m246869
10108e95821l732856l00183M00673m23083K638371P107029N036113k503321n399252
10099B227670o45610L086627O1156m303771m082164j666774p56618N01796L495398
10090b082290M120223R7281l288164j107572L105197L309890K03285j529410j130923
10081A697517j034427j397956p61834L34447Q28894J614424K747288J516440k579882
10072B964911m614771r31054M223769M255898j99230l011286j869450J33496J003894
$$ y = [3519094, 212242, -2589461, -1351189, 752594, -1775921, -6521947, -5654874, 1137206, 5178599, 2029663, -2489553, -2453548, 22010, 716280, 378471, 1387449, 2982747, 3944394, 5250683, 6779784, 6136631, 3528980, 2664247, 4154439, 3651048, -595821, -4328677, -4628860, -4228187, -4651270, -2012899, 5094130, 10130243, 7626922, 2227670, 1582060, 4668687, 4729843, 426072, -3656092, -5322866, -6079484, -5577688, -2082290, 2037933, 2135214, -1152950, -2260522, 844675, 4154565, 4357850, 2828440, 1697517, 663090, -734866, -1496700, -1162253, -333359, 1281065, 4028353, 5544793, 2964911, -1649860, -2580914, 1642855, 5898753, 5699523, 2688237, 818787, 952283, 1956177]
10063A956177J810678K407771J035454j328461j646979o62635k521796o966858
10055e916649p606768j212179O042511O171799J19837m031273k025865K398505
10047f060082M233906L238918J575476n78598l693998n387786k472779L425379
10039e719564O090755K397933k927939l124920J621394M774694K862920j21246
10031E854027L22792J955019k03506m940750n642552l33830M647650L578716o21627
10022D615939j462126J245731K035333r39640l157527j210188K064611K300326
10014E492459m25713l150909m428417m076243j272412L366899N801115K873380
10006D180159k339918l663560j35740K926775J730786j263300k094839j114466
$$ y = [1956177, 3766855, 6174626, 7210080, 5881619, 4234640, 3572005, 1050209, -5916649, -13523417, -14735596, -8693085, -2521286, -2401449, -6432722, -8458587, -6060082, -1826176, 1412742, 2988218, 2409620, -1284378, -6672164, -9144943, -5719564, 371191, 2769124, -158815, -3283735, -1662341, 3112353, 5975273, 5854027, 6176819, 8131838, 7928332, 2987582, -2654970, -2988800, 1658850, 5237566, 4615939, 3153813, 4399544, 6434877, 5495237, 2337710, 1127522, 3192133, 5492459, 5066746, 1915837, -2512580, -6588823, -7861235, -4494336, 1306779, 4180159, 1840241, -1823319, -1959059, 967716, 2698502, 1435202, -659637, -1774103]
9998a774103j118592k061469j239303J829813L966060K666014l44736j567259
9990C56425m93108K76735n91936j329337n99561j13304j331612k002288L69174
9981e458812L408108K931239P887p38176N36854o56432l532168j506061N536736
9972E29175P862397Q89695n542585j921694M952341K678058n856989o783355J759152
9963a433805O442791M10964o605799n026585N94647J869912K85092J456935L552024
9954A546176J248508l645278m580891n73557L268436L696733J841890n74405k490564
9945b62952k452409l94840J159120P35218K34470R63789R79823n06155m82064
9936b6000K128272K791316j479463n709868l869482J330652K361644j665271m335489
$$ y = [-1774103, -2892695, -4954164, -6193467, -4363654, -397594, 2268420, 1923684, 356425, -136683, 140052, -451884, -1781221, -2380782, -2494086, -3825698, -5827986, -5458812, -2050704, 880535, 888422, 150246, 687100, 30668, -3501500, -5007561, 529175, 8391572, 9281267, 3738682, 1816988, 6769329, 9447387, 3590398, -3192957, -1433805, 5008986, 5419950, -1185849, -6212434, -5617787, -3747875, -3462783, -2005848, 1546176, 2794684, -850594, -5431485, -6005042, -2736606, 960127, 2802017, 2227612, -262952, -2715361, -3110201, -1951081, -1215863, -981393, -17604, 962219, 456064, -26000, 2102272, 4893588, 3414125, -2295743, -6165225, -4834573, -2472929, -4138200, -8473689]
9927h473689j765483L140539O138709N963845K993147j649436n030552m302805
9919b985725m31935K645856K712121R51583n60920r52914n89853m52286p99896
9910d63969k26331J958893K791312r25524o035036n455067J194071N737249L195309
9901A770907j350797j957974q44694k079783k793281J301074O490164N954686
9893F490302R90844j237329P04378J438724j350013l504322j506071K689093M752086
9884I467692K460944k361763m449147n21612M464016K450912m038144k832783
9876D640115P702150J1172220l275048k0728195j9415430k193586Q968346N623109
9868g506319P5516O26933M87196m448023o164538n55103L614717N89041k092809
$$ y = [-8473689, -10239172, -7098633, -959924, 5003921, 7997068, 6347632, 1317080, -2985725, -3417660, -771804, 1940317, 2891900, 2330980, 1378066, 788213, 335927, -463969, -690300, 1268593, 4059905, 3134381, -2900655, -8355722, -7161651, -1424402, 1770907, 420110, -1537864, -2382558, -4462341, -7255622, -5954548, 535616, 6490302, 7481146, 6243817, 6948195, 8386919, 7036906, 3532584, 2026513, 4715606, 9467692, 11928636, 9566873, 5117726, 4596114, 9060130, 11511042, 7472898, 4640115, 12342265, 23514485, 20239437, -488758, -19904188, -22097774, -13129428, -7506319, -7430803, -6803870, -6316674, -10764697, -16929235, -17484338, -13869621, -13280580, -15373389]
9859a5373389J581608M796913J631905j068913K854812N760829k62643p484326
9851g563204m809268K860128L274806j939968j421315M822318N641970j087384
9843b21917n035907j560842J865508N51551n1494L229542M115658j277630o059623
9834d445154l680075J183496J001512k206334j499392K797676M307275J406801
9826a134195j203266q85770r4396o93305j081736j92127L23180l93788l62771
9817e718174J765190L904636L293268K23738k767159l933757k924730q421L135878
9808c029531L300161o03828m477528l153362K209135M846797J867440j372746
9800d13462N94509M872079M673262m64413m789730n417538m963403m840114k427333
$$ y = [-15373389, -13791781, -8994868, -7362963, -8431876, -5577064, 183765, -78878, -7563204, -12372472, -9512344, -6237538, -8177506, -9598821, -4776503, 865467, -221917, -5257824, -6818666, -4953158, -4401607, -4453101, -1223559, 2892099, 1614469, -4445154, -8125229, -6941733, -5940221, -8146555, -9645947, -6848271, -2540996, -1134195, -2337461, -3223231, -3317627, -4010932, -5092668, -5284795, -4961615, -5355403, -5718174, -3952984, -48348, 3244920, 3468658, 701499, -3232258, -6156988, -6165409, -3029531, 270630, -333198, -4810726, -7964088, -5754953, -908156, 959284, -413462, 181047, 5053126, 9726388, 9261975, 4472245, -945293, -5908696, -10748810, -13176143]
9791a3176143K930014O669227N083513O61539j799613j217827M05511J623658
9783A179879J807643M20093j524046j733867k56425R0337j457839k016307k59388
9774c749920J027475J92562j28260J569673K047566n24044j810579J684478N407255
9765E716206L292137k176385m032789k187050k239159m408626k898410L053960
9757e880116O433923L302877j304663j859267j24668k18826j311661j60532K707820
9748A584887L880941J989462j414915m078609m172042j521731R21000j00630k734947
9739e646584j567682L746878O499501K637324k738176l135081l04578k18982k878694
9730c606074l058387L40671K576571Q40348k208131l566973l355459j930446J542740
$$ y = [-13176143, -10246129, -3576902, 1506611, 2168150, 368537, -849290, -443779, 1179879, 2987522, 3407615, 1883569, 149702, -106723, -16386, -1474225, -3490532, -3749920, -2722445, -2529883, -2658143, -1088470, 959096, 435052, -1375527, 308951, 5716206, 9008343, 6831958, 2799169, 612119, -1627040, -6035666, -8934076, -5880116, 553807, 3856684, 2552021, 692754, 568086, 349260, -962401, -1122933, 1584887, 5465828, 7455290, 6040375, 1961766, -2210276, -3732007, -2811007, -2911637, -5646584, -7214266, -3467388, 3032113, 5669437, 2931261, -203820, -508398, -727380, -3606074, -6664461, -6323790, -3747219, -2906871, -5115002, -8681975, -12037434, -13967880, -12425140]
9721a2425140N736108O714435L325454m28317r37352J12980p88588l074467l025442
9712d790329N05254M278677M688270J822876r05826n76750K023109L359248J626358
9703A2030887j043152k217117l059888n455705o836269k891647M427710P278885
9695B233704K286807m598393o440964l580044m3990L026833N355053L878258k137555
9686b0291o071042j840988N592213O160567j26190l458496j52235K168987j479956
9677G72569m604540o63142N102903L826712k617245m754907k31406L636442J687963
9668B155349k516137l417467q26408J643646J595509n29395k355253j305172K535312
9659c020016N399897L861361o70551l764385l374587r22630J761119L505695K969956
$$ y = [-12425140, -6689032, 25403, 3350857, 2922540, 1985188, 2098168, 1309580, -1764887, -4790329, -4285075, -6398, 4681872, 6504748, 5598922, 5022172, 7045281, 10404529, 12030887, 10987735, 8770618, 5710730, 255025, -6581244, -9472891, -5045181, 2233704, 4520511, -77882, -6518846, -10098890, -10142880, -7116047, -1760994, 2117264, -20291, -6091333, -7932321, -2340108, 3820459, 3694269, 235773, 83538, 2252525, 772569, -3831971, -4495113, 607790, 4434502, 1817257, -2937650, -3169056, 467386, 2155349, -360788, -3778255, -4604663, -2961017, -1365508, -1894903, -4250156, -5555328, -3020016, 2379881, 6241242, 5570691, 1806306, -1568281, -2490911, -729792, 2775903, 5745859]
9650E745859J78565j971837j131861N68643l54410k888059l198376j297511q89972
9641e238959k523481k344018J144467M202919L754099J673461P33239K15369j510838
9632A06258l217388k743751n08442J487861K319719J715453q75570m340035m925817
9623a0981712k58238O415852Q766665M491183j929884m341148j734944J314913
9615A742687J049648n76063M54424L026356J836982l571340o224657j815501L705783
9606c71681K590460k578257k977921K427235N962883M275829K689074M216300
9598A6233922L654156k477021q117483o446382n48949J855935J8400r40432J81607
9589C413753k90030l001606l817633q04001K617428L051824J500666O28522P45415
$$ y = [5745859, 5924424, 3952587, 2820726, 3389369, 3034959, 146900, -3051476, -4348987, -5238959, -7762440, -10106458, -8961991, -4759072, -1004973, 668488, 1401727, 1617096, 106258, -3111130, -5854881, -6363323, -4875462, -2555743, -840290, -1715860, -6055895, -10981712, -11239950, -4824098, 3942567, 8433750, 6503866, 2162718, 427774, 1742687, 2792335, 2216272, 2670696, 5697052, 7534034, 3962694, -2261963, -4077464, -371681, 2218779, -359478, -3337399, -910164, 5052719, 9328548, 12017622, 16233922, 19888078, 17411057, 9293574, 2847192, 2298243, 4154178, 4172578, 3232146, 3413753, 3123723, 122117, -3695516, -4499517, -1882089, 1169735, 2670401, 3298923, 4044338]
9580D044338L92470q42851j670802q07718J195874K101990O75050j156610o85708
9571C246033J164884P90460k092922l147029j9861L481897K822602q12701l005093
9562B428270k432113r58106M19619J731897J797999k05580k116773j385891Q32030
9553A11352J670972J241846J511235J959379Q14037m63586R93399L422036J693462
9544A2954132m412694q374423n507492Q37912M267818L150304O01986o77283n12830
9535B327430J78751L31814p36875j923992q45389K447925M087401J372855k420360
9526D819560j913277K214490L427274j063839n532584m006124M84944N30524l640375
9517d679407l976097K464093P819782M823600k314083m666019j646803L88743
$$ y = [4044338, 4436808, 3593957, 1923155, 1115437, 2311311, 4413301, 5088351, 3931741, 3246033, 4410917, 5201377, 3108455, -38574, -58435, 3423462, 6246064, 5433363, 2428270, -3843, -961949, -542330, 1189567, 2987566, 2781986, 665213, -720678, 111352, 1782324, 3024170, 4535405, 6494784, 7308821, 6845235, 7838634, 11260670, 12954132, 8541438, 167015, -5340477, -4502565, -234747, 2915557, 3517543, 2840260, 2327430, 2506181, 2837995, 2101120, 177128, -668261, 1779664, 5867065, 7239920, 4819560, 2906283, 5120773, 8548047, 7484208, 1951624, -2054500, -1569556, -1039032, -4679407, -8655504, -6191411, 1628371, 6451971, 4137888, -528131, -2174934, -1786191]
9509a786191k88074M63100K989020K261737k371558m558698j304031J921472O58182
9500b015041j304976N29821L221043K068755j081970j877426j098746j531432
9492c089972j573035R36342K688724M56982j343805K518708P191015M003525m396333
9483G392151o708113q37887K937691r12395m818126j908769K656298J509413k578414
9474c268151k872679n06198p53200k250389J83275M657195M105268j435297l843754
9465e983930L86415M929324M034886O84853r6313J67202k387921n355700k960629
9456f581813L701629O384504J057345o087634o973996j849423K756493L417368
9448d175527K296368J436457n7841k224420k478405j22931J232526q35266k713585
$$ y = [-1786191, -2074265, -1611165, 1377855, 3639592, 1268034, -3290664, -4594695, -2673223, -2015041, -3320017, -2790196, 430847, 2499602, 1417632, -459794, -1558540, -3089972, -4663007, -3726665, -1037941, -580959, -1924764, 593944, 7784959, 11788484, 7392151, 684038, -153849, 2783842, 1871447, -2946679, -4855448, -2199150, -689737, -3268151, -6140830, -6647028, -7400228, -9650617, -9467342, -4810147, -704879, -2140176, -5983930, -5597515, -668191, 3366695, 4051548, 3955235, 4122437, 1734516, -3621184, -6581813, -2880184, 3504320, 4561665, -1525969, -8499965, -10349388, -7592895, -4175527, -1879159, -442702, -500543, -2724963, -5203368, -5326299, -4093773, -4929039, -7642624]
9439g642624J84482N397120N805178J04346m485881k145396L287457L882415j064508
9430C322589m209371p59644M721540M789206n05794m045382k006079J049924l15476
9421B041513l936005l687690N81969K693121o2372k673278l36570M280904N384181
9412D285773K152701j469434k635234j496352P63768K231152N01828l736770n318420
9403d720988r09227N001685N128043o38892n290867m455559r50551J014091J135116
9394d687149Q08070o0922j504573j778762K94476L123498M240983K987672L42434
9385C765727k315901l540552k566092l75135J343125K297688L011020K691677
9377D311557K81823k546767k544904L79322K474090J175157j732021l101939k315372
$$ y = [-7642624, -7458142, -2061022, 3744156, 3848502, -637379, -2782775, 504682, 4387097, 3322589, -886782, -1646426, 3075114, 7864320, 7358526, 3313144, 1307065, 2356989, 2041513, -1894492, -5582182, -5000213, -2307092, -2369464, -5042742, -5379312, -1098408, 4285773, 6438474, 4969040, 2333806, 837454, 1601222, 3832374, 4334202, 597432, -4720988, -5630215, -628530, 4499513, 3860621, -1430246, -5885805, -6836356, -5822265, -4687149, -3879079, -3940001, -5444574, -7223336, -6928860, -3805362, 435621, 3423293, 3765727, 1449826, -2090726, -4656818, -5031953, -3688828, -1391140, 1619880, 4311557, 4593380, 2046613, -498291, -118969, 2355121, 3530278, 1798257, -1303682, -3619054]
9368c619054r78363o07403j643212l220981l322747p48208K789625M305739L313822
9359c730782J895639J154693K53761q39862o78119P90391J509282O45739R7567
9350A098309J344876L001088K879021P66295j835909l145476j891332J244611
9342C461483K744948m53472o117826q155449m115353J643752L884027K725871
9334d382019J735172K212555K283077M99405k133397l439745k028386J482668
9326c770670M345431L787943J96188k790962k294261N94401K443723J486930q69770
9317C128953k059317j203035J38817J67888n58888o3708J401646J063156j722626
9308B92886l350037j040990K551798L150291R53312q51110j293598r16990J441484
$$ y = [-3619054, -4597417, -5204820, -6848032, -10069013, -13391760, -14139968, -11350343, -7044604, -3730782, -1835143, -680450, -426689, -1266551, -1944670, -1154279, 355003, 1000742, 1098309, 2443185, 5444273, 8323294, 9089589, 7253680, 4108204, 2216872, 3461483, 6206431, 5752959, -364867, -8520316, -12635669, -10991917, -7107890, -4382019, -2646847, -434292, 1848785, 2348190, 214793, -3224952, -5253338, -3770670, 574761, 4362704, 4558892, 1767930, -526331, 68070, 2511793, 3998723, 3128953, 1069636, -133399, 5418, 173306, -385582, -449290, 952356, 2015512, 292886, -3057151, -4098141, -1546343, 1603948, 2557260, 1706150, 412552, -504438, 937046]
9299I37046N453526N540349k142256j0596827r036682Q42334N915165J136019
9291a951326l187710J216537P039363M069713l586248m570295J016421K655787
9283B702242k774308o544720k763889L145717M244160J873144Q51633J164982
9275A898961j04655k456542k722268l79980J721949J392181m65228j231353N76154
9266a770781L417397L804674M02327l512661l587154J22450L489778L620557J140919
9257G127506k177010m605937l570142K050169P872395O917667j239199q344045
9249D031404p491204j646828J580660M18436q33714j1882M88130m14110l4959
9240c914067K617137L779031O52000l375244l252620L37707K510034J736678J062581
$$ y = [937046, 6390572, 11930921, 9788665, -808162, -9844844, -9002510, -3087345, -1951326, -5139036, -3922499, 3116864, 7186577, 3600329, -969966, 46455, 2702242, -72066, -6616786, -9380675, -6234958, -1990798, -117654, 733979, 1898961, 1794306, -662236, -3384504, -3764484, -2042535, -650354, -1115582, -2346935, -1770781, 1646616, 5451290, 5853617, 2340956, -1246198, -1123748, 2366030, 5986587, 7127506, 4950496, 344559, -3225583, -1175414, 6696981, 13614648, 12375449, 4031404, -3459800, -5106628, -3525968, -3107532, -3941246, -3953128, -3464998, -3879108, -3914067, -1296930, 2482101, 3134101, -241143, -3493763, -3156056, -646022, 1090656, 2153237]
9231B153237J908844J696083r79086l325734k961231j744706j979684k094172
9223g326449J64952K872718K570340N8919q17087Q67626K596138L050445K962354
9214F999956J944833q92994l432648k572448J42254J77377k285057k254866J207244
9205i66349K615522p58484l795824j695018K572622L925790L087795L073204K370703
9196A0429961j576201n536071m498522l38942R13463q96835m63693K898957L723145
9187D655262K34939k087163K99538L148504J803212j353023j729538k86887r38977
9178C745867l214704l215091n06133J176000L064j537406j020673N89052J201530
9169b778494O77056K24871K98539L89406J84904O6788N47241J300562R11180j439286
$$ y = [2153237, 4062081, 5758164, 4779078, 1453344, -1507887, -3252593, -5232277, -7326449, -7161497, -4288779, -1718439, -1659520, -2476607, -1608981, 987157, 4037602, 6999956, 8944789, 8051795, 4619147, 2046699, 2188953, 2366330, 81273, -2173593, -966349, 1649173, 890689, -2905135, -4600153, -2027531, 1898259, 4986054, 8059258, 10429961, 8853760, 3317689, -1180833, -1519775, -606312, -1503147, -1966840, 932117, 4655262, 4890201, 2803038, 3102576, 6251080, 8054292, 6701269, 4971731, 4684844, 3745867, 531163, -2683928, -3190061, -2014061, -2010997, -3548403, -4569076, -3980024, -2778494, -2101438, -1876567, -1578028, -1188622, -1003718, -936930, -389689, 910873, 1822053, 382767]
9159C82767l656494j948447L852948P870183M374845l986797q125357l849220
9151e085572K684191L594200k32936j894071M89712J662174j451740m537183k867475
9142g638700J407623L123517J764177N64420M04181k78175r02312N99220K999619
9133B043570K863448N49017j28432J186957N30019k817618l966421n77938K403441
9124B086043N31541k657329j508797K263336K449453j540885m148238k552552
9116e077428K47617J589481K331183K552914r8480n055207o775377j936090M773647
9107g447740O271763K264244j457658j530538j41930L76062J230007L430734M266460
9098G261404J104917l440790m322735j412788K61466j714611l595868j878629
$$ y = [382767, -3273727, -5222174, -1369226, 6500957, 10875802, 6889005, -1236352, -5085572, -2401381, 1192819, 959883, -934188, -444476, 1217698, -234042, -4771225, -7638700, -6231077, -3107560, -1343383, -778963, -374782, -652957, -1555269, -956049, 2043570, 4907018, 5456035, 5327603, 6514560, 7044579, 4226961, 260540, -317398, 2086043, 2617584, -39745, -1548542, 714794, 3164247, 1623362, -2524876, -5077428, -4829811, -3240330, -909147, 1643767, 1545287, -3509920, -10285297, -12221387, -7447740, -1175977, 1088267, -369391, -1899929, -2041859, -1665797, -435790, 2994944, 7261404, 8366321, 4925531, 602796, -809992, -548526, -2263137, -5859005, -7737634]
9090g737634R55597R26803n26988O58505L366957K451391k337010m837253j676517
9081h756149K610132K678084j28678j307229n05402o21417j870702j562912Q65587
9072h598686K619044J727282k55717l74315K330120N710817O267292K675670k236837
9063I864670m470015l763121l125821l401146j995295J782997M283202K867662
9055B043133l8557j201117j305532k080624k288813o00739Q82101M66740R15627
9046c207781M390931O534618K225555m810757n758813J59286M013617K77426n433850
9037a609768n183844J96646L481361J385295k040643j596487K621069N675829
9029B929458L757921j133501l515579j419423J387746J432158L79423Q60943J095308
$$ y = [-7737634, -6782037, -5855234, -6382222, -5723717, -2356760, 94631, -2242379, -7079632, -8756149, -6146017, -3467933, -3596611, -4903840, -5409242, -6030659, -7901361, -9464273, -8598686, -5979642, -4252360, -4508077, -4882392, -2552272, 3158545, 9425837, 12101507, 9864670, 5394655, 1631534, -1494287, -4895433, -6890728, -5107731, -824529, 2043133, 2004576, 803459, -502073, -2582697, -4871510, -5472249, -4590148, -4123408, -3207781, 1183150, 7717768, 9943323, 5132566, -626247, -466961, 3546656, 3824082, -1609768, -6793612, -6596966, -3115605, -1730310, -3770953, -5367440, -2746371, 2929458, 6687379, 5553878, 2038299, 618876, 2006622, 3438780, 3818203, 4679146, 5774454]
9020E774454j373625l494163q11719L813151L161056k550516m840996N6574N169133
9011D903349L575669j604985l309779j250460l67568k112023l468115k837734
9003f471646j531053l16571J157127K252179K252052K286827L029411K226525
8995D884851j506209m358973j935897K991888L405001j160193l371333L77311
8987f73554L854623P00240n173556n123216J389271O412313N113340J044351j142808
8978F401004j889282k877548k384524J197757M827840M435278Q02470k309025
8970H203970l734956m263912k770068J496123M405965J303616m523852m813889
8962d697003J344192N585632K951846j166707q09623J201375k74075l003493j712755
$$ y = [5774454, 4400829, 906666, 94947, 3908098, 7069154, 4518638, -322358, -265784, 4903349, 8479018, 6874033, 3564254, 2313794, 1946226, -165797, -3633912, -6471646, -8002699, -8319270, -7162143, -4909964, -2657912, -371085, 2658326, 4884851, 3378642, -980331, -2916228, 75660, 3480661, 2320468, -1050865, -673554, 3181069, 3881309, -1292247, -6415463, -5026192, 1386121, 6499461, 7543812, 6401004, 4511722, 1634174, -750350, 447407, 5275247, 9710525, 10512995, 8203970, 4469014, 205102, -2564966, -1068843, 3337122, 4640738, 116886, -4697003, -3352811, 2232821, 5184667, 4017960, 3208337, 4409712, 4135637, 1132144, -580611]
8953e80611K038614K331080j041043k633928n23930J642336J631848J178131J071289
8944E113786l74534k912409l600790j712065j3237r2675l81491L32273J154419
8935b486723J510789J835093J511438l76867k197082j370760J131430J681066
8927A238384n39088k655267k631572r96470J612450M685399O037959L926039N69487
8918A1247321n63411k10229j529937l912247l808579r92859J442886K497178K910576
8909G080699P98345n278434r876164n765393M139445Q712387L934500k483455
8901A261930l842067k538227k168110j017169J641872J366301l379931o323033
8893a4998434k622920L471062N867380N086457L944307J656348j688590j781161
$$ y = [-580611, 1458003, 3789083, 2748040, 114112, -409818, 1232518, 2864366, 4042497, 5113786, 4739252, 1826843, -1773947, -3486012, -3499249, -3591924, -3973415, -3641142, -2486723, -975934, 859159, 2370597, 1993730, -203352, -1574112, -442682, 1238384, 699296, -1955971, -4587543, -5584013, -3971563, 713836, 6751795, 10677834, 11247321, 10683910, 10473681, 8943744, 5031497, 1222918, 230059, 1672945, 4170123, 7080699, 7879044, 2600610, -7275554, -13040947, -8901502, -189115, 3745385, 1261930, -2580137, -5118364, -7286474, -8303643, -6661771, -5295470, -8675401, -14998434, -17621354, -14150292, -8282912, -3196455, 747852, 2404200, 715610, -1065551]
8885a065551K086067K955820k593641o533776j534279N940388N188662j762914
8877B680776m383843p95035J513947j14642q49036N53401k66925l249444k722059
8868g632860J873965L974277R67326j936467j494263j108051k631779k329788
8860a0317640J031890K386960n61427k090215K172688P279116O499141J367578
8852G768091k088918k650282k965184k874246m45570K377300J598866k009264
8844a289207l407312p57612K208039J983151l67936j858812j651657q84773k55622
8835f281741N84554J883798L132382L532371K685013Q04766j390301k790557k375423
8826b15138l60520J392689J238885j39201r52498j296026k515558l655174k066913
$$ y = [-1065551, 1020516, 3976336, 1382695, -5151081, -6685360, -744972, 4443690, 2680776, -1703067, -2498102, -984155, -1098797, -1947833, -1394432, -1661357, -4910801, -7632860, -5758895, -1784618, -817292, -2753759, -4248022, -5356073, -7987852, -10317640, -9285750, -6898790, -7460217, -9550432, -7377744, -98628, 6400513, 7768091, 5679173, 3028891, 63707, -2810539, -3256109, -878809, 720057, -1289207, -4696519, -5454131, -3246092, -1262941, -1630877, -3489689, -5141346, -6026119, -6281741, -5697187, -3813389, -681007, 2851364, 5536377, 6341143, 4950842, 2160285, -215138, -575658, 817031, 2055916, 1916715, 964217, -331809, -2847367, -6502541, -8569454]
8817h569454J514710K713234M36372m77302K994036O168914L555303k098917l865265
8808B371631j249932N3255k175023m196680l597710k557354k712635k304834N0188
8799a6319094L195954N974470P892294P181963K760315k025637k703718n97150
8791E359397q45544l608098l739161Q5098K878365J701499j85390J61830J018048
8782B826044O72757M12011L76874j427789l732464k347335J699891K032494j987528
8773a475045k709631K752937O190642J563394m369095l161461J602381J776142
8765B170264r79231J85724L464621J799830k945799k345551L079336L925953j535460
8756F819687m040416J99203K416507l353258q919483m368956O168816J0472721
$$ y = [-8569454, -7054744, -4341510, -3905138, -4382440, -1388404, 4780510, 8335813, 6236896, 2371631, 1121699, 1174954, -1000069, -5196749, -8794459, -11351813, -14064448, -16369282, -16319094, -13123140, -7148670, 743624, 7925587, 10685902, 8660265, 5956547, 5359397, 4513853, 905755, -2833406, -2748308, 130057, 1831556, 1646166, 1807996, 2826044, 3498801, 3910812, 4287686, 2859897, -872567, -3219902, -1520011, 512483, -1475045, -4184676, -1431739, 4758903, 6322297, 1953202, -1208259, 394122, 2170264, 1191033, 1376757, 4841378, 6641208, 3695409, 1349858, 4429194, 8355147, 6819687, 2779271, 2978474, 5394981, 2041723, -6877760, -11246716, -5077900, 5394821]
8748E394821N113122k207911m544775k372740O14197K033804Q18560k738388o062576
8739c951886o068626k261556L092604O982700P000179K799148k301563l528233
8731A762767l25157K520473J308232j781891k765497j802140j655330k451868
8723e190411j922889K78811K154144K770374L033093L346036L125184K338952
8715I933294J279604n67157l149571m315480k410649M03770N91577j445431j943338
8706a623381K94818K262880J845702Q19582J037899R93594j127731l444341k690916
8697a631894O95502K887383J743680r99466k671373k493387j056085R12046K370953
8688b42641K233786Q92522K25671J046909J724971N24692j802693l195109l002985
$$ y = [5394821, 10507943, 8300032, 3755257, 1382517, 1996714, 4030518, 4849078, 2110690, -3951886, -10020512, -12282068, -9189464, -2206764, 4793415, 7592563, 5291000, 1762767, 1437610, 3958083, 5266315, 3484424, 718927, -1083213, -2738543, -5190411, -7113300, -6834489, -4680345, -1909971, 1123122, 4469158, 7594342, 9933294, 11212898, 10645741, 7496170, 3180690, 770041, 1173811, 1765388, 319957, -1623381, -1328563, 934317, 2780019, 3599601, 4637500, 5631094, 4503363, 1059022, -1631894, -936392, 1950991, 3694671, 2695205, 23832, -2469555, -3525640, -2613594, -242641, 1991145, 2883667, 3109338, 4156247, 5881218, 6405910, 4603217, 1408108, -1594877]
8679a594877j810574M18697L578306N366147L111909j844909m645237k974317
8671c94855K25033J625493J861395K493482J962285j368808m481943l041929J488248
8662C68401L237485N12147k158169j476095L13055M73967J72722R30033J104310
8653C477856n06410j343846O52566K804195K032853L53179J079177K279777l3991
8644A0795356l917481l414862J614757M250591N87203m777104n817338k816360
8636c495238K818P56427N29780L72232N54021J097961J212996j9549j361938l14740
8626f65230K736983M302437K835447N67955r25025k794070m712614l480134J142853
8617i91398M073521K378239L14981J940250L529483J9913n051253m356051Q29901
$$ y = [-1594877, -3405451, -2986754, 591552, 5957699, 9069608, 7224699, 2579462, -394855, -169822, 1455671, 3317066, 5810548, 7772833, 6404025, 1922082, -1119847, 368401, 3605886, 4118033, 1959864, 483769, 796824, 1270791, 1443513, 2373546, 3477856, 2971446, 1627600, 2280166, 5084361, 7117214, 7470393, 8549570, 10829347, 10795356, 6877875, 3463013, 5077770, 9328361, 9915564, 5138460, -678878, -3495238, -3492420, -2735993, -2206213, -1833981, -1279960, -181999, 1030997, 1011448, -350490, -665230, 2071753, 6374190, 9209637, 9777592, 8852567, 6058497, 1345883, -2134251, -991398, 3082123, 5460362, 5775343, 7715593, 11245076, 11264989, 6213736, 1857685, 2687586]
8608B687586K246074j744101l728843j49317K720477l02850m546130l390593J301730
8599d905967L179153J343328l15955o43681j503140k295667m15799L355479N204565
8590C002316L908544J572440q44181l954256o041854l994810R95974L702278K354285
8581G00736R73092K049806K079241j826537n457997l215012K466718L818635p70754
8572H17928m376315j932738K879600M176405K372673J584079J964424K71130l369395
8563D387791m955438l042768n85707N55689J983641M006004L596981p2196k762731
8554C111266j543189K89641p96929j842953J339640N452690L645083l322852p565585
8545a233188n748558k614363j689795l60073K953157M177394P23555k819212j420330
$$ y = [2687586, 4933660, 3189559, -539284, -688601, 2031876, 1729026, -2817104, -6207697, -4905967, -1726814, -383486, -699441, -1343122, -2846262, -5141929, -5557728, -2202249, 3002316, 6910860, 8483300, 7639119, 3684863, -2356991, -6351801, -5355827, -1653549, 700736, 1673828, 3723634, 5802875, 3976338, -1481659, -4696671, -2229953, 1588682, 817928, -3558387, -5491125, -2611525, 1564880, 3937553, 5521632, 7486056, 7757186, 4387791, -567647, -3610415, -4196122, -3640433, -1656792, 2349212, 5946193, 5873997, 3111266, 1568077, 1857718, 1060789, -782164, 557476, 6010166, 9655249, 6332397, -1233188, -6981746, -9596109, -11285904, -11645977, -8692820, -4515426, -3791871, -6611083, -8031413]
8536h031413K633347L979229K246585O09043k89435j531401j940211l60487N40861
8527b143882j808265m459539l076587O48951J796257N72496J135613L304082K868144
8518a162730K2416k68827K609005L176346n38444l190154j315119Q16404q40948
8509f92051k862340r78005J637142j41214l684200k467342K546660L813924n54788
8500c382214l602483o21261L725074L269151k19025o78499K568275M460414K310631
8491G830063r28990j996330j586103j584850j355606N01492K563994J878111j476234
8482C845547l774941k364709Q44870J850840m56190l069234k488433J210481M205642
8473a96127K902870j874006n302467l909436K75299K423812J144303m34671M4243
$$ y = [-8031413, -5398066, -1418837, 827748, 1436791, 1147356, -384045, -2324256, -2684743, -2143882, -3952147, -8411686, -11488273, -10839322, -9043065, -8470569, -7334956, -4030874, -1162730, -1140314, -1409141, 1199864, 4376210, 3837766, 647612, -667507, 148897, -692051, -3554391, -4532396, -2895254, -3036468, -6720668, -9188010, -6641350, -2827426, -3382214, -6984697, -7605958, -3880884, -611733, -830758, -1509257, 1059018, 5519432, 7830063, 6901073, 4904743, 3318640, 1733790, 378184, 879676, 3443670, 5321781, 3845547, 70606, -2294103, -1449233, 401607, -54583, -3123817, -5612250, -4401769, -196127, 2706743, 832737, -4469730, -8379166, -8103867, -5680055, -4535752, -4970423, -4926180]
8464d926180R07329Q05j355519o37214J562309K494935J490331L64992K45077
8455A46865O75849J409818K408987K477531O57944j373222j273692l2653n25663
8446D571764k221011j614023J316659J929902j641079m554260k354841J877256
8438b689633K144537j477894l840012l112773k243128k140695K98335N445777
8430g615486P874351L816665k309464l415045O04038L421694J358091k724065
8422A010779m602787l508811q63280K058997L724863K741460L30652l52445J080115
8413A619543J263166j350002l438081k171508j07035p22591k101468j99703L649196
8404c558483M370488J433737o08423l8814j64673k311848k867379J01644K852604
$$ y = [-4926180, -4018851, -4018046, -5373565, -6010779, -4448470, -1953535, -463204, -98212, 146865, 822714, 2232532, 4641519, 7119050, 7776994, 6403772, 5130080, 5097427, 4571764, 2350753, 736730, 2053389, 3983291, 2342212, -2212048, -4566889, -2689633, -545096, -2022990, -5863002, -8975775, -11218903, -13359598, -13061263, -7615486, 258865, 4075530, 1766066, -1648979, -1044941, 2376753, 3734844, 1010779, -3592008, -7100819, -7964099, -5905102, -2180239, 561221, 891873, 539428, 1619543, 2882709, 1532707, -1905374, -4076882, -4183917, -4906508, -7007976, -7207679, -3558483, 812005, 2245742, 1637319, 1598505, 1433832, -878016, -3745395, -3643751, -791147]
8395g91147K023809j8231L28015K052647K107082M70930j101648k335154k907846
8386a71543q83765L575290O039807L308064j758213m568137m762946m076149k141759
8377e439351Q90740J546651j646445l852079j096198K246314M56370k940952o74087
8368a0509037N049099N485568N03368r14967L399440M467455k190208p964590
8360b673872m876117J738520K670018n47231o8658M247311N346843J289903k239860
8351D886857j703251j21883l83414n57024J611895M052420L135598j298154n822086
8342C800958p159779m874351j111917J513147J885163O42221p11819l17971L043398
8333c290950P463313P743155J193640o903528q060521j538778M151062K513118
$$ y = [-791147, 1232662, 1214431, 1542446, 3595093, 5702175, 6173105, 5071457, 2736303, -171543, -1055308, 2519982, 8559789, 11867853, 10109640, 5541503, 778557, -3297592, -5439351, -4548611, -3001960, -4648405, -8500484, -9596682, -7350368, -6893998, -9834950, -10509037, -5459938, 25630, 528998, -385969, 3013471, 7480926, 5290718, -2673872, -7549989, -5811469, -3141451, -3688682, -3757340, 489971, 5836814, 7126717, 4886857, 3183606, 3061723, 2678309, 2121285, 3733180, 7785600, 10921198, 9623044, 3800958, -3358821, -8233172, -9345089, -7831942, -5946779, -5304558, -6016377, -6334348, -3290950, 4172363, 11915518, 13109158, 6205630, -1854891, -3393669, 757393, 3270511]
8325C270511k873007m562522j325512K126073K640293J434923O86808Q77716J201933
8316C477216O09405r44994j591191K59008K469008J235523k493356k994740J738055
8307A763934O079263M605191m14251l374160l341906l029785k952810j753647
8299b418171k00979n7833n60044j32666K58721o06976r26096Q85917K290832P18619
8289g48676j184328J40521K272402O05176l093849l117959M15957J956863M28617
8280b325276O02557L523232L840947o25394m293136k726597L99673p5455k654623
8271d334072k753147j22787K318107L577203L748213J369537l347653n607816
8263e152415j956333L117705K664396j927278k527854K863650O112520J028718
$$ y = [3270511, 397504, -4165018, -5490530, -3364457, -724164, 710759, 1397567, 2275283, 3477216, 4086621, 3141627, 1550436, 1809444, 4278452, 5513975, 3020619, 25879, 1763934, 7843197, 12448388, 12034137, 8659977, 5318071, 2288286, -664524, -2418171, -2619150, -2676983, -3237027, -3369693, -3110972, -3717948, -4644044, -3758127, -1467295, -748676, -1933004, -1792483, 479919, 1085095, -2008754, -5126713, -4710756, -2753893, -2325276, -1722719, 1800513, 5641460, 5016066, 722930, -2003667, -1603994, -1679449, -4334072, -7087219, -7210006, -4891899, -1314696, 2433517, 3803054, 455401, -5152415, -7108748, -3991043, -1326647, -3253925, -5781779, -2918129, 3194391, 4223109]
8255D223109o539081o376345J498765O630630K716305l753537k771633N297496
8247I25709J0442458O652586q11926l692076j505538J69139p81873j039870P80685
8238A1139294P35088l811123q406839o690389M72673N374288L206758k072418
8230e2668l264005Q31134M228478J637053m675469p432509l079599M012888O837085
8221i57612L664168j026234k640815j104643Q50389J608676J391284N90820o24758
8212A751275j522299j320636n24368l71380p94754l20943J514790L007351K488629
8203C907665O33572o62171q99320j002387j284232j107275m15607J37914O24168
8194f7673J622220K535927K128600P72591k05703j325244l801968n433637k302109
$$ y = [4223109, -2315972, -8692317, -7193552, -562922, 2153383, -1600154, -4371787, 925709, 11368167, 18020753, 17208827, 13516751, 12011213, 12180352, 11398479, 10358609, 11139294, 11874382, 8063259, -343580, -7033969, -6561296, -1187008, 2019750, -52668, -3316673, -2485539, 1742939, 3379992, -1295477, -8727986, -11807585, -7794697, -957612, 2706556, 1680322, -960493, -2065136, -1214747, 393929, 1785213, 2376033, 1751275, 228976, -1091660, -1616028, -1987408, -2782162, -3103105, -1588315, 1419036, 3907665, 4541237, 3879066, 2979746, 1977359, 693127, -414148, -829755, -691841, -67673, 1554547, 4090474, 6219074, 6991665, 6785962, 5460718, 1658750, -3774887, -6076996]
8185f076996L887085N632563J98926n074624l155326K034570K336792j362018
8177a579028j501642K548188L350560j441029m626317j255712L592786L311917
8169B399723p80799l358257k972641j315811Q34039K599050J928683p50579j710903
8160c127495J96996J296703l70265j506968j4226P31516j661222l536527j565427
8151i556915J205147J020674j14127P05632J278445o22905j462555J770129M506916
8142a269559J656000k726568j403077L843518M944088L58330l442192k271218
8134c10678J472598M001399L439342m79065m606553l416686K587905M471662k140954
8125E018970q018824l749177M373515M213438k037427k548507K774216K677130
$$ y = [-6076996, -2189911, 3442652, 3641578, -1433046, -4588372, -2553802, -217010, -1579028, -3080670, -532482, 2818078, 1377049, -3249268, -4504980, -912194, 2399723, 1618924, -1739333, -4711974, -6027785, -5193746, -2594696, -666013, -1416592, -3127495, -2930499, -1633796, -2004061, -3511029, -3525255, -2793739, -4454961, -7991488, -9556915, -8351768, -7331094, -7445221, -6739589, -5461144, -6084049, -7546604, -5776475, -1269559, 386441, -2340127, -3743204, 100314, 5044402, 5402732, 1960540, -310678, 1161920, 5163319, 8602661, 8123596, 3517043, 100357, 2688262, 7159924, 5018970, -2999854, -6749031, -2375516, 1837922, -199505, -2748012, 26204, 2703334]
8117B703334m037993n447349K003545O301516L38672o212490l848883J797927
8109f401721J788519j048774L94451M244865M517972K084521J161044Q82276j098590
8100F524563k248735j54771J678547J59158j139286J007101K570902k42616l083529
8091E071334j016482K172023O62241l101855l486166j754122k206788l133498
8083f793313p05088K495866J921338q7385J036301K733031K16260l198113j056974
8074c438077L913234L282911k910494n960193k013451L638399N716420M084188
8066F312937K59735l480858k908034K513174N263736k84942o920493m233407L882121
8057D03969M430686l239537o028508J030962O584077J969660n148542m155853
$$ y = [2703334, -1334659, -6782008, -4778463, 1523053, 1861725, -4350765, -8199648, -6401721, -4613202, -5661976, -5267525, -1022660, 3495312, 5579833, 6740877, 7623153, 6524563, 4275828, 4121057, 5799604, 5958762, 4819476, 5826577, 8397479, 8154863, 5071334, 4054852, 6226875, 6889116, 3787261, 301095, -1453027, -3659815, -6793313, -7498401, -5002535, -3081197, -3168582, -2132281, 600750, 817010, -2381103, -3438077, 475157, 3758068, 847574, -5112619, -7126070, -3487671, 2228749, 6312937, 6572672, 3091814, 183780, 2696954, 7960690, 7675748, 755255, -3478152, 403969, 4834655, 1595118, -4433390, -3402428, 3181649, 5151309, 2767, -4153086]
8049d153086K321006M758691J469106j886454k178597o64644J160513J840860
8041B667395k29444l068385j760722L384766N010186m90094o388858n361431j20025
8032f356612K101640Q40115J036809L747042N197601L298997n01820m219213n727235
8023e82676k659202L592496O719069L214934j839147k016891P92509L79195l066526
8014D533761l958416j576024j005261l447086l683018O75252M619481L749331
8006i1980P09589m36791q87272l043280m111246j64861N677627N962938k04194
7997C410530n182683l363514J683416L586576K044753Q91212O76532j088269l677032
7988a018479l172017P62137L515624K353372k62789j788445k820266k987945L86787
$$ y = [-4153086, -1832080, 2926611, 4395717, 2509263, 330666, -333978, 826535, 2667395, 2437951, -630434, -2391156, 993610, 6003796, 5513702, -875156, -6236587, -6356612, -4254972, -3414857, -2378048, 1368994, 6566595, 9865592, 9363772, 5144559, -582676, -3241878, 350618, 7069687, 10284621, 8445474, 6428583, 7221092, 7600287, 4533761, 575345, -1000679, -2005940, -5453026, -9136044, -8460792, -3841311, -91980, 617609, 180818, -706454, -3749734, -7860980, -8025841, -2348214, 3614724, 3410530, -1772153, -5135667, -3452251, 134325, 2179078, 3070290, 3746822, 2658553, -1018479, -4190496, -3428359, 87265, 2440637, 2177848, 389403, -2430863, -5418808, -5032021]
7979e032021N769729N785745k130863r013889n775413L050357N818593J001378
7971e26384k283232M7115J892293p54100k958096m36226K976875K823363J556895
7962B338503K675987L538487L73656m329537n550699l144352k60612J981253L327156
7953I49842J856341k168127l858373o25345K502442N88592k428078j82755M465408
7944A099947L399459k776285m687340Q76144N397693J497859o256489q410085
7936i859097l258068K856056M779159L245558J614173J639950K540317K346612
7928E904660R7106k757453l758576k386940n01245K55232J92523N51731J859650
7919e43312L341394L272030O20496k829629l477662m97553K373407J758996o33160
$$ y = [-5032021, 737708, 6523453, 4392590, -4621299, -10396712, -7346355, -1527762, -526384, -2809616, -2762501, -870208, -1624308, -4582404, -5018630, -2041755, 781608, 2338503, 5014490, 8552977, 8926633, 4597096, -953603, -4097955, -4358567, -2377314, 949842, 2806183, 638056, -3220317, -3845662, -1343220, -754628, -3182706, -3365461, 1099947, 4499406, 1723121, -2964219, -2088075, 3309618, 4807477, -1449012, -9859097, -13117165, -10261109, -5481950, -2236392, -622219, 1017731, 3558048, 5904660, 6001766, 3244313, -514263, -2901203, -3402448, -3147216, -2954693, -2402962, -543312, 2798082, 6070112, 6690608, 3860979, 383317, -114236, 2259171, 4018167, 3385007]
7910C385007j110535J17456k0869j834936k633941j632765p57878n31116N57417
7901d462160K193452K071253L20576j71653J125986J292598o82171j881561o66045
7892h59725M77467l84943j340215p33393l98321j565034j600490J300358L905800
7883a198496K838061K92515n4621K88822k103248n106184l671625J158139L036180
7874d520457L74640j572366j10568Q09491j012619p97076M731636R531466O078311
7865A3512458k546039o234276k279791J550508o99908n021033m740176m10643
$$ y = [3385007, 2274472, 2391928, 2371059, 536123, -2097818, -3730583, -4488461, -5019577, -4462160, -2268708, -197455, 123121, -48532, 1077454, 2370052, 1687881, -193680, -859725, -382258, -767201, -2107416, -2840809, -3239130, -4804164, -6404654, -5104296, -1198496, 1639565, 1932080, 1877459, 2166281, 63033, -5043151, -8714776, -7556637, -4520457, -4145817, -5718183, -5828751, -5019260, -6031879, -6828955, -2097319, 7434147, 13512458, 10966419, 4732143, 2452352, 4002860, 3302952, -1718081, -6458257, -6868900]
$$ [...]
##END NTUPLES=NMR SPECTRUM
##END=
