##TITLE=31Pdec_SR_136_rm1h
 , 24 sc
 27.7.2022
##JCAMPDX= 6.0         $$ Bruker NMR JCAMP-DX V2.0
##DATA TYPE= NMR SPECTRUM
##DATA CLASS= NTUPLES
##ORIGIN= UXNMR, Bruker Analytische Messtechnik GmbH
##OWNER= root
$$ XWIN-NMR		Version 3.5
$$ Wed Jul 27 16:29:45 2022 Russian Standard Time (UT+4h)  she@DPX200
##.OBSERVE FREQUENCY= 81.013821
##.OBSERVE NUCLEUS= ^31P
##.ACQUISITION MODE= SIMULTANEOUS
##.ACQUISITION SCHEME= undefined
##.AVERAGES= 24
##.DIGITISER RES= 16
##SPECTROMETER/DATA SYSTEM= spect
##.PULSE SEQUENCE= zgpg30
##.SOLVENT NAME= CDCl3
##.SHIFT REFERENCE= (INTERNAL, CDCl3, 0, 248.564)
##AUDIT TRAIL= $$ (NUMBER, WHEN, WHO, WHERE, WHAT)
$$ ##TITLE= Audit trail, XWIN-NMR		Version 3.5
$$ ##JCAMPDX= 5.01
$$ ##ORIGIN= Bruker BioSpin GmbH
$$ ##OWNER= she
$$ F:/spectra/data/she/nmr/P31/1/pdata/1/auditp.txt
$$ ##AUDIT TRAIL=  $$ (NUMBER, WHEN, WHO, WHERE, WHAT)
(   1,<2022-07-27 16:28:09.09 +0400>,<she>,<DPX200>,
      <created by zg, POWCHK disabled, PULCHK disabled
       configuration hash MD5:
       00 E9 B6 7A A2 85 ED C7 34 08 36 98 17 FE 4E 26
       data hash MD5: 32K
       7F 8E 70 49 0B 6F AA 43 62 01 91 38 93 C9 25 87>)
(   2,<2022-07-27 16:28:22.68 +0400>,<she>,<DPX200>,
      <Start of raw data processing
       efp BC_mod = 2 LB = 1 FT_mod = 6 PKNL = 1 PHC0 = -10302.18 PHC1 = 129.0568 SI = 64K 
       data hash MD5: 64K
       9C FE 2D F8 81 C7 8E 32 EE BB 9F 64 47 9D 8C 20>)
(   3,<2022-07-27 16:29:14.79 +0400>,<she>,<DPX200>,
      <pk PHC0 = 24.61392 PHC1 = -22.6 
       data hash MD5: 64K
       EF 45 92 59 4F 6A 1B B2 7B 14 84 B1 B8 AF 04 C5>)
$$ ##END=
$$ 
$$ hash MD5
$$ 23 06 5F 02 1C 4A C0 CB 36 98 42 62 69 D8 6D 2C
##$RELAX= 
##$RELAX= 
##$RELAX= 
##$RELAX= 
##$RELAX= 
##$RELAX= 
##$RELAX= 
##$RELAX= 
$$ Bruker specific parameters
$$ --------------------------
##$DU= <F:/spectra>
##$EXPNO= 1
##$NAME= <P31>
##$PROCNO= 1
##$TYPE= <nmr>
##$USER= <she>
##$AMP= (0..31)
100 100 100 100 100 100 100 100 100 100 100 100 100 100 100 100 100 100 
100 100 100 100 100 100 100 100 100 100 100 100 100 100 
##$AQSEQ= 0
##$AQ_mod= 1
##$AUNM= <au_zg>
##$AUTOPOS= <>
##$BF1= 81.014009
##$BF2= 200.13
##$BF3= 200.13
##$BF4= 200.13
##$BF5= 200.13
##$BF6= 200.13
##$BF7= 200.13
##$BF8= 200.13
##$BYTORDA= 1
##$CFDGTYP= 0
##$CFRGTYP= 5
##$CHEMSTR= <none>
##$CNST= (0..31)
1 1 145 1 1 1 1 1 1 1 1 1 1 1 1 1 1 1 1 1 1 1 1 1 1 1 1 1 1 1 1 1 
##$CPDPRG= <waltz16>
##$CPDPRG1= <>
##$CPDPRG2= <waltz16>
##$CPDPRG3= <>
##$CPDPRG4= <mlev>
##$CPDPRG5= <mlev>
##$CPDPRG6= <mlev>
##$CPDPRG7= <mlev>
##$CPDPRG8= <mlev>
##$CPDPRGB= <>
##$CPDPRGT= <>
##$D= (0..31)
0 1 0 0 0 0 0 0 0 0 0 0.03 2e-05 3e-06 0 0 0 0 0 0 0 0 0 0 0 0 0 0 0 0 
0 0 
##$DATE= 1658924888
##$DBL= (0..7)
120 120 120 11 120 120 24 19 
##$DBP= (0..7)
150 150 150 150 150 150 150 150 
##$DBP07= 0
##$DBPNAM0= <>
##$DBPNAM1= <>
##$DBPNAM2= <>
##$DBPNAM3= <>
##$DBPNAM4= <>
##$DBPNAM5= <>
##$DBPNAM6= <>
##$DBPNAM7= <>
##$DBPOAL= (0..7)
0.5 0.5 0.5 0.5 0.5 0.5 0.5 0.5 
##$DBPOFFS= (0..7)
0 0 0 0 0 0 0 0 
$$ [...]
##$SUBNAM2= <"">
##$SUBNAM3= <"">
##$SUBNAM4= <"">
##$SUBNAM5= <"">
##$SUBNAM6= <"">
##$SUBNAM7= <"">
##$SUBNAM8= <"">
##$SUBNAM9= <"">
##$SW= 501.771253377433
##$SWIBOX= (0..15)
0 1 3 0 0 0 0 0 0 0 0 0 0 0 0 0 
##$SW_h= 40650.406504065
##$TD= 32768
##$TD0= 1
##$TE= 0
##$TE2= 300
##$TE3= 300
##$TEG= 300
##$TL= (0..7)
0 120 53 12 22 120 120 120 
##$TP= (0..7)
150 150 150 150 150 150 150 150 
##$TP07= 0
##$TPNAME0= <>
##$TPNAME1= <>
##$TPNAME2= <>
##$TPNAME3= <>
##$TPNAME4= <>
##$TPNAME5= <>
##$TPNAME6= <>
##$TPNAME7= <>
##$TPOAL= (0..7)
0.5 0.5 0.5 0.5 0.5 0.5 0.5 0.5 
##$TPOFFS= (0..7)
0 0 0 0 0 0 0 0 
##$TUNHIN= 0
##$TUNHOUT= 0
##$TUNXOUT= 0
##$USERA1= <user>
##$USERA2= <user>
##$USERA3= <user>
##$USERA4= <user>
##$USERA5= <user>
##$V9= 5
##$VALIST= <valist>
##$VCLIST= <CCCCCCCCCCCCCCC>
##$VD= 0
##$VDLIST= <DDDDDDDDDDDDDDD>
##$VPLIST= <PPPPPPPPPPPPPPP>
##$VTLIST= <TTTTTTTTTTTTTTT>
##$WBST= 1024
##$WBSW= 4
##$XGAIN= (0..3)
0 0 0 0 
##$XL= 0
##$YL= 0
##$YMAX_a= 3687
##$YMIN_a= -3125
##$ZGOPTNS= <>
##$ZL1= 120
##$ZL2= 120
##$ZL3= 120
##$ZL4= 120
##$ABSF1= 0
##$ABSF2= 0
##$ABSG= 0
##$ABSL= 0
##$ALPHA= 0
##$AQORDER= 0
##$ASSFAC= 0
##$ASSFACI= 0
##$ASSFACX= 0
##$ASSWID= 0
##$AUNMP= <proc_1d>
##$AZFE= 0.1
##$AZFW= 0.5
##$BCFW= 0
##$BC_mod= 2
##$BYTORDP= 0
##$COROFFS= 0
##$CY= -3
##$DATMOD= 1
##$DC= 0
##$DFILT= <>
##$DTYPP= 0
##$F1P= 0
##$F2P= 0
##$FCOR= 1
##$FTSIZE= 65536
##$FT_mod= 6
##$GAMMA= 0
##$GB= 0
##$INTBC= 1
##$INTSCL= 5.30512e-09
##$ISEN= 30
##$LB= 1
##$LEV0= 0
##$LPBIN= 0
##$MAXI= 10000
##$MC2= 0
##$MEAN= 0
##$ME_mod= 0
##$MI= 50
##$NCOEF= 0
##$NC_proc= -8
##$NLEV= 6
##$NOISF1= 182.463
##$NOISF2= 159.3651
##$NSP= 0
##$NTH_PI= 0
##$NZP= 0
##$OFFSET= 248.5645
##$PC= 4
##$PHC0= -10277.57
##$PHC1= 106.4568
##$PH_mod= 1
##$PKNL= yes
##$PPARMOD= 0
##$PSCAL= 0
##$PSIGN= 0
##$REVERSE= no
##$SF= 81.014009
##$SI= 65536
##$SIGF1= 159.3651
##$SIGF2= -187.1042
##$SINO= 113.3802
##$SIOLD= 16384
##$SREGLST= <1H.CDCl3>
##$SSB= 0
##$STSI= 65536
##$STSR= 0
##$SW_p= 40650.406504065
##$SYMM= 0
##$S_DEV= 0
##$TDeff= 32768
##$TDoff= 0
##$TI= <>
##$TILT= no
##$TM1= 0
##$TM2= 0
##$TOPLEV= 0
##$USERP1= <user>
##$USERP2= <user>
##$USERP3= <user>
##$USERP4= <user>
##$USERP5= <user>
##$WDW= 1
##$XDIM= 65536
##$YMAX_p= 174797511
##$YMIN_p= -281381276
$$ End of Bruker specific parameters
$$ ---------------------------------
##NTUPLES= NMR SPECTRUM
##VAR_NAME=  FREQUENCY,     SPECTRUM/REAL,   SPECTRUM/IMAG
##SYMBOL=    X,             R,               I
##VAR_TYPE=  INDEPENDENT,   DEPENDENT,       DEPENDENT
##VAR_FORM=  AFFN,          ASDF,            ASDF
##VAR_DIM=   65536,         65536,           65536
##UNITS=     HZ,            ARBITRARY UNITS, ARBITRARY UNITS
##FACTOR=    0.620285442955139, 1,           1
##FIRST=     20137.2065510759, 0,            0
##LAST=      -20513.1999529892, 0,           0
##MIN=       -20513.1999529892, -281381276,  0
##MAX=       20137.2065510759, 174797511,    0
$$ Real data points
##PAGE= N=1
##DATA TABLE= (X++(R..R)), XYDATA
$$ [...]
$$ plain form
13041 9998537 7854648 3681237 757077 -701964 -2062977 -2963503 -2463091 -1774090 -2584773
13032 -2584773 -3802072 -3163269 -1271242 -831557 -2353021 -3643438 -3232600 -1376279 1865349
13023 1865349 6273661 9385462 8255504 3706677 -238437 -1395721 -804894 693676
13015 693676 3142438 4322711 851232 -5745556 -8763845 -5079260 -27671 246450
13007 246450 -2235065 -771408 5789995 11572335 11881644 8260853 4819429 3303080
12999 3303080 2986453 2698063 1558638 -664374 -3046701 -4308285 -4223640 -3449325 -2674046
12990 -2674046 -2977332 -5476449 -8698242 -8259682 -2451779 3282690 1822802 -5914931
12982 -5914931 -11474705 -9969889 -5803247 -5071376 -6969410 -6754769 -3965103 -2661927
$$ packed form
13041I998537k143889m173411k924160j459041j361013r00526N00412O89001q10683
13032b584773j217299O38803J892027M39685j521464j290417M10838J856321L241628
13023A865349M408312L111801j129958m548827l945114j157284N90827J498570
13015F93676K448762J180273l471479o596788l018289L684585N051589K74121
13007B46450k481515J463657O561403N782340L09309l620791l441424j516349
12999C303080l16627k88390j139425k223012k382327j261584Q4645P74315P75279
12990b674046l03286k499117l221793M38560N807903N734469j459888p737733
12982e914931n559774J504816M166642P31871j898034K14641K789666J303176
$$ plain form
12974 -2661927 -4663667 -7081931 -6842192 -4184976 -957744 1844341 3832450 4540966
12966 4540966 4106113 3482964 3380745 3784419 4525725 5288502 5203165 3649436 1342428
12957 1342428 -506540 -1686903 -2253876 -969354 3353713 8968917 11865000 9842244
12949 9842244 4307360 -1945511 -6579481 -7460872 -3795860 1369099 2872501 -453796
12941 -453796 -4089079 -4341269 -3593989 -5925588 -10223313 -12104223 -11141266 -11037732 -12694243
12932 -12694243 -12309588 -7760240 -2280797 460814 1002300 1100136 -73274 -2986666 -4167172
12923 -4167172 -460595 4783185 4938099 -729928 -5898202 -5758036 -2196549 842221
12915 842221 2527520 3129715 980204 -4580940 -9760374 -10036062 -6139003 -2630486 -1420241
$$ packed form
12974b661927k001740k418264K39739K657216L227232K802085J988109P08516
12966D540966m34853o23149j02219M03674P41306P62777q5337j553729k307008
12957A342428j848968j180363n66973J284522M323067N615204K896083k022756
12949I842244n534884o252871m633970q81391L665012N164959J503402l326297
12941d53796l635283k52190P47280k331599m297725j880910R62957J03534j656511
12932a2694243L84655M549348N479443K741611N41486R7836j173410k913392j180506
12923d167172L706577N243780J54914n668027n168274J40166L561487L038770
12915H42221J685299O02195k149511n561144n179434k75688L897059L508517J210245
$$ plain form
12906 -1420241 -636261 374603 -578478 -3899545 -5821208 -3109786 2274934 5607265
12898 5607265 4833433 1581621 -1614806 -2827253 -854680 3418935 6336366 4681648
12890 4681648 -396676 -4632646 -5533033 -3878750 -859374 3072067 5936946 4493312
12882 4493312 -942135 -4641634 -1654113 5598287 10252334 9821544 8296952 8992245
12874 8992245 9447376 6054940 847960 -385998 3800150 8034970 6875469 1473395
12866 1473395 -2303171 -982920 3070136 4708939 1152942 -5438202 -9485262 -6826715
12858 -6826715 673486 6176220 5136054 535811 -1480408 -188714 -599751 -4799436
12850 -4799436 -7825761 -5067821 271495 1764751 -744744 -1877717 49950 875741
$$ packed form
12906a420241P83980J010864r53081l321067j921663K711422N384720L332331
12898E607265p73832l251812l196427j212447J972573M273615K917431j654718
12890D681648n078324m235970r00387J654283L019376L931441K864879j443634
12882D493312n435447l699499K987521P252400M654047m30790j524592O95293
12874H992245M55131l392436n206980j233958M186148M234820j159501n402074
12866A473395l776566J320251M053056J638803l555997o591144m047060K658547
12858f826715P500201N502734j040166m600243k016219J291694m11037m199685
12850d799436l026325K757940N339316J493256k509495j132973J927667Q25791
$$ plain form
12842 875741 -1377027 -2709103 -433464 1355605 -1600962 -5902541 -5324671 -872610
12834 -872610 758581 -2127799 -4246789 -2993760 -2838831 -6850777 -10283909 -7930765
12826 -7930765 -3046902 -2207924 -4220076 -2052734 4607946 7062034 569361 -7440500
12818 -7440500 -7248150 -70446 4877509 3742748 1380046 1745295 2170886 -277258 -2537889
12809 -2537889 -250619 4562870 5535261 634864 -5450713 -7745316 -6315740 -4391856
12801 -4391856 -4058677 -5260820 -7088682 -8351436 -7839141 -5330474 -2082101 147676
12793 147676 336283 -1173863 -2451878 -1121229 2594413 4619703 1480043 -3924910
12785 -3924910 -4414012 2153919 8993160 8659993 2616902 -1388012 -142752 1513734
$$ packed form
12842H75741k252768j332076K275639J789069k956567m301579N77870M452061
12834h72610J631191k886380k118990J253029J54929m011946l433132K353144
12826g930765M883863Q38978k012152K167342O660680K454088o492673q009861
12818g440500J92350P177704M947955j134761k362702L65249M25591k448144k260631
12809b537889K287270M813489R72391m900397o085577k294603J429576J923884
12801d391856L33179j202143j827862j262754N12295K508667L248373K229777
12793A47676J88607j510146j278015J330649L715642K025290l139660n404953
12785c924910m89102O567931O839241l33167o043091m004914J245260J656486
$$ plain form
12777 1513734 -1366196 -6614742 -8151061 -3951416 2045842 5074791 4120665 1414358
12769 1414358 -558018 -736230 422080 1175251 -607604 -5202991 -9479191 -9316744 -4755060
12760 -4755060 -1189376 -3265748 -8489398 -9836987 -4705787 2094852 5115576 4273200
12752 4273200 2147924 -643895 -3630816 -3430528 2080553 8165950 7663237 946893
12744 946893 -4263653 -3942184 -2608144 -4730280 -7138893 -4585555 1281899 4104034
12736 4104034 1956846 -949854 -1092921 468952 1277552 641748 -1178857 -3796865 -5751754
12727 -5751754 -5358709 -3413497 -2708902 -3997797 -4810917 -3441796 -1842762 -2949621 -6909736
12718 -6909736 -11672754 -15774359 -18500784 -18423603 -14316234 -7656773 -2352848 -1278418
$$ packed form
12777A513734k879930n248546j536319M199645N997258L028949r54126k706307
12769A414358j972376j78212J158310P53171j782855m595387m276200J62447M561684
12760d755060L565684k076372n223650j347589N131200O800639L020724q42376
12752D273200k125276k791819k986921K00288N511081O085397n02713o716344
12744I46893n210546L21469J334040k122136k408613K553338N867454K822135
12736D104034k147188k906700j43067J561873Q08600o35804j820605k618008j954889
12727e751754L93045J945212P04595j288895q13120J369121J599034j106859l960115
12718f909736m763018m101605k726425P7181M107369O659461N303925J074430
$$ plain form
12710 -1278418 -3907184 -7495646 -9680060 -9838403 -9045486 -9142758 -10899434 -12559680 -11244144
12701 -11244144 -6682175 -2531579 -2449693 -5353288 -6531135 -3699910 130082 896575
12693 896575 -1301022 -3149482 -2988290 -2089593 -1253814 1065723 5918210 10861923 11778859
12684 11778859 7617990 2214379 715685 4126541 7966663 7353245 3236774 1542846
12676 1542846 5155493 9341657 7823014 1362084 -3688735 -4393854 -3813570 -4094412 -2563686
12667 -2563686 2475654 6693756 4984815 -831049 -4148193 -2314036 828214 924024
12659 924024 -1800970 -3922236 -2854219 1091663 5307633 7506498 8323823 10070869
12651 10070869 12247238 11139678 6094256 2864361 6467126 13034681 14278664 9229832
$$ packed form
12710a278418k628766l588462k184414j58343P92917r7272j756676j660246J315536
12701a1244144M561969M150596Q1886k903595j177847K831225L829992P66493
12693H96575k197597j848460J61192Q98697Q35779K319537M852487M943713R16936
12684A1778859m160869n403611j498694L410856L840122o13418m116471j693928
12676A542846L612647M186164j518643o460930n050819p05119N80284k80842J530726
12667b563686N039340M218102j708941n815864l317144J834157L142250R5810
12659I24024k724994k121266J068017L945882M215970K198865Q17325J747046
12651A0070869K176369j107560n045422l229895L602765O567555J243983n048832
$$ plain form
12643 9229832 5466352 7811152 11828903 11236977 6699189 3180903 2068160 658059
12635 658059 -2117918 -3886803 -2766043 49636 2135897 2109779 -346399 -4753442 -9155763
12626 -9155763 -10466402 -6991076 -724562 3727086 3261424 -773009 -4327267 -5072547
12618 -5072547 -3891723 -2179899 31510 2370559 3209399 2450799 2673645 4705741 4758071
12609 4758071 134809 -4447919 -1975059 6115047 10594165 6814699 257313 -2444294
12601 -2444294 -1955944 -2025612 -2099543 714138 5684594 9403452 10417087 8782200 3660460
12592 3660460 -3842384 -7803855 -3391400 5068909 7766763 1880040 -4755557 -4167091
12584 -4167091 1923586 5590632 3111081 -1564604 -2983882 -965215 121645 -2009921
$$ packed form
12643I229832l763480K344800M017751n91926m537788l518286j112743j410101
12635F58059k775977j768885J120760K815679K086261k6118k456178m407043m402321
12626i155763j310639L475326O266514M451648m65662m034433l554258p45280
12618e072547J180824J711824K211409K339049Q38840p58600K22846K032096N2330
12609D758071m623262m582728K472860Q090106M479118l779466o557386k701607
12601b444294M88350o9668p3931K813681M970456L718858J013635j634887n121740
12592C660460p502844l961471M412455Q460309K697854n886723o635597N88466
12584d167091O090677L667046k479551m675685j419278K018667J086860k131566
$$ plain form
12576 -2009921 -3897431 -1218172 3925652 4581453 -1223023 -6673557 -5345945 -318644
12568 -318644 796465 -2657809 -4038448 29476 5077468 6244185 4855704 4709443
12560 4709443 5850989 5674900 3881407 2834722 3743969 4967828 4142148 777383 -3193692
12551 -3193692 -5066952 -4039208 -2266647 -2480188 -4715080 -6420473 -5495066 -1984215
12543 -1984215 2789386 7220292 9763588 9723304 7583528 3832770 -1302714 -5894683
12535 -5894683 -6470891 -2625056 917472 394894 -1090038 1487069 6067670 5792444 98588
12526 98588 -3462506 -306817 4793635 5531360 2436053 -688459 -3460396 -6675959 -7316319
12517 -7316319 -2151663 5378496 7697820 2498596 -4608201 -7074271 -3827994 1393576
$$ packed form
12576b009921j887510K679259N143824O55801n804476n450534J327612N027301
12568c18644J115109l454274j380639M067924N047992J166717j388481j46261
12560D709443J141546j76089j793493j046685R09247J223859q25680l364765l971075
12551c193692j873260J027744J772561k13541k234892j705393R25407L510851
12543a984215M773601M430906K543296m0284k139776l750758n135484m591969
12535e894683n76208L845835L542528n22578j484932K577107M580601k75226n693856
12526I8588l561094L155689N100452P37725l095307l124512k771937l215563o40360
12517g316319N164656P530159K319324n199224p106797k466070L246277N221570
$$ plain form
12509 1393576 4423254 4071386 2818135 3907104 7027575 8532414 6975243 5676044
12501 5676044 7683148 11136999 12591657 12077817 11241199 9257715 5176260 2081813
12493 2081813 3554286 7153497 6914201 2037958 -2153615 -2121205 166019 1955119 3005929
12484 3005929 3088603 1247790 -840703 369799 4255115 5547177 2211324 -1168691
12476 -1168691 -942888 -300687 -3303154 -7414733 -7543738 -4524640 -3485005 -5251377 -5431270
12467 -5431270 -1960280 1987736 3584508 3993619 4757761 4737866 3042149 1686366 2522742
12458 2522742 3927751 3500989 2381426 3712527 7552633 10418009 10129486 8431687
12450 8431687 7796365 7740575 5949860 1789992 -3041524 -6639790 -7865535 -5655604 233126
$$ packed form
12509A393576L029678l51868j253251J088969L120471J504839j557171j299199
12501E676044K007104L453851J454658n13840q36618j983484m081455l094447
12493B081813J472473L599211k39296m876243m191573L2410K287224J789100J050810
12484C005929Q2674j840813k088493J210502L885316J292062l335853l380015
12476a168691K25803O42201l002467m111579j29005L019098J039635j766372j79893
12467e431270L470990L948016J596772M09111P64142j9895j695717j355783Q36376
12458B522742J405009m26762j119563J331101L840106K865376k88523j697799
12450H431687o35322n5790j790715m159868m831516l598266j225745K209931N888730
$$ plain form
12441 233126 7142944 10456622 8374871 4419176 3309815 5340009 6960739 6183571
12433 6183571 4611772 3965703 3558672 2454748 1639490 2106056 2593468 1533514 161508
12424 161508 1289591 5320156 9520437 11195119 9808927 6145307 1559715 -1551228
12416 -1551228 -919735 2569406 4720063 2645568 -1488540 -3104026 -849473 2389273
12408 2389273 3757619 3338465 2352471 903459 -996414 -2023728 -1290594 -431465 -1697153
12399 -1697153 -4438476 -5693661 -4193248 -1670234 -138809 -114996 -1692874 -4615295
12391 -4615295 -6458198 -3819833 2746620 7524503 5923716 261850 -3253118 -1925945
12383 -1925945 1526425 3151050 1064652 -4379643 -10679698 -13836260 -11664541 -6335846
$$ packed form
12441B33126O909818L313678k081751l955695j109361K030194J620730p77168
12433F183571j571799o46069m07031j103924q15258M66566M87412j059954j372006
12424A61508J128083M030565M200281J674682j386192l663620m585592l110943
12416a551228O31493L489141K150657k074495m134108j615486K254553L238746
12408B389273J368346m19154r85994j449012j899873j027314P33134Q59129j265688
12399a697153k741323j255185J500413K523014J531425K3813j577878k922421
12391d615295j842903K638365O566453M777883j600787n661866l514968J327173
12383a925945L452370J624625k086398n444295o300055l156562K171719N328695
$$ plain form
12375 -6335846 -1527482 2033764 5586078 8250732 7762842 4819740 2699218 2458025
12367 2458025 2448049 2626957 4622441 6810854 4753943 -1382908 -5100201 -2441639 2133665
12358 2133665 2718447 429936 -51920 1263129 1007588 -185629 1634875 6039427 7527068
12349 7527068 3790753 -573382 -747603 2010379 3249791 1433404 -1477222 -3492583
12341 -3492583 -4187544 -3920166 -3337710 -3174773 -3479596 -3449192 -2474397 -759769 1155862
12332 1155862 2638191 2823049 1367403 -655853 -1625986 -1019280 619549 2607284 3800091
12323 3800091 2488691 -1314556 -4350122 -3487842 -295054 533982 -2635026 -6602869
12315 -6602869 -8093932 -7246247 -5477959 -2959988 121846 2303076 2804563 2887996 3500432
$$ packed form
12375f335846M808364L561246L552314K664654m87890k943102k120522k41193
12367B458025r976J78908J995484K188413k056911o136851l717293K658562M575304
12358B133665N84782k288511m81856J315049k55541j193217J820504M404552J487641
12349G527068l736315m364135j74221K757982J239412j816387k910626k015361
12341c492583o94961K67378N82456J62937l04823L0404R74795J714628J915631
12332A155862J482329J84858j455646k023256r70133O06706J638829J987735J192807
12323C800091j311400l803247l035566Q62280L192788Q29036l169008l967843
12315f602869j491063Q47685J768288K517971L081834K181230N01487Q3433O12436
$$ plain form
12306 3500432 3331501 1095715 -1727935 -2412840 -327599 2720805 4596974 4212215 2029735
12297 2029735 267210 1070408 3284012 2919070 -1492936 -6030213 -6227154 -3068342 -1177318
12288 -1177318 -2156827 -3139078 -1760502 765238 2177016 1925560 403361 -2066829 -4114256
12279 -4114256 -3426373 121494 2978322 1650596 -2825534 -5906870 -4561115 283582
12271 283582 5706248 9116390 8599268 3472957 -4013468 -9120380 -8787204 -4882508 -1678767
12262 -1678767 -601744 383960 2230728 2600213 -208956 -3493319 -3147461 473378 2610098
12253 2610098 286955 -3907320 -5116253 -1730009 3349565 6097456 5434387 4218384
12245 4218384 5791950 9111175 9008407 3205281 -2988162 -2919083 1481051 1611410 -4825933
$$ packed form
12306C500432j68931k235786k823650o84905K085241L048404J876169l84759k182480
12297B029735j762525Q03198K213604l64942m412006m537277j96941L158812J891024
12288a177318r79509r82251J378576K525740J411778k51456j522199k470190k047427
12279d114256O87883L547867K856828j327726m476130l081336J345755M844697
12271B83582N422666L410142n17122n126311p486425n106912L33176L904696L203741
12262a678767J077023R85704J846768L69485k809169l284363L45858L620839K136720
12253B610098k323143m194275j208933L386244N079574K747891o63069j216003
12245D218384J573566L319225j02768n803126o193443O9079M400134J30359o437343
$$ plain form
12236 -4825933 -9068130 -3558986 6303277 9161734 3436773 -1668691 -524457 1744758
12228 1744758 -753731 -4627740 -2950846 3135701 5601333 1386084 -3365566 -2376568
12220 -2376568 2690058 6277938 7112753 7824605 8477204 5944157 251495 -3458144 -1818782
12211 -1818782 1649152 1812599 -589942 -1267721 -248841 -1588314 -5170341 -5115157 1157118
12202 1157118 7619834 7429443 2117992 -1660341 -1746454 -1592791 -3229062 -4484811 -3374527
12193 -3374527 -881637 1335726 2678177 2692902 1473816 948907 2635132 4500714 3712981
12184 3712981 1934770 3196859 6497362 6127219 617093 -4478545 -5150147 -4430305 -5608357
12175 -5608357 -5599641 -627049 5691802 6527232 1937393 -1474789 -109743 3090015 4481030
$$ packed form
12236d825933m242197N509144R862263K858457n724961n105464J144234K269215
12228A744758k498489l874009J676894O086547K465632m215249m751650R88998
12220b376568N066626L587880Q34815P11852O52599k533047n692662l709639J639362
12211a818782L467934J63447k402541o77779J018880j339473l582027N5184O272275
12202A157118O462716j90391n311451l778333q6113J53663j636271j255749J110284
12193c374527K492890K217363J342451J4725j219086n24909J686225J865582p87733
12184C712981j778211J262089L300503l70143n510126n095638o71602P19842j178052
12175e608357Q716M972592O318851Q35430m589839l412182J365046L199758J391015
$$ plain form
12166 4481030 3876878 2334602 301997 -1162578 -1055388 -903637 -3071318 -6259185 -6429978
12157 -6429978 -2833746 483677 -54270 -3984070 -8699765 -11319611 -8818942 -1088459
12149 -1088459 5472127 2849924 -8020903 -16538685 -14960684 -7064400 -1282357 -12459
12141 -12459 -87918 152650 -275980 -1210394 -1290667 -765651 -833463 -1328277 -1767296 -2779106
12131 -2779106 -3893665 -2709453 630759 1618658 -1872208 -4752134 -1908219 3345967
12123 3345967 4540760 2676836 3653164 7062878 6756330 2498939 1425329 5880997
12115 5880997 8994522 5958118 1389798 796592 2205861 1729902 636539 717873 -1122453
12106 -1122453 -6572167 -9679034 -5037857 1929175 1667270 -5049469 -8273878 -3611477
$$ packed form
12166D481030o04152j542276k032605j464575J07190J51751k167681l187867j70793
12157f429978L596232L317423n37947l929800m715695k619846K500669P730483
12149a088459O560586k622203j0870827q517782J578001P896284N782043J269898
12141a2459p5459K40568m28630r34414q0273N25016o7812m94814m39019j011810
12131b779106j114559J184212L340212R87899l490866k879926K843915N254186
12123C345967J194793j863924R76328L409714l06548m257391j073610M455668
12115E880997L113525l036404m568320n93206J409269m75959j093363Q1334j840326
12106a122453n449714l106867M641177O967032k61905o716739l224409M662401
$$ plain form
12098 -3611477 2790618 4553988 2543874 279890 -1405786 -2590581 -2432869 -1602789
12090 -1602789 -2366418 -4415591 -4559722 -2111016 -585284 -2295842 -4900465 -5134554 -2848772
12081 -2848772 141313 2302423 2351153 -149905 -3300079 -4644039 -4544412 -4666105 -3787154
12072 -3787154 359000 5390627 6091697 2651772 1054982 3615914 5433549 2909842
12064 2909842 -597787 -1453745 -2024071 -5344308 -8761601 -8613245 -7000579 -7852262 -9620160
12055 -9620160 -8086306 -3825225 -704250 958004 3454982 5457470 3288005 -1957592
12047 -1957592 -4639043 -2325275 1769790 4278412 4743419 3243635 173362 -1265183
12039 -1265183 2285445 8212680 9543497 4043148 -2992019 -6348666 -6399913 -5339941
$$ packed form
12098c611477O402095J763370k010114k263984j685676j184795J57712Q30080
12090a602789p63629k049173j44131K448706J525732j710558k604623k34089K285782
12081b848772K990085K161110M8730k501058l150174j343960R9627j21693Q78951
12072c787154M146154N031627P01070l439925j596790K560932J817635k523707
12064B909842l507629q55958n70326l320237l417293J48356J612666q51683j767898
12055i620160J533854M261081L120975J662254K496978K002488k169465n245597
12047a957592k681451K313768M095065K508622M65007j499784l070273j438545
12039a265183L550628N927235J330817n500349p035167l356647n1247J059972
$$ plain form
12031 -5339941 -3227323 -696726 -953339 -5230620 -9582995 -9848883 -7211959 -5563250
12023 -5563250 -5848060 -6508135 -7343365 -8990598 -9795149 -7054763 -1202939 4268241 7167326
12014 7167326 8453514 9584441 10274723 9565201 7580553 5408170 3938129 3270442 2989160
12005 2989160 2895899 3360836 4521952 5280868 4021071 579035 -3278155 -5512185 -5219025
11996 -5219025 -2592851 1213346 4095531 4298548 2192412 -211933 -1530672 -1589359 -39689
11987 -39689 3644389 8438029 11840349 12240221 9772724 4877453 -1711825 -7162060 -7643473
11978 -7643473 -2974591 1868239 1936452 -2125765 -5354106 -4471357 -1165227 265572 -2362576
11969 -2362576 -6617103 -7694268 -3767244 1517814 3257649 1144944 -1190546 -1919245
$$ packed form
12031e339941K112618K530597k56613m277281m352375k65888K636924J648709
12023e563250k84810o60075q35230j647233q04551K740386N851824N471180K899085
12014G167326J286188J130927O90282p09522j984648k172383j470041o67687k81282
12005B989160r3261M64937J161116P58916j259797l442036l857190k234030K93160
11996e219025K626174L806197K882185K03017k106136k404345j318739n8687J549670
11987c9689L684078M793640L402320L99872k467497m895271o589278n450235m81413
11978g643473M668882M842830O8213m062217l228341Q82749L306130J430799k628148
11969b362576m254527j077165L927024N285058J739835k112705k335490p28699
$$ plain form
11961 -1919245 -2587091 -3739706 -3079277 380877 3995615 5632000 6784968 8661732
11953 8661732 8322571 2766213 -5038889 -8533244 -5557316 -468754 1856443 1324046
11945 1324046 1439026 4786346 10157301 13253534 10733140 4358004 -214087 49190
11937 49190 2143899 1942144 132918 129480 1880723 2024927 -72629 -687573 2558485
11928 2558485 6445241 5701318 -489339 -7015321 -7733565 -1652609 5714147 7846453
11920 7846453 4111148 -475477 -2498432 -3806635 -6212962 -6800150 -2883764 1508499
11912 1508499 179721 -5467170 -7636740 -3386216 1724912 2715116 1575909 1682634
11904 1682634 1659873 -807161 -3653579 -4030798 -3839175 -6289361 -9313453 -8007121 -2390710
$$ packed form
11961a919245o67846j152615O60429L460154L614738J636385J152968J876764
11953H661732l39161n556358p805102l494355K975928N088562K325197n32397
11945A324046J14980L347320N370955L096233k520394o375136m572091K63277
11937D9190K094709k01755j809226l438J751243J44204k097556o14944L246058
11928B558485L886756p43923o190657o525982p18244O080956P366756K132306
11920G846453l735305m586625k022955j308203k406327n87188L916386M392263
11912A508499j328778n646891k169570M250524N111128R90204j139207J06725
11904A682634k2761k467034k846418l77219J91623k450186l024092J306332N616411
$$ plain form
11895 -2390710 2621001 4350214 4132269 2244155 -2824575 -8712828 -8891904 -1367396
11887 -1367396 6940320 8598005 4996918 2831318 3971154 4320227 1775512 -407483
11879 -407483 694506 3255005 4181455 3657907 3651431 4247294 4067847 2815749 1175143
11870 1175143 -613522 -2243599 -2831612 -2810996 -4590309 -8833693 -11774670 -9499013 -3837447
11861 -3837447 -411307 -1319206 -3477465 -4030442 -3260110 -1691337 1172922 3816857 2782277
11852 2782277 -2034842 -6099639 -6730815 -6885138 -9343929 -11175417 -8319083 -2513384
11844 -2513384 1208331 1651207 1242187 692440 -824788 -1651140 364147 2471703 -243800
11835 -243800 -6387211 -8801429 -5149208 -1855812 -4539425 -9733318 -10226764 -4978110
$$ packed form
11895b390710N011711J729213k17945j888114n068730n888253j79076P524508
11887a367396Q307716J657685l601087k165600J139836L49073k544715k182995
11879d07483J101989K560499R26450n23548o476N95863j79447j252098j640606
11870A175143j788665j630077n88013K0616j779313m243384k940977K275657N661566
11861c837447L426140r07899k158259n52977P70332J568773K864259K643935j034580
11852B782277m817119m064797o31176j54323k458791j831488K856334N805699
11844b513384L721715M42876m09020n49747j517228q26352K015287K107556k715503
11835b43800o143411k414218L652221L293396k683613n193893m93446N248654
$$ plain form
11827 -4978110 590365 1987315 -387110 -3351111 -4012465 -1558863 1832767 2609635
11819 2609635 -193203 -3631601 -4493973 -2810452 -872583 -548512 -2385632 -5310604
11811 -5310604 -6468945 -3763999 772005 2998339 2584653 3100839 5300473 5355928 2078899
11802 2078899 314073 3023442 5185781 1290357 -5298659 -7294761 -4786669 -3913814
11794 -3913814 -5845078 -5358445 -696966 3253086 3578448 3810860 6714379 9152710 8240393
11785 8240393 7004683 8949452 11357382 9510719 4637451 2163505 3676202 5624174
11777 5624174 5332822 3972706 3498072 3944682 3890001 1355554 -4847573 -12215028 -14658285
11768 -14658285 -9216453 -1583816 -524811 -6789412 -12058489 -9822251 -2977385 1250778
$$ packed form
11827d978110N568475J396950k374425k964001o61354K453602L391630P76868
11819B609635k802838l438398q62372J683521J937869L24071j837120k924972
11811e310604j158341K704946M536004K226334m13686N16186K199634N5455l277029
11802B078899j764826K709369K162339l895424o589016j996102K508092Q72855
11794c913814j931264M86633M661479L950052L25362K32412K903519K438331r12317
11785H240393j235710J944769K407930j846663m873268k473946J512697J947972
11777E624174k91352j360116m74634M46610n4681k534447o203127p367455k443257
11768a4658285N441832P632637J059005o264601n269077K236238O844866M228163
$$ plain form
11760 1250778 77288 -3816583 -6866692 -6923022 -3134799 2836383 6519425 4943128
11752 4943128 1039885 751301 5393061 9586718 7770861 686364 -5951903 -7803528
11744 -7803528 -5448764 -2402797 -1164562 -1520873 -2045114 -2428262 -3450903 -4477376 -2573850
11735 -2573850 3932001 11655719 14635188 11230074 5963346 3192225 1783143 -1327992
11727 -1327992 -4808404 -4426135 -53683 3540799 3793086 3830112 6632369 9559931 8308529
11718 8308529 3810210 980432 1658064 2873953 2130919 666802 580973 1719444 2698831
11709 2698831 2871434 2313731 1732965 2806373 6251449 9146001 7244383 1014525 -4068939
11700 -4068939 -5044123 -5439246 -8645341 -11122410 -7332519 674513 4629087 1040761
$$ packed form
11760A250778j173490l893871l050109n6330L788223N971182L683042j576297
11752D943128l903243k88584M641760M193657j815857p084497o638267j851625
11744g803528K354764L045967J238235l56311n24241l83148j022641j026473J903526
11735b573850O505851P723718K979469l405114n266728k771121j409082l111135
11727a327992l480412L82269M372452L594482K52287L7026K802257K927562j251402
11718H308529m498319k829778O77632J215889p43034j464117q5829J138471R79387
11709B698831J72603n57703n80766J073408L445076K894552j901618o229858n083464
11700d068939r75184l95123l206095k477069L789891Q007032L954574l588326
$$ plain form
11692 1040761 -4648066 -6187594 -3893375 -1676553 -1074009 -1487643 -2985585 -4964280
11684 -4964280 -4269761 1194268 8032881 10343266 6820985 1580206 -1869230 -3811052
11676 -3811052 -5022442 -4192149 -646645 3083398 3913949 1929221 -483460 -1835752
11668 -1835752 -1946675 -548916 2101237 4164515 4430021 4991136 8571649 13156767 13078734
11659 13078734 6827374 558 -2274431 -2400351 -5427899 -9596454 -7928139 692494
11651 692494 8372069 8442772 3445035 -490690 -2085545 -2762328 -629314 6186866 12528274
11642 12528274 10597380 1466277 -5381988 -5344521 -3913696 -5901532 -7358800 -3412540
11634 -3412540 2533439 4374609 3286811 4552539 7741827 8142745 6103131 6496587
$$ packed form
11692A040761n688827j539528K294219K216822O02544m13634j497942j978695
11684d964280O94519N464029O838613K310385l522281n240779l449436j941822
11676c811052j211390Q30293L545504L730043Q30551j984728k412681j352292
11668a835752j10923J397759K650153K063278K65506N61115L580513M585118p8033
11659A3078734o251360o826816k274989j25920l027548m168555J668315Q620633
11651F92494P679575P0703m997737l935725j594855o76783K133014O816180O341408
11642A2528274j930894r131103o848265L7467J430825j987836j457268L946260
11634c412540N945979J841170j087798J265728L189288M00918k039614L93456
$$ plain form
11626 6496587 9152355 8246295 2540508 -1790250 -1238153 -419782 -3408340 -6158657 -3058301
11617 -3058301 3738387 7432379 6008606 3151268 1883403 2336488 4353386 7432837
11609 7432837 8823921 6149715 1773950 619047 3507013 6241191 5686527 3389424
11601 3389424 2241283 2376845 1780703 -824014 -4817113 -8293967 -9241125 -6983845 -2790104
11592 -2790104 1441226 4791180 7142636 8271642 8033607 6648622 4009599 -147934
11584 -147934 -4511984 -6253200 -4303433 -1170412 102898 -595740 -1631356 -2634769
11576 -2634769 -4217267 -5951543 -6812095 -6765481 -6289448 -5486759 -4992446 -5781354 -6388005
11567 -6388005 -2978197 5126770 12531444 13749015 10039731 6807189 6330477 7053155
$$ packed form
11626F496587K655768r06060n705787m330758N52097Q18371k988558k750317L100356
11617c058301O796688L693992j423773k857338j267865M53085K016898L079451
11609G432837J391084k674206m375765j154903K887966K734178n54664k297103
11601C389424j148141J35562n96142k604717l993099l476854r47158K257280M193741
11592b790104M231330L349954K351456J129006k38035j384985k639023m157533
11584a47934m364050j741216J949767L133021J273310o98638j035616j003413
11576b634769j582498j734276q60552M6614M76033Q02689M94313p88908o06651
11567f388005L409808Q104967P404674J217571l709284l232542m76712P22678
$$ plain form
11559 7053155 7942022 8727689 7343422 2387468 -2664980 -2950031 549333 2574284 2068109
11550 2068109 3164390 7193879 9767184 7437729 2053230 -3076182 -6363267 -6104377
11542 -6104377 -1069212 5375830 7542124 5857549 6806840 11886525 13754950 7758526
11534 7758526 394550 38097 4769265 6737879 4693760 4226136 7419438 9869273
11526 9869273 8132615 4198224 1612165 1243801 1447766 -301969 -5338091 -11062661
11518 -11062661 -12163612 -7313963 -2062210 -1725471 -4582108 -6240938 -6977817 -9028273
11510 -9028273 -10055615 -6571667 -1662771 -1373327 -4414673 -3802953 1177492 3403631
11502 3403631 -155300 -3631903 -2451618 -125746 -382000 75606 5007628 10731512
$$ packed form
11559G053155Q88867P85667j384267m955954n052448k85051L499364K024951n06175
11550B068109J096281M029489K573305k329455n384499n129412l287085K58890
11542f104377N035165O445042K166294j684575R49291N079685J868425n996424
11534G758526p363976l56453M731168J968614k044119m67624L193302K449835
11526I869273j736658l934391k586059l68364K03965j749735n036122n724570
11518a1062661j100951M849649N251753L36739k856637j658830p36879k050456
11510i028273j027342L483948M908896K89444l041346O11720M980445K226139
11502C403631l558931l476603J180285K325872k56254M57606M932022N723884
$$ plain form
11494 10731512 11504560 8731298 8093725 10118727 10008999 5632245 125965 -3141001
11486 -3141001 -3911958 -3656595 -4208727 -6966906 -10430208 -10083746 -4244711 1812162 1948466
11477 1948466 -2053564 -2937030 1381339 5314284 4545492 1797055 1321671 2491356 2413038
11468 2413038 1369924 1482175 2043588 404348 -3256352 -5764568 -5641711 -4757206 -4684117
11459 -4684117 -4356154 -2725534 -1279545 -1751726 -2896066 -2058391 657688 2278212 1131111
11450 1131111 -1146339 -2387945 -2523283 -2290384 -1357079 462814 1614859 576247 -1635853
11441 -1635853 -2722017 -2180560 -1202348 -285984 774743 1198112 172571 -832555 367926
11432 367926 2790109 3096639 673043 -1466696 -1606630 -1441716 -1843082 -577861 3097903
$$ packed form
11494A0731512P73048k773262o37573K025002j09728m376754n506280l266966
11486c141001p70957K55363n52132k758179l463302L46462N839035O056873J36304
11477A948466m002030q83466M318369L932945p68792k748437m75384J169685p8318
11468B413038j043114J12251N61413j639240l660700k508216J22857Q84505P3089
11459d684117L27963J630620J445989m72181j144340Q37675K716079J620524j147101
11450A131111k277450j241606j35338K32899R33305J819893J152045j038612k212100
11441a635853j086164N41457R78212R16364J060727M23369j025541j005126J200481
11432C67926K422183L06530k423596k139739j39934J64914m01366J265221L675764
$$ plain form
11423 3097903 5266238 2502181 -2507811 -4627031 -3605698 -3319520 -4815177 -4888939 -1816446
11414 -1816446 1675711 2232427 -388182 -4220826 -7067569 -7018072 -3781974 -202156 244193
11405 244193 -1859851 -2443239 84992 2593115 2156990 -29460 -1514409 -2269243 -3081098
11396 -3081098 -2992035 -1303240 -43656 -1292548 -3552916 -3862640 -2272706 -1101710 -809346
11387 -809346 -32255 952890 508154 -696499 -64485 2309678 3077817 814934 -1822906
11378 -1822906 -2835642 -4214478 -7773405 -10586061 -8405260 -2227036 2340779 2081140
11370 2081140 -643247 -2082079 -1578063 -656080 113112 1319961 2655116 2572238 445905
11361 445905 -1957481 -2142388 68212 2170965 2243703 1459708 1905571 2843654 1759416
$$ packed form
11423C097903K168335k764057n009992k119220J021333K86178j495657p3762L072493
11414a816446L492157N56716k620609l832644k846743M9497L236098L579818M46349
11405B44193k104044n83388K528231K508123m36125k186450j484949p54834q11855
11396c081098Q9063J688795J259584j248892k260368l09724J589934J170996K92364
11387h09346P77091R85145m44736j204653O32014K374163P68139k262883k637840
11378a822906j012736j378836l558927k812656K180801O178224M567815k59639
11370B081140k724387j438832N04016R21983P69192J206849J335155q2878k126333
11361D45905k403386j84907K210600K102753P2738p83995M45863R38083j084238
$$ plain form
11352 1759416 -804694 -721578 3833599 8822205 9251041 5508671 1752472 -309341 -2183845
11343 -2183845 -3886247 -2805420 1815201 6715163 8470740 6997840 3880371 -276220
11335 -276220 -4920994 -7931015 -7295344 -3844863 -731346 -234154 -1619155 -1895504 1180936
11326 1180936 6206579 8927296 7246508 4282406 4023334 5128192 3009875 -2066847
11318 -2066847 -4115242 -541152 2836589 -330884 -7693656 -11580669 -9376854 -5548613
11310 -5548613 -4225724 -4619469 -4227663 -2524622 -306544 1612908 1968515 -153027 -3093218
11301 -3093218 -3611143 -1275154 319536 -1757270 -5611016 -6902249 -4386658 -1190277
11293 -1190277 -650101 -2395520 -3335469 -1891686 26729 -153229 -1985575 -2900517 -2504213
$$ packed form
11352A759416k564110Q3116M555177M988606M28836l742370l756199k061813j874504
11343b183845j702402J080827M620621M899962J755577j472900l117469m156591
11335b76220m644774l010021O35671L450481L113517M97192j385001k76349L076440
11326A180936N025643K720717j680788k964102k59072J104858k118317n076722
11318b066847k048395L574090L377741l167473p362772l887013K203815L828241
11310e548613J322889l93745L91806J703041K218078J919452L55607k121542k940191
11301c093218n17925K335989J594690k076806l853746j291233K515591L196381
11293a190277N40176j745419r39949J443783J918415j79958j832346r14942L96304
$$ plain form
11284 -2504213 -3483193 -7113210 -10109076 -8145587 -1347370 5877310 9847952 10520673
11276 10520673 9822034 9104400 8556524 7802732 6504524 4596861 1873169 -2174884 -6863104
11267 -6863104 -9130392 -6319933 -524076 2775400 1448572 -1074115 -1678617 -1615577 -2226223
11258 -2226223 -1213109 2634384 5156955 2870419 -28438 2592775 8310944 9021477
11250 9021477 3409140 -1607744 -2414606 -3102633 -6056731 -6751411 -2449573 1432444 -191311
11241 -191311 -3231354 -1313420 2843042 1132381 -6889493 -12797412 -11325768 -6433627
11233 -6433627 -3634518 -2424391 401373 4374318 6541153 6802633 8010111 10979866
11225 10979866 12451529 9108399 2200270 -3110192 -2842268 1979176 6534338 6661578
$$ packed form
11284b504213r78980l630017k995866J963489O798217P224680L970642O72721
11276A0520673o98639p17634n47876p53792j298208j907663k723692m048053m688220
11267f863104k267288K810459N795857L299476j326828k522687o04502O3040o10646
11258b226223J013114L847493K522571k286536k898857K621213N718169P10533
11250I021477n612337n016884q06862o88027k954098o94680M301838L882017j623755
11241a91311l040043J917934M156462j710661q021874n907919J471644M892141
11233f433627K799109J210127K825764L972945K166835K61480J207478K969755
11225A0979866J471663l343130o908129n310462K67924M821444M555162J27240
$$ plain form
11217 6661578 2082412 -3882403 -7156261 -6136577 -2925665 -935848 -832791 45932
11209 45932 3402281 6781907 6591225 3099171 59723 36724 2368999 5025997 5987028
11200 5987028 3577275 -1659497 -6010830 -6518149 -5090162 -5313085 -6286478 -4248894 269027
11191 269027 2634261 2011968 2828230 6433189 7707344 3483045 -1488118 -1765187 427987
11182 427987 -298889 -3399498 -4097320 -1905137 -941158 -2404118 -2775865 -334215 1544966
11173 1544966 -495616 -4752053 -6734590 -4790047 -1731617 -1267519 -3686134 -5644165
11165 -5644165 -4471776 -1514636 348593 1052544 2103368 2211722 -1000072 -4955113
11157 -4955113 -3703369 2901482 7723830 6686868 4217382 4597091 4639684 557776 -4131968
$$ packed form
11217F661578m579166n964815l273858J019684L210912J989817J03057Q78723
11209D5932L356349L379626j90682l492054l039448k2999K332275K656998R61031
11200E987028k409753n236772m351333n07319J427987k22923r73393K037584M517921
11191B69027K365234o22293Q16262L604959J274155m224299m971163k77069K193174
11182D27987p26876l100609o97822K192183R63979j462960l71747K441650J879181
11173A544966k040582m256437j982537J944543L058430M64098k418615j958031
11165e644165J172389K957140J863229P03951J050824J08354l211794l955041
11157d955113J251744O604851M822348j036962k469486L79709M2593m081908m689744
$$ plain form
11148 -4131968 -4652301 -3628525 -5589253 -7139516 -1917472 7302384 11165591 7478215
11140 7478215 3193412 2675891 2962651 1664448 897422 1327874 101042 -2897911 -3736220
11131 -3736220 -1605265 -492438 -1609212 -1221934 1585084 2325942 -722030 -3084802
11123 -3084802 -2283543 -2041493 -4233486 -4314167 -6827 2959326 328242 -2365325 1165715
11114 1165715 6312887 4037620 -4670019 -9967344 -7083505 -776322 3377965 4453632
11106 4453632 2845403 -1378194 -5616441 -6036137 -3072998 -1064744 -1774665 -2703903 -2130395
11097 -2130395 -1186942 -499543 599654 1017344 -1113269 -3677765 -2036953 3260172 5498385
11088 5498385 1139684 -4557714 -4791773 -368651 2518665 1180694 -1244701 -1369538
$$ packed form
11148d131968n20333J023776j960728j550263N222044R219856L863207l687376
11140G478215m284803n17521K86760j298203p67026M30452j226832k998953q38309
11131c736220K130955J112827j116774L87278K807018P40858l047972k362772
11123c084802Q01259K42050k191993q0681M307340K966153k631084k693567L531040
11114A165715N147172k275267q707639n297325K883839O307183M154287J075667
11106D453632j608229m223597m238247m19696K963139K008254p09921r29238N73508
11097b130395R43453O87399J099197M17690k130613k564496J640812N297125K238213
11088E498385m358701n697398k34059M423122K887316j337971k425395j24837
$$ plain form
11080 -1369538 405385 1734715 1505469 281586 -1029367 -2203486 -3667435 -5292555
11072 -5292555 -5275840 -1527930 4948676 9475872 8409413 3901516 1734973 4034408
11064 4034408 6505689 4595546 405053 115169 4796685 7966852 4483795 -1636271
11056 -1636271 -2401180 3132320 8181514 8319967 6561015 6726725 7272539 5396877 2982449
11047 2982449 3463579 5369258 4238213 -204239 -3790367 -4579363 -4926854 -6146688 -5732656
11038 -5732656 -2035060 1824529 1794579 -1138167 -1897411 1824003 5882831 4177809 -3755237
11029 -3755237 -11359482 -12392965 -8267656 -5438619 -6072155 -5585240 -964996 3192609
11021 3192609 1029354 -5457408 -8881966 -6484191 -2388248 -417258 -45263 -51566 -1022698
$$ packed form
11080a369538J774923J329330k29246j223883j310953j174119j463949j625120
11072e292555J6715L747910O476606M527196j066459m507897k166543K299435
11064D034408K471281j910143m190493k89884M681516L170167l483057o120066
11056a636271p64909N533500N049194J38453j758952J65710N45814j875662k414428
11047B982449M81130J905679j131045m442452l586128p88996l47491j219834M14032
11038e732656L697596L859589k9950k932746p59244L721414M058828j705022p933046
11029c755237p604245j033483M125309K829037o33536M86915M620244M157605
11021C192609k163255o486762l424558K397775M095943J970990L71995o303r71132
$$ plain form
11012 -1022698 -2577049 -2481241 -596512 -8845 -2132573 -4121020 -3452368 -1908467 -2361471
11003 -2361471 -4293163 -5162234 -3856084 -242581 6170935 13990241 18464109 15960378
10995 15960378 8929470 3244101 1350881 1039242 225981 -592076 -862316 -1611608 -3343107
10986 -3343107 -4608488 -4001926 -1993615 272938 2504965 4317307 4107510 845424
10978 845424 -3252542 -3794639 990475 7455403 9911818 6706406 1626550 -959288
10970 -959288 -662876 208498 591046 1001844 993945 -729640 -3529821 -4984914 -4662080
10961 -4662080 -5187799 -8193091 -11361399 -11310595 -7913449 -4059509 -2238865 -2788839 -4455471
10952 -4455471 -5307611 -4006729 -1351122 325204 131511 -262140 688269 2305501 3442330
$$ packed form
11012a022698j554351R5808J884729N87667k123728j988447O68652J543901m53004
11003b361471j931692q69071J306150L613503O413516P819306M473868k503731
10995A5960378p030908n685369j893220l11639q13261q18057k70240p49292j731499
10986c343107j265381O06562K008311K266553K232027J812342k09797l262086
10978H45424m097966n42097M785114O464928K456415l205412n079856k585838
10970i59288K96412Q71374L82548M10798p899j723585k800181j455093L22834
10961d662080n25719l005292l168308N0804L397146L853940J820644n49974j666632
10952d455471q52140J300882K655607J676326j93693l93651R50409J617232J136829
$$ plain form
10943 3442330 4341004 5066887 4147185 1125556 -1252782 -214531 2935338 4862186 5343438
10934 5343438 6878288 9541088 10207026 7833960 5816284 6846640 8098582 4700878
10926 4700878 -2861615 -7899290 -5129900 2434981 6043240 804606 -8781972 -14204378
10918 -14204378 -12705421 -9103146 -7972724 -7763475 -4853674 -233157 1809219 120228
10910 120228 -2503721 -4613969 -7770838 -11893320 -13104687 -8781704 -2093689 1361820
10902 1361820 96295 -2497536 -3040422 -1484437 329861 1296893 1334405 201254 -2538493
10893 -2538493 -6038674 -7608081 -5098500 -223937 1995524 -1435470 -7387453 -9424678
10885 -9424678 -4663762 3365680 8643547 8388656 4892266 2470600 2725818 2968397 276028
$$ packed form
10943C442330Q98674P25883r19702l021629k378338J038251L149869J926848M81252
10934E343438J534850K662800O65938k373066k017676J030356J251942l397704
10926D700878p562493n037675K769390P564881L608259n238634r586578n422406
10918a4204378J498957L602275J130422K09249K909801M620517K042376j688991
10910A20228k623949k110248l156869m122482j211367M322983O688015L455509
10902A361820j265525k593831n42886J555985J814298R67032L7512j133151k739747
10893b538493l500181j569407K509581M874563K219461l430994n951983k037225
10885i424678M760916Q029442N277867k54891l496390k421666K55218K42579k692369
$$ plain form
10876 276028 -3351123 -2725099 2692247 6450220 3675608 -1349740 -952097 4755459 8370571
10867 8370571 6305248 3002824 2884517 4272505 4204738 4013600 5906276 7709334 5731033
10858 5731033 919773 -2011389 -864802 1837993 2697702 1136473 -816415 -1008393
10850 -1008393 768118 2936813 4506318 6179766 7751429 6462639 1389254 -2343050
10842 -2343050 830414 7574430 8602945 2143785 -2887203 -210117 4812372 4601843
10834 4601843 920619 -124897 686137 -2011359 -7599708 -9725692 -6199490 -1339528
10826 -1339528 1289337 2015069 1217271 -1297380 -2975367 -618011 3923063 5909574
10818 5909574 5519939 7082017 10185992 8923162 2000233 -3459324 -1858278 2844100
$$ packed form
10876B76028l627151O26024N417346L757973k774612n025348L97643N707556L615112
10867H370571k065323l302424j18307J387988o7767j91138J892676J803058j978301
10858E731033m811260k931162J146587K702795Q59709j561229j952888j91978
10850a008393J776511K168695J569505J673448J571663j288790n073385l732304
10842b343050L173464O744016J028515o459160n030988K677086N022489k10529
10834D601843l681224j045516Q11034k697496n588349k125984L526202M859962
10826a339528K628865P25732p97798k514651j677987K357356M541074J986511
10818E909574l89635J562078L103975j262830o922929n459557J601046M702378
$$ plain form
10810 2844100 3413197 -572558 -3457166 -1674490 2884502 6385112 6927762 5250131
10802 5250131 3016627 433798 -3785776 -8943624 -10768079 -6542302 -400499 873151
10794 873151 -3205890 -6769960 -6375616 -4556840 -3820175 -2582333 719175 3929655 4300902
10785 4300902 2334192 568482 777052 3137787 5916059 6219590 3654655 1805542
10777 1805542 2614298 1997038 -3411896 -8096192 -4364238 4239758 5911820 -2341075
10769 -2341075 -10472808 -10444114 -5771890 -2763262 -1894488 -2317650 -5507183 -9108272 -6341163
10760 -6341163 2472741 6963803 1933422 -4107641 -3548052 -2509491 -8319137 -13577438
10752 -13577438 -6709915 7629833 13613986 6977753 -1439595 -4144196 -5153849 -7974927
$$ packed form
10810B844100N69097l985755k884608J782676M558992L500610N42650j677631
10802E250131k233504k582829m219574n157848j824455M225777O141803J273650
10794H73151m079041l564070L94344J818776P36665J237842L301508L210480L71247
10785D300902j966710j765710K08570K360735K778272L03531k564935j849113
10777A805542Q08756o17260n408934m684296L731954Q603996J672062q252895
10769b341075q131733K8694M672224L008628Q68774m23162l189533l601089K767109
10760f341163Q813904M491062n030381o041063N59589J038561n809646n258301
10752a3577438O867523J4339748N984153o636233q417348k704601j009653k821078
$$ plain form
10744 -7974927 -8082853 -1892216 6124913 9999666 9363742 6699468 3185188 -144894
10736 -144894 -1928046 -2862726 -4520437 -5708005 -4551227 -3113078 -4144748 -4565356 630696
10727 630696 8554000 10513913 4524601 -2231539 -4674447 -5363775 -6549623 -5118618
10719 -5118618 308627 4251013 1689215 -4249323 -6759180 -4122632 -52413 1990792
10711 1990792 1389318 -791849 -2864125 -3417931 -2335561 -68451 3431766 7113079
10703 7113079 7730379 3810137 -575079 -174059 4187737 7093360 6340277 4329883 2304345
10694 2304345 -1260075 -6078104 -8894451 -7918742 -4738233 -1663526 -394868 -2268269
10686 -2268269 -6158288 -7859184 -5544596 -3253914 -4368701 -5390627 -2366296 733807
$$ packed form
10744g974927j07926O190637Q017129L874753o35924k664274l514280l330082
10736a44894j783152r34680j657711j187568J156778J438149j031670m20608N196052
10727F30696P923304J959913n989312o756140k442908o89328j185848J431005
10719e118618N427245L942386k561798n938538k509857K636548M070219K043205
10711A990792o01474k181167k072276n53806J082370K267110L500217L681313
10703G113079O17300l920242m385216M01020M361796K905623p53083k010394k025538
10694B304345l564420m818029k816347R75709L180509L074707J268658j873401
10686b268269l890019j700896K314588K290682j114787j021926L024331L100103
$$ plain form
10678 733807 -1861193 -6998042 -7562849 -5056585 -6220133 -9293327 -6250290 1618794
10670 1618794 3856775 -1684757 -5056710 -1499506 762493 -4474608 -10962066 -11649955
10662 -11649955 -9918723 -11364789 -13760385 -13087416 -11264276 -10328426 -6933854 -183022
10654 -183022 3028937 -1425508 -6500355 -4592333 466520 965218 -1645256 -996584 2159085
10645 2159085 2149688 -1056516 -2835814 -2742661 -3844614 -5491042 -4685791 -2829442 -3670846
10636 -3670846 -5929983 -4763005 312480 4730593 5293609 2659042 -1257231 -4441411
10628 -4441411 -5082068 -3784895 -3026151 -2341919 1623780 7912224 9971214 5139516 -967874
10619 -967874 -3824691 -6559645 -11602031 -13440692 -7417397 682868 2364190 -1358595
$$ packed form
10678G33807k595000n136849n64807K506264j163548l073194L043037P869084
10670A618794K237981n541532l371953L557204K261999n237101o487458o87889
10662a1649955J731232j446066k395596O72969J823140R35850L394572O750832
10654a83022L211959m454445n074847J908022N058853M98698k610474O48672L155669
10645B159085r397l206204j779298R3153j101953j646428Q05251J856349q41404
10636c670846k259137J166978N075485M418113N63016k634567l916273l184180
10628d441411o40657J297173P58744O84232L965699O288444K058990m831698o107390
10619i67874k856817k734954n042386j838661O023295Q100265J681322l722785
$$ plain form
10611 -1358595 -3764355 -3602983 -3771297 -3201385 540087 3663033 417130 -6975030 -10949848
10602 -10949848 -9525462 -7013136 -5688956 -4355704 -3628378 -5128477 -6337275 -3085692
10594 -3085692 3377440 7475901 6471799 1815610 -4510251 -10105762 -11285179 -7234222
10586 -7234222 -2492480 -946071 -931602 -460090 -2009425 -6567747 -8662306 -4347955 973616
10577 973616 244209 -4409699 -6233632 -4761509 -4104353 -4332050 -2745495 -476981 -347922
10568 -347922 -1365654 -1863622 -3933019 -8415935 -10777684 -8618986 -7064009 -9537292
10560 -9537292 -10662688 -6763622 -5024858 -11671488 -19110487 -17099267 -9640580 -7517466
10552 -7517466 -10161649 -9028258 -4084759 -2535053 -4709128 -4994785 -3695410 -4918701
$$ packed form
10611a358595k405760J61372j68314N69912L741472L122946l245903p392160l974818
10602a0949848J424386K512326J324180J333252P27326j500099j208798L251583
10594c085692O463132M098461j004102m656189o325861n595511j179417M050957
10586g234222M741742J546409J4469M71512j549335m558322k094559M314351N321571
10577I73616p29407m653908j823933J472123O57156k27697J586555K268514J29059
10568c47922j017732m97968k069397m482916k361749K158698J554977k473283
10560i537292j125396L899066J738764o646630p438999K011220P458687K123114
10552g517466k644183J133391M943499J549706k174075k85657J299375j223291
$$ plain form
10544 -4918701 -6241971 -3467157 -1357545 -5962350 -11076654 -7326626 -20440 -1436824
10536 -1436824 -9106022 -9474725 -1085396 3798905 79327 -4897719 -6939826 -9231248
10528 -9231248 -10662801 -6139709 924316 1729107 -2572928 -3663776 -2397186 -6125224
10520 -6125224 -12040145 -10953545 -5841865 -8126053 -17048662 -21632031 -21172030 -23952074
10512 -23952074 -27999090 -24439991 -17617219 -19255241 -25137619 -21652136 -12585050 -13209153
10504 -13209153 -20858101 -20102003 -14003747 -18512693 -28941878 -27463698 -20919295 -30903031
10496 -30903031 -48856384 -47912921 -38067802 -53373322 -82399761 -81944286 -72416307 -130852688
10488 -130852688 -247474512 -281381276 -138410055 75385963 174797511 126572412 56882960
$$ packed form
10544d918701j323270K774814K109612m604805n114304L750028P306186j416384
10536a436824p669198l68703Q389329M884301l719578m977046k042107k291422
10528i231248j431553M523092P064025Q04791m302035j090848J266590l728038
10520f125224n914921J086600N111680k284188q922609m583369M60001k780044
10512b3952074m047016L559099O822772j638022n882378L485483R067086o24103
10504a3209153p648948P56098O098256m508946j0429185J478180O544403r983736
10496c0903031j7953353R43463R845119j5305520k9026439M55475R527979n8436381
10488a30852688j16621824l3906764J42971221K13796018R9411548m8225099o9689452
$$ plain form
10481 56882960 53196873 73190757 59031981 32662027 34582032 48817723 42608676
10474 42608676 26721389 27054862 35248550 30588371 20754185 22962960 29205302 23559346
10466 23559346 13139129 12321283 15087794 9917290 4613650 10965918 20643568 20101647
10458 20101647 14675563 15507808 16961174 9280694 400177 2927162 11003808 11576674
10450 11576674 8218512 12527002 20876526 20815446 13725104 11222693 14282333 14343213 10910108
10441 10910108 10825939 13310598 11635908 7232357 7607912 12046586 12415723 6811867 1041671
10432 1041671 -1930247 -3963110 -5024485 -3429829 -857627 223733 1359945 4290201
10424 4290201 6532733 6303106 6354367 7759971 6906053 3949498 5444611 12208671 14666398
$$ packed form
10481E6882960l686087J9993884j4158776k6369954J920005J4235691o209047
10474D2608676j5887287L33473Q193688m660179r834186K208775O242342n645956
10466B3559346j0420217q17846K766511n170504n303640O352268R677650n41921
10458B0101647n426084Q32245J453366p680480q880517K526985Q076646N72866
10450A1576674l358162M308490Q349524o1080p090342k502411L059640O0880l433105
10441A0910108q4169K484659j674690m403551L75555M438674L69137n603856n770196
10432A041671k971918k032863j061375J594656K572202J081360J136212K930256
10424D290201K242532k29627N1261J405604q53918k956555J495113O764060K457727
$$ plain form
10415 14666398 8157175 2147923 4697974 8773925 5455329 78328 1800938 6581752
10407 6581752 5456112 1833152 4627837 10369639 8795794 2119133 1933491 8922409
10399 8922409 11976181 7562515 4684951 8687877 13675715 14002091 11768503 9773717
10391 9773717 6938352 3753074 3789161 7129063 9228741 7795363 4763211 1631561
10383 1631561 -832946 357357 6390036 11453183 9665709 5299672 6889233 12680495
10375 12680495 12517776 4242425 -2832896 -2738859 -619376 -2143367 -4588817 -3541408
10367 -3541408 -958114 -814284 -1998548 -954249 1979337 3364603 1937474 -48618
10359 -48618 123007 2773462 5554716 6026177 4951072 5492913 8184986 9534420 7525102
$$ packed form
10415A4666398o509223o009252K550051M075951l318596n377001J722610M780814
10407F581752j125640l622960K794685N741802j573845o676661j85642O988918
10399H922409L053772m413666k877564M002926M987838L26376k233588j994786
10391I773717k835365l185278L6087L339902K099678j433378l032152l131650
10383A631561k464507J190303O032679N063147j787474m366037J589561N791262
10375A2680495j62719q275351p075321R4037K119483j523991k445450J047409
10367c541408K583294J43830j184264J044299K933586J385266j427129j986092
10359d8618J71625K650455K781254M71461j075105N41841K692073J349434k009318
$$ plain form
10350 7525102 4898622 4124339 3273378 760225 -349651 2119069 4024827 1289671
10342 1289671 -2203188 -336559 4670829 5375072 979494 -1926127 95054 3540191
10334 3540191 4955445 5029015 4982312 4510366 4070443 4833197 6395260 7985814 10225914
10325 10225914 12043720 9339229 1927278 -2396084 2125847 8871159 7176172 -1703862
10317 -1703862 -6665660 -3443857 1016748 1129471 -533249 -769344 -652419 -85841 4079179
10308 4079179 10976914 14104284 10425815 4857623 2442995 1922811 166084 -2559578
10300 -2559578 -4798498 -6393135 -6215393 -2315567 3515467 6428729 5723910 5931044 8672378
10291 8672378 9469858 5508243 615106 -1212625 -1897000 -4610358 -7474097 -6553384 -2128868
$$ packed form
10350G525102k626480p74283q50961k513153j109876K468720J905758k735156
10342A289671l492859J866629N007388P04243m395578k905621K021181L445137
10334C540191J415254P3570m6703m71946m39923P62754J562063J590554K240100
10325A0225914J817806k704491p411951m323362M521931O745312j694987q880034
10317a703862m961798L221803M460605J12723j662720k36095J16925N66578M165020
10308D079179O897735L127370l678469n568192k414628n20184j756727k725662
10300b559578k238920j594637J77742L899826N831034K913262p04819K07134K741334
10291H672378P97480l961615m893137j827731o84375k713358k863739R20713M424516
$$ plain form
10282 -2128868 1965610 3191101 1797100 -458050 -1281523 208715 1654893 471452
10274 471452 -1294115 538189 4751069 5505583 1920656 269020 3822088 7247766
10266 7247766 5552214 2350802 3184800 5637441 3517191 -2105241 -3960269 -121241
10258 -121241 2772354 -580341 -6674308 -8534943 -4769848 161425 2790620 4078066
10250 4078066 5835300 6839574 4859070 1296102 555588 3971274 7251902 5997549
10242 5997549 1422078 -2045980 -2750897 -2057907 -425503 2540087 4997214 4376586 2040414
10233 2040414 2180818 5555025 8322771 7828593 5582650 3564421 1598875 -199508
10225 -199508 -255207 1311060 1714241 -303832 -2176772 -1222280 1973911 5417259 8186815
$$ packed form
10282b128868M094478J225491j394001k255150q23473J490238J446178j183441
10274D71452j765567J832304M212880P54514l584927j651636L553068L425678
10266G247766j695552l201412Q33998K452641k120250n622432j855028L839028
10258a21241K893595l352695o093967j860635L765095M931273K629195J287446
10250D078066J757234J004274j980504l562968p40514L415686L280628j254353
10242E997549m575471l468058p04917O92990J632404K965590K457127o20628k336172
10233B040414J40404L374207K767746m94178k245943k018229j965546j798383
10225a99508n5699J566267M03181k018073j872940R54492L196191L443348K769556
$$ plain form
10216 8186815 9483255 8127033 5035302 3610928 5444790 7780497 7396040 5077242
10208 5077242 4006204 5223700 6894367 7134878 5747971 3666966 1867323 405445
10200 405445 -1887585 -5772315 -9377986 -9204337 -4274347 1979563 5131168 4322296 2435178
10191 2435178 2177090 3081798 2808183 828827 -508907 596112 2245023 1212751 -2155266
10182 -2155266 -4212464 -3251840 -1411381 -847184 -1287916 -2072483 -2963272 -2275333 1325735
10173 1325735 4368356 1753908 -3904209 -3281630 5799540 13222231 10843986 4395511
10165 4395511 3650559 7568986 8568624 6108802 5329095 5788274 2724718 -2261271 -2494057
10156 -2494057 2519721 6923730 8754619 10543773 10853953 6045556 -47490 247895
$$ packed form
10216H186815J296440j356222l091731j424374J833862K335707l84457k318798
10208E077242j071038J217496J670667K40511j386907k081005j799643j461878
10200D05445k293030l884730l605671J73649M929990O253910L151605q08872j887118
10191B435178k58088R04708k73615j979356j337734J105019J648911j032272l368017
10182b155266k057198R60624J840459N64197m40732p84567q90789O87939L601068
10173A325735L042621k614448n658117O22579R081170P422691k378245o448475
10165D395511p44952L918427R99638k459822p79707M59179l063556m985989k32786
10156b494057N013778M404009J830889J789154L10180m808397o093046K95385
$$ plain form
10148 247895 4941211 4706675 -412294 -76845 7943504 12600887 7861018 2459576 4219742
10139 4219742 7304711 4094409 -1307446 -1651903 460955 -1283143 -5000925 -4934737 -1743010
10130 -1743010 722857 3213860 6846636 7019605 972668 -3996317 211193 9408273
10122 9408273 12997242 9139474 4584849 2851508 2151665 2173988 3533443 3037918 -1434491
10113 -1434491 -4241938 340944 6857805 5804864 -370129 -463379 6848312 10218345
10105 10218345 3551138 -4920200 -5595464 -21144 4348493 4412010 1964393 -73223
10097 -73223 1500584 7819487 14139772 13902880 8192201 4788088 6272089 6645916 2462965
10088 2462965 -872001 1441763 5188324 4213267 175295 -1248590 382852 1250375
$$ packed form
10148B47895M693316k34536n118969L35449Q020349M657383m739869n401442J760166
10139D219742L084969l210302n401855l44457K112858j744098l717782O6188L191727
10130a743010K465867K491003L632776J72969o046937m968985M207510R197080
10122I408273L588969l857768m554625j733341o99843K2323J359455m95525m472409
10113a434491k807447M582882O516861j052941o174993r3250P311691L370033
10105A0218345o667207q471338o75264N574320M369637O3517k447617k037616
10097g3223J573807O318903O320285k36892n710679l404113J484001L73827m182951
10088B462965l334966K313764L746561r75057m037972j423885J631442Q67523
$$ plain form
10080 1250375 472852 280753 1059850 1684030 3227948 7157279 10812184 9702279 4201167
10071 4201167 -310124 -272871 2668676 5447491 7255793 8462799 8714169 7651730 5802154
10062 5802154 3537917 445816 -3198165 -5414235 -4364353 -891984 1996846 2463205
10054 2463205 1735859 2008747 3188341 3137119 1174959 -311864 1244031 5088931 7642033
10045 7642033 6073340 921366 -4053935 -4390894 1118987 8180735 10442589 6410498
10037 6410498 1120785 -485763 510155 133008 -1700273 -1284542 2829503 7680796 10077517
10028 10077517 9867697 8481799 6924033 6047504 6503490 7366963 6603606 3832761 1113764
10019 1113764 159113 157378 -661477 -2314308 -2990997 -1415127 1317112 2499894 727781
$$ packed form
10080A250375p77523j92099P79097O24180J543918L929331L654905j109905n501112
10071D201167m511291L7253K941547K778815J808302J207006K51370j062439j849576
10062E802154k264237l092101l643981k216070J049882L472369K888830M66359
10054B463205p27346K72888J179594n1222j962160j486823J555895L844900K553102
10045G642033j568693n151974m975301l36959N509881P061748K261854m032091
10037F410498n289713j606548R95918l77147j833281M15731M114045M851293K396721
10028A0077517k09820j385898j557766q76529M55986Q63473p63357k770845k718997
10019A113764r54651j735q18855j652831o76689J575870K732239J182782j772113
$$ plain form
10010 727781 -2016034 -2099333 1464670 5414949 5672622 1652099 -3296247 -4793430 -606083
10001 -606083 7426958 14026510 14786646 10618750 6182917 3737417 1510285 -1137632
9993 -1137632 -1178152 2895833 7165766 7262063 4284103 1830813 -16510 -3008798 -5418185
9984 -5418185 -4117716 -865644 -710394 -4220260 -6915369 -6940525 -7472584 -9883076 -10247995
9975 -10247995 -5850678 -595582 167064 -2727032 -3945136 -1443005 1163718 -259172
9967 -259172 -5522608 -10723559 -12237784 -9976753 -7282660 -7127041 -8166609 -5945319 1086754
9958 1086754 8316073 9601878 4528713 -974635 -1516283 1928957 3983244 1409416
9950 1409416 -3974204 -8537177 -10816174 -11297223 -10129066 -7204655 -3692873 -1174499
$$ packed form
10010G27781k743815q3299L564003L950279K57673m020523m948346j497183M187347
10001f06083Q033041O599552P60136m167896m435833k445500k227132k647917
9993a137632m0520M073985M269933R6297k977960k453290j847323k992288k409387
9984e418185J300469L252072J55250l509866k695109k5156n32059k410492l64919
9975a0247995M397317N255096P62646k894096j218104K502131K606723j422890
9967b59172n263436n200951j514225K261031K694093J55619j039568K221290P032073
9958A086754P229319J285805n073165n503348n41648L445240K054287k573828
9950A409416n383620m562973k278997m81049J168157K924411L511782K518374
$$ plain form
9942 -1174499 605613 3011848 5587604 6156281 4178071 1789436 953155 1492350 2223375
9933 2223375 2117122 574549 -1082572 806043 7606877 13924782 12535958 4216931
9925 4216931 -2544438 -2800829 -421472 -123338 -589585 583765 743600 -3653944 -10421247
9916 -10421247 -14075543 -12396651 -7187819 -1556866 941229 -1381554 -4282058 -1090508
9908 -1090508 6889229 10192832 5185323 43840 1152748 2804627 -1177926 -4879732
9900 -4879732 -816862 4889563 1770505 -6199585 -6414781 990195 3628934 -2149281
9892 -2149281 -6834973 -5447770 -3968775 -5495024 -5233504 -2933586 -5134745 -10582577
9884 -10582577 -9134605 -899220 142882 -10708845 -19541570 -17974939 -18144780 -28361027
$$ packed form
9942a174499J780112K406235K575756N68677j978210k388635q36281N39195P31025
9933B223375j06253j542573j657121J888615O800834O317905j388824q319027
9925D216931o761369k56391K379357K98134m66247J173350J59835m397544o767303
9916a0421247l654296J678892N208832N630953K498095k322783k900504L191550
9908a090508P979737L303603n007509n141483J108908J651879l982553l701806
9900d879732M062870N706425l119058p970090k15196P404976K638739n778215
9892b149281m685692J387203J478995j526249K61520K299918k201159n447832
9884a0582577J447972Q235385J042102j0851727q832725J566631j69841j0216247
$$ plain form
9876 -28361027 -31405070 -8808472 25144663 38379902 24829055 9230176 8697951 13138774
9868 13138774 8995260 1125957 291152 4242721 3815311 -1592935 -5677670 -6415421 -6529820
9859 -6529820 -6638162 -5131099 -2398477 -12451 2124435 4264699 5042395 3995351 3025232
9850 3025232 3181568 3197273 2919870 4268125 6881540 7178420 4129201 1612609 2296349
9841 2296349 3478757 2133954 -66698 -325752 460019 213008 -410951 -468628 -1747494
9832 -1747494 -5062367 -6623586 -3041445 2396077 3798034 1564500 1592107 5894509 9614485
9823 9614485 8587646 5113111 3850124 5366238 6572850 5682599 4157568 4296349 6504502
9814 6504502 8954556 9371906 7287507 4461287 2690921 1879678 1385608 2373957 6472040
$$ packed form
9876b8361027l044043K2596598L3953135J3235239j3550847j5598879n32225M440823
9868A3138774m143514p869303q34805L951569m27410n408246m084735p37751j14399
9859f529820j08342J507063K732622K386026K136886K140264P77696j047044r70119
9850C025232J56336J5705k77403J348255K613415K96880l049219k516592O83740
9841B296349J182408j344803k200652k59054P85771k47011o23959n7677j278866
9832a747494l314873j561219L582141N437522J401957k233534K7607M302402L719976
9823I614485j026839l474535j262987J516114J206612q90251j525031J38781K208153
9814F504502K450054M17350k084399k826220j770366q11243m94070R88349M098083
$$ plain form
9805 6472040 11957913 13987140 10087478 3547316 -473189 -768692 86333 560971 1803368
9796 1803368 4245121 5476161 3158348 -1516373 -4964362 -5046035 -2529109 558451 2736663
9787 2736663 3657478 4047281 4917008 6174749 6558133 5551910 4415323 4427263 5283431
9778 5283431 6309410 7658129 8690678 7201999 2947309 52737 2131022 6295045
9770 6295045 6751020 3830706 3613362 7503852 8693185 2452583 -5765486 -7818686 -4326975
9761 -4326975 -2357293 -4187197 -5274925 -2876091 22016 612616 374749 928152 492282
9752 492282 -2350768 -4813341 -3381652 880558 3657201 2863113 259668 -1582938 -1696042
9743 -1696042 -574318 502012 306954 -767574 -599338 1723051 3711040 2412646 -808526
$$ packed form
9805F472040N485873K029227l899662o540162m020505k95503Q55025M74638J242397
9796A803368K441753J231040k317813m674721l447989q1673K516926L087560K178212
9787B736663R20815L89803Q69727J257741L83384j006223j136587J1940Q56168
9778E283431J025979J348719J032549j488679m254690k894572K078285M164023
9770F295045M55975k920314k17344L890490J189333o240602q218069k053200L491711
9761d326975J969682j829904j087728K398834K898107N90600k37867N53403m35870
9752D92282k843050k462573J431689M262210K776643p94088k603445j842606j13104
9743a696042J121724J076330j95058j074528J68236K322389J987989j298394l221172
$$ plain form
9734 -808526 -1129821 3301601 8219089 8279888 3601777 -975078 -2137362 -857059 910888
9725 910888 2950632 4797833 4036198 -429099 -5013780 -4904489 -586070 2502775 1423765
9716 1423765 -564044 591379 3707273 4590395 2312294 -202999 -1252087 -2566681
9708 -2566681 -5717321 -9062563 -9965757 -8376690 -6274475 -4452859 -2087229 453746
9700 453746 791362 -1930221 -4311799 -2035811 4372924 9742356 10703924 9222550 8462470
9691 8462470 8147562 6554237 4550033 4096819 4401993 3455765 2241885 3083869 4493594
9682 4493594 2696626 -1476864 -2660978 728772 3663903 2355703 -320805 -639314
9674 -639314 -318868 -2478212 -5394371 -5616361 -4217337 -4190214 -3817772 1051050 8925434
$$ packed form
9734h08526l21295M431422M917488O0799m678111m576855j162284J280303J767947
9725I10888K039744J847201p61635m465297m584681J09291M318419L088845j079010
9716A423765j987809J155423L115894Q83122k278101k515293j049088j314594
9708b566681l150640l345242r03194J589067K102215J821616K365630K540975
9700D53746L37616k721583k381578K275988O408735N369432R61568j481374p60080
9691H462470l14908j593325k004204m53214L05174r46228j213880Q41984J409725
9682D493594j796968m173490j184114L389750K935131j308200k676508l18509
9674f39314L20446k159344k916159k21990J399024K7123L72442M868822P874384
$$ plain form
9665 8925434 13137233 10998246 7013556 5587039 5460047 3675755 1000224 231080 1486368
9656 1486368 2162673 721840 -1447094 -1826447 368177 3136441 3697763 1706530 -539407
9647 -539407 -1475346 -1808160 -1609510 929756 5002496 4834901 -3095522 -12465584 -12975097
9638 -12975097 -3722746 5516933 7498169 5574883 5891464 7753669 6749949 3164373
9630 3164373 1348354 2626017 4085157 3788020 2700536 1400222 -1110263 -4406578
9622 -4406578 -5632507 -3016219 1435902 4009896 3093127 312988 -1384860 -458174 2021695
9613 2021695 3893692 4575456 5227012 6083320 5568644 3280297 1705366 2634736 3627068
9604 3627068 1301490 -2813278 -3642377 -28101 3110211 1479500 -3164954 -6362217
$$ packed form
9665H925434M211799k138987l984690j426517j26992j784292k675531p69144J255288
9656A486368O76305j440833k168934l79353K194624K768264N61322j991233k245937
9647e39407r35939l32814J98650K539266M072740j67595p930423r370062n09513
9638a2975097R252351R239679J981236j923286L16581J862205j003720l585576
9630C164373j816019J277663J459140k97137j087484j300314k510485l296315
9622d406578j225929K616288M452121K573994r16769k780139j697848R26686K479869
9613B021695J871997O81764O51556Q56308n14676k288347j574931R29370R92332
9604C627068k325578m114768q29099L614276L138312j630711m644454l197263
$$ plain form
9596 -6362217 -6645043 -5181323 -2400056 1402734 3755105 2300322 -1117215 -2253256
9588 -2253256 -213718 2058053 2958936 3904097 5251429 4869378 2344187 525396 731525
9579 731525 402346 -1907213 -3471273 -2680471 -2707095 -5094173 -4398995 3783129 12902821
9570 12902821 12361165 3203612 -2465590 1183876 6452534 5558474 2283308 4047081
9562 4047081 9323570 10792398 7105478 3916845 4749660 7088418 7245307 4510655 612773
9553 612773 -1705096 -300152 3654327 6045700 5001251 3101129 2152568 -299545 -5580938
9544 -5580938 -9283139 -7259597 -2632756 -880549 -1132933 821565 3555210 2099255
9536 2099255 -2196964 -2420416 2842563 7270536 7082656 5847545 6699262 7133586 5023331
$$ packed form
9596f362217k82826J463720K781267L802790K352371j454783l417537j136041
9588b253256K039538K271771R00883R45161J347332l82051k525191j818791K06129
9579G31525l29179k309559j564060P90802k6624k387078O95178Q182124R119692
9570A2902821n41656r157553n669202L649466N268658q94060l275166J763773
9562D047081N276489J468828l686920l188633Q32815K338758J56889k734652l897882
9553F12773k317869J404944L954479K391373j044449j900122r48561k452113n281393
9544e580938l702201K023542M626841J752207k52384J954498K733645j455955
9536B099255m296219k23452N262979M427973j87880j235111Q51717M34324k110255
$$ plain form
9527 5023331 3333804 4681062 6551539 6144602 5279704 6216033 6820434 4504545 1573132
9518 1573132 1964993 5021182 6657210 5053820 1811681 -980363 -2006353 -701721
9510 -701721 1577488 2038343 43780 -1841364 -2003627 -2110374 -3258021 -3128380 106618
9501 106618 4053155 5613318 5664103 6695055 7983834 6915626 3613473 694918 -607383
9492 -607383 -1007276 -682324 962281 3451936 5167515 4721499 1581383 -3204585 -6357086
9483 -6357086 -5054620 -1181059 433911 -869046 -707738 2071300 1910006 -4500441 -11169596
9474 -11169596 -10826555 -5859753 -4063616 -6317225 -6640212 -3456200 -2197846 -5383316
9466 -5383316 -7835296 -4991539 -77867 945867 -2411346 -5696460 -5556173 -2210190
$$ packed form
9527E023331j689527J347258J870477m06937q64898R36329O04401k315889k931413
9518A573132L91861L056189J636028j603390l242139k792044j025990J304632
9510g01721K279209M60855j994563j885144j62263j06747j147647J29641L234998
9501A06618L946537J560163N0785J030952J288779j068208l302153k918555j302301
9492f07383l99893L24952J644605K489655J715579m46016l140116m785968l152501
9483f357086J302466L873561J614970j302957J61308K779038j61294o410447o669155
9474a1169596L43041M966802J796137k253609l22987L184012J258354l185470
9466e383316k451980K843757M913672J023734l357213l285114J40287L345983
$$ plain form
9458 -2210190 2214512 5309165 5522317 3414702 1120804 -631 -249779 -402028 -1240032
9449 -1240032 -3657932 -6965675 -7746265 -3419576 3208828 6232412 3820894 -74751
9441 -74751 -1687809 -1628146 -1896238 -1929499 325890 5310019 11271714 15409278 15034155
9432 15034155 9452460 1437579 -4531517 -5747959 -2227524 4232981 9805542 9706032
9424 9706032 3545427 -1921525 -303251 5219501 6106477 1477328 -506807 4131035
9416 4131035 8498310 5496623 -1632140 -5113326 -3760602 -1927364 -1185673 220545
9408 220545 1923904 1839029 886166 1760014 3732688 3612350 1123271 -1287472 -2985462
9399 -2985462 -4671326 -4528212 -352150 5037826 6320526 3686775 2504716 4522626
$$ packed form
9458b210190M424702L094653K13152k107615k293898j121435k49148j52249q38004
9449a240032k417900l307743p80590M326689O628404L023584k411518l895645
9441g4751j613058N9663k68092l3261K255389M984129N961695M137564l75123
9432A5034155n581695q014881n969096j216442L520435O460505N572561r9510
9424I706032o160605n466952J618274N522752Q86976m629149j984135M637842
9416D131035M367275l001687p128763l481186J352724J833238P41691J406218
9408B20545J703359q4875r52863Q73848J972674j20338k489079k410743j697990
9399b985462j685864J43114M176062N389976J282700k633751j182059K017910
$$ plain form
9391 4522626 5648831 3761834 2155064 2708464 2071178 -1547147 -3647250 -551876 3539762
9382 3539762 2564586 -1743092 -2629652 1170002 4238881 3446803 1962032 3030801 4726239
9373 4726239 3263163 -1578669 -6464309 -8109833 -5741871 -1526536 981242 414323
9365 414323 -551145 1031853 3521075 2999985 195623 332242 4574397 6658856 1738122
9356 1738122 -5420086 -6337795 -733941 3414663 1428204 -2462417 -2730963 -448575 -126891
9347 -126891 -2537272 -5041348 -6785043 -8922920 -10654999 -9741434 -7280280 -7581934 -11804653
9338 -11804653 -15350034 -13681459 -7761596 -1374884 4116889 9197394 12555864 11930402
9330 11930402 7896927 3505213 349406 -2213388 -4333432 -5169829 -4939206 -4409167 -2527026
$$ packed form
9391D522626J126205j886997j606770N53400o37286l618325k100103L095374M091638
9382C539762r75176m307678q86560L799654L068879p92078j484771J068769J695438
9373D726239j463076m841832m885640j645524K367962M215335K507778n66919
9365D14323r65468J582998K489222n21090k804362J36619M242155K084459m920734
9356A738122p158208r17709N603854M148604j986459l890621k68546K282388L21684
9347a26891k410381k504076j743695k137877j732079R13565K461154l01654m222719
9338a1804653l545381J668575N919863O386712N491773N080505L358470o25462
9330A1930402m033475m391714l155807k562794k120044q36397K30623N30039J882141
$$ plain form
9321 -2527026 1984392 6630825 6859284 2617656 -1016771 -1168376 -612991 -1777598 -2301200
9312 -2301200 -216858 1200293 -981235 -2627953 2129093 10952458 15592585 13521039
9304 13521039 10346456 9946616 9228829 5206846 999915 664176 2663237 3109243 2332709
9295 2332709 3558733 6975517 9510529 9641340 8700426 7711135 6132642 3918085 2257778
9286 2257778 1818313 1988242 2076366 1902219 1272574 143062 -809784 -868799 -356934 -139766
9276 -139766 -341869 -361789 160433 1022931 1705171 1522830 157794 -1650759 -2729673
9267 -2729673 -3028398 -3662296 -5319856 -7643690 -9967363 -11329718 -10388977 -7379258 -5342831
9258 -5342831 -6342132 -7032316 -2352485 5847149 8927961 2368814 -8007895 -13582399
$$ packed form
9321b527026M511418M646433K28459m241628l634427j51605N55385j164607n23602
9312b301200K084342J417151k181528j646718M757046Q823365M640127k071546
9304A3521039l174583l99840p17787m021983m206931l35739J999061M46006p76534
9295B332709J226024L416784K535012J30811r40914r89291j578493k214557j660307
9286B257778m39465J69929Q8124j74147o29645j129512r52846n9015N11865K17168
9276a39766k02103j9920N22222Q62498O82240j82341j365036j808553j078914
9267b729673k98725o33898j657560k323834k323673j362355R40741L009719K036427
9258e342831r99301o90184M679831Q199634L080812o559147j0376709n574504
$$ plain form
9250 -13582399 -12432823 -7977810 -2739517 1728375 2427648 -1762477 -6510692 -7115262
9242 -7115262 -5411236 -6434832 -9939428 -10939452 -7673120 -3351260 -563628 603224
9234 603224 -401732 -3596863 -5230302 -2185344 734694 -4200131 -14397823 -17505648
9226 -17505648 -8545835 1937963 2375931 -4328645 -6996664 -2586741 2024956 2033797 11749
9217 11749 -792373 -1234416 -2481371 -2777414 -725452 1603007 1485099 -506985 -1591260
9208 -1591260 -764834 124395 -908651 -3532489 -5879542 -7113678 -8149472 -9613330 -10321607
9199 -10321607 -8802516 -5350112 -1245587 3020219 6978265 8734672 6809977 3004647
9191 3004647 1017119 2349895 5476015 8178743 8485180 4875473 -1159651 -4366003
$$ packed form
9250a3582399J149576M455013N238293M467892O99273m190125m748215o04570
9242g115262J704026j023596l504596j000024L266332M321860K787632J166852
9234F03224j004956l195131j633439L044958K920038m934825j0197692l107825
9226a7505648Q959813J0483798M37968o704576k668019M409923M611697Q841k022048
9217A1749q04122m42043j246955k96043K051962K328459j17908j992084j084275
9208a591260Q26426Q89229j033046k623838k347053j234136j035794j463858p08277
9199a0321607J519091L452404M104525M265806L958046J756407j924695l805330
9191C004647j987528J332776L126120K702728L06437l609707o035124l206352
$$ plain form
9183 -4366003 -1639113 2778007 2870474 75362 643824 4654932 5455441 967161 -2645534
9174 -2645534 -1129426 2007155 3367846 5378176 9170352 9460145 3041295 -4121303
9166 -4121303 -5390496 -3287504 -3284622 -3289282 1778393 9035119 10812732 6452139 2020312
9157 2020312 42892 -1667963 -2374877 1029621 6077581 6502832 2614676 1134433 3624686
9148 3624686 4059456 -16053 -2793328 15263 4742875 7093185 8582477 11194403
9140 11194403 12327161 10203444 8515231 10192532 11447943 7759976 1877520 40550
9132 40550 2928414 5773247 5790304 4801405 5309147 7488332 9549352 9000580 4758646
9123 4758646 -642533 -2979557 -1513390 578000 1711393 3674668 6403661 6211380
$$ packed form
9183d366003K726890M417120R2467k795112N68462M011108Q00509m488280l612695
9174b645534J516108L136581J360691K010330L792176K89793o418850p162598
9166d121303j269193K102992K882m660N067675P256726J777613m360593m431827
9157B020312j977420j710855p06914L404498N047960M25251l888156j480243K490253
9148C624686M34770m075509k777275K808591M727612K350310J489292K611926
9140A1194403J132758k123717j688213J677301J255411l687967n882456j836970
9132D0550K887864K844833J7057r88899N07742K179185K061020n48772m241934
9123D758646n401179k337024J466167K091390J133393J963275K728993j92281
$$ plain form
9115 6211380 2365887 390875 4325321 9795379 9842737 4493671 -534362 -2029198 -1096215
9106 -1096215 967805 3314506 3614219 603691 -2447793 -1430475 2539500 5268183
9098 5268183 6328824 8564335 11618217 11684684 7984805 4145528 2247555 506280 -1780932
9089 -1780932 -1826154 1891989 6390735 8159091 7331770 5789190 4059810 2559597 3377449
9080 3377449 7826097 13451047 15985002 13970493 10016468 7772034 8445527 9898762
9072 9898762 8861503 4661532 696858 1158580 6267233 11801815 13247711 9446334
9064 9446334 2773165 -2773272 -4260074 -2452898 -1290344 -2928388 -4352413 -1608930
9056 -1608930 3640096 5760084 3399322 1594121 4115892 7948603 8153773 4878618
$$ packed form
9115F211380l845493j975012L934446N470058M7358n349066n028033j494836R32983
9106a096215K064020K346701K99713l010528l051484J017318L969975K728683
9098E268183J060641K235511L053882O6467l699879l839277j897973j741275k287212
9089a780932m5222L718143M498746J768356q27321j542580j729380j500213Q17852
9080C377449M448648N624950K533955k014509l954025k244434O73493J453235
9072I898762j037259m199971l964674M61722N108653N534582J445896l801377
9064I446334o673169n546437j486802J807176J162554j638044j424025K743483
9056a608930N249026K119988k360762j805201K521771L832711K05170l275155
$$ plain form
9048 4878618 2083055 1666169 2501335 3721810 5243174 5888699 4649251 3481717 5165133
9039 5165133 8105907 7143204 843660 -5580065 -6991411 -5070540 -5070665 -7782654 -8911067
9030 -8911067 -6237416 -3172493 -3547874 -6077610 -6650332 -4165321 -1152321 374234 676685
9021 676685 258500 -913399 -1832708 -963056 936723 1272525 -135640 -356800 1547411
9012 1547411 2200030 -582161 -3244305 -1427177 3110095 5450148 5811958 9008345 15635746
9003 15635746 19972361 18384646 14211095 11494326 9180694 5635234 4079234 7632703
8995 7632703 12002740 9873919 1715795 -4159401 -2882191 1414507 2830961 1109860
8987 1109860 -818787 -2053548 -2855753 -1975729 1261169 4511895 5555244 5738715 6785144
$$ packed form
9048D878618k795563m16886Q35166J220475J521364O45525j239448j167534J683416
9039E165133K940774r62703o299544o423725j411346J920871j25k711989j128413
9030h911067K673651L064923l75381k529736n72722K485011L013000J526555L02451
9021F76685m18185j171899r19309Q69652J899779L35802j408165k21160J904211
9012A547411O52619k782191k662144J817128M537272K340053L61810L196387O627401
9003A5635746M336615j587715m173551k716769k313632l545460j556000L553469
8995G632703M370037k128821q158124n875196J277210M296698J416454j721101
8987A109860j928647j234761q02205Q80024L236898L250726J043349J83471J046429
$$ plain form
8978 6785144 6526421 2286093 -3295822 -5135645 -3549909 -3352628 -5023510 -3546428 2037034
8969 2037034 5055134 1531190 -2252096 921935 7016582 6273225 -1298154 -5346949
8961 -5346949 -941846 4136704 1543810 -5767200 -9563501 -8609682 -7809718 -8279502 -5972416
8952 -5972416 172133 5437612 6175999 4422379 3722645 4351815 4899628 5365074 6182296
8943 6182296 6507234 5707148 4683688 3916877 2310671 -33347 -277045 3170536 7224107
8934 7224107 8159700 7510778 9566044 13496049 13186161 6446837 -488819 -1128968 2254961
8925 2254961 2636125 -686990 -1021947 4971627 11264373 10735082 5496010 3660423 7292297
8916 7292297 9601102 5590952 107906 997213 7347248 10296689 5387128 -1456560
$$ packed form
8978F785144k58723m240328n581915j839823J585736J97281j670882J477082N583462
8969B037034L018100l523944l783286L174031O094647p43357p571379m048795
8961e346949M405103N078550k592894p311010l796301R53819P99964m69784K307086
8952e972416O144549N265479P38387j753620o99734O29170N47813M65446Q17222
8943F182296L24938q00086j023460p66811j606206k344018k43698L447581M053571
8934G224107R35593o48922K055266L930005l09888o739324o935656o40149L383929
8925B254961L81164l323115l34957N993574O292746n29291n239072j835587L631874
8916G292297K308805m010150n483046Q89307O350035K949441m909561o843688
$$ plain form
8908 -1456560 -2554767 1344373 3506767 1036549 -2770113 -4908193 -6015601 -6299161
8900 -6299161 -3466028 2293408 5551693 2328837 -3148133 -3396005 1889544 5583316
8892 5583316 3255545 -1832697 -5180662 -7241397 -10149067 -12491143 -11652824 -8926317
8884 -8926317 -7872229 -8626376 -7819205 -4112122 -504119 -503490 -4284071 -9162399 -12234023
8875 -12234023 -12306650 -10480778 -8719041 -7149930 -4075767 178977 1802111 -1326418
8867 -1326418 -5029982 -3460340 2668239 6940714 6124605 3350501 1826620 775564
8859 775564 -262589 1619434 7503357 12326730 10550902 3886074 -1134867 -1664501 10249
8850 10249 2429849 6861956 12367449 14069448 9304767 2400655 -119083 2299184 4074615
$$ packed form
8908a456560j098207L899140K162394k470218l806662k138080j107408k83560
8900f299161K833133N759436L258285l222856n476970k47872N285549L693772
8892E583316k327771n088242l347965k060735k907670k342076Q38319K726507
8884h926317J054088p54147Q07171L707083L608003O29l780581m878328l071624
8875a2234023p2627J825872J761737J569111L074163M254744J623134l128529
8867a326418l703564J569642O128579M272475q16109k774104j523881j051056
8859G75564j038153J882023N883923M823373j775828o664828n020941n29634J674750
8850A0249K419600M432107N505493J701999m764681o904112k519738K418267J775431
$$ plain form
8841 4074615 1348657 -2910157 -2948739 2458436 8795273 11265616 9208601 4849124 355182
8832 355182 -2233409 -734759 4264037 7697342 5258500 -78921 -1347693 2111488
8824 2111488 3131387 -2084140 -6901254 -3387263 5588561 9935542 6122273 432068
8816 432068 -1555574 -1690992 -3213498 -4173324 -1335156 3148635 3893307 -408118 -5723084
8807 -5723084 -7975621 -6379389 -2047776 3335613 7067321 6628098 2706168 -734593
8799 -734593 -632195 2044700 4146377 4049839 2426135 481257 -878507 -610750 1815408
8790 1815408 4926330 5980783 4145145 1762865 1239085 1635008 100509 -3747894 -6984409
8781 -6984409 -7298912 -5848385 -5216715 -6052526 -6961105 -6529345 -4170325 -120034 3839405
$$ packed form
8841D074615k725958m258814l8582N407175O336837K470343k057015m359477m493942
8832C55182k588591J498650M998796L433305k438842n337421j268772L459181
8824B111488J019899n215527m817114L513991Q975824M346981l813269n690205
8816D32068j987642j35418j522506r59826K838168M483791P44672m301425n314966
8807e723084k252537J596232M331613N383389L731708m39223l921930l440761
8799g34593J02398K676895K101677r6538j623704j944878j359764K67757K426158
8790A815408L110922J054453j835638k382280n23780L95923j534499l848403l236515
8781f984409l14503J450527O31670q35811r08579M31760K359020M050291L959439
$$ plain form
8772 3839405 4701174 1330958 -3194321 -4398707 -1577018 1713494 2484305 1618824 1697539
8763 1697539 3463512 5750084 7525729 8366267 7587563 4592148 233173 -3253311 -4167282
8754 -4167282 -2845105 -1022556 165359 1373235 3979648 7707238 9951492 8488518
8746 8488518 4676556 2499891 3839326 6116991 5894593 3582071 2465043 3522482
8738 3522482 3978750 1965023 64211 1854375 6383001 9113490 8164789 6479879 6884867
8729 6884867 7980820 7042601 4672548 3523846 3605884 2291701 -1034423 -3656781 -3814015
8720 -3814015 -3415659 -4731691 -6625315 -6399357 -3948275 -1512366 7025 1753571 3707578
8711 3707578 3438663 -446740 -5314470 -7001686 -4642725 -975385 1975413 4923517
$$ packed form
8772C839405Q61769l370216m525279j204386K821689L290512P70811q65481P8715
8763A697539J765973K286572J775645Q40538p78704k995415m358975l486484r13971
8754d167282J322177J822549J187915J207876K606413L727590K244254j462974
8746H488518l811962k176665J339435K277665k22398k312522j117028J057439
8738C522482M56268k013727j900812J790164M528626K730489r48701j684910M04988
8729F884867J095953r38219k370053j148702Q2038j314183l326124k622358j57234
8720c814015L98356j316032j893624K25958K451082K435909J519391J746546J954007
8711C707578k68915l885403m867730j687216K358961L667340K950798K948104
$$ plain form
8703 4923517 8050957 8572581 4497045 -835115 -1927406 1346692 3577643 1979409
8695 1979409 80817 1133145 2750904 2135455 2274966 7099837 13308740 13819384 8235654
8686 8235654 3044987 1482789 270490 -2518401 -3670996 -1602800 -341423 -3011533
8678 -3011533 -6743477 -7765909 -6505234 -4056897 839145 6981828 8689992 4107204
8670 4107204 112552 2567102 6806596 5404307 802278 1134911 6571719 9743104
8662 9743104 8422815 7671579 9105293 8031834 3133362 -250609 671341 2095277 1855568
8653 1855568 3242659 6764794 6718360 1223686 -2475226 672794 4282435 529614 -6729503
8644 -6729503 -7919119 -2529112 1539838 842306 -854566 -1600438 -3697985 -6515072 -5573832
$$ packed form
8703D923517L127440N21624m075536n332160j092291L274098K230951j598234
8695A979409j898592J052328J617759o15449J39511M824871O208903N10644n583730
8686H235654n190667j562198j212299k788891j152595K068196J261377k670110
8678c011533l731944j022432J260675K448337M896042O142683J708164m582788
8670D107204l994652K454550M239494j402289m602029L32633N436808L171385
8662I743104j320289p51236J433714j073459m898472l383971R21950J423936k39709
8653A855568J387091L522135m6434n494674l698912L148020L609641l752821p259117
8644f729503j189616N390007M068950o97532j696872p45872k097547k817087R41240
$$ plain form
8635 -5573832 -861628 1591940 -680396 -2207350 1505296 6646041 7375073 4853356
8627 4853356 4649632 7841435 9866500 7335018 2005958 -1907911 -1642837 2680001 8133212
8618 8133212 10434131 7229769 457204 -5330375 -6922914 -4454167 -411311 2428814
8610 2428814 2779723 1604526 942496 1660619 2811089 3107625 1976625 -787722 -4775932
8601 -4775932 -8011678 -8139035 -5480051 -3206230 -3383408 -4563034 -4533497 -3428463 -2187039
8592 -2187039 79442 4331504 8469292 9289957 7253126 5902899 6115489 4510165 -707854
8583 -707854 -5459456 -4470601 1246017 4965041 2462784 -3052053 -5422664 -3146701 -478145
8574 -478145 -1275713 -3815456 -3143318 2112999 7318033 7214872 2433034 -1282528 -157257
$$ packed form
8635e573832M712204K453568k272336j526954L712646N140745P29032k521717
8627D853356k03724L191803K025065k531482n329060l913869K65074M322838N453211
8618H133212K300919l204362o772565n787579j592539K468747M042856K840125
8610B428814L50909j175197o62030P18123J150470K96536j131000k764347l988210
8601d775932l235746j27357K658984K273821j77178j179626K9537J105034J241424
8592b187039K266481M252062M137788Q20665k036831j350227K12590j605324n218019
8583g07854m751602R88855N716618L719024k502257n514837k370611K275963K668556
8574d78145p97568k539743O72138N256317N205034j03161m781838l715562J125271
$$ plain form
8565 -157257 3305278 3953236 426215 -3608424 -4229048 -1809449 -257566 -2298334 -6339363
8556 -6339363 -8505313 -7429149 -5833808 -6802658 -9721847 -11203923 -9039355 -3614350
8548 -3614350 3476058 9824518 12114264 8967673 3993195 2621828 5399125 7885243
8540 7885243 7590398 6383310 4852814 235022 -6762022 -9112488 -3001884 4622383
8532 4622383 4813627 -737646 -3488575 -1673065 -1126298 -3453509 -3190653 1621028 5072747
8523 5072747 2902044 -1279118 -3001562 -3191753 -3311165 -1024127 4261164 7460055 4885366
8514 4885366 266396 -1503568 -1749292 -3736214 -5853150 -5127975 -3390614 -3806054 -5025422
8505 -5025422 -4728528 -4894725 -7045114 -6537012 613610 8680651 8599589 1281962 -3945314
$$ packed form
8565a57257L462535O47958l527021m034639o20624K419599J551883k040768m041029
8556f339363k165950J076164J595341r68850k919189j482076K164568N425005
8548c614350P090408O348460K289746l146591m974478j371367K777297K486118
8540G885243k94845j207088j530496m617792o997044k350466O110604P624267
8532D622383J91244n551273k750929J815510N46767k327211K62856M811681L451719
8523E072747k170703m181162j722444j90191j19412K287038N285291L198891k574689
8514D885366m618970j769964k45724j986922k116936P25175J737361m15440j219368
8505e025422K96894j66197k150389N08102P150622Q067041q1062p317627n227276
$$ plain form
8496 -3945314 -2966815 -595572 -1143994 -3292300 -4618773 -4161279 -466491 6262751 10796102
8487 10796102 8639552 3875974 3448203 5386179 2293379 -4530334 -5789353 106772
8479 106772 3849867 519420 -3441497 -2643269 -923483 -1730855 -1137798 2932570 4636464
8470 4636464 897406 -1467427 2194663 4484855 -1828812 -10009525 -9406704 -2843965
8462 -2843965 -1386618 -6083265 -7834869 -3416348 837736 1285478 1505087 3164531 2460229
8453 2460229 -1812286 -5025710 -4307182 -2435798 -1881221 -1258353 168614 326316 -1175632
8444 -1175632 -1614958 -70100 1120254 1358171 3275986 7373855 9832301 7996312 4372505
8435 4372505 3042148 4772686 7022373 6729782 2884781 -1742682 -2539010 849414 2650401
$$ packed form
8496c945314R78499K371243n48422k148306j326473M57494L694788O729242M533351
8487A0796102k156550m763578m27771J937976l092800o823713j259019N896125
8479A06772L743095l330447l960917P98228J719786q07372N93057M070368J703894
8470D636464l739058k364833L662090K290192o313667q180713O02821O562739
8462b843965J457347m696647j751604M418521M254084M47742K19609J659444p04302
8453B460229m272515l213424P18528J871384N54577O22868J426967J57702j501948
8444a175632m39326J544858J190354K37917J917815M097869K458446j835989l623807
8435D372505j330357J730538K249687k92591l845001m627463p96328L388424J800987
$$ plain form
8426 2650401 -1192416 -6341936 -6452247 -3171585 -2739149 -4768357 -2960516 3387656 7533476
8417 7533476 6208654 3839495 3584730 2450691 -1323374 -3741338 -2041669 709143
8409 709143 2256472 5494265 11217570 13317165 7522002 -534415 -2701209 542979
8401 542979 2940582 2735745 3106240 4887940 5782268 5503841 5654267 5412574 2907615
8392 2907615 63034 598553 3629066 4600151 2589196 1314445 2134242 1313666 -3630261
8383 -3630261 -8954041 -8996236 -3275808 3167397 5563662 3850792 1530535 1158022 1781580
8374 1781580 1289849 309665 1635658 5642305 8880676 8365535 4921099 1007891 -2253049
8365 -2253049 -4377366 -4587806 -3488974 -3001616 -2826740 -216671 4592168 6740361 3767354
$$ packed form
8426B650401l842817n149520j10311L280662M32436k029208J807841O348172M145820
8417G533476j324822k369159k54765j134039l774065k417964J699669K750812
8409G09143J547329L237793N723305K099595n795163q056417k166794L244188
8401E42979K397603k04837L70495J781700Q94328k78427J50426k41693k504959
8392B907615k844581N35519L030513R71085k010955j274751Q19797q20576m943927
8383c630261n323780m2195N720428O443205K396265j712870k320257l72513O23558
8374A781580m91731r80184J325993M006647L238371n15141l444436l913208l260940
8365b253049k124317k10440J098832M87358J74876K610069M808839K148193k973007
$$ plain form
8356 3767354 108229 274870 1661603 -273095 -3347162 -2240633 1687098 2149907 -1325672
8347 -1325672 -2720447 -278121 451353 -3252567 -6049993 -3606193 -95217 -1202383
8339 -1202383 -4835064 -4893379 -795059 2782147 3509536 3132695 2757188 1619081 364145
8330 364145 1075065 3558264 5101425 4439839 3130777 2704071 3063611 3901040 5091645
8321 5091645 5358724 3082311 -935652 -3711759 -3774714 -2699461 -2348506 -2555706 -2480116
8312 -2480116 -2489988 -3300725 -4236927 -3702616 -1275845 1250987 1169988 -2325490 -6381954
8303 -6381954 -6617304 -2104965 2725893 2783047 -1756525 -6066157 -6749371 -5059238 -3961861
8294 -3961861 -4260927 -4448988 -2914308 308139 3002490 2252408 -2073500 -5953001 -5507218
$$ packed form
8356C767354l659125J66641J386733j934698l074067J106529L927731M62809l475579
8347a325672j394775K442326P29474l703920k797426K443800L510976j107166
8339a202383l632681n8315M098320L577206P27389l76841l75507j138107j254936
8330C64145P10920K483199J543161o61586j309062m26706L59540Q37429J190605
8321E091645K67079k276413m017963k776107o2955J075253L50955k07200P5590
8312b480116r872q10737r36202N34311K426771K526832q0999l495478m056464
8303f381954k35350M512339M830858N7154m539572m309632o83214J690133J097377
8294c961861k99066j88061J534680L222447K694351p50082m325908l879501M45783
$$ plain form
8285 -5507218 -2041763 63996 -58369 748382 3384826 4620824 3252391 3029852 6011260
8276 6011260 7565597 3026812 -3852309 -4971226 1008026 7282749 8440359 6138792
8268 6138792 4469142 4194330 3349182 597675 -3359846 -5931090 -4376683 375153 2889547
8259 2889547 -350319 -5005398 -4051132 1938624 5458204 3224072 109828 259853 1031371
8250 1031371 -836397 -3173034 -3113148 -2658487 -4112653 -4334563 224235 5878150 5813702
8241 5813702 312191 -3444164 -1369973 3377818 6426313 7073073 6221103 4135958 2008134
8232 2008134 2216885 5107099 7805510 7642206 5136945 2865315 2763553 4846998 7338502
8223 7338502 8040363 6457578 4028314 1745673 -782814 -3010209 -2797607 7110 2096320
$$ packed form
8285e507218L465455K105759j22365Q06751K636444J235998j368433k22539K981408
8276F011260J554337m538785o879121j118917N979252O274723J157610k301567
8268F138792j669650k74812q45148k751507l957521k571244J554407M751836K514394
8259B889547l239866m655079R54266N989756L519580k234132l114244J50025P71518
8250A031371j867768k336637N9886M54661j454166k21910M558798N653915o4448
8241E813702n501511l756355K074191M747791L048495O46760q51970k085145k127824
8232B008134K08751K890214K698411j63304k505261k271630j01762K083445K491504
8223G338502P01861j582785k429264k282641k528487k227395K12602K804717K089210
$$ plain form
8214 2096320 1409057 502304 2024363 3725740 2019945 -2045910 -4905227 -6199529 -7356230
8205 -7356230 -6664490 -1731634 4508118 6504044 4162394 2003082 840033 -2658257
8197 -2658257 -7834858 -9210096 -5690776 -3268794 -5386301 -7258903 -3966049 1406860
8189 1406860 2583775 -982540 -4554814 -4565074 -948560 4356558 8124386 7481064 3339469
8180 3339469 -188330 -1332819 -2232931 -3598019 -2543045 1674923 4655551 3233193
8172 3233193 505305 460452 1649130 681706 -1661216 -2703705 -3092242 -4642585 -5616279
8163 -5616279 -3354971 473351 2365302 2867160 4768615 7008053 6042389 2637659 1664253
8154 1664253 4627413 7196277 5306269 129460 -3993260 -3903308 308756 5101143 5693492
$$ packed form
8214B096320o87263r06753J522059J701377j705795m065855k859317j294302j156701
8205g356230O91740M932856O239752J995926k341650k159312j163049l498290
8197b658257n176601j375238L519320K421982k117507j872602L292854N372909
8189A406860J176915l566315l572274j0260L616514N305118L767828o43322m141595
8180C339469l527799j144489r00112j365088J054974M217968K980628j422358
8172C233193k727888m4853J188678r67424k342922j042489l88537j550343r73694
8163e616279K261308L828322J891951N01858J901455K239438r65664l404730r73406
8154A664253K963160K568864j890008n176809m122720Q9952M212064M792387N92349
$$ plain form
8145 5693492 1113915 -3607403 -3109856 1343359 3850433 1888331 -1576289 -3595338
8137 -3595338 -4428767 -4478395 -2224829 2719493 7295687 8054254 5257099 2412485 2295981
8128 2295981 4172803 4793271 2193436 -1577450 -2650563 -557750 683938 -2123135
8120 -2123135 -6956793 -9205392 -7018149 -2356797 1554395 2250243 -456002 -3357117
8112 -3357117 -2601244 993545 2571500 820036 288931 3066178 3648180 -2374634 -9310686
8103 -9310686 -8538874 -1684541 1627237 -2165511 -7160710 -8532543 -7762699 -5879231 -158613
8094 -158613 8863686 14451858 12493656 7668368 6104426 6717199 4906418 868259 -1395465
8085 -1395465 -872263 -20655 314146 1875380 5188097 8277437 9191159 7391519 3134298
$$ packed form
8145E693492m579577m721318M97547M453215K507074j962102l464620k019049
8137c595338q33429m9628K253566M944322M576194P58567k797155k844614j16504
8128B295981J876822O20468k599835l770886j073113K092813J241688k807073
8120b123135m833658k248599K187243M661352L911192O95848k706245k901115
8112c357117P55873L594789J577955j751464n31105K777247N82002o022814o936052
8103i310686P71812O854333L311778l792748m995199j371833P69844J883468N720618
8094a58613R022299N588172j958202m825288j563942O12773j810781m038159k263724
8085a395465N23202Q51608L34801J561234L312717L089340R13722j799640m257221
$$ plain form
8076 3134298 -2224211 -5749970 -4992474 -615309 4330848 7481825 8604530 8683180 8522892
8067 8522892 7698566 4539593 -1679157 -8265069 -10683615 -7530112 -2331264 463861
8059 463861 -389375 -3475654 -7014647 -9160192 -8266512 -4971230 -2421010 -2393123 -2666921
8050 -2666921 -471602 2840970 3437707 788955 -1220296 421744 3964931 5758870
8042 5758870 5274126 5072811 6247062 6360495 3114884 -1625142 -3673013 -1829710 1110498
8033 1110498 2833099 4146210 6045509 7157753 6479151 6210687 8677404 11997363 12205738
8024 12205738 8775440 4745800 2057281 214219 -760698 278049 2882476 4922031
8016 4922031 5730710 6480906 7157592 6246298 3900615 2382922 2797488 4271694 6596520
$$ packed form
8076C134298n358509l525759P57496M377165M946157L150977J122705P8650j60288
8067H522892q24326l158973o218750o585912k418546L153503N198848K795125
8059D63861q53236l086279l538993k145545Q93680L295282K550220K7887k73798
8050b666921K195319L312572N96737k648752k009251J642040L543187J793939
8042E758870m84744k01315J174251J13433l245611m740026k047871J843303K940208
8033A110498J722601J313111J899299J112244o78602k68464K466717L319959K08375
8024A2205738l430298m029640k688519j843062r74917J038747K604427K039555
8016D922031Q08679P50196O76686r11294k345683j517693M14566J474206K324826
$$ plain form
8007 6596520 10239012 13254396 12122404 6995356 2559320 2048977 3592481 4013422 2927473
7998 2927473 1268744 -914287 -2950707 -2792649 -113664 2420672 3101173 3723120 6008018
7989 6008018 8341160 8748788 8474543 9419419 10095252 7611556 2628805 -737442 275165
7980 275165 4300667 7548060 7209829 4016045 1942689 3888415 7499727 7883784 4810283
7971 4810283 3384092 6103997 8731649 7144045 4108612 4563262 7087096 5731975
7963 5731975 -592826 -5911123 -5097649 -3835 3721522 3251980 577867 -613487 1065731
7954 1065731 3475211 3619499 1366699 -701981 -1245276 -1794539 -3622812 -5597175 -6730577
7945 -6730577 -8179929 -10500243 -11547745 -9882325 -7776478 -7533570 -7058603 -3072216 2845292
$$ packed form
8007F596520L642492L015384j131992n127048m436036n10343J543504M20941j085949
7998B927473j658729k183031k036420J58058K678985K534336O80501O21947K284898
7989F008018K333142M07628k74245R44876O75833k483696m982751l366247J012607
7980B75165M025502L247393l38231l193784k073356J945726L611312L84057l073501
7971D810283j426191K719905K627652j587604l035433M54650K523834j355121
7963E731975o324801n318297Q13474N093814L725357m69542k674113j191354J679218
7954A065731K409480J44288k252800k068680n43295n49263j828273j974363j133402
7945f730577j449352k320314j047502J665420K105847K42908M74967L986387N917508
$$ plain form
7936 2845292 5751447 4158384 1224077 -547547 -1606877 -2093341 -495343 3110997
7928 3110997 5852337 5733931 4023874 2642664 1609167 626741 897973 3109983 5027698
7919 5027698 3648945 -384573 -2717481 -615618 3030615 3031693 -922727 -3146132 233610
7910 233610 5015327 4475386 -135096 -429092 6458291 12075779 7700808 -3233739 -9452710
7901 -9452710 -6216726 656115 4467414 5144920 5554566 5494710 2978541 -922584 -2195138
7892 -2195138 982266 5267966 5661305 1694144 -1527082 226108 4332809 4725412 504787
7883 504787 -3092639 -2815623 -1335064 -1068378 253362 3926095 5570068 1813698 -2653474
$$ packed form
7936B845292K906155j593063k934307j771624j059330m86464J597998L606340
7928C110997K741340j18406j710057j381210j033497r82426K71232K212010J917715
7919E027698j378753m033518k332908K101863L646233J078l954420k223405L379742
7910B33610M781717n39941m610482k93996O887383N617488m374971j0934547o218971
7901i452710L235984O872841L811299O77506M09646n9856k516169l901125j272554
7892b195138L177404M285700L93339l967161l221226J753190M106701L92603m220625
7883E04787l597426K77016J480559K66686J321740L672733J643973l756370m467172
$$ [...]
##END NTUPLES=NMR SPECTRUM
##END=
