##TITLE=31Pdec_SR135_rm1h
 , 24 sc
 25.7.2022
##JCAMPDX= 6.0         $$ Bruker NMR JCAMP-DX V2.0
##DATA TYPE= NMR SPECTRUM
##DATA CLASS= NTUPLES
##ORIGIN= UXNMR, Bruker Analytische Messtechnik GmbH
##OWNER= root
$$ XWIN-NMR		Version 3.5
$$ Mon Jul 25 16:10:38 2022 Russian Standard Time (UT+4h)  she@DPX200
##.OBSERVE FREQUENCY= 81.013821
##.OBSERVE NUCLEUS= ^31P
##.ACQUISITION MODE= SIMULTANEOUS
##.ACQUISITION SCHEME= undefined
##.AVERAGES= 24
##.DIGITISER RES= 16
##SPECTROMETER/DATA SYSTEM= spect
##.PULSE SEQUENCE= zgpg30
##.SOLVENT NAME= CDCl3
##.SHIFT REFERENCE= (INTERNAL, CDCl3, 0, 248.564)
##AUDIT TRAIL= $$ (NUMBER, WHEN, WHO, WHERE, WHAT)
$$ ##TITLE= Audit trail, XWIN-NMR		Version 3.5
$$ ##JCAMPDX= 5.01
$$ ##ORIGIN= Bruker BioSpin GmbH
$$ ##OWNER= she
$$ F:/spectra/data/she/nmr/P31/1/pdata/1/auditp.txt
$$ ##AUDIT TRAIL=  $$ (NUMBER, WHEN, WHO, WHERE, WHAT)
(   1,<2022-07-25 16:09:33.25 +0400>,<she>,<DPX200>,
      <created by zg, POWCHK disabled, PULCHK disabled
       configuration hash MD5:
       00 E9 B6 7A A2 85 ED C7 34 08 36 98 17 FE 4E 26
       data hash MD5: 32K
       4D BE B2 33 9E 73 32 EE EF F6 E2 DE 8B 81 16 5A>)
(   2,<2022-07-25 16:09:35.96 +0400>,<she>,<DPX200>,
      <Start of raw data processing
       efp BC_mod = 2 LB = 1 FT_mod = 6 PKNL = 1 PHC0 = -10377.97 PHC1 = 356.2568 SI = 64K 
       data hash MD5: 64K
       CA B1 5A C8 2D 0E 85 00 FC C8 C8 1B 10 F9 8B CB>)
(   3,<2022-07-25 16:09:53.90 +0400>,<she>,<DPX200>,
      <pk PHC0 = 54.00239 PHC1 = -156.2 
       data hash MD5: 64K
       AC D6 CF B2 86 83 1B 03 E9 EF 9E 9C 50 F8 C8 F3>)
(   4,<2022-07-25 16:09:57.93 +0400>,<she>,<DPX200>,
      <abs ABSG = 5 
       data hash MD5: 64K
       CC 34 C0 9C C3 A2 4F 53 29 5B C1 23 4B 1E B9 67>)
$$ ##END=
$$ 
$$ hash MD5
$$ 0A CB CA 20 AB AD 6F 04 8D CF 1E 43 F6 D9 59 6E
##$RELAX= 
##$RELAX= 
##$RELAX= 
##$RELAX= 
##$RELAX= 
##$RELAX= 
##$RELAX= 
##$RELAX= 
$$ Bruker specific parameters
$$ --------------------------
##$DU= <F:/spectra>
##$EXPNO= 1
##$NAME= <P31>
##$PROCNO= 1
##$TYPE= <nmr>
##$USER= <she>
##$AMP= (0..31)
100 100 100 100 100 100 100 100 100 100 100 100 100 100 100 100 100 100 
100 100 100 100 100 100 100 100 100 100 100 100 100 100 
##$AQSEQ= 0
##$AQ_mod= 1
##$AUNM= <au_zg>
##$AUTOPOS= <>
##$BF1= 81.014009
##$BF2= 200.13
##$BF3= 200.13
##$BF4= 200.13
##$BF5= 200.13
##$BF6= 200.13
##$BF7= 200.13
##$BF8= 200.13
##$BYTORDA= 1
##$CFDGTYP= 0
##$CFRGTYP= 5
##$CHEMSTR= <none>
##$CNST= (0..31)
1 1 145 1 1 1 1 1 1 1 1 1 1 1 1 1 1 1 1 1 1 1 1 1 1 1 1 1 1 1 1 1 
##$CPDPRG= <waltz16>
##$CPDPRG1= <>
##$CPDPRG2= <waltz16>
##$CPDPRG3= <>
##$CPDPRG4= <mlev>
##$CPDPRG5= <mlev>
##$CPDPRG6= <mlev>
##$CPDPRG7= <mlev>
##$CPDPRG8= <mlev>
##$CPDPRGB= <>
##$CPDPRGT= <>
##$D= (0..31)
0 1 0 0 0 0 0 0 0 0 0 0.03 2e-05 3e-06 0 0 0 0 0 0 0 0 0 0 0 0 0 0 0 0 
0 0 
##$DATE= 1658750972
##$DBL= (0..7)
120 120 120 11 120 120 24 19 
##$DBP= (0..7)
150 150 150 150 150 150 150 150 
##$DBP07= 0
##$DBPNAM0= <>
##$DBPNAM1= <>
##$DBPNAM2= <>
$$ [...]
##$SUBNAM3= <"">
##$SUBNAM4= <"">
##$SUBNAM5= <"">
##$SUBNAM6= <"">
##$SUBNAM7= <"">
##$SUBNAM8= <"">
##$SUBNAM9= <"">
##$SW= 501.771253377433
##$SWIBOX= (0..15)
0 1 3 0 0 0 0 0 0 0 0 0 0 0 0 0 
##$SW_h= 40650.406504065
##$TD= 32768
##$TD0= 1
##$TE= 0
##$TE2= 300
##$TE3= 300
##$TEG= 300
##$TL= (0..7)
0 120 53 12 22 120 120 120 
##$TP= (0..7)
150 150 150 150 150 150 150 150 
##$TP07= 0
##$TPNAME0= <>
##$TPNAME1= <>
##$TPNAME2= <>
##$TPNAME3= <>
##$TPNAME4= <>
##$TPNAME5= <>
##$TPNAME6= <>
##$TPNAME7= <>
##$TPOAL= (0..7)
0.5 0.5 0.5 0.5 0.5 0.5 0.5 0.5 
##$TPOFFS= (0..7)
0 0 0 0 0 0 0 0 
##$TUNHIN= 0
##$TUNHOUT= 0
##$TUNXOUT= 0
##$USERA1= <user>
##$USERA2= <user>
##$USERA3= <user>
##$USERA4= <user>
##$USERA5= <user>
##$V9= 5
##$VALIST= <valist>
##$VCLIST= <CCCCCCCCCCCCCCC>
##$VD= 0
##$VDLIST= <DDDDDDDDDDDDDDD>
##$VPLIST= <PPPPPPPPPPPPPPP>
##$VTLIST= <TTTTTTTTTTTTTTT>
##$WBST= 1024
##$WBSW= 4
##$XGAIN= (0..3)
0 0 0 0 
##$XL= 0
##$YL= 0
##$YMAX_a= 13495
##$YMIN_a= -16450
##$ZGOPTNS= <>
##$ZL1= 120
##$ZL2= 120
##$ZL3= 120
##$ZL4= 120
##$ABSF1= 248.5645
##$ABSF2= -253.2056
##$ABSG= 5
##$ABSL= 3
##$ALPHA= 0
##$AQORDER= 0
##$ASSFAC= 0
##$ASSFACI= 0
##$ASSFACX= 0
##$ASSWID= 0
##$AUNMP= <proc_1d>
##$AZFE= 0.1
##$AZFW= 0.5
##$BCFW= 0
##$BC_mod= 2
##$BYTORDP= 0
##$COROFFS= 0
##$CY= -3
##$DATMOD= 1
##$DC= 0
##$DFILT= <>
##$DTYPP= 0
##$F1P= 0
##$F2P= 0
##$FCOR= 1
##$FTSIZE= 65536
##$FT_mod= 6
##$GAMMA= 0
##$GB= 0
##$INTBC= 1
##$INTSCL= 5.30512e-09
##$ISEN= 30
##$LB= 1
##$LEV0= 0
##$LPBIN= 0
##$MAXI= 10000
##$MC2= 0
##$MEAN= 0
##$ME_mod= 0
##$MI= 50
##$NCOEF= 0
##$NC_proc= -6
##$NLEV= 6
##$NOISF1= 182.463
##$NOISF2= 159.3651
##$NSP= 0
##$NTH_PI= 0
##$NZP= 0
##$OFFSET= 248.5645
##$PC= 4
##$PHC0= -10323.97
##$PHC1= 200.0568
##$PH_mod= 1
##$PKNL= yes
##$PPARMOD= 0
##$PSCAL= 0
##$PSIGN= 0
##$REVERSE= no
##$SF= 81.014009
##$SI= 65536
##$SIGF1= 159.3651
##$SIGF2= -187.1042
##$SINO= 113.3802
##$SIOLD= 16384
##$SREGLST= <1H.CDCl3>
##$SSB= 0
##$STSI= 65536
##$STSR= 0
##$SW_p= 40650.406504065
##$SYMM= 0
##$S_DEV= 0
##$TDeff= 32768
##$TDoff= 0
##$TI= <>
##$TILT= no
##$TM1= 0
##$TM2= 0
##$TOPLEV= 0
##$USERP1= <user>
##$USERP2= <user>
##$USERP3= <user>
##$USERP4= <user>
##$USERP5= <user>
##$WDW= 1
##$XDIM= 65536
##$YMAX_p= 465189612
##$YMIN_p= -40001596
$$ End of Bruker specific parameters
$$ ---------------------------------
##NTUPLES= NMR SPECTRUM
##VAR_NAME=  FREQUENCY,     SPECTRUM/REAL,   SPECTRUM/IMAG
##SYMBOL=    X,             R,               I
##VAR_TYPE=  INDEPENDENT,   DEPENDENT,       DEPENDENT
##VAR_FORM=  AFFN,          ASDF,            ASDF
##VAR_DIM=   65536,         65536,           65536
##UNITS=     HZ,            ARBITRARY UNITS, ARBITRARY UNITS
##FACTOR=    0.620285442955139, 1,           1
##FIRST=     20137.2065510759, 0,            0
##LAST=      -20513.1999529892, 0,           0
##MIN=       -20513.1999529892, -40001596,   0
##MAX=       20137.2065510759, 465189612,    0
$$ Real data points
##PAGE= N=1
##DATA TABLE= (X++(R..R)), XYDATA
$$ [...]
41107 1107659 2199395 1736320 850439 76056 -1091568 -2461919 -2977370 -2531774 -2124067
41098 -2124067 -1923958 -1073246 218040 410045 -858190 -1947557 -1790183 -1445501 -2051209
41089 -2051209 -2963350 -3147397 -2837632 -2511713 -1678005 -73369 1256097 1483910 1372038
41080 1372038 1704144 1649654 314312 -1258047 -1448478 -511049 120282 138175 158542 10180
41070 10180 -783224 -1430073 -865035 124491 -64741 -965284 -529956 1432461 2714236
41061 2714236 2080658 923161 741841 1041489 810964 307576 130415 11532 -225412
41052 -225412 147776 1314049 1887529 802042 -765832 -877502 502470 1792762 2140900
41043 2140900 1962998 1554455 762938 6378 179681 1300494 2321486 2488498 1981414
41034 1981414 1123251 -90737 -1484576 -2545607 -2948789 -2589870 -1252828 812292 2173548
41025 2173548 1448990 -557813 -1420264 -299374 917690 543058 -432628 -249579 544711
41016 544711 -10158 -1935548 -3098299 -2435361 -1294633 -951322 -692098 503891 1879576
41007 1879576 1979524 906959 49158 51692 361385 480594 468389 320806 -75627 -419900
40997 -419900 -370790 -352008 -1015241 -1980241 -2160723 -1379683 -611983 -528107 -873700 -1416018
40987 -1416018 -2276614 -3011492 -2668012 -1337407 -406729 -501000 -398215 968928 2543507
40978 2543507 2551598 1128025 28439 67832 306139 -214244 -1202024 -1825095 -1673382 -727883
40968 -727883 782389 2143736 2452786 1557447 336293 -160880 423552 1710648 2967921
40959 2967921 3515481 3152077 2237208 1145112 -155406 -1666013 -2855880 -3125982 -2538870
40950 -2538870 -1592550 -585612 236942 337168 -526440 -1660335 -2178154 -2061020 -1658098
40941 -1658098 -669209 1126154 2530731 1999156 134275 -634894 596122 1839308 1108892
40932 1108892 -807016 -1762302 -1293358 -681987 -630377 -487269 287225 1192868 1467926
40923 1467926 960748 43347 -763000 -1026025 -738591 -364302 -174106 192191 996179
40914 996179 1575134 975605 -725350 -2413456 -3185856 -2994957 -2161821 -983938 99078
40905 99078 601412 456204 -13761 -594362 -1205511 -1542253 -1347220 -1070550 -1525246 -2651162
40895 -2651162 -3297877 -2644432 -1310635 -571637 -844157 -1468559 -1732507 -1521810 -1016600
40886 -1016600 -352740 185123 86222 -826247 -1924097 -2317098 -1880893 -1314732 -1102041
40877 -1102041 -986029 -762577 -876942 -1535025 -1868833 -1108139 -185904 -686637 -2189001
40868 -2189001 -2425644 -673981 852059 223047 -1260577 -1192441 120192 339452 -941819
40859 -941819 -1512893 -112560 1662674 1914656 1041009 619237 1122612 1976736 2820919
40850 2820919 3534586 3824830 3831215 4419031 5910383 7206155 7089489 5757079 4223636
40841 4223636 2958920 2002875 1576288 1510086 912716 -385093 -927152 353709 2004629
40832 2004629 1746803 -163666 -1254137 -426069 808405 987098 623136 737393 1141419
40823 1141419 1170452 870571 521259 -17469 -711560 -1054863 -982149 -1043170 -1135419 -381055
40813 -381055 994675 1180999 -634189 -2569566 -2437322 -703444 581069 827092 978767
40804 978767 1229009 809390 -112554 -395386 4549 -204268 -1365467 -2055515 -1215613
40795 -1215613 351421 1370019 1708483 1798470 1578693 965299 537040 868563 1760818
40786 1760818 2728134 3591376 4097747 3758409 2645347 1565759 896070 119669 -900593
40777 -900593 -1263635 -494560 377493 299947 -150260 157052 941546 1034718 339233 -178859
40767 -178859 -141179 -11926 81387 407169 649062 253275 -313356 -72445 720925 866342
40757 866342 316175 277772 924115 867772 -397944 -1382163 -986606 -315606 -721160 -1550270
40747 -1550270 -1521811 -1091576 -1468155 -2152730 -1638240 -152050 505097 -101309 -363472
40738 -363472 678994 1881222 1962860 1299473 826322 529230 38225 -434440 -774314
40729 -774314 -1528563 -2718442 -3106532 -1904092 -338149 -99537 -910859 -1195656 -672238
40720 -672238 -492482 -913024 -751705 388452 1099040 273339 -1127387 -1536146 -1002590
40711 -1002590 -718821 -1014176 -1155263 -850011 -667393 -886518 -1017742 -773647 -623517
40702 -623517 -899805 -1046366 -420744 549655 766522 -12062 -720684 -358958 677606
40693 677606 1194377 899644 747924 1400536 2130240 1896427 949670 432101 636250 770651
40683 770651 548067 809272 2023085 3175397 2995609 1615787 168683 -715778 -1135479
40674 -1135479 -1134788 -742201 -538669 -1148682 -2193353 -2633424 -2139489 -1303229 -574304 78789
40664 78789 482879 302291 -80402 214773 1175817 1751395 1442262 968609 869144 583847
40654 583847 -309853 -1023311 -754248 -116268 -205662 -855545 -1053642 -686490 -567166 -887990
40644 -887990 -946773 -536653 -433842 -1153241 -2155283 -2677070 -2557162 -1864815 -519219
40635 -519219 1175733 2268952 2095658 1100834 205260 -305994 -727825 -1088492 -1064572
40626 -1064572 -730556 -759611 -1589186 -2706875 -3076439 -2188575 -497314 1127472 2148900
40617 2148900 2512440 2325055 1701805 884472 187236 -264896 -496246 -348786 406713
40608 406713 1443504 1830223 1050646 -226956 -898515 -736270 -400513 -285266 -64336
40599 -64336 494340 982257 1067954 1270994 2349668 4002349 4817982 3843281 1881804
40590 1881804 769153 1355176 2647160 3163988 2676904 2073465 1810210 1365920 353345
40581 353345 -674967 -994760 -651682 -88027 624243 1506323 2055559 1701637 708690
40572 708690 -49215 -89828 465210 1411739 2447971 2840097 2043883 737426 332130
40563 332130 1165203 1952458 1452966 30771 -968090 -916033 -350155 77020 443009 1130606
40553 1130606 1901779 1904156 832094 -295914 -188224 922148 1414156 542842 -443463
40544 -443463 -218417 568738 402297 -632493 -1058692 -394453 331752 497771 637144
40535 637144 931518 626404 -381101 -907442 -327366 320822 97987 -267198 195524
40526 195524 873492 666851 37623 330301 1529520 2250515 1769172 716379 -124267
40517 -124267 -481333 -183005 700423 1366559 1124739 686665 1388233 3115754 4323477
40508 4323477 4271589 3881626 4021642 4332175 4382539 4718070 5864776 7286870 8305732
40499 8305732 9316909 11185726 14091165 17887830 22928515 29265602 35280668 38374546
40491 38374546 37307908 33141582 27781725 22378160 17343603 13068440 9908402 7745551
40483 7745551 6102396 4690055 3581621 2883279 2485285 2206686 2024196 2001202 2010840
40474 2010840 1714456 973762 201896 52371 675866 1480398 1781998 1570781 1456804
40465 1456804 1898633 2628871 2872945 2117876 713650 -296774 -100902 1047392 2060173
40456 2060173 2187238 1758165 1549503 1646540 1398798 519158 -310826 -273505 486860 1062862
40446 1062862 934689 435593 77488 -79461 -222514 -376643 -432988 -260384 372413 1556250
40436 1556250 2706170 2837125 1832681 923028 1277834 2538324 3436361 3452577 2997324
40427 2997324 2320010 1375979 668309 966414 1967416 2386758 1740157 961752 860165
40418 860165 1120195 1373573 1983795 2903627 2964838 1509991 -195873 -510690 302369
40409 302369 670442 51062 -721990 -1069404 -1192812 -1102797 -513525 239575 432957 200182
40399 200182 352518 873993 872980 251074 96661 961505 1952749 2154633 1910824 1986436
40389 1986436 2318224 2346424 1942818 1348280 712191 242564 323033 973862 1596550 1640656
40379 1640656 1171648 588633 254886 512120 1427785 2394472 2679550 2480442 2623856
40370 2623856 3152351 3281760 2995402 3420502 5061392 6852525 7719380 8023836 8727089
40361 8727089 10282706 13206490 18304057 24847721 29626845 29690303 25652799 20790139
40353 20790139 17286870 14953931 13274815 12743929 13808311 15989879 18569107 21025007
40345 21025007 22498095 22004491 19632534 16552546 13545238 10566674 7981214 6811065
40337 6811065 7080344 7207951 6067022 4645869 4505457 5361631 5530895 4372536 2944206
40328 2944206 2270974 2191285 2190963 2342307 2858061 3405225 3504730 3252056 3082208 3011963
40318 3011963 2635379 1835829 1027962 571681 342631 139323 199568 870608 1848610 2236986
40308 2236986 1570612 493061 145909 997322 2451369 3509905 3643569 3072734 2377471
40299 2377471 1928073 1728150 1738752 2051861 2535703 2666832 2227222 1914957 2503779 3463429
40289 3463429 3393435 2083640 1086130 1606315 2787841 3046864 2349142 1950941 2347318
40280 2347318 2861683 3183059 3877564 4996962 5414292 4310879 2544609 1708281 2220038
40271 2220038 3063646 3239721 2796503 2314264 1925116 1351565 813823 1220679 2922090
40262 2922090 4681979 4856487 3653019 3137089 4556429 6770599 8123895 8777083 10014178
40253 10014178 12221416 15083752 18962144 24054019 28482011 29448398 26685968 22885747
40245 22885747 20207749 18254263 16170968 14665650 14645073 15598160 16891239 19162970
40237 19162970 22614478 25161927 24467406 21166109 17991500 16028199 13935750 10916548
40229 10916548 8288410 7394496 7602273 7374492 6274036 5026568 4320143 4294820 4765307
40220 4765307 5407720 5993627 6627891 7386724 7753018 7048861 5474532 4004081 3173961
40211 3173961 2766809 2756748 3501309 4622760 4815967 3537288 2024778 1715601 2289392
40202 2289392 2318003 1447176 793745 1246108 2436306 3586540 4415507 4798707 4406622
40193 4406622 3413181 2958313 3925022 5452871 5720237 4406365 3326798 3969830 5310594
40184 5310594 5222507 3560981 2360809 2883948 4006455 4189405 3671249 3551767 3734341
40175 3734341 3299977 2433134 2404263 3627821 5057787 5718176 5733947 5628442 5641420 5983605
40165 5983605 6710769 7036857 5873220 3502477 1633741 1229508 1377516 1033205 694022
40156 694022 1241467 2133415 2213161 1726723 1944273 2917542 3171606 1940641 397842
40147 397842 27800 727434 1289741 1154716 862212 1026815 1590787 2146536 2499332 2687505
40137 2687505 2701272 2488048 2251388 2472947 3365458 4380022 4615588 3833389 2762016
40128 2762016 2235777 2357821 2751687 3256571 3918787 4525103 4708579 4548906 4619892 5268321
40118 5268321 6111889 6453715 6112096 5702105 6021880 7139415 8208830 8355862 7617318
40109 7617318 6703315 5961555 5105932 4026619 3248870 3277814 3947052 4705921 5105217
40100 5105217 4766048 3492150 1833126 913837 1147326 1684132 1729528 1737465 2462610 3437501
40090 3437501 3505019 2558578 1636764 1401677 1576797 1860703 2342345 2937426 3418734 4086724
40080 4086724 5353639 6549105 6357240 4786910 3478216 3476803 3875370 3454384 2584601
40071 2584601 2425767 3040543 3518571 3514272 3484899 3595993 3478480 3118040 3061374 3501970
40061 3501970 3834603 3432667 2473652 1741801 1790332 2403520 2833713 2632506 2229457 2405119
40051 2405119 3156906 3571782 3058123 2186037 1885557 2237287 2561847 2400784 1919357
40042 1919357 1568000 1759498 2630865 3740864 4298152 4083198 3820709 4243670 5177636
40033 5177636 5992780 6495568 6800066 6775426 6329238 5893208 5928033 6282434 6734406 7689551
40023 7689551 9388524 10817707 10630248 9076464 7796189 7561397 7452180 6623531 5658758
40014 5658758 5470980 5864390 6106311 6226261 6704887 7220177 6774936 5191854 3679109
40005 3679109 3488290 4402186 5024805 4506496 3530338 3334337 4101822 4887142 5022451
39996 5022451 4805186 4612060 4299562 4072569 4952329 7295698 9562900 9914644 8667280
39987 8667280 7772933 8091884 8729140 9053081 9617778 10692808 11593928 12193428 13526312
39978 13526312 15999662 18504671 20393241 22859604 27021530 32078462 37100515 43410949
39970 43410949 53165770 66622748 83232852 104400150 131283929 158841582 175579012
39963 175579012 172417585 151195257 122734063 97264751 78202147 63965892 52603756
39956 52603756 43408351 35973669 29838886 25038127 21868561 19943595 18212271 16109956
39948 16109956 14063497 12581350 11458280 10344110 9518331 9340139 9287385 8487107 7135015
39939 7135015 6408782 6816501 7599755 8059745 8412429 8813011 8677064 7863075 7504480
39930 7504480 8456672 9719222 9838235 9299193 9827275 11518563 12555694 12108604 11707115
39921 11707115 12925348 15320528 17921199 21410476 26936758 33176773 36466368 34427881
39913 34427881 28476422 22211457 18019636 15772574 14219954 12684158 11279246 10213779
39905 10213779 9499768 9168877 9178498 9008466 7933841 6049348 4536008 4371219 5110044
39896 5110044 5548824 5310192 5028132 5137591 5371451 5521708 5825915 6356165 6800572
39887 6800572 7142794 7804533 8780394 9431966 9596326 10072738 11353499 12611328 12775226
39878 12775226 12052423 11504583 11550668 11816584 12146893 12779116 13678969 14677830 16203457
39869 16203457 18875421 22327551 25469365 28135688 31478377 36394640 42578568 49623918
39861 49623918 58135326 69270685 84279304 104908242 132066334 161733338 183382471
39854 183382471 186180398 168500901 139888667 112530050 91937372 76494412 63468885
39847 63468885 52507423 44053846 37617343 32648720 29256684 27069894 24832405 22090520
39839 22090520 19988137 19297254 18815648 17045096 14588413 13387872 14026660 15158343
39831 15158343 15410761 14631406 13328536 12013772 11171985 10971479 10965991 10806100 11012501
39822 11012501 12155426 13581805 14124229 13989964 14801453 17748183 22702511 28870317
39814 28870317 34845346 38137217 36615506 31174386 25565367 22878084 23353749 25938209
39806 25938209 29973792 34168021 35769948 32894446 26986692 21368734 17813086 15820897
39798 15820897 14521082 13569841 12494006 10868674 9298900 8890849 9553223 9943821 9256699
39789 9256699 8012166 6914161 5979379 5113809 4643378 4840110 5521948 6389256 7270570
39780 7270570 7944446 8224456 8243145 8206396 8047191 7858335 8281005 9619643 10918115
39771 10918115 11014645 10319221 10242900 10834373 10481970 8430871 6169975 5436086 5954960
39762 5954960 6239404 5813423 5431602 5534090 5695049 5567653 5400562 5443977 5558599 5630964
39752 5630964 5803621 6016675 5788327 4856308 3784819 3482499 4123552 4919686 5095771
39743 5095771 4767206 4584423 4803985 5174688 5590877 6286696 7376379 8760130 10484754
39734 10484754 12531147 14268723 15065316 15581147 17295270 20420750 23758457 27256621
39726 27256621 32697440 40097168 45164037 43168219 34856243 25851073 20130776 16716145
39718 16716145 13247308 9929432 8345180 8462011 8836684 8675376 8065718 6975798 5418597
39709 5418597 4012728 3276011 2945011 2826801 3449165 4876510 5809244 5072534 3300794
39700 3300794 2037644 1871164 2492675 3660717 4773336 4400222 1934065 -850186 -1600766
39691 -1600766 -436656 451885 -6578 -741416 -695622 -204007 118161 283650 273779 -128224
39681 -128224 -390772 491117 2226946 3133287 2557527 2072962 3216765 5113817 5637422
39672 5637422 4328839 2908931 3029436 4470433 5686408 5568520 4489365 3800541 4361513
39663 4361513 5671138 6642404 6947875 7027696 6989967 6429054 5454167 4920150 5192321 5479398
39653 5479398 4958875 3940528 3312546 3299472 3352821 2977574 2208770 1470670 1249410 1714362
39643 1714362 2564193 3483166 4565933 5736933 6040013 4565832 2140377 846670 1421651
39634 1421651 2299007 1882599 603922 -183937 -256139 -228645 -47306 809791 2020997
39625 2020997 2617621 2331734 1690013 1005233 355422 278945 1188412 2161711 1711199 -13790
39615 -13790 -1132768 -618256 295986 98526 -664839 -229930 1705953 3375119 3132203
39606 3132203 1373282 -174583 -561442 -345050 -284812 -119256 724483 1696902 1544431
39597 1544431 293325 -414253 368332 1383809 1079703 50510 -1946 851602 873085
39588 873085 -354537 -1061243 -47371 1465307 1809008 1280050 1237776 1816874 2024125
39579 2024125 1560109 1135238 1144794 1183366 887912 404980 38232 101170 943613 2422359
39569 2422359 3563078 3505571 2596488 1800358 1304930 637061 -42695 87427 1093342
39560 1093342 1865406 1481844 249307 -886900 -1278944 -730403 496797 1519143 1411415
39551 1411415 323095 -602853 -680999 -334520 -56908 344195 984578 1347823 1240888
39542 1240888 1465030 2603555 3830358 4003918 3434335 3337464 3780107 3482717 1821288
39533 1821288 -108675 -854084 -244179 734688 1113261 658072 -95458 -264407 524411
39524 524411 1566176 1788494 1034062 82460 -534406 -909427 -895687 14574 1442750
39515 1442750 1849737 480528 -1149922 -871021 1391880 3606921 4255550 3801963 3360829
39506 3360829 3051694 2355008 1349555 689186 566090 454038 -15099 -447499 -235674
39497 -235674 563051 1221431 1175447 612271 159512 189570 566181 888281 758595 -10548
39487 -10548 -1099597 -1681166 -1166078 16127 830826 894744 793890 1032969 1360311 1484567
39477 1484567 1719706 2265826 2451296 1550396 -7382 -1118059 -1427069 -1338866 -819994
39468 -819994 620353 2600169 3691367 3121503 1796693 1040823 998619 876786 162980
39459 162980 -1030738 -2328894 -3136076 -2745420 -1113126 732954 1679500 1726220 1682830
39450 1682830 1938411 2114044 1724981 611289 -1089655 -2816193 -3654513 -3225465 -2364867
39441 -2364867 -2203599 -2642097 -2522365 -1376634 -183514 -82126 -971252 -1771914 -1670186
39432 -1670186 -814693 -93007 -358975 -1554782 -2572520 -2406659 -1403333 -790421 -995384
39423 -995384 -1202819 -713336 138558 751074 1029569 879905 -122769 -1725273 -2461664
39414 -2461664 -1263211 815485 1611609 446435 -1313792 -2226324 -2246718 -2072807 -1999582
39405 -1999582 -1867625 -1505821 -831768 62563 747687 854862 729291 1095399 1938584
39396 1938584 2389193 1960201 1238090 1025202 1427111 2130443 2901584 3357980 2951981
39387 2951981 1833282 1159863 1813809 3230473 4262717 4887558 6229123 8962330 12334565
39378 12334565 14735496 14805126 12266597 8309257 4973399 3491481 3282007 3015202 2306257
39369 2306257 1671700 1256886 693206 102085 97541 643516 957473 777493 668127 759004
39359 759004 354789 -625876 -991698 26425 1345917 1386543 212964 -793633 -969186
39350 -969186 -923231 -1244519 -1711729 -1822768 -1271772 97864 2025142 3523747 3654087
39341 3654087 2688687 1787102 1470550 1200327 554280 -59885 -150713 186743 714811 1450307
39331 1450307 2197578 2389559 1959644 1769865 2470666 3352793 3114159 1615359 157341
39322 157341 -68097 715372 1285708 816765 -355294 -1236010 -1269827 -832223 -607933 -694254
39312 -694254 -634724 -251245 30977 -185477 -730512 -1150126 -1166515 -701429 108107 703599
39302 703599 453341 -439862 -925881 -463175 195804 200203 -38401 389670 1245458 1488202
39292 1488202 1126583 1353084 2571686 3633911 3653282 3346517 3629448 3940492 3238343
39283 3238343 1939558 1387339 1736630 1893747 1537983 1645628 2651862 3539108 3393713
39274 3393713 2599009 1710135 407024 -1368155 -2385060 -1653236 -173424 334055 -153244
39265 -153244 -393872 -208890 -493694 -1127099 -988312 -262495 -473443 -1539481 -1148743
39256 -1148743 1587215 4026532 3539404 1475759 1168130 3072809 4591244 4278305 3432351
39247 3432351 3220918 2863984 1666746 725933 1197141 2333580 2678448 2205085 1958423
39238 1958423 2280498 2609112 2601836 2423534 2176735 1860962 1688183 1794425 1853997 1502681
39228 1502681 904433 476606 338740 370231 451571 375179 -3415 -276699 202575 1187197
39218 1187197 1509193 716403 -89468 216503 1178714 1593530 1292404 1029522 1051508 943032
39208 943032 704140 856326 1417966 1717982 1408614 931986 804899 1013963 1235734 1189533
39198 1189533 752341 148650 -49118 452722 1169867 1408190 1136425 812482 591082
39189 591082 276330 -150237 -533386 -859080 -1012960 -554387 599102 1636902 1847058
39180 1847058 1817876 2631431 4032097 4554415 3589586 2245842 1833455 2380422 3004554
39171 3004554 2998002 2198403 955726 50958 63315 591132 681525 162681 -133447 390693
39161 390693 1406755 2388502 3180907 3552050 3081386 1984020 1255162 1425807 1851080
39152 1851080 1787089 1481764 1533191 1796534 1732819 1401500 1279007 1360787 1247466 998778
39142 998778 1099861 1477575 1273743 12993 -1401326 -1451778 112947 1589611 1032649
39133 1032649 -1385217 -3368445 -3137405 -1385073 -20020 302569 343933 483121 191934
39124 191934 -662614 -1372543 -1607921 -1887220 -2384714 -2437094 -1822713 -1399052 -1727808 -2122879
39114 -2122879 -1921605 -1683982 -2072284 -2400167 -1514572 444368 2294248 3363610 3736246
39105 3736246 3403056 2323380 1041452 150300 -621220 -1736969 -2574340 -2072272 -562906
39096 -562906 373485 78174 -393661 -49947 598445 554067 -41163 -146491 666333 1648442
39086 1648442 1838260 1235500 836653 1436896 2501460 2667857 1561602 490418 757066
39077 757066 1860664 2286035 1706411 1250727 1606148 2041089 1665239 700616 -5180
39068 -5180 -23107 551878 1402197 1929571 1471053 100839 -1192064 -1550634 -1073428 -234935
39058 -234935 963452 2646433 4260002 4912322 4539966 4156845 4768066 6354935 8015097
39049 8015097 8778618 8152596 6243234 3793999 2043036 1992230 3410410 4776346 4678507
39040 4678507 3253969 1840811 1296639 1296224 1346547 1606855 2212914 2577591 2162799 1433728
39030 1433728 1210898 1462625 1598866 1592371 1784356 1817170 965584 -400650 -876463 82945
39020 82945 1296029 1364053 297665 -784348 -922613 46234 1426453 1931911 801996
39011 801996 -976083 -1413393 11622 1522346 1360631 45336 -617224 -31284 847395
39002 847395 1203810 1120934 758159 -17612 -984856 -1518319 -1459555 -1246516 -982281 -277724
38992 -277724 617685 518050 -1074280 -2729704 -2516038 -464034 1341498 1261103 -90436
38983 -90436 -875984 -267748 909579 1459630 1104823 431677 4536 -165987 -383794 -734803
38973 -734803 -940003 -797899 -661128 -1168662 -2356425 -3321175 -3099202 -1728615 -107674
38964 -107674 1035757 1593676 1639517 1175368 445328 -32370 27271 492185 1164163 1799816
38954 1799816 1798495 673581 -919438 -1472216 -413077 1126086 1804096 1507416 735073
38945 735073 -414976 -1686483 -2053256 -993916 275429 269937 -545889 -560629 308284
38936 308284 545999 -341123 -1063548 -868341 -763293 -1521528 -2090147 -1271753 211681
38927 211681 777887 344660 208188 925142 1601122 1313913 317314 -381640 -183204 464530
38917 464530 496882 -461882 -1311581 -691521 972873 1727607 825703 -53016 751134 2374865
38907 2374865 2792858 1884741 1407249 2139650 2815811 2243624 1021368 429818 649809
38898 649809 914461 796266 539940 408726 336788 175610 -79041 -275628 -160829 398248
38888 398248 1078566 1204794 490817 -404040 -409882 730940 2037636 2378879 1830871 1467390
38878 1467390 1756936 1865819 1024376 -67349 -94975 945659 1739527 1517555 827147
38869 827147 293073 -213915 -771451 -934979 -704074 -874583 -1647421 -1951185 -1133202 -296608
38859 -296608 -680178 -1557916 -1295398 21989 689025 -19135 -963480 -1064237 -649012
38850 -649012 -413513 -272037 81318 360972 150935 -342747 -500222 59336 1179773
38841 1179773 2133075 1977680 598652 -712467 -563839 670997 1285880 628350 -110094
38832 -110094 180899 1050559 1573305 1758801 1949516 1767465 805638 -274923 -504970
38823 -504970 -46270 242240 344379 987850 2138049 2841433 2697386 2289696 1841026
38814 1841026 654584 -1457498 -3257056 -3551266 -2842706 -2451618 -2521162 -2126133 -1132284
38805 -1132284 -545893 -758925 -771508 127951 965107 400151 -1213799 -2257690 -2053748
38796 -2053748 -1496185 -1444586 -1578617 -1228018 -494584 38039 231198 480639 1049520 1620767
38786 1620767 1497784 322538 -1223705 -1755158 -756260 474536 289222 -1064685 -1754152
38777 -1754152 -990350 -31167 -48194 -319540 425963 1841751 2437523 1745660 812569
38768 812569 659682 1208740 1744381 1731632 1145986 471830 305149 671098 1031650 1188858
38758 1188858 1569587 2228946 2377778 1568064 548227 86589 -265825 -1183970 -2073769
38749 -2073769 -1854218 -718994 219441 650263 1035912 1195707 499743 -586272 -762266
38740 -762266 90854 654343 278823 -85156 424655 1295962 1726647 1860805 2184793 2615252
38730 2615252 2932393 3370261 4098750 4727591 4862485 4582065 3969215 2855272 1476699
38721 1476699 689819 973151 1737054 2112396 2004023 1964407 2350289 2879832 2842020 1803802
38711 1803802 365590 -187149 488677 1153014 867274 688555 1947570 3519289 3038386
38702 3038386 786932 -169311 1548626 3465309 2928716 855863 -75562 588465 1061812
38693 1061812 392528 -531642 -762445 -408882 -3155 58063 -472187 -1335089 -1673989 -1047379
38683 -1047379 -104139 428305 755312 1229776 1391566 820545 186898 314061 855367
38674 855367 1026978 976379 1240211 1535618 1368137 1176562 1524118 1809692 1242228 460189
38664 460189 566505 1101927 762102 -234041 -378457 639968 1515577 1446639 967973 600646
38654 600646 372343 755646 2299058 4169421 4913643 4888101 5912857 8104709 9244882
38645 9244882 8083094 6131694 5084067 4494433 3407970 2384848 2180744 2017877 1057624
38636 1057624 253656 724403 1413548 615738 -943611 -977865 678267 1672060 709314
38627 709314 -656097 -561177 637378 1441841 1484613 1466577 1603765 1352391 479606 -430645
38617 -430645 -605094 170914 1407518 2296429 2307131 1530024 445353 -513140 -1042396
38608 -1042396 -917389 -254666 340480 339634 -79968 -371143 -432509 -596521 -911786 -997567
38598 -997567 -615157 108957 1000786 1864073 2245086 1797928 945904 577687 970711 1564277
38588 1564277 1865026 1964614 2083006 2270893 2636677 3077326 2725497 779454 -1760369
38579 -1760369 -2495440 -632257 1592194 1712856 278154 -279615 724113 1723050 1831744
38570 1831744 2031651 2851944 2963889 1382847 -488649 -654544 624760 1443686 1092675
38561 1092675 561487 445402 120810 -711131 -1196705 -710379 56959 157347 -248733
38552 -248733 -323734 206335 939655 1566798 2112850 2547492 2610213 2050000 923477 -241948
38542 -241948 -671642 -121789 573076 257295 -1099712 -2223870 -2012543 -723838 521925
38533 521925 959650 658335 234140 349538 1127050 1897935 1926143 1402530 1129736 1204862
38523 1204862 872644 -79950 -767225 -576717 -189429 -475964 -1129658 -1288434 -940099
38514 -940099 -752704 -896597 -984266 -953195 -1106539 -1348326 -1154488 -328588 779504 1727059
38504 1727059 2141264 1636821 211946 -1347126 -2015083 -1473839 -181565 1247554 2308516
38495 2308516 2608604 2225672 1875476 2183600 2940111 3458304 3355777 2601003 1300709
38486 1300709 -17067 -496848 -54431 178205 -662926 -1803869 -1918186 -1046126 -274274
38477 -274274 58474 472730 891370 577835 -323862 -593260 284425 1258873 1128728 -58879
38467 -58879 -1405308 -2161934 -2038225 -1302307 -852750 -1425600 -2491096 -2698527 -1606037
38458 -1606037 -171984 627714 798484 773178 793945 1074346 1643139 1823025 897365 -477467
38448 -477467 -729790 355553 1113895 395195 -795975 -972220 -335481 -117211 -599949
38439 -599949 -1044143 -1052399 -847734 -521320 -13390 397102 475413 685803 1622246 2948134
38429 2948134 3691520 3501072 2911232 2441642 2085323 1656402 1074402 306860 -517014
38420 -517014 -985111 -782872 -104456 625490 1229880 1643087 1612806 1031328 341898 92520
38410 92520 218685 253211 123775 199904 535470 574676 -177305 -1448913 -2350979 -2160264
38400 -2160264 -908451 736301 2065874 2710959 2532473 1578595 412409 2789 667869
38391 667869 1410138 1064732 -38642 -457796 293125 1069387 800459 -94705 -569991
38382 -569991 -471626 -485456 -1021159 -1774766 -2171881 -1862394 -987483 -138138 236857 394874
38372 394874 836391 1395358 1488835 1183610 1092742 1211310 985928 675585 1251276 2472396
38362 2472396 2565183 727300 -1393147 -1922190 -1327870 -1330401 -2110707 -2262733 -1159123
38353 -1159123 198246 736011 502481 122709 -37569 37134 175007 212204 344943 990557
38343 990557 1936562 2194913 1313055 274865 357456 1537275 2697264 2922537 2000886
38334 2000886 349803 -844472 -305227 1561628 2507859 1242585 -587246 -735276 267772
38325 267772 104933 -1496870 -2310601 -1148085 425505 654614 -43284 -321229 19130
38316 19130 381201 629993 768246 250268 -1106015 -2087588 -1231762 1142358 3047722
38307 3047722 3059532 1752825 812926 1246263 2659718 3928886 4248450 3618070 2648574
38298 2648574 2132664 2627336 4033815 5547518 6424503 6840300 7506036 8461071 9031456
38289 9031456 9093146 9316021 9816199 9928341 10094802 12396556 17620276 22952571 24582077
38280 24582077 22022541 17974545 14447135 11281640 8384858 6816817 6855926 7056255
38272 7056255 6342575 5492348 5514412 5973158 6049636 6078085 6838190 8170236 9275767 9666641
38262 9666641 9100661 7481280 5546495 4622741 4836799 4627738 3005946 1184017 745618
38253 745618 1242431 1127876 274020 -188277 -107924 -546716 -1727275 -2452736 -2023455 -1317186
38243 -1317186 -1268096 -1405027 -817605 182451 410241 -446581 -1341092 -1240003 -335235
38234 -335235 432206 630641 620953 732921 773618 567180 449204 752219 1164653 1194223
38224 1194223 1036528 1312940 2053239 2629575 2659415 2263314 1483799 336460 -476772
38215 -476772 47313 1694752 2824338 2302722 950199 402196 1092202 2046044 2275372
38206 2275372 1723088 1049611 970088 1641602 2409815 2388179 1458564 363804 -272288 -500555
38196 -500555 -517460 -259370 207439 534476 609077 592793 282657 -685756 -1733638 -1565374
38186 -1565374 -97103 984878 494336 -487890 -301398 743267 999095 122297 -584818
38177 -584818 -393489 -106482 -435002 -781291 -345340 523975 928636 791656 762744 955948
38167 955948 597052 -798043 -2371294 -2621205 -1205884 458207 807061 -7147 -498555
38158 -498555 99372 1036871 1398087 1278207 1187869 1159167 1082881 1213488 1605704 1651081
38148 1651081 961455 204376 232055 807610 1067891 904155 942419 1349926 1616626 1519407
38138 1519407 1449201 1641270 1757523 1415866 652969 -243631 -988141 -1366866 -1379757 -1280211
38128 -1280211 -1267195 -1311870 -1417633 -1638344 -1661925 -1044652 -225997 -436278 -1882592 -2928463
38118 -2928463 -2169717 -587656 -251751 -1356747 -2149106 -1671662 -865378 -630861 -455349
38109 -455349 252555 820581 394346 -550969 -918046 -647991 -566589 -840046 -677259 296937
38099 296937 1255790 1230705 475899 168565 804280 1473200 1095358 -8175 -471974 225617
38089 225617 1089053 1173728 956559 1369579 2137522 2160709 1255863 389456 177171 190888
38079 190888 -55121 -357620 -377140 -172851 127463 534560 846992 784515 664161 1121750
38069 1121750 1871524 1708611 323607 -806658 -234300 1404892 2188566 1405424 174404
38060 174404 -382803 -516157 -1042062 -1979054 -2613468 -2531007 -1971361 -1272102 -511395 192470
38050 192470 507925 355725 237210 613596 1098697 881337 18850 -404966 222313 1068488
38040 1068488 1029889 333389 81477 528031 882932 822690 1049163 1976227 2883011 3032222
38030 3032222 2822490 2982896 3214293 2669045 1524555 963958 1445039 2003760 1766068
38021 1766068 1304036 1644454 2444633 2290487 851126 -385510 -88501 1074609 1475727
38012 1475727 841298 366385 695488 1102523 964859 770548 936496 725305 -552859
38003 -552859 -2001109 -2108460 -935634 -20144 -107912 -270007 368167 1170820 999859
37994 999859 -68234 -896540 -847306 -425421 -351747 -567406 -451043 187698 694320 336135
37984 336135 -674192 -1311276 -1001136 -335786 -196409 -513224 -417824 505344 1637656
37975 1637656 2043514 1413383 230967 -769689 -1293273 -1723528 -2539188 -3458621 -3574300
37966 -3574300 -2562618 -1272955 -705439 -864994 -1140399 -1336862 -1631019 -1865133 -1691415
37957 -1691415 -1236363 -888458 -585769 -34961 540110 653408 413827 283136 81011
37948 81011 -807910 -2153957 -2758992 -1904731 -209425 1188667 1675140 1286207 522383
37939 522383 203366 802507 1733961 1939294 1263026 514521 136765 -237418 -720803 -743315
37929 -743315 -164674 160766 -393080 -1217444 -1420441 -1144122 -1129611 -1440892 -1488378 -1123766
37919 -1123766 -912801 -1224232 -1593397 -1258517 -138112 980115 1356059 1264799 1603728
37910 1603728 2410628 2472712 1004454 -932369 -1646750 -1020132 -346041 -264243 -229892 -1627
37900 -1627 -117806 -566760 -477036 297266 695776 281798 142571 982427 1656561 918403
37890 918403 -422633 -567910 779725 2505341 4172200 6392303 9113960 10985393
37882 10985393 10883714 9219913 7326486 6050548 5192016 4057505 2476386 1246339
37874 1246339 1231422 2030259 2294537 1611465 1066404 1361823 1552437 751514 53421 1123824
37864 1123824 3386455 4416117 3211152 1441884 968787 1526583 1725987 1330335 1355694
37855 1355694 2227108 2914112 2276750 757194 52000 944988 2083252 1633632 -165095
37846 -165095 -1238548 -584497 424343 325663 -205386 317805 1677358 2415882 2267532
37837 2267532 2358167 3064248 3356054 2570868 1409439 702487 384199 187742 277140 624907
37827 624907 696150 302870 -64535 -227871 -714114 -1572434 -1768128 -630519 833848
37818 833848 1087519 98081 -740648 -544486 80648 60476 -805932 -1743587 -1888819 -1104368
37808 -1104368 -20027 711732 1147535 1805309 2703524 3123929 2569614 1507169 759550
37799 759550 531906 535337 765643 1465325 2341062 2521537 1593687 239687 -508977 -364068
37789 -364068 200153 698412 865476 326209 -1141307 -2757772 -2984539 -1366720 359271
37780 359271 9445 -2263737 -3937042 -3126317 -731606 930509 894000 205782 228585
37771 228585 1041837 1559619 884648 -538684 -1227428 -373071 1032501 1458587 947028
37762 947028 824012 1356014 1293577 239662 -314095 567615 1455595 812167 -396755
37753 -396755 -402100 230126 -306433 -1507891 -1027076 1220951 2369315 884082 -1070924
37744 -1070924 -965724 525941 1018457 -106694 -1521885 -2173785 -2039411 -1446889 -1029251
37735 -1029251 -1598530 -2810006 -2850563 -861857 1258602 1179723 -487507 -1115123 26531
37726 26531 943034 166542 -1247890 -1673366 -1141737 -635703 -481689 -574068 -1201934 -2410795
37716 -2410795 -3152899 -2320613 -432370 753981 346932 -794864 -1412930 -1296966 -1011724
37707 -1011724 -809025 -491842 -159898 -362320 -1245269 -2014285 -1721376 -432620 824044
37698 824044 1230373 869870 273275 -158578 -104133 709024 2061788 3200035 3708700
37689 3708700 4093764 5003222 6214793 7044124 7521645 8341713 9575675 10235452 9523066
37680 9523066 8012957 7091821 7395766 8154715 8065349 6657384 4819486 3983262 4656445
37671 4656445 5784188 5801093 4344518 2600802 1808339 1809828 1509583 545406 -140890
37662 -140890 394441 1748819 2664910 2683548 2669803 3524377 4906299 5651348 5137489 3761186
37652 3761186 2265559 1143270 627487 654853 701337 194060 -675182 -1014232 -407029
37643 -407029 402009 400235 -438921 -1239906 -1343144 -864376 -243623 260901 535489 460009
37633 460009 44466 -428137 -605688 -437314 -236216 -273015 -346494 19890 840476 1408979
37623 1408979 1106465 256298 -308974 -425955 -721104 -1468874 -2008615 -1648028 -627182
37614 -627182 243624 528503 361876 54664 -96312 88081 391334 336273 -94030 -306125
37604 -306125 -48475 50395 -501223 -1068313 -786962 -42129 39438 -564638 -633196 383737
37594 383737 1467885 1577297 1078260 833696 665028 -169290 -1330314 -1467083 -164725
37585 -164725 1107300 611114 -1501330 -3229535 -2875958 -772910 1214779 1639278 724898
37576 724898 -195634 -185213 532732 1156438 1294650 1164824 962958 423857 -735033 -2062144
37566 -2062144 -2471096 -1360188 526872 1715281 1527978 708672 394428 781952 1119363
37557 1119363 824477 170190 -203443 -99909 152397 264614 335889 555274 729207 367205
37547 367205 -630922 -1530105 -1338248 19966 1334201 1233475 -298946 -1782159 -1753632
37538 -1753632 -293923 1150358 1390846 634378 -122327 -452609 -749036 -1225035 -1392097
37529 -1392097 -888469 -248469 -189966 -441333 -56392 1109090 1970349 1503056 -55886
37520 -55886 -1549838 -2059945 -1540038 -665471 -219310 -340775 -374262 178220 746947 430920
37510 430920 -470739 -670539 193715 989455 869171 379887 25723 -935784 -2899943
37501 -2899943 -4187618 -2806351 434690 2464011 1747203 -123593 -993262 -635890 49762
37492 49762 800873 1693532 2064867 1136386 -624691 -1859689 -1949042 -1499309 -1260997 -1243964
37482 -1243964 -976522 -154538 1084396 2256934 2828835 2534489 1467100 16394 -1121139
37473 -1121139 -1235737 -476410 -129647 -1135897 -2475339 -2227647 -349887 1081596 917130
37464 917130 532306 1252397 1834125 414478 -2140620 -3147102 -1939950 -485079 -125302
37455 -125302 -52139 471513 665717 56682 -293374 183097 40628 -1887126 -4046343
37446 -4046343 -4070048 -2247770 -971928 -1206633 -1671936 -1456754 -1246401 -1510940 -1459595
37437 -1459595 -671548 -170810 -796267 -1713748 -1680822 -890745 -461957 -765283 -1283150 -1608507
37427 -1608507 -1607009 -978059 399538 1880555 2572311 2310218 1603514 927497 572152
37418 572152 721953 1073821 909275 252012 295499 1699934 3100906 2650290 692521
37409 692521 -600369 -218482 657033 890353 972556 1571740 2003470 1471502 869694 1794985
37399 1794985 4059362 5568214 4900138 3064738 2287785 3574740 5843621 7207731
37391 7207731 6805348 5384052 4297034 4196569 4814328 5642449 6312198 6470492 5981845
37382 5981845 5339393 5208342 5395524 4978105 3707977 2512010 2191733 2415364 2551481
37373 2551481 2694159 3085267 3234014 2592368 1613418 1123251 1009282 596584 46857
37364 46857 169702 872955 1042265 220867 -697727 -860458 -529354 -220794 288128 1287328
37354 1287328 2132361 1855409 520182 -803003 -1343333 -1306243 -1241888 -1273022 -1138842 -713468
37344 -713468 -253268 -136494 -407718 -675931 -585930 -285046 -165892 -234881 -141112 172124
37334 172124 391346 582846 1390746 2999061 4365765 4194376 2527968 747131 -23793
37325 -23793 64412 247010 217621 203231 391406 726182 1077699 1245141 945032 190776
37315 190776 -419740 -273500 364607 542182 -86931 -663674 -253269 791950 1204829
37306 1204829 425038 -761066 -1302226 -1090324 -844097 -1137246 -1830788 -2320182 -2161781
37297 -2161781 -1479656 -734112 -88382 663811 1317667 981878 -679241 -2339546 -2252438
37288 -2252438 -552863 868849 959373 629937 841408 1065864 618343 146792 418001
37279 418001 713758 56509 -809556 -482698 645277 1022823 724715 1367783 3105219
37270 3105219 4049539 3385118 2864920 4118224 6487405 8961797 12287579 17031284 20916639
37261 20916639 20653891 16092986 10465307 6521427 4259377 2588859 1352235 979991
37253 979991 1434414 2242146 2801590 2364325 656478 -1193284 -1413671 245676 2086617
37244 2086617 2713343 2678367 3147891 3924111 3908088 2930431 1918243 1414995 982185 170812
37234 170812 -736478 -1212327 -1174356 -945726 -854644 -998881 -1163953 -957922 -260983 530046
37224 530046 977528 1185720 1543406 2035669 2312278 2373907 2582747 2897234 2731201 1855181
37214 1855181 888521 515248 675482 949707 1268816 1691343 1906035 1681753 1527988
37205 1527988 2061064 2823057 2692595 1629398 1035140 1907149 3454775 4233352 4034910
37196 4034910 3835822 4248047 4898491 5250273 5273927 5214263 5261611 5569831 6184980 6915737
37186 6915737 7622968 8546946 9911888 11332509 12189997 12579198 13262115 14570654 15940125
37177 15940125 16736721 17036039 17308512 17724064 18039644 17930974 17289048 16360551 15531922
37168 15531922 14735907 13365811 11283918 9524940 9089445 9259000 8354465 6316825 5114355
37159 5114355 5928096 7247975 6875722 4844464 3008381 2355503 2202596 1844408 1532412
37150 1532412 1569031 1612476 1358441 1065392 914123 508345 -452164 -1449195 -1633112 -852799
37140 -852799 165261 603059 308507 -205773 -392844 -207015 64668 365439 882977
37131 882977 1455320 1509957 913370 347853 325293 297930 -545918 -1920033 -2684532 -2350036
37121 -2350036 -1580358 -1175750 -1247112 -1503113 -1741968 -1875115 -1900898 -1950443 -2019241 -1745513
37111 -1745513 -897074 60996 410352 68688 -472445 -868979 -990735 -618085 115368
37102 115368 337060 -442989 -1094691 -80095 2143724 3446106 2977654 2158268 2142224
37093 2142224 2053317 870917 -478018 -523718 294241 324967 -727270 -1602931 -1563963 -1108253
37083 -1108253 -702930 -287811 -118837 -692330 -1578665 -1633926 -734839 -88272 -382301 -855382
37073 -855382 -815451 -863727 -1663789 -2474951 -2099798 -718272 389969 650457 602776 604925
37063 604925 277691 -492368 -980404 -639158 -44499 -133951 -856727 -1320916 -1188155 -1130711
37053 -1130711 -1644393 -2120607 -1744402 -897636 -781993 -1662407 -2419852 -2221955 -1791581
37044 -1791581 -2269487 -3376062 -3657981 -2400625 -435191 977558 1299146 662993 -522343
37035 -522343 -1598243 -1906855 -1422133 -767898 -425853 -368709 -566407 -1166688 -1862777 -1791214
37025 -1791214 -610636 826060 1422145 1037301 265672 -451167 -874002 -674922 78433
37016 78433 545668 124509 -477872 -202864 591476 614813 -91495 69042 1625968 2691114
37006 2691114 1423736 -1201207 -2596675 -1992063 -1034559 -1026082 -1242987 -606697 353612
36997 353612 347049 -598570 -1138690 -580907 162101 -114690 -1279652 -2025870 -1454785 -107275
36987 -107275 667124 158859 -1124226 -2287195 -3036248 -3527811 -3617044 -2933755 -1633911
36978 -1633911 -334696 802785 2116898 3327894 3367055 1955480 445758 159690 622588
36969 622588 544696 -121494 -513432 -767192 -1832574 -3380884 -3750240 -2474269 -1158898
36960 -1158898 -1043526 -1291605 -799507 -201231 -573683 -1316239 -1071499 -28248 448321
36951 448321 53217 -302380 -337545 -677031 -1271436 -1247240 -611052 -503824 -1252917 -1614612
36941 -1614612 -643494 894606 1696320 1461158 575851 -725167 -2102848 -2876869 -2815688
36932 -2815688 -2455286 -2054615 -1122062 343201 1152811 463591 -792525 -1098404 -367570
36923 -367570 295853 339184 145753 24665 -96263 -153675 -62380 -142732 -558334 -636615
36913 -636615 225194 1241416 1042874 -225394 -883073 -63845 1077997 1025082 -190403
36904 -190403 -1374272 -1732475 -1332941 -540724 223654 404261 -276443 -1260131 -1512626
36895 -1512626 -641970 611069 1195256 881581 294487 -102054 -540612 -1184716 -1366929
36886 -1366929 -392849 1048582 1278409 -268211 -2191914 -2867382 -2251691 -1344533 -627457
36877 -627457 49431 549493 458864 -104968 -461439 -121252 883050 2210946 3409364
36868 3409364 4297023 5440978 7602677 10518027 13469988 17574900 25458395 36777995
36860 36777995 45691376 45772709 37258281 26835231 20101116 16802554 13963692 10695640
36852 10695640 8153521 6838471 6133504 5562251 4942880 4038462 3198675 3441117 4812382
36843 4812382 5707422 4993079 3692197 3203810 3029758 2002024 761372 868723 1949723
36834 1949723 1981032 454217 -870178 -783587 -242118 -379389 -645839 -110603 683408
36825 683408 566873 -332027 -876964 -749432 -695894 -983563 -793184 460512 2042253
36816 2042253 2718162 2201602 1226237 490426 155788 259119 882897 1731539 2162285
36807 2162285 1963495 1584671 1299902 820198 194041 234095 1198300 1860573 1109960 -173119
36797 -173119 -338412 430013 597374 171916 836939 2753127 3613982 2053276 -94106
36788 -94106 -525169 302845 554595 149787 319040 1047067 1275097 1102003 1552016 2407758
36778 2407758 2425610 1666925 1508056 2172426 2366013 1802154 1999497 3738717 5565271
36769 5565271 5933376 5394174 5547325 7056800 9762384 13469076 17247909 18992759 17371242
36760 17371242 13825598 11200470 10561815 10680130 10563216 10945761 12710073 15118101 16812314
36751 16812314 18106204 21034397 26782521 33761599 38781652 39928353 38019476 35612993
36743 35612993 35064689 37180720 40885393 44027189 45083932 44334926 43239859 43090434
36735 43090434 44795556 49211775 56440213 65486380 76398121 91847024 113189745 134434633
36727 134434633 144320466 137405949 120614793 105808193 98290108 96271354 98755751 107191501
36719 107191501 118718580 124305817 117489193 101728300 85821343 74339416 65609911
36712 65609911 57075032 48792924 41962242 36970002 33423594 30469474 27003859 22829470
36704 22829470 19322212 17723033 17251408 16259119 14683911 13713609 13361253 12240416 9935355
36695 9935355 7931591 7607401 8497473 9165550 8924948 8137096 7460740 7307171 7609814
36686 7609814 7785351 7224541 5986806 4720074 3875313 3393977 3194342 3475278 4321619
36677 4321619 5332322 5896965 5738841 5094064 4464843 4272365 4662331 5485327 6340186
36668 6340186 6721464 6448753 6063916 6395253 7427890 8064388 7496861 6319698 5559693
36659 5559693 5130539 4353388 3670975 4352798 6308964 7699371 7394570 6585891 6995486
36650 6995486 8431125 9293947 9015593 8784252 9807744 11780300 13566841 15073393 17788450
36641 17788450 23010586 29738777 35115041 37225513 36662884 35008340 33116357 31863775
36633 31863775 32981951 37087875 41775650 43933010 43537823 43041410 43637385 44827438
36625 44827438 47224019 52484543 60431226 69907567 82716478 101722007 123036365 135268588
36617 135268588 130919639 115415035 100642801 92384861 89001049 89746510 96920216 108830294
36609 108830294 117046600 114275849 101906303 87139938 75048611 65888989 58229257
36602 58229257 51607238 46254721 42105639 38586084 34975162 31126536 27851140 25979311
36594 25979311 25087975 23995629 22455008 21343326 21193462 21645903 22402454 23562506 24847348
36585 24847348 25536602 25325773 24381461 22705574 20487433 18782326 18498757 18895704 18529663
36576 18529663 17557566 17506729 18779396 20119628 20775181 21486836 22933926 24748844 26472622
36567 26472622 28033438 29031838 29161819 29560443 31854174 35423979 37626798 37417618 36682494
36558 36682494 37074498 37766147 37738998 38127211 40269016 43094319 44730634 45578490 47485769
36549 47485769 50605437 53439801 55738378 59017152 63894674 68942332 72909825 76487350
36541 76487350 80860174 85648956 89422222 91631343 92943505 93829743 93771810 92117235
36533 92117235 89115823 85677116 82382613 79153675 75710944 71831261 67202011 61707586
36525 61707586 56060348 51446457 48160287 45261461 42027924 38925003 36462324 34036015
36517 34036015 31008288 28185291 26855635 26802375 26642132 25822137 24864624 23871484 22351570
36508 22351570 20530750 19302721 18724382 17967263 16863812 16027566 15346879 14021179 12340121
36499 12340121 11631885 11959643 11720136 10294444 9264326 9897474 11088846 11191168 10531534
36490 10531534 10534098 11297236 11635623 11022515 10127430 9630288 9506156 9388557 9017731 8504352
36480 8504352 8436483 9258333 10352513 10485078 9437014 8323965 7967648 7946963 7707097
36471 7707097 7529652 7758523 8019813 7886240 7495659 6988034 6221893 5492372 5478312 5982875
36461 5982875 5884009 4898572 4136660 4236453 4319813 3681754 3154776 3696747 4837106 5682024
36451 5682024 6319451 7010390 7108329 6177025 5265759 5650415 6994737 8015029 8284954
36442 8284954 8201787 7905743 7454299 7346591 7651941 7363030 5880887 4350195 4098743
36433 4098743 4490398 3940244 2515136 1785118 2331919 3121462 3417643 3741181 4565319
36424 4565319 5352087 5459075 5147756 5126800 5524079 5684916 4912654 3395460 2301490
36415 2301490 2549962 3562560 3987295 3678961 3833329 4846422 5417912 4551949 3151941
36406 3151941 2561337 2653677 2604830 2569646 3176927 4061032 4294943 3856254 3496897 3542364
36396 3542364 3785949 4089499 4211480 3646571 2500565 1821947 2213682 2939117 3240212
36387 3240212 3474642 3947767 3898536 2986932 2487059 3309098 4018672 2848873 762170
36378 762170 232482 1517621 2538964 2369891 2429992 3724357 5006442 4701952 3253010
36369 3253010 2450629 3127162 4310697 4481964 3351368 2289838 2720727 4203813 4972882
36360 4972882 4473287 4029933 4490585 4843646 4214494 3569287 3943163 4511740 4228946
36351 4228946 3982201 5031549 6509101 6758409 6136065 6014181 5889360 4283153 1998735
36342 1998735 1453304 2711008 3110706 1383238 -507494 -483613 974853 2262306 2788062
36333 2788062 2654743 1896188 1109648 1466463 3089250 4513513 4573973 3856279 3586798
36324 3586798 3951935 4183899 3722625 2832702 2363017 2876316 3744327 3622412 2320440
36315 2320440 1327144 1654945 2301770 2103571 1850359 2773619 4033122 3912387 2775600
36306 2775600 2510108 3498603 4465583 4946166 5467525 5546559 4143237 2122938 1592947
36297 1592947 2520412 2671575 1378532 629038 1564684 2538288 1962005 872343 1141283
36288 1141283 2810769 4621591 5904931 6735273 7199792 7467767 7840915 8200505 8109880
36279 8109880 7590440 6954766 6059209 4790225 3889992 3963035 4184720 3589849 3011412
36270 3011412 3774204 5035091 4760966 3076085 2166438 2835018 3564153 3194698 2264711
36261 2264711 1483052 1046575 1575082 3525594 5638051 6167375 5547790 5540392 6113688
36252 6113688 5900512 5420342 6635807 9182128 10312262 9110364 7702510 7659778 8103061
36243 8103061 8009624 7605728 6860274 5243015 3449033 2874549 3276911 3478906 3980544
36234 3980544 5898069 7973010 8127792 7286445 7753824 8644266 7424107 5181388 5168307
36225 5168307 6640965 5906217 3306695 2902028 4969477 5498147 3791003 3501794 5049094
36216 5049094 4513198 1698035 1463552 4856839 6888986 5630274 5255118 7357633 8094642
36207 8094642 6954420 8759304 13642651 15744550 15627719 21615508 34103070 43178008
36199 43178008 48333439 63133783 90945161 117931251 146811584 211994851 328468543
36192 328468543 440850350 465189612 384517140 268294608 189170492 153462140 127440484
36185 127440484 97715655 76544007 67716577 59827111 48483413 40946888 39116744
36178 39116744 36040576 29741695 25785018 25398747 23492882 19210734 17510439 19435996
36170 19435996 20487530 19340640 19307544 20565149 19436792 16230008 15751743 18869131
36162 18869131 20988303 20222003 20056233 22372150 24448586 24808910 26049275 29768132
36154 29768132 34006213 37700479 42752216 49767898 56478056 62447542 70896458 83447437
36146 83447437 96873143 107412557 114981169 120816378 123958661 122617921 117013966 108896994
36138 108896994 99784802 90886157 83101320 76079624 68769492 61478363 55762591 51932196
36130 51932196 48482239 44373530 40134317 36453289 33415355 31262293 30161610 29175198
36122 29175198 27176202 24689075 23102925 22386412 21459942 20358187 19873575 19494123 18069616
36113 18069616 16252710 15819017 16657739 16861590 15804827 14757966 14392175 13984798 13185760
36104 13185760 12402089 11519446 10426056 10426308 12559358 14840360 14118431 10673990 7944606
36095 7944606 7526649 7680674 7230827 7418072 8760968 9438539 8511054 7874839 9028172
36086 9028172 10322229 9603974 7668065 6833683 7429416 7781693 6896761 5455794 4578727
36077 4578727 4744021 5577694 6094846 5661286 4916912 4896214 5274061 4833462 3752194
36068 3752194 3697487 5169657 6483216 6190456 5006744 4424184 4722153 5278368 5747191
36059 5747191 6041055 5986758 5648049 5282567 4715915 3634499 2548778 2326176 2733453
36050 2733453 2750531 2363636 2563081 3463013 4042417 3955916 3918963 4038360 3553399 2599566
36040 2599566 2346207 2871344 2827326 1868951 1433527 2252043 3047389 2783004 2339270 2677953
36030 2677953 3061336 2594011 2111820 2924673 4659944 5773063 5516924 4350445 3073550
36021 3073550 2392126 2646464 3334341 3597314 3461508 3608725 3830360 3172460 1869131
36012 1869131 1374871 1943136 2037689 928889 -23005 327878 1196588 1626600 2125919
36003 2125919 3161927 3736502 3009757 1855883 1306323 890763 8298 -554280 -69720
35994 -69720 637451 794510 1253950 2676847 3741563 3258930 2554958 3324317 4431871
35985 4431871 3604086 1342999 179393 554591 554841 -281969 -85095 1758514 3062021
35976 3062021 2203904 696868 740953 1932446 2243763 1250881 595618 1536014 3409935
35967 3409935 4681483 4667981 3914981 3267684 2976532 2795736 2657510 2740377 2858222 2467971
35957 2467971 1597737 1075200 1340197 1716746 1499618 1087075 1245042 1840913 2185095
35948 2185095 2124921 1882039 1247287 -63830 -1514044 -2115766 -1574788 -396893 890327
35939 890327 2006851 2750471 3145842 3408319 3367565 2581809 1449252 1227135 2253214
35930 2253214 3235266 3200051 2924065 3256503 3379125 2399693 1470904 2210312 3820573
35921 3820573 4116400 3031286 2690962 3974930 5417666 6018131 6890030 9122977 11726169
35912 11726169 12848194 11927973 9806786 7635654 6256603 5780088 5342201 4094690
35904 4094690 2572106 2064127 2623836 3013533 2744890 2658380 3146453 3396334 2980333
35895 2980333 2671340 2935561 3047115 2529572 2090711 2190623 2035955 1098802 384151 909479
35885 909479 1960477 2212024 1777372 1790088 2523119 3181108 3178751 2577711 1621827 737389
35875 737389 557192 1104336 1477668 1187786 1138758 2248036 3721342 3951853 2780394
35866 2780394 1682003 1935871 3661009 6353566 9202668 11085880 11521121 11658727 13264934
35857 13264934 16800923 21635661 27876357 36146218 45005186 50375526 49044838 42110956
35849 42110956 33833799 27457557 23121536 19509081 16175514 13716450 12429980 11698745
35841 11698745 10726747 9388795 8102377 7120389 6311371 5576315 5070853 4872533 4760290
35832 4760290 4545167 4362862 4420477 4690354 5038874 5365020 5427196 4941154 4144759 3819751
35822 3819751 4364769 5344596 6467118 8375972 11545714 14765960 15920788 14426992
35814 14426992 11932551 10281725 9615527 8919211 7705235 6468129 5826750 5818431 5988841
35805 5988841 5881183 5462708 5108146 4999658 4663022 3532172 1938027 937332 1003719
35796 1003719 1473005 1535740 1205676 979301 1099321 1557452 2288971 2907262 2781846 1919992
35786 1919992 1258593 1470966 1997324 1977889 1628182 1765236 2373579 2739494 2789292 3070116
35776 3070116 3404236 2902606 1638151 989559 1687745 2698407 2878400 2625111 2739323
35767 2739323 2619261 1171486 -920835 -1566166 -96649 1720800 2038585 1113223 371738
35758 371738 227347 -100162 -975684 -1624111 -1209817 -42978 659895 116502 -1082852
35749 -1082852 -1479741 -273056 1759855 3069356 2959962 2094664 1460966 1324833 1319588
35740 1319588 1084501 540301 -128687 -517660 -323915 169758 269705 -241650 -742285 -551872
35730 -551872 278584 1224039 1902734 2064802 1430398 120583 -1049869 -1337488 -969613
35721 -969613 -699310 -619507 -118128 972557 1900472 1914130 1131515 222365 -338633 -422701
35711 -422701 -62706 501966 854529 831176 758865 962362 1195485 924028 122197 -578221
35701 -578221 -617632 -103493 467112 819170 962056 823047 280132 -351611 -351331 508887
35691 508887 1439504 1575095 1259458 1650597 2980903 4070695 3992264 3406673 3465536 3964163
35681 3964163 3636952 2107691 487291 -98941 370702 1443470 2955842 4561636 5336460
35672 5336460 4816983 4011830 4333006 5569325 5941687 4502535 2616857 2366039 3977201
35663 3977201 5667976 5886028 4822107 3531100 2474374 1609896 1283686 1956893 3105781
35654 3105781 3399031 2305029 788496 28583 137302 612898 1292786 2082790 2366922
35645 2366922 1712623 834800 792098 1358306 1300245 323516 -427919 -132172 550682 619714
35635 619714 76618 -541083 -1117826 -1639484 -1617667 -759567 265215 604224 385964 289946
35625 289946 391938 378701 509021 1216070 1957322 1713012 674987 184240 730093 1249681
35615 1249681 895649 304129 351947 679305 427635 -284239 -645811 -439128 -92579 196759
35605 196759 510469 670641 525230 537002 1210480 2100230 2278251 1694960 1193335 1211015
35595 1211015 1359711 1311999 1213817 1149874 1065574 1233524 1829321 2066865 997512 -662332
35585 -662332 -958842 532975 1883919 1615846 814930 1121803 1955741 1563645 -14803
35576 -14803 -1077106 -1043268 -1072642 -1735414 -1997365 -1161140 -205604 -247596 -852246 -865807
35566 -865807 -71111 918273 1744201 2379050 2596128 2215725 1606502 1273376 1174945 990112
35556 990112 781573 819912 951797 715201 38024 -591029 -647553 -43452 831367 1392923
35546 1392923 1366377 1116426 1240277 1779542 2196036 2197944 2101428 2187986 2217678 1876817
35536 1876817 1264288 640465 133594 -14209 598900 1935487 3258081 3830899 3575538
35527 3575538 2833876 1946614 1282515 1093627 1023526 389776 -665485 -1019098 -86365
35518 -86365 1215416 1693107 1399505 1126617 992209 551920 -31381 -4563 807911 1694747
35508 1694747 1983160 1631996 891042 -15712 -763934 -953033 -435854 502383 1244094
35499 1244094 1165803 254091 -597577 -502422 185090 410012 269631 1018408 2724223 3458538
35489 3458538 1940062 -353470 -1168899 -451222 317475 726228 1363566 1839317 1165889
35480 1165889 -62693 -86433 1255754 2195419 1760340 893559 484677 265107 206936
35471 206936 1008008 2369016 2692873 1513429 472324 774711 1374184 961637 143313
35462 143313 146636 756258 1132210 1487318 2312948 2965406 2692841 2191361 2457058 2855165
35452 2855165 2075556 418663 -619697 -615190 -364899 -121137 571338 1442508 1651239
35443 1651239 1413867 1822929 2845246 3073710 1862554 337189 -197103 292244 1107570
35434 1107570 1751654 1913473 1486300 995927 1202985 2027876 2650647 2753983 2730427 2597895
35424 2597895 1836619 546152 -350714 -415872 -177375 24674 563156 1454380 1906389
35415 1906389 1574109 1251571 1597275 2082349 1977878 1561001 1490003 1662147 1559968 1209605
35405 1209605 989902 909172 785682 766500 1025879 1312534 1359638 1340148 1394423 1208327
35395 1208327 661466 370733 863197 1617586 1658718 793397 -381033 -1328059 -1770218
35386 -1770218 -1449977 -469977 434730 716805 811690 1366495 2053352 2078913 1581218 1423544
35376 1423544 1681775 1502842 655819 118815 664795 1737245 2297370 2152604 1882302
35367 1882302 1887986 2027847 1953043 1493355 887085 690772 1130521 1588577 1291192 520669
35357 520669 396822 1251020 2045328 1857735 1183417 1114138 1825307 2602535 2904343 2647798
35347 2647798 1835055 726865 112135 525885 1340984 1514607 1141075 1250000 1985521
35338 1985521 2164488 1129754 -52301 -127276 428161 210606 -761127 -852335 789520
35329 789520 2780646 3164120 1856927 560336 477647 1026634 1022286 407613 211748 1045355
35319 1045355 2236355 2599754 1776932 642066 438139 1497271 2774267 2852349 1604708
35310 1604708 527713 936409 2136102 2273118 1009423 177138 1190466 2914776 3242486
35301 3242486 2051025 1141470 1507530 2238170 2352469 2225228 2518918 2905234 2763803
35292 2763803 2297842 2026158 1806554 1272149 738776 781805 1263721 1588282 1605101 1509414
35282 1509414 1187364 468589 -248211 -421701 -194383 -68187 -45527 173392 518022 876205
35272 876205 1592320 2640199 2881324 1498328 -271335 -482750 613441 892669 -249311
35263 -249311 -896063 270845 1831790 1856287 647690 -275119 -686976 -1420866 -2433080
35254 -2433080 -2835461 -2483035 -2034007 -1641469 -929073 -150276 -98985 -806570 -1377806 -1195323
35244 -1195323 -433271 545863 1426158 1702876 1157923 475484 427020 552486 -266592 -1909049
35234 -1909049 -2857298 -2212264 -836723 -64893 -100387 -169268 341160 1310207 2070060 2007258
35224 2007258 1316150 997564 1548592 1949593 856016 -1358076 -2837890 -2588002 -1452142
35215 -1452142 -565673 -41686 364910 472670 275021 380292 1064521 1637945 1500444
35206 1500444 1131758 1248955 1595200 1403621 583854 -378036 -1307743 -2277617 -2895342
35197 -2895342 -2509991 -1170981 186748 611491 -51593 -1078580 -1416880 -627655 503451
35188 503451 704485 -186693 -896530 -363339 865193 1441642 962746 258783 213352 854205
35178 854205 1474988 1325645 398318 -337673 36342 1013440 1114968 21620 -799338
35169 -799338 -267452 616084 341558 -761488 -1144981 -390957 587639 1335454 2205407
35160 2205407 2951146 2616705 1190543 -43127 -325040 -372831 -921591 -1435061 -1047772
35151 -1047772 47332 926785 1086455 692445 184213 36376 405139 772077 582965
35142 582965 345713 1119020 2671431 3414370 2759284 2166447 2811597 3514072 2543500
35133 2543500 575856 -60103 1189580 2292310 1512767 -446527 -1762008 -1740974 -1037454
35124 -1037454 -461932 -299608 -353446 -207429 243270 450132 -66315 -731582 -563619 119427
35114 119427 -153208 -1681165 -2713263 -1851767 -215376 194643 -461406 -182237 1666263
35105 1666263 3252724 2901993 1344707 410276 527651 733457 597559 789294 1644307
35096 1644307 2248468 1487658 -509251 -2453918 -3175810 -2472143 -915319 702438 1693929
35087 1693929 1708618 1024965 511743 930387 2128993 3107398 3015459 1951939 671380
35078 671380 -281116 -902479 -1370178 -1703193 -1790287 -1493611 -710923 440329 1528878
35069 1528878 2157597 2367008 2399517 2148114 1287793 -21143 -1070784 -1393954 -1138344
35060 -1138344 -516343 492192 1570176 1899871 1205681 443968 678973 1615027 2104930
35051 2104930 1922137 2034098 2999022 4036803 4112388 3247207 2247494 1625232 1311112
35042 1311112 1098107 843639 395451 -232999 -647187 -368414 590037 1605500 1967710
35033 1967710 1524511 849914 703382 1205350 1659781 1374368 485543 -306890 -597423
35024 -597423 -445788 49430 689512 826192 -68524 -1354960 -1615845 -431908 1009964
35015 1009964 1477384 1049981 418394 -244535 -879255 -826774 321783 1635515 1817483
35006 1817483 1050648 663297 1002539 953027 -115538 -1144221 -807947 717397 2160655
34997 2160655 2731452 2555693 1965556 1141129 339327 -130868 -214858 -79479 157224 412583
34987 412583 519162 416438 305006 289990 35671 -802811 -1843025 -2125947 -1190889 260498
34977 260498 1011380 583551 -292708 -483138 333455 1340978 1547018 958346 520331
34968 520331 821875 1258095 897831 -25826 -161728 1198824 2988153 3545524 2598195
34959 2598195 1323273 546655 -135359 -1088941 -1531346 -665513 675873 791719 -554325
34950 -554325 -1775475 -1668481 -817568 -299246 -101203 322242 773783 622567 -117538
34941 -117538 -933573 -1611996 -2048045 -1774441 -704780 92575 -443163 -1692979 -2109408
34932 -2109408 -1496441 -1142310 -1598096 -1823796 -984255 279913 1034254 1294416 1317846
34923 1317846 763844 -491877 -1596228 -1759579 -1363911 -1148890 -1009977 -558848 -179065
34914 -179065 -408698 -787483 -451235 488575 1216578 1506395 1664681 1554207 888010 225271
34904 225271 335845 703753 135654 -1052398 -1059878 711207 2511075 2608148 1507061
34895 1507061 748634 578960 161654 -552297 -644722 183796 1064295 1188822 709602 194308
34885 194308 -63560 103375 900822 2093099 2764998 2146867 639900 -396706 -38223
34876 -38223 1220044 2039773 1686277 653447 -116232 -221165 211405 1070593 2196135
34867 2196135 2954522 2638453 1453486 468120 290138 379720 79060 -272807 88933
34858 88933 1063011 1752821 1708940 1325454 919797 212649 -872548 -1527589 -919536 440334
34848 440334 954360 -143122 -1642940 -1705890 -155965 1296672 1315417 646269 869725
34839 869725 1979191 2367851 1303268 188046 642483 2208905 3017936 2302218 1085247
34830 1085247 401104 -566 -732258 -1462455 -1316604 -185998 1065962 1601120 1303829
34821 1303829 536882 -308644 -905175 -991947 -537358 178383 742748 874787 579261 135537
34811 135537 -137755 -231880 -470744 -1019996 -1508335 -1443236 -948368 -674784 -869138 -960111
34801 -960111 -375396 551169 906695 287653 -809943 -1592569 -1622478 -994064 -259377 -80624
34791 -80624 -517219 -769281 -163282 751434 865785 259088 250543 1362927 2348960 2010342
34781 2010342 999416 702881 1085803 1018046 308877 -116613 5270 -114025 -673091
34772 -673091 -762040 -47217 427245 -56070 -630564 -335621 211482 -101043 -939866 -1079193
34762 -1079193 -378209 235964 494993 1029242 1871880 2158340 1620624 1099117 1094296 988250
34752 988250 346521 -123860 164266 378978 -567532 -2089576 -2474824 -1261739 161578
34743 161578 558963 314531 364909 661796 605382 330087 403140 538280 -106214 -1260026
34733 -1260026 -1532480 -593850 -22284 -964047 -2132933 -1646638 -14301 619986 -142963
34724 -142963 -518265 290929 771024 -133948 -1034879 -379931 967077 1247425 588135
34715 588135 238965 34060 -1117431 -2750193 -3173996 -2172537 -1186051 -733717 109296
34706 109296 1337772 1464567 139806 -855424 -363508 380655 104635 -254646 565378
34697 565378 1601776 1162168 -173944 -356698 836305 1582665 1063255 523336 798636
34688 798636 774817 -617461 -2334114 -2557991 -1341866 -496875 -1003222 -1782460 -1425020
34679 -1425020 -209995 424105 -2189 -493752 -326784 -162783 -641775 -849176 401887
34670 401887 2233889 2406591 522336 -1202092 -1010963 137747 403315 -258364 -576854
34661 -576854 -48859 913412 2092184 3220376 3270578 1590402 -609297 -1436803 -788424
34652 -788424 -162463 -171682 116906 1190840 2044955 1701450 573493 -306141 -501305 -97328
34642 -97328 767965 1726817 2114257 1575791 446504 -651809 -1306650 -1465888 -1445993 -1601959
34632 -1601959 -1678017 -998937 214606 560765 -614117 -1920532 -1886622 -1333412 -1987203
34623 -1987203 -3371562 -3369698 -1778322 -828478 -1665952 -2665367 -2202239 -1004877 -512286
34614 -512286 -717219 -1018891 -1589265 -2383421 -2244604 -648608 858809 635138 -674080
34605 -674080 -1375046 -1364096 -1689787 -2240772 -1869377 -507976 645603 968010 883920 604516
34595 604516 -96033 -861431 -963624 -626562 -819150 -1621962 -2076857 -1818035 -1601148 -1924648
34585 -1924648 -2230775 -1826759 -731063 592516 1546637 1451242 218151 -1036360 -1067512
34576 -1067512 -196767 149357 -400700 -723406 -106936 743597 1083288 1279746 1877315
34567 1877315 2469420 2276271 1192388 -324384 -1798232 -2682375 -2411227 -1096743 249404
34558 249404 637104 -19403 -1032633 -1507806 -833146 696630 1759888 1342708 197562
34549 197562 -21630 885136 1423146 763762 -99877 -182194 -55935 -566337 -1213948 -1077471
34539 -1077471 -443578 -213479 -382556 -423466 -606707 -1521921 -2631645 -2756577 -1930343
34530 -1930343 -1403624 -1672847 -1788793 -982032 143181 598638 370442 177186 401273
34521 401273 799127 983900 810072 388719 -130141 -808713 -1758951 -2572041 -2400928 -1161138
34511 -1161138 -170219 -696694 -2143787 -2749625 -2018476 -1205483 -1177504 -1203647 -576790 -137886
34501 -137886 -968345 -2404088 -2770953 -1756904 -699617 -528582 -703063 -498940 -196680
34492 -196680 -334936 -606783 -335056 360630 636951 60921 -878866 -1385831 -1104887 -294628
34482 -294628 425356 527185 51191 -402017 -375804 -129483 -203555 -555858 -596490 -104278
34472 -104278 397021 398792 125724 125954 413296 489778 172294 -85748 97988 368886 110125
34461 110125 -527993 -652399 42166 483237 -556659 -2634723 -3904605 -3394826 -2136435
34452 -2136435 -1521976 -1434699 -936103 -133140 -46152 -794610 -1238733 -650725 370321 987218
34442 987218 1111489 908085 335977 -274045 -144553 772205 1380439 890887 -105249 -680119
34432 -680119 -817468 -854564 -624117 -124363 -140356 -1047368 -1804138 -1397947 -530319 -471244
34422 -471244 -982939 -1007683 -755773 -1174740 -1757664 -1081079 481141 869267 -423132
34413 -423132 -1431640 -783731 427613 863510 1029562 1769759 2422798 2118139 1504201
34404 1504201 1479155 1383746 247811 -1136433 -1267464 -344148 252117 325533 750524 1324541
34394 1324541 839800 -602605 -1352611 -753905 -175505 -820143 -2024148 -2588164 -2496618
34385 -2496618 -2305864 -1867484 -814421 343055 714067 290214 -188520 -410094 -692663
34376 -692663 -1079105 -1051617 -385137 317839 395497 144971 528155 1780152 2817137 2493233
34366 2493233 1177483 379509 780297 1463962 1453785 1120543 1288186 1660396 1285939
34357 1285939 279223 -176589 353747 877886 493176 -398253 -999496 -1462366 -2470749
34348 -2470749 -3859766 -4533233 -3855083 -2544485 -1875018 -2215441 -2692042 -2325956 -1205604
34339 -1205604 -240861 66005 72160 149568 44021 -506593 -1048364 -928894 -225600 449818
34329 449818 818872 969024 748428 -92482 -1162530 -1558858 -911815 194239 952422
34320 952422 1073735 771511 430026 348772 529092 759429 1057166 1646893 2213333 1835187
34310 1835187 338163 -921400 -602087 764571 1565530 1341180 919832 638530 52181
34301 52181 -561075 -176925 1032219 1382356 45119 -1717443 -2471272 -2303308 -1681817
34292 -1681817 -230094 1980114 3318699 2549787 925854 510512 1145313 1048179 -23459
34283 -23459 -370448 812965 2237533 2650026 2419159 2290761 2098367 1613023 1372100
34274 1372100 1614054 1454568 289335 -805202 -375308 1147374 1770531 512353 -1366406
34265 -1366406 -1910753 -570527 1461774 2536116 1983447 599697 -141177 502023 1887141
34256 1887141 2772950 2523804 1390469 -22510 -1138295 -1497423 -1014725 -149848 570462
34247 570462 1176030 2018846 2977917 3411125 3009353 2225876 1638032 1288297 944034 635462
34237 635462 506416 351232 -197794 -1007850 -1372837 -766947 523891 1629517 1837611
34228 1837611 1104589 25679 -634291 -565832 -194367 -209217 -709175 -975347 -296717 1055078
34218 1055078 1949094 1614822 573987 111857 798409 1804536 1933649 1147767 580482
34209 580482 950344 1573437 1442197 793331 727562 1386906 1568447 535606 -729474
34200 -729474 -862289 -47843 398636 58449 -150945 319412 629500 -174801 -1636346
34191 -1636346 -2435272 -2092303 -1347331 -931638 -690975 -134698 679044 1214818 1184147 800821
34181 800821 355419 -78061 -362984 -89907 918621 2000438 2107078 1078716 5465
34172 5465 -70663 579405 980513 1021961 1520541 2607455 3034305 1764165 -372371 -1557877
34162 -1557877 -1328856 -1025712 -1689980 -2502752 -2058145 -544546 429494 64557 -697101
34153 -697101 -786832 -505913 -654339 -981292 -612996 375419 1008474 949951 832637 955963
34143 955963 861334 493545 509914 894007 572315 -756895 -1707563 -1266409 -539388 -913465
34133 -913465 -1545036 -675509 1190451 1741416 470478 -512520 176006 1236498 1110386
34124 1110386 424151 526024 1077562 861892 31770 -224600 262917 588915 542241 867267
34114 867267 1674384 1992015 1293765 397706 336835 1082138 1844846 2084911 1805885 1279952
34104 1279952 901688 1085958 1959578 3153932 4004473 3987800 3085592 1830068 881742
34095 881742 468589 368814 414124 642090 887515 767007 363064 393318 1240366 2248892
34085 2248892 2508546 1965015 1207024 520730 -180737 -752268 -866860 -573413 -180371
34076 -180371 319976 1077860 1713737 1539276 566597 -318554 -413138 20966 225806 -153916
34066 -153916 -806628 -1129837 -784164 -88120 152821 -527965 -1628924 -2145899 -1632135
34057 -1632135 -524599 528804 1337816 2112672 2968199 3600166 3488703 2547505 1498722
34048 1498722 1227915 1698072 1972855 1478287 666808 136873 -237860 -789142 -1282591
34039 -1282591 -1323158 -1027974 -635566 20269 906555 1262834 624307 -172748 -146231 132341
34029 132341 -609460 -2000599 -2134128 -279258 1969554 2802411 2229010 1366693 835778
34020 835778 720456 1214067 2270028 3107746 2957258 2056769 1294835 1100862 1175309 1068558
34010 1068558 619181 45932 -135641 386016 1112502 1099917 161745 -834731 -1137381 -924119
34000 -924119 -589281 5597 923178 1467698 978243 -96850 -770529 -894555 -1091215
33991 -1091215 -1434507 -1166113 35026 1277610 1461546 665745 19113 267901 909267
33982 909267 970602 408150 232743 1064452 2052640 1811041 210809 -1446176 -2013879
33973 -2013879 -1534658 -620474 321326 906444 685726 -134564 -533389 78204 968148
33964 968148 1119576 625977 237332 7967 -522406 -1023027 -498768 1033804 2095363
33955 2095363 1561579 145408 -678230 -701511 -1046307 -2350060 -3781882 -4136653 -3257674
33946 -3257674 -1893735 -592923 589040 1466577 1626214 1148842 732516 704564 524494
33937 524494 -208513 -868644 -688289 -34597 165693 -48961 127533 651840 540106 -322148
33927 -322148 -597887 557817 2003694 2004664 469305 -1123938 -1666688 -1478854 -1562522 -2357819
33917 -2357819 -3224274 -3009654 -1405322 311272 573965 -355227 -578033 722882 1907457
33908 1907457 1073804 -1346290 -3319312 -3822378 -3457688 -2917143 -2210719 -1383464 -832065
33899 -832065 -717331 -862758 -1268122 -1959412 -2366003 -1706183 -137830 1160725 1225686
33890 1225686 167903 -1134452 -1686323 -887234 930967 2489149 2644988 1498863 71548
33881 71548 -838124 -1026026 -591313 3247 -34465 -916500 -1706217 -1457449 -557096 -58270
33871 -58270 -124898 -224003 -439214 -1224931 -2031628 -1670266 -201698 902090 775862 100094
33861 100094 -285565 -459095 -675573 -723004 -547159 -516668 -629020 -448961 -187330 -698856
33851 -698856 -1962137 -2773916 -2537235 -2140241 -2358839 -2611173 -2190002 -1619725 -1762653
33842 -1762653 -2477935 -3125167 -3546968 -3653196 -2971640 -1630014 -856229 -1352531 -2012359
33833 -2012359 -1472833 -152742 580015 543467 553978 665454 235924 -492507 -491598 324721
33823 324721 877938 585688 -8587 -429882 -848209 -1159959 -685126 670743 1840649
33814 1840649 1765136 583741 -705705 -1296624 -1040088 -327507 241999 342611 131916
33805 131916 -153919 -513059 -780448 -420514 692154 1729282 1835162 1201851 571784
33796 571784 217760 170835 720500 1633403 1657674 206034 -1153407 -612477 966548
33787 966548 1107150 -462018 -1352066 -267929 1101292 905475 -187531 -478724 203065
33778 203065 892032 1198169 1201983 621416 -569747 -1480667 -1428357 -951233 -686902 -226113
33768 -226113 738048 1199949 295026 -912837 -788578 350255 818131 247628 -156571
33759 -156571 94580 136681 -350914 -393685 501473 1281568 906547 -108146 -594548 -409490
33749 -409490 -324528 -689051 -1034170 -939010 -679258 -746137 -944644 -460196 841295 1637141
33739 1637141 618857 -1333068 -1788423 -48002 1700386 1497829 379332 448143 1502494
33730 1502494 1732111 945825 639828 1129559 1146803 470803 451729 1341272 1531357 380240
33720 380240 -495986 34356 754264 475387 242223 1282519 2473746 2009513 326839
33711 326839 -792935 -1052613 -1398066 -1763649 -1360969 -728658 -1149858 -2153538 -1866976
33702 -1866976 -49964 1355477 1168991 515022 706489 1275896 1056921 -32323 -1189007
33693 -1189007 -1816188 -1770799 -1266363 -886903 -931163 -678060 631706 2072499 1757863
33684 1757863 -369202 -2036099 -1632689 -250575 210064 -343748 -691580 -443039 -384436
33675 -384436 -1162749 -2563933 -3730381 -3566412 -1620624 903320 1929734 974976 -180312
33666 -180312 -59469 473680 -111384 -1458114 -1984850 -1306371 -373927 273060 777484
33657 777484 848272 39474 -957408 -872620 222969 976249 795803 422007 357250 244823
33647 244823 106896 674051 1924255 2644101 2114810 1069058 338694 -275495 -1057624
33638 -1057624 -1457857 -1043611 -424075 -277271 -254224 222689 821523 950920 901703 1287703
33628 1287703 1829560 1749731 1075152 575351 590615 780280 892258 997921 1063819 987857
33618 987857 970973 1248291 1587951 1615365 1435023 1375622 1383331 1259245 1173876 1269490 1110279
33607 1110279 349230 -360188 -74405 976050 1637783 1527363 1417686 1749911 1795434
33598 1795434 789830 -832307 -1896059 -1811311 -1107083 -855570 -1599255 -2607426 -2446187
33589 -2446187 -737218 1077915 1492684 980117 1126206 2052721 2273432 1217528 158997
33580 158997 40073 34396 -732121 -1518572 -1327277 -678728 -513724 -325422 894850 2528395
33570 2528395 2955172 1960175 770596 -99991 -1198014 -2283231 -2097991 -484590 1008222
33561 1008222 1346154 1262991 1489092 1345817 284577 -607231 -172566 773850 621385
33552 621385 -495714 -1026630 -529278 -164282 -612594 -1063005 -708802 -33346 14117 -670435
33542 -670435 -1387044 -1489720 -922870 -290933 -386459 -1154565 -1359653 -96704 1574825
33533 1574825 1653144 -73837 -1582403 -1286752 75427 869027 700952 223202 -194349
33524 -194349 -428891 64022 1615441 3338808 3856970 2942183 1620036 830991 749548
33515 749548 1147517 1575955 1420579 639145 195741 852420 1825212 1718055 554770
33506 554770 -367342 -533340 -687511 -1136173 -1129278 -406515 126720 -7530 24322 744100
33496 744100 1187343 548937 -171761 337840 1428273 1368568 25577 -1014818 -871147
33487 -871147 -306020 -74985 191835 985261 1963920 2594919 2893055 3007052 2770395 2122034
33477 2122034 1396081 834517 345372 -372 154476 764214 1148731 824287 126499
33468 126499 -266529 -36356 669347 1338635 1258449 220763 -873343 -906113 -158851 -63357
33458 -63357 -1056065 -1834186 -1375269 -516475 -467460 -725345 82175 1778780 2645410 1896448
33448 1896448 758084 633302 1283794 1537320 1076518 681124 951663 1522914 1651975
33439 1651975 1139753 423224 -12614 18368 576091 1639744 2735750 2973028 1996940
33430 1996940 643618 -12846 -84944 -542840 -1556611 -2197895 -1971925 -1542780 -1491932
33421 -1491932 -1437588 -1040408 -841673 -1229249 -1484240 -861667 151459 684438 837031
33412 837031 1074874 1034764 255144 -525132 -260187 635207 868646 276935 -230258 -403714
33402 -403714 -727963 -1024501 -727800 -379411 -909253 -1487336 -360186 1862727 2276611
33393 2276611 -46082 -2295363 -1931652 -284794 -136484 -1405457 -1700965 -312607 784112
33384 784112 -107580 -2261365 -3684700 -3291403 -1673212 -347839 -255551 -773664 -671455
33375 -671455 -53934 -196895 -1166658 -1320369 -76822 711157 -305973 -1483454 -768919
33366 -768919 767430 682177 -617130 -504793 1358040 2391519 1383937 350955 1024599
33357 1024599 2114391 1648956 48289 -882703 -641059 -89406 211159 339469 335092
33348 335092 253907 378546 641758 472266 -214884 -655389 -404853 6411 136304 370015
33338 370015 953191 1285258 934995 449089 390857 455901 296021 327417 919998 1623859
33328 1623859 1957169 2090227 2036205 1216524 -266669 -1003517 -50772 1573243 2316958
33319 2316958 2147777 1948112 1735663 984541 135393 210026 1140383 1851056 1912742 1892633
33309 1892633 2077377 1974542 1235439 226106 -480278 -655565 -494961 -445101 -627823
33300 -627823 -290411 1346727 3387988 3688176 1770444 -89634 53010 1053056 742014
33291 742014 -487027 -467679 1043861 1979000 1245711 97651 -143952 296765 842875
33282 842875 1525895 2069398 1617373 131785 -1261636 -1907418 -2297680 -2640261 -2222588
33273 -2222588 -894074 201526 204419 -321314 -562484 -610721 -704868 -495580 98401 372228
33263 372228 7837 -245851 133427 502537 260383 -38102 270708 738271 626864 128807
33253 128807 -179960 -302279 -348080 -8734 506341 485 -1959451 -3649267 -3061370
33244 -3061370 -723203 834843 260838 -1324030 -2233203 -2125449 -1641315 -1116276 -324484
33235 -324484 822279 1796087 1857947 990416 138629 51246 149971 -588079 -1787597 -2009901
33225 -2009901 -1113254 -706701 -1577180 -2289525 -1518997 -299639 -343759 -1265383 -1362546 -472348
33215 -472348 -102095 -946760 -2015589 -2269457 -1696110 -698005 361207 1007433 1131305
33206 1131305 1416214 2229286 2568581 1493537 79354 169267 1464516 1888755 903687
33197 903687 271928 1017055 1801100 1330182 463647 556360 1190861 1094301 284605 -163952
33187 -163952 180261 888952 1619007 2199817 2268249 1792764 1491686 1824920 2075491 1372420
33177 1372420 131802 -540534 -475380 -392807 -522779 -417646 -47872 64363 -45477 392972
33167 392972 1545926 2322972 1701184 206012 -601963 10039 1136684 1414161 628903
33158 628903 -237126 -460833 -492984 -1076369 -1966351 -2291403 -1993213 -1964305 -2582471 -3020019
33148 -3020019 -2453651 -1200664 -99662 573041 936128 859766 251650 -442183 -749783
33139 -749783 -808997 -797974 -229044 1223001 2536746 2209886 387705 -1016393 -726457
33130 -726457 310679 347490 -872390 -2029482 -2079130 -1387899 -976958 -1197651 -1450633
33121 -1450633 -1033952 -20991 791740 777758 190219 -154092 165059 758095 1047548
33112 1047548 1066257 1339802 1973484 2200859 1184430 -813666 -2497886 -2941236 -2503798
33103 -2503798 -2030679 -1618393 -841772 123149 564430 441327 507366 929119 822555 -234984
33093 -234984 -1227745 -1166767 -713675 -1119690 -2063534 -1978150 -451310 1094862 1392452 773502
33083 773502 171309 -208881 -540024 -611470 -258965 72743 -10031 -133550 147674 444079
33073 444079 181902 -264580 -103889 455134 452922 -127910 -111725 1020511 2071677 1658128
33063 1658128 110209 -992513 -819566 -23747 406049 310527 237837 617223 1279941
33054 1279941 1648473 1342845 646240 241203 404660 708366 657262 283286 -129382 -476422
33044 -476422 -590539 -32876 1237483 2321909 2277685 1383745 724558 622402 385800
33035 385800 -339688 -947188 -866485 -320371 243983 660105 676515 32936 -674662 -271968
33025 -271968 1184799 1959473 930395 -667166 -973932 -109672 388595 68506 -178942
33016 -178942 -63053 -302481 -942663 -942522 51609 939127 859437 482200 817462 1654818
33006 1654818 1998207 1411010 257553 -886645 -1557947 -1605546 -1419289 -1477317 -1523829 -885206
32996 -885206 297350 1082618 1188406 1355547 1902376 2132252 1747389 1562377 1988437
32987 1988437 2090557 1229861 428831 777922 1571190 1557404 1074972 1153636 1290290 261013
32977 261013 -1230723 -1073698 872724 2174016 1281099 -422918 -1045712 -829820 -995552
32968 -995552 -1462266 -1468007 -1442295 -2331270 -3496602 -3189567 -1237021 410906 331403 -551633
32958 -551633 -621159 59804 223513 -350195 -466230 517466 1613589 1717665 1259775 1354595
32948 1354595 1858688 1556746 246646 -710906 -394136 350038 427675 278971 872942
32939 872942 1669627 1198699 -523719 -1781473 -1604619 -936569 -823792 -858663 -343736
32930 -343736 174977 -195015 -982940 -875042 342281 1531772 1819286 1407961 740830
32921 740830 -104955 -911616 -1143250 -783052 -650714 -1282535 -1991650 -1712465 -501277
32912 -501277 486551 460723 -181058 -620527 -678419 -779116 -1170569 -1578557 -1573047 -995120
32902 -995120 -11416 1038864 1797407 2050005 1843099 1410528 979005 660874 442391
32893 442391 175177 -317737 -962213 -1344796 -1118305 -458148 87106 157122 -192646 -691670
32883 -691670 -997739 -804351 -236232 -22920 -713278 -1726092 -1854441 -868548 94693
32874 94693 65529 -525101 -634683 -34787 658746 927267 696300 88722 -577412 -841041
32864 -841041 -685174 -742036 -1366941 -1894130 -1471121 -309189 592313 708227 302893 -247147
32854 -247147 -744139 -1009777 -1089532 -1355975 -1827068 -1853253 -1196262 -757556 -1198140 -1512096
32844 -1512096 -396383 1431151 1989077 972452 124263 482343 1086182 930991 461289
32835 461289 366528 483583 749854 1702963 3066758 3399793 2304326 1417075 1794623
32826 1794623 1899223 60523 -2390107 -2769552 -1074003 82639 -606340 -1615287 -1332000
32817 -1332000 -265254 257313 9914 -413991 -672260 -653835 -224738 370010 541376
32808 541376 251900 177102 562142 644384 -269996 -1720145 -2582924 -2284816 -1189781 -91985
32798 -91985 448747 489652 484503 545382 224324 -615800 -1204603 -806317 202279 1032136
32788 1032136 1764577 2842063 3719283 3422722 2289987 1691377 2044738 2626046 3335862
32779 3335862 4828480 6698352 7793661 9174789 14362690 24701073 35884499 41135393
32771 41135393 37365132 27140242 15705126 7514039 4454255 5223563 6513400 6184872
32763 6184872 5039226 4591559 4340359 3055667 1667948 2248677 4382646 5264757 3833543
32754 3833543 2297652 2613529 3658127 3279815 1438835 -260427 -963455 -988246 -666778
32745 -666778 -93916 459253 843326 1267556 1615871 1306542 481855 311077 1213467 1844793
32735 1844793 992479 -518069 -1149880 -976273 -1096320 -1454157 -1080818 -164513 37198
32726 37198 -595346 -744102 88566 703370 204177 -599621 -613355 -72637 179360 82684
32716 82684 91821 215791 190216 102444 142655 176766 112399 164344 253220 -193981 -1204787
32705 -1204787 -1719510 -935948 356790 745596 117085 -389120 -150218 251371 165477
32696 165477 -216106 -341586 -18446 602034 1240806 1511713 1213881 759424 808766 1290079
32686 1290079 1313944 392467 -720851 -893479 -57601 734059 659366 41939 -279300 -123525
32676 -123525 -75691 -500147 -962451 -906403 -523311 -438794 -688287 -608587 150096 1037315
32666 1037315 1275233 736394 -70538 -553174 -408383 176246 547012 256488 -160683
32657 -160683 316620 1706499 2773464 2677720 2061016 1833593 1700806 895343 -225478
32648 -225478 -551107 20786 383695 -116681 -804213 -704194 258934 1298241 1509354
32639 1509354 612827 -572710 -683697 513861 1447997 682903 -931808 -1367246 -370627
32630 -370627 342058 -81191 -459988 167936 915583 720518 160801 293698 852132 993800
32620 993800 895992 1122245 1154096 151950 -1284095 -1710951 -1005467 -432817 -580996 -670184
32610 -670184 -89221 717913 1235440 1569694 1749323 1391530 569788 112763 500058 1189803
32600 1189803 1495756 1422080 1196169 728282 84218 -196215 93561 264011 -321422 -1166960
32590 -1166960 -1270597 -579841 -67331 -378267 -1043881 -1198113 -631664 107519 423013
32581 423013 219555 -222292 -688936 -1121068 -1295064 -830609 164547 790064 277334 -878785
32571 -878785 -1369042 -744748 34495 15183 -456180 -419215 185366 462805 -36721 -587352
32561 -587352 -293057 570023 760554 -304415 -1599738 -1657204 -506021 311042 -102650
32552 -102650 -696666 -85590 1268271 1716692 947996 364248 774694 1237957 822691
32543 822691 87968 -215764 -660033 -1919559 -2969003 -2275623 -408197 403758 -535517
32534 -535517 -1382192 -551116 994173 1296962 211653 -590932 48976 1534705 2487806
32525 2487806 2158406 814397 -712932 -1735544 -2195804 -2432830 -2466168 -1946956 -1028820
32516 -1028820 -660473 -1416980 -2476240 -2491222 -1251266 231487 1108628 1371871 1202315
32507 1202315 554904 -341282 -809357 -487915 189035 599352 623556 480973 307510 177865
32497 177865 155180 61849 -402912 -1106898 -1534983 -1623797 -1903816 -2410138 -2196257 -675078
32487 -675078 1121727 1579337 542508 -606337 -849727 -611695 -776997 -1415771 -1849350
32478 -1849350 -1530449 -565728 414312 835926 781454 812943 988337 568438 -738038 -1835819
32468 -1835819 -1525815 -324143 217673 -177313 -305464 307610 570994 -237578 -1153127
32459 -1153127 -1018263 -103861 722478 1357837 1928311 1919676 1093125 408403 701255 1212946
32449 1212946 884479 353445 879099 1816332 1333323 -328150 -620203 1528983 3741368
32440 3741368 3350542 1031155 -422972 -39888 503804 -144966 -1002684 -423705 1337476
32431 1337476 2400996 1835261 837406 888045 1553941 1196033 -373092 -1323621 -394167
32422 -394167 1236756 1715064 1129721 891544 1146970 661133 -720779 -1319048 59458
32413 59458 2386650 3720418 3268488 1610874 -141005 -844740 8885 1446736 1684835
32404 1684835 275774 -1262065 -1525288 -915577 -505087 -314129 159287 528725 -50028
32395 -50028 -1433736 -2579653 -2851246 -2400156 -1581218 -798646 -559999 -856114 -864316 -88809
32385 -88809 652382 319281 -694626 -1090834 -588996 -157613 -340240 -451510 295509 1631594
32375 1631594 2481803 1982072 296746 -1247509 -1216768 250691 1351868 850033 -306553
32366 -306553 -524157 66403 132634 -555336 -992483 -850424 -771603 -754429 -85014 829833
32356 829833 469766 -1279082 -2410132 -1615999 -229003 -87576 -848890 -950156 -199942
32347 -199942 284478 127254 39349 330565 516210 435958 552835 954981 1022813 350185
32337 350185 -664735 -1296174 -1091717 -82701 1102379 1527015 926891 189224 255783
32328 255783 839679 951991 392934 -186798 -514756 -946387 -1479820 -1593668 -1296605 -1326188
32318 -1326188 -1882924 -2064906 -1154204 223138 874335 520950 -65409 -83593 586264
32309 586264 1394542 1499812 491410 -940069 -1489926 -784881 37835 -215832 -1271587
32300 -1271587 -1966912 -1880136 -1497462 -1054763 -305858 501918 529875 -360445 -1147013 -1088404
32290 -1088404 -833600 -1278574 -1943949 -1577831 -130205 1015736 912732 119521 -462576
32281 -462576 -854867 -1426639 -1838072 -1546220 -987789 -1191107 -2173215 -2636470 -1542633
32272 -1542633 701148 2932534 4438998 5026602 4542056 3128164 1704669 1364907 2136131
32263 2136131 2877805 2629829 1674939 1032650 1226949 1868606 2249753 1987693 1144008
32254 1144008 90684 -606800 -454898 533775 1717996 2334144 2143050 1490072 834156
32245 834156 431897 389216 638982 782563 364275 -447728 -823122 -287536 528423 660635
32235 660635 128525 -136499 344966 956269 885735 125465 -704495 -1076458 -786334 124592
32225 124592 1272070 2025055 2103565 1937152 2112990 2579329 2667955 1866824 439856 -660839
32215 -660839 -556167 617162 1604784 1344122 325869 -61188 401061 418392 -600957
32206 -600957 -1240593 -163651 1453019 1284329 -700372 -2040248 -1260193 285817 796845
32197 796845 574029 895905 1619717 1604518 880393 638345 1159994 1378527 800944 428878
32187 428878 1103009 2070650 2115467 1349600 885100 1154943 1567465 1709673 1926946 2466931
32177 2466931 2798381 2300670 1272723 723399 1188447 2134934 2664856 2544245 2263664
32168 2263664 2193737 2104941 1714477 1326748 1451173 1925209 1977342 1226740 96708 -889560
32158 -889560 -1617559 -1940181 -1476201 -425052 88880 -660742 -1819329 -2092477 -1681946
32149 -1681946 -1810106 -2489146 -2391133 -1275979 -773573 -1749558 -2507928 -1244511 888590
32140 888590 1250785 -323719 -1326989 -441695 702155 428296 -395797 -99930 984394
32131 984394 1232752 348413 -497829 -715047 -819603 -1043404 -973664 -713168 -957229 -1569369
32121 -1569369 -1415903 -181444 838910 517591 -514162 -915249 -467237 113630 568688
32112 568688 1188424 1826182 1912671 1432548 971777 728892 328891 -240418 -389200 22944
32102 22944 196673 -458406 -1272131 -1132479 -18065 1045587 1433198 1518855 1674282 1453038
32092 1453038 349275 -1049972 -1413659 -233968 1459393 2184512 1531555 395618 -101458
32083 -101458 328585 1062392 1324940 1011322 805238 1395366 2571721 3361951 3191920
32074 3191920 2562300 2256393 2225374 1823533 972559 359335 347922 386730 -121433 -876467
32064 -876467 -1102293 -584346 208298 828391 1182043 1246560 936444 321815 -334105 -825769
32054 -825769 -1099580 -1128656 -919137 -617575 -395335 -238801 -30777 209889 349091 332756
32044 332756 200692 24383 10459 467121 1357942 2041209 1859911 986672 332094 545085
32034 545085 1339931 1837141 1383611 86179 -1263689 -1871342 -1721803 -1522478 -1707069
32025 -1707069 -1871278 -1563886 -1172131 -1335407 -1793358 -1688262 -921765 -305414 -308795 -589383
32015 -589383 -925344 -1589037 -2414098 -2518875 -1587704 -548462 -248967 -275403 48887 246944
32005 246944 -604781 -2188923 -3117402 -2686754 -1543283 -633136 -255775 -119101 302622
31996 302622 1323227 2381990 2193132 324242 -1788303 -2380318 -1569428 -899250 -1007894
31987 -1007894 -1192447 -1210199 -1781361 -2846879 -2993523 -1554105 51872 255460 -363213
31978 -363213 -8188 1700489 3302040 3488224 2477338 1391895 1024180 1314498 1608035
31969 1608035 1380936 825397 479910 328023 -88104 -595966 -416910 383582 613123
31960 613123 -193618 -834220 -399180 -15128 -1131510 -2930083 -3281127 -1924269 -812793
31951 -812793 -1178591 -1977850 -1716822 -389985 1025230 1875149 1999824 1479631 746252
31942 746252 261418 -174824 -1024649 -1857989 -1693108 -702802 -300220 -1039127 -1720708 -1312125
31932 -1312125 -503115 -374236 -620911 -312080 410999 677254 372660 70400 -126001
31923 -126001 -514867 -869658 -708697 -308963 -381890 -854463 -1009886 -764183 -726450 -959959
31913 -959959 -798639 -117652 268717 -126604 -725551 -924105 -1060072 -1679837 -2437302 -2491973
31903 -2491973 -1727128 -890689 -561677 -498968 -155131 471387 755036 232455 -680543 -1015854
31893 -1015854 -392399 444402 496661 -274061 -976427 -922583 -332350 95698 -22056 -441208
31883 -441208 -557117 -23276 734559 815934 -90380 -1223740 -1721341 -1744740 -2049992 -2684725
31873 -2684725 -2898499 -2337556 -1528909 -986688 -561154 -7920 405972 308264 -168383 -570005
31863 -570005 -641990 -412918 -53707 130666 -116731 -595844 -675691 86067 1524761 3048423
31853 3048423 3921683 3507596 1827987 -76380 -988230 -839194 -554353 -543328 -283453
31844 -283453 353981 520998 -194190 -833572 -510339 124012 41595 -280126 401912 1890265
31834 1890265 2657996 2114360 1231632 726400 155658 -673047 -860566 121065 1239132
31825 1239132 1187275 90234 -974963 -1474300 -1555566 -1342372 -1024720 -1093094 -1543116 -1411802
31815 -1411802 -137893 1193179 1204418 341047 144249 707232 636057 -335699 -651637
31806 -651637 435774 1362539 634929 -746999 -854804 208351 737948 251587 -67028
31797 -67028 276107 175158 -1085969 -2468821 -2675335 -1908374 -1215433 -908853 -620963
31788 -620963 -338750 -345301 -429896 -128609 326827 177026 -650864 -1255537 -933359 -41908
31778 -41908 599603 661427 300898 -312295 -927415 -965079 -22959 1338609 1910903 1170877
31768 1170877 -139781 -1025331 -1341255 -1462906 -1363694 -811770 -242942 -454363 -1301115
31759 -1301115 -1648615 -992037 -224518 -242013 -666163 -724480 -551448 -575408 -366763 532594
31749 532594 1132489 8284 -2247471 -3272074 -2000133 53130 1148293 1431246 1769334
31740 1769334 1885109 1021714 -406663 -1214596 -1041725 -440327 209594 825005 1050634
31731 1050634 626011 33621 -198373 -500374 -1508014 -2640124 -2678829 -1630927 -684484
31722 -684484 -242938 579002 2064864 2842376 1630648 -781389 -2282721 -1834467 -377033
31713 -377033 523909 341629 -212996 -319962 -57444 -125250 -727471 -1247698 -1247790 -1208356 -1741340
31702 -1741340 -2530588 -2761239 -2292417 -1665786 -1187554 -755677 -386556 -137478 270872
31693 270872 933987 1162709 408369 -467677 -83502 1340700 2062458 1216574 -124892
31684 -124892 -609517 -90762 937308 2099709 2730022 1947207 -1651 -1468111 -1343830
31675 -1343830 -454396 -224701 -777429 -1214254 -1042102 -410576 460171 1209470 1194526 223580
31665 223580 -959465 -1528199 -1459131 -1131464 -733119 -546627 -967492 -1635007 -1506779 -522957
31655 -522957 -105289 -1049127 -2068005 -1691894 -554593 -263642 -853720 -1079477 -631780
31646 -631780 -259874 -70565 442045 834474 71516 -1437724 -1964565 -965406 173602
31637 173602 333922 63886 240337 781832 1343752 1966790 2328284 1595587 -178673
31628 -178673 -1619064 -1782780 -1340621 -1228321 -1160287 -441904 605801 1090877 868928
31619 868928 538689 534116 873341 1369235 1588984 1132373 322098 -88515 -186175 -828220
31609 -828220 -1845772 -1705873 64271 1500663 731967 -1206305 -1886733 -1048034 -538786
31600 -538786 -1005579 -955762 454534 1838431 1809506 1096620 1068346 1413606 915751 -228964
31590 -228964 -640228 -120603 -73023 -1142780 -1904100 -839363 1311794 2357550 1426922
31581 1426922 -180342 -897460 -591812 -48555 316926 567535 664953 551091 504281 708543
31571 708543 651742 -344449 -2048025 -3422018 -3827869 -3524699 -2935684 -2076168 -927346
31562 -927346 129484 533792 -9744 -1263486 -2351395 -2222479 -812515 534616 604753
31553 604753 29021 403379 1788237 2437637 1334180 -380395 -1185534 -1148337 -1153720 -1219119
31543 -1219119 -792987 -63298 252959 82648 -56388 -22067 -99924 -368099 -789950 -1564372
31533 -1564372 -2554944 -2831617 -1821710 -564302 -601877 -1728423 -2112014 -860528 717323
31524 717323 927548 -123378 -847294 -213064 1142177 1749974 955593 -350519 -708565
31515 -708565 239759 1420751 1799948 1594994 1588034 1848595 1870788 1542469 1171028 850375
31505 850375 569315 627053 1129139 1408388 845346 -51908 -345731 -109525 -95429 -302782
31495 -302782 -147711 173323 -81599 -680510 -660744 -140668 -217057 -818958 -518614 934385
31485 934385 1802222 1068810 155126 581987 1547423 1531337 966977 1274294 2101815 1726899
31475 1726899 -80169 -1617373 -1774496 -1235948 -881842 -608669 -267070 -354035 -994778
31466 -994778 -1296835 -569089 510138 697881 -261439 -1452078 -1875549 -1349937 -546002
31457 -546002 -332630 -875191 -1366616 -971338 53328 662545 383766 -229435 -516392
31448 -516392 -419568 -160652 126578 231588 -44378 -390406 -164524 672657 1386923 1497907
31438 1497907 1346507 1302008 1084180 380574 -458578 -952301 -1231507 -1597165 -1752509 -1237931
31428 -1237931 -388711 -58906 -409678 -681749 -314831 274701 287182 -437537 -1219650 -1214811
31418 -1214811 -228921 1033659 1608179 1284646 806745 886053 1346287 1605206 1625526 1743705
31408 1743705 1764888 1056953 -345952 -1495397 -1694748 -1303006 -1008547 -859661 -501208
31399 -501208 63328 509778 736459 868805 898266 758852 620464 706973 943648 1104994
31389 1104994 1112295 873934 171380 -841157 -1411637 -1110388 -643753 -942476 -1691974 -1785147
31379 -1785147 -1174133 -1055043 -1892163 -2457790 -1560468 176669 1137014 724497 -224402
31370 -224402 -591429 123497 1584996 2673580 2269434 623002 -656537 -650883 -351844
31361 -351844 -891097 -1522463 -867262 546270 926988 197128 218116 1684927 2836998
31352 2836998 2146707 535201 -297569 -307221 -453772 -750836 -556219 -96090 -128828 -449228
31342 -449228 -160485 672861 894952 -138495 -1786119 -3006166 -3245039 -2500265 -1243260
31333 -1243260 -233234 184163 392571 620391 298877 -907899 -2102899 -2328012 -2159019
31324 -2159019 -2719290 -3551341 -3210065 -1838775 -1177077 -1695277 -1769316 -489038 706853
31315 706853 473638 -141456 425762 1497208 1383833 469265 671381 2057118 2422075
31306 2422075 742580 -1111716 -1194158 -300567 -476801 -1852469 -2699418 -2159033 -1201179
31297 -1201179 -774357 -508893 166225 770472 527557 -309757 -803705 -624115 -156193
31288 -156193 398021 1080657 1464446 973614 85068 62710 1025736 1444239 379084 -884558
31278 -884558 -681639 434333 556055 -599947 -1443348 -1219122 -983501 -1362994 -1296666
31269 -1296666 -114362 805153 26535 -1479085 -1648979 -397928 463214 84033 -474704
31260 -474704 -291104 81045 -140669 -711680 -1075102 -1349048 -1834741 -2215281 -1943221 -1011392
31250 -1011392 131659 1042943 1338889 783610 -280943 -996876 -830347 -32386 881748
31241 881748 1607435 1852333 1360513 501166 176262 674935 1222533 1144007 783563 632629
31231 632629 277948 -834317 -2090879 -2259816 -1160927 179075 914149 952367 252818
31222 252818 -1265289 -2874797 -3231805 -1978941 -341543 420864 414332 378217 326833 -206119
31212 -206119 -1052861 -1494866 -1310026 -944608 -675972 -313856 189552 460853 245767 -204058
31202 -204058 -481408 -479622 -405178 -571827 -1172037 -1974746 -2319185 -1792697 -891997 -560731
31192 -560731 -993284 -1346771 -817031 383791 1341150 1413434 677417 -315170 -971240 -1030043
31182 -1030043 -705162 -357965 -32701 407273 695731 230386 -1015753 -2096474 -2043113
31173 -2043113 -974233 123772 524779 297912 -96416 -299111 -199911 8710 -90380
31164 -90380 -690854 -1383687 -1523302 -1003647 -405168 -334453 -865339 -1662258 -2355874 -2647933
$$ [...]
##END NTUPLES=NMR SPECTRUM
##END=
