##TITLE=31Pdec_SR135_oil
 , 24 sc
 29.7.2022
##JCAMPDX= 6.0         $$ Bruker NMR JCAMP-DX V2.0
##DATA TYPE= NMR SPECTRUM
##DATA CLASS= NTUPLES
##ORIGIN= UXNMR, Bruker Analytische Messtechnik GmbH
##OWNER= root
$$ XWIN-NMR		Version 3.5
$$ Fri Jul 29 13:39:10 2022 Russian Standard Time (UT+4h)  she@DPX200
##.OBSERVE FREQUENCY= 81.013821
##.OBSERVE NUCLEUS= ^31P
##.ACQUISITION MODE= SIMULTANEOUS
##.ACQUISITION SCHEME= undefined
##.AVERAGES= 24
##.DIGITISER RES= 16
##SPECTROMETER/DATA SYSTEM= spect
##.PULSE SEQUENCE= zgpg30
##.SOLVENT NAME= CD2Cl2
##.SHIFT REFERENCE= (INTERNAL, CD2Cl2, 0, 248.564)
##AUDIT TRAIL= $$ (NUMBER, WHEN, WHO, WHERE, WHAT)
$$ ##TITLE= Audit trail, XWIN-NMR		Version 3.5
$$ ##JCAMPDX= 5.01
$$ ##ORIGIN= Bruker BioSpin GmbH
$$ ##OWNER= she
$$ F:/spectra/data/she/nmr/P31/1/pdata/1/auditp.txt
$$ ##AUDIT TRAIL=  $$ (NUMBER, WHEN, WHO, WHERE, WHAT)
(   1,<2022-07-29 13:37:51.75 +0400>,<she>,<DPX200>,
      <created by zg, POWCHK disabled, PULCHK disabled
       configuration hash MD5:
       00 E9 B6 7A A2 85 ED C7 34 08 36 98 17 FE 4E 26
       data hash MD5: 32K
       5A C2 AA 76 0C 90 C0 4F 14 97 83 0F 64 03 ED FF>)
(   2,<2022-07-29 13:38:11.12 +0400>,<she>,<DPX200>,
      <Start of raw data processing
       efp BC_mod = 2 LB = 1 FT_mod = 6 PKNL = 1 PHC0 = -10363.56 PHC1 = 319.4567 SI = 64K 
       data hash MD5: 64K
       34 96 30 DC 2C 6E F8 72 2E 91 BA EC 17 1E 0A 16>)
(   3,<2022-07-29 13:38:30.78 +0400>,<she>,<DPX200>,
      <pk PHC0 = -20.05663 PHC1 = 50.19999 
       data hash MD5: 64K
       4B 56 05 87 F7 AC C8 6A 84 ED 22 54 EC 7C 75 E0>)
(   4,<2022-07-29 13:38:35.45 +0400>,<she>,<DPX200>,
      <abs ABSG = 5 
       data hash MD5: 64K
       7C F5 F2 C1 3F 6F F5 EB E0 49 EC 45 A5 B1 79 C9>)
(   5,<2022-07-29 13:38:45.17 +0400>,<she>,<DPX200>,
      <abs ABSG = 5 
       data hash MD5: 64K
       FA CC 0D 31 FE 7A 55 5E 23 A1 16 D8 79 2D C4 86>)
$$ ##END=
$$ 
$$ hash MD5
$$ 8D 9B 22 A6 C4 CB 0F 8C 7C 18 07 AA 23 11 E1 A6
##$RELAX= 
##$RELAX= 
##$RELAX= 
##$RELAX= 
##$RELAX= 
##$RELAX= 
##$RELAX= 
##$RELAX= 
$$ Bruker specific parameters
$$ --------------------------
##$DU= <F:/spectra>
##$EXPNO= 1
##$NAME= <P31>
##$PROCNO= 1
##$TYPE= <nmr>
##$USER= <she>
##$AMP= (0..31)
100 100 100 100 100 100 100 100 100 100 100 100 100 100 100 100 100 100 
100 100 100 100 100 100 100 100 100 100 100 100 100 100 
##$AQSEQ= 0
##$AQ_mod= 1
##$AUNM= <au_zg>
##$AUTOPOS= <>
##$BF1= 81.014009
##$BF2= 200.13
##$BF3= 200.13
##$BF4= 200.13
##$BF5= 200.13
##$BF6= 200.13
##$BF7= 200.13
##$BF8= 200.13
##$BYTORDA= 1
##$CFDGTYP= 0
##$CFRGTYP= 5
##$CHEMSTR= <none>
##$CNST= (0..31)
1 1 145 1 1 1 1 1 1 1 1 1 1 1 1 1 1 1 1 1 1 1 1 1 1 1 1 1 1 1 1 1 
##$CPDPRG= <waltz16>
##$CPDPRG1= <>
##$CPDPRG2= <waltz16>
##$CPDPRG3= <>
##$CPDPRG4= <mlev>
##$CPDPRG5= <mlev>
##$CPDPRG6= <mlev>
##$CPDPRG7= <mlev>
##$CPDPRG8= <mlev>
##$CPDPRGB= <>
##$CPDPRGT= <>
##$D= (0..31)
0 1 0 0 0 0 0 0 0 0 0 0.03 2e-05 3e-06 0 0 0 0 0 0 0 0 0 0 0 0 0 0 0 0 
0 0 
$$ [...]
##$SUBNAM3= <"">
##$SUBNAM4= <"">
##$SUBNAM5= <"">
##$SUBNAM6= <"">
##$SUBNAM7= <"">
##$SUBNAM8= <"">
##$SUBNAM9= <"">
##$SW= 501.771253377433
##$SWIBOX= (0..15)
0 1 3 0 0 0 0 0 0 0 0 0 0 0 0 0 
##$SW_h= 40650.406504065
##$TD= 32768
##$TD0= 1
##$TE= 0
##$TE2= 300
##$TE3= 300
##$TEG= 300
##$TL= (0..7)
0 120 53 12 22 120 120 120 
##$TP= (0..7)
150 150 150 150 150 150 150 150 
##$TP07= 0
##$TPNAME0= <>
##$TPNAME1= <>
##$TPNAME2= <>
##$TPNAME3= <>
##$TPNAME4= <>
##$TPNAME5= <>
##$TPNAME6= <>
##$TPNAME7= <>
##$TPOAL= (0..7)
0.5 0.5 0.5 0.5 0.5 0.5 0.5 0.5 
##$TPOFFS= (0..7)
0 0 0 0 0 0 0 0 
##$TUNHIN= 0
##$TUNHOUT= 0
##$TUNXOUT= 0
##$USERA1= <user>
##$USERA2= <user>
##$USERA3= <user>
##$USERA4= <user>
##$USERA5= <user>
##$V9= 5
##$VALIST= <valist>
##$VCLIST= <CCCCCCCCCCCCCCC>
##$VD= 0
##$VDLIST= <DDDDDDDDDDDDDDD>
##$VPLIST= <PPPPPPPPPPPPPPP>
##$VTLIST= <TTTTTTTTTTTTTTT>
##$WBST= 1024
##$WBSW= 4
##$XGAIN= (0..3)
0 0 0 0 
##$XL= 0
##$YL= 0
##$YMAX_a= 3951
##$YMIN_a= -7434
##$ZGOPTNS= <>
##$ZL1= 120
##$ZL2= 120
##$ZL3= 120
##$ZL4= 120
##$ABSF1= 248.5645
##$ABSF2= -253.2056
##$ABSG= 5
##$ABSL= 3
##$ALPHA= 0
##$AQORDER= 0
##$ASSFAC= 0
##$ASSFACI= 0
##$ASSFACX= 0
##$ASSWID= 0
##$AUNMP= <proc_1d>
##$AZFE= 0.1
##$AZFW= 0.5
##$BCFW= 0
##$BC_mod= 2
##$BYTORDP= 0
##$COROFFS= 0
##$CY= -3
##$DATMOD= 1
##$DC= 0
##$DFILT= <>
##$DTYPP= 0
##$F1P= 0
##$F2P= 0
##$FCOR= 1
##$FTSIZE= 65536
##$FT_mod= 6
##$GAMMA= 0
##$GB= 0
##$INTBC= 1
##$INTSCL= 5.30512e-09
##$ISEN= 30
##$LB= 1
##$LEV0= 0
##$LPBIN= 0
##$MAXI= 10000
##$MC2= 0
##$MEAN= 0
##$ME_mod= 0
##$MI= 50
##$NCOEF= 0
##$NC_proc= -8
##$NLEV= 6
##$NOISF1= 182.463
##$NOISF2= 159.3651
##$NSP= 0
##$NTH_PI= 0
##$NZP= 0
##$OFFSET= 248.5645
##$PC= 4
##$PHC0= -10383.62
##$PHC1= 369.6567
##$PH_mod= 1
##$PKNL= yes
##$PPARMOD= 0
##$PSCAL= 0
##$PSIGN= 0
##$REVERSE= no
##$SF= 81.014009
##$SI= 65536
##$SIGF1= 159.3651
##$SIGF2= -187.1042
##$SINO= 113.3802
##$SIOLD= 16384
##$SREGLST= <1H.CDCl3>
##$SSB= 0
##$STSI= 65536
##$STSR= 0
##$SW_p= 40650.406504065
##$SYMM= 0
##$S_DEV= 0
##$TDeff= 32768
##$TDoff= 0
##$TI= <>
##$TILT= no
##$TM1= 0
##$TM2= 0
##$TOPLEV= 0
##$USERP1= <user>
##$USERP2= <user>
##$USERP3= <user>
##$USERP4= <user>
##$USERP5= <user>
##$WDW= 1
##$XDIM= 65536
##$YMAX_p= 379996547
##$YMIN_p= -73075134
$$ End of Bruker specific parameters
$$ ---------------------------------
##NTUPLES= NMR SPECTRUM
##VAR_NAME=  FREQUENCY,     SPECTRUM/REAL,   SPECTRUM/IMAG
##SYMBOL=    X,             R,               I
##VAR_TYPE=  INDEPENDENT,   DEPENDENT,       DEPENDENT
##VAR_FORM=  AFFN,          ASDF,            ASDF
##VAR_DIM=   65536,         65536,           65536
##UNITS=     HZ,            ARBITRARY UNITS, ARBITRARY UNITS
##FACTOR=    0.620285442955139, 1,           1
##FIRST=     20137.2065510759, 0,            0
##LAST=      -20513.1999529892, 0,           0
##MIN=       -20513.1999529892, -73075134,   0
##MAX=       20137.2065510759, 379996547,    0
$$ Real data points
##PAGE= N=1
##DATA TABLE= (X++(R..R)), XYDATA
$$ [...]
$$ plain form
38140 -6636192 -9383141 -8102177 -3870394 -1876841 -4619282 -7861940 -7099304 -4444256
38132 -4444256 -4244876 -5116205 -2657455 1864054 2807612 -85707 -713351 3095369 5584262
38123 5584262 2705131 -726874 1426608 6784013 8180988 4298384 339656 -633986
38115 -633986 -1012108 -2901752 -4375077 -3315028 -1324627 -1545907 -4781082 -9431264 -13454618
38106 -13454618 -14903231 -12238577 -6078564 68500 2366195 21420 -4272136 -6764967
38098 -6764967 -5388649 -1129997 2709381 3397635 1312109 -1281878 -3932172 -8371548
38090 -8371548 -14160392 -16581981 -11956759 -3838739 -17867 -2823081 -6105105 -3709078
38082 -3709078 2322206 5202322 2843285 -384389 -849592 -294647 -2025160 -5883457
$$ packed form
38140f636192k746949J280964M231783J993553k742441l242658P62636K655048
38132d444256J99380q71329K458750M521509R43558k893319o27644L808720K488893
38123E584262k879131l432005K153482N357405J396975l882604l958728r73642
38115f33986l78122j889644j473325J060049J990401k21280l235175m650182m023354
38106a3454618j448613K664654O160013O147064K297695k344775m293556k492831
38098f764967J376318M258652L839378O88254k085526k593987k650294m439376
38090h371548n788844k421589M625222Q118020L820872k805214l282024K396027
38082c709078O031284K880116k359037l227674m65203N54945j730513l858297
$$ plain form
38074 -5883457 -9190270 -10412697 -9626393 -7014751 -3356241 -973038 -1726301 -4324968
38066 -4324968 -5552610 -4086710 -1561794 -28208 125959 -230886 -112188 927597 2376897
38057 2376897 3258538 3644097 4664781 6032596 5245860 1349106 -2089591 -978399 2934051
38048 2934051 3369048 -2261291 -9341403 -12011447 -9601044 -5400110 -1903124 98093
38040 98093 -270094 -3408051 -7360531 -8955835 -7130545 -3836566 -1686490 -1601307 -2510443
38031 -2510443 -2677343 -1715828 -1561214 -4359472 -8932612 -11027504 -8341692 -3757967 -1748863
38022 -1748863 -2719669 -3189684 -1104135 1475236 1471822 -1227073 -3855002 -3898887 -1401532
38013 -1401532 1348788 1897684 -285043 -3270055 -4161753 -1518008 3168005 6303133
$$ packed form
38074e883457l306813j222427P86304K611642L658510K383203p53263k598667
38066d324968j227642J465900K524916J533586J54167l56845J18698J039785J449300
38057B376897Q81641L85559J020684J367815p86736l896754l438697J111192L912450
38048B934051M34997n630339p080112k670044K410403M200934L496986K001217
38040I8093l68187l137957l952480j595304J825290L293979K150076Q5183r09136
38031b510443j66900R61515J54614k798258m573140k094892K685812M583725K009104
38022a748863r70806m70015K085549K579371l414k698895k627929m3885K497355
38013a401532K750320N48896k182727k985012q91698K643745M686013L135128
$$ plain form
38005 6303133 5229726 983859 -2615475 -3227009 -2257724 -1853667 -1377640 659479 2543854
37996 2543854 1018691 -3117280 -5247421 -3761027 -2383043 -3723574 -4806646 -2266234
37988 -2266234 1779666 3314727 2977392 4134721 6435920 6700637 5249067 5619323 7757103
37979 7757103 7196921 2537174 -1517022 -1225180 482721 -1092843 -5052928 -6463826
37971 -6463826 -3485280 827452 3069954 2635101 581337 -1755276 -2687762 -1122321
37963 -1122321 1635039 2762116 1407932 -204383 -62299 842970 648505 279788 2221753
37954 2221753 5529587 5288235 -906656 -8318923 -10177940 -6235551 -2474995 -2554805 -3891902
37945 -3891902 -3312656 -2125031 -3016981 -5622708 -8395670 -11732769 -15555965 -16636522
$$ packed form
38005F303133j073407m245867l599334o11534R69285M04057M76027K037119J884375
37996B543854j525163m135971k130141J486394J377984j340531j083072K540412
37988b266234M045900J535061l37335J157329K301199K64717j451570L70256K137780
37979G757103n60182m659747m054196K91842J707901j575564l960085j410898
37971f463826K978546M312732K242502m34853k053764k336613r32486J565441
37963a122321K757360J127077j354184j612315J42084R05269j94465l68717J941965
37954B221753L307834k41352o194891p412267j859017L942389L760556p9810j337097
37945c891902N79246J187625q91950k605727k772962l337099l823196j080557
$$ plain form
37937 -16636522 -12754106 -7435179 -5787511 -7006447 -5956851 -1417532 2372820 2385135
37929 2385135 107058 -2300296 -4444628 -5375350 -3288992 966130 3797052 3541895
37921 3541895 1995157 732921 -346000 -461509 1570008 3459157 905567 -5528599
37913 -5528599 -9765913 -8384629 -4831509 -3327262 -3334029 -2838123 -2585851 -3717757 -4952352
37904 -4952352 -5171613 -5381876 -5771018 -4838136 -3565592 -5427067 -9621848 -10241563 -5870071
37895 -5870071 -3473319 -7495031 -11730199 -9247795 -4536901 -6621953 -13950392 -16215342
37887 -16215342 -9832516 -2010988 907618 443822 -157461 -1277011 -3511706 -4955993
37879 -4955993 -4555637 -3775028 -3398640 -2705610 -2361419 -3719346 -5175332 -4151647 -2503843
$$ packed form
37937a6636522L882416N318927J647668j218936J049596M539319L790352J2315
37929B385135k278077k407354k144332r30722K086358M255122K830922k55157
37921C541895j546738j262236j078921j15509K031517J889149k553590o434166
37913e528599m237314J381284L553120J504247o767M95906K52272j131906j234595
37904d952352k19261k10263l89142R32882J272544j861475m194781o19715M371492
37895e870071K396752m021712m235168K482404M710894k085052p328439k264950
37887a6215342O382826P821528K918606m63796o01283j119550k234695j444287
37879d955993M00356P80609L76388O93030L44191j357927j455986J023685J647804
$$ plain form
37870 -2503843 -4123427 -7075961 -4988760 2422345 7300293 4791600 -268300 -1444873
37862 -1444873 214262 -387926 -4204161 -7743625 -8148856 -5256438 -1034849 868346
37854 868346 -1926902 -6216457 -5597115 756088 5909990 4474841 -143430 -1235618
37846 -1235618 2131731 5338485 4731339 494944 -4653269 -6824289 -3496463 2759861
37838 2759861 5740761 3109947 -550010 -442676 2276131 3850430 3719026 3446245 3064053
37829 3064053 2057071 1168725 34129 -3764226 -9861676 -12866590 -9049189 -2146585
37821 -2146585 1689826 1671782 830256 119805 -801789 37154 3875079 6724928 3896446
37812 3896446 -2467970 -6134071 -5751332 -5127046 -5543109 -4386840 -1591337 -902991 -3259183
$$ packed form
37870b503843j619584k952534K087201P411105M877948k508693n059900j176573
37862a444873J659135o02188l816235l539464m05231K892418M221589J903195
37854H68346k795248m289555O19342O353203N153902j435149m618271j092188
37846a235618L367349L206754o07146m236395n148213k171020L327826O256324
37838B759861K980900k630814l659957J07334K718807J574299j31404k72781l82192
37829C064053j006982q88346j134596l798355o097450l004914L817401O902604
37821b146585L836411j8044q41526p10451r21594Q38943L837925K849849k828482
37812C896446o364416l666101L82739O24286m16063J156269K795503O88346k356192
$$ plain form
37803 -3259183 -4532736 -2069151 1028350 543534 -3234245 -6569938 -6585320 -3227759 1166341
37794 1166341 3778871 4255294 4908665 6187782 4428431 -2080445 -7349738 -3995558
37786 -3995558 5511673 10451739 5587906 -2846109 -6753778 -5907061 -4927643 -5392755 -5139127
37777 -5139127 -2672025 1232290 4803375 6077787 4055990 411506 -1826801 -2112445
37769 -2112445 -2534129 -3589560 -3047880 -291480 1543562 -102312 -3195583 -3555383 171708
37760 171708 5213259 7114725 3405699 -3358902 -6887660 -4200947 -294240 -1870854
37752 -1870854 -7656489 -10524289 -8779349 -8070754 -10631740 -10661796 -4452242 2168405 2446573
37743 2446573 -1001098 -1405158 1009493 737118 -2818976 -4682362 -2957562 -1038305
$$ packed form
37803c259183j273553K463585L097501m84816l777779l335693j5382L357561M394100
37794A166341K612530M76423O53371J279117j759351o508876n269293L354180
37786c995558R507231M940066m863833q434015l907669Q46717R79418m65112K53628
37777e139127K467102L904315L571085J274412k021797l644484k238307k85644
37769b112445m21684j055431N41680K756400J835042j645874l093271l59800L727091
37760A71708N041551J901466l709026o764601l528758K686713L906707j576614
37752a870854n785635k867800J744940P08595k560986l0056O209554O620647K78168
37743B446573l447671m04060K414651k72375l556094j863386J724800J919257
$$ plain form
37735 -1038305 -919932 -605403 865395 1353310 47746 -739956 248795 1361747 1795491
37726 1795491 3293587 6463438 9017269 9399455 8727549 7396301 3535456 -2566421
37718 -2566421 -6100931 -3613501 1102174 1252574 -3750293 -7485221 -5239075 210743
37710 210743 3057117 1812954 -271529 -420773 1052554 2965329 4991193 6209229
37702 6209229 4662737 504354 -2386098 -872386 2385795 1779283 -3392271 -7558268
37694 -7558268 -6417398 -2352031 -265008 -1012959 -1897095 -1565882 -1057170 -1005151 -1034718
37685 -1034718 -1719706 -4361742 -8451924 -11416683 -11391599 -8942470 -5999330 -4211160 -3982781
37676 -3982781 -3902559 -1787661 2128395 3830418 -398515 -8615004 -14255744 -13237606
$$ packed form
37735a038305J18373L14529J470798M87915j305564p87702R88751J112952M33744
37726A795491J498096L169851K553831L82186o71906j331248l860845o101877
37718b566421l534510K487430M715675J50400n002867l734928K246146N449818
37710B10743K846374j244163k084483j49244J473327J912775K025864J218036
37702F209229j546492m158383k890452J513712L258181o06512n171554m165997
37694g558268J140870M065367K087023p47951q84136L31213N08712N2019k9567
37685a034718o84988k642036m090182k964759K5084K449129K943140J788170K28379
37676c982781Q0222K114898L916056J702023m228933q216489n640740J018138
$$ plain form
37668 -13237606 -8228624 -4831455 -4950514 -5611478 -4014903 -1835157 -2889253 -6955511
37660 -6955511 -8503580 -3557519 3915328 5986832 977242 -4304045 -3820056 110933
37652 110933 1176922 -2165638 -5901302 -6480066 -4074500 -924004 575345 -927616
37644 -927616 -3995844 -5218260 -3874580 -3238337 -4379302 -2509767 5222106 11752924
37636 11752924 7859335 -3121608 -7371242 674580 10257103 9299547 67404 -6461509
37628 -6461509 -6206232 -4116154 -3818488 -3466259 -1714149 -612855 -852728 310921 3884619
37619 3884619 6110383 3592328 -1438463 -4015915 -2778289 -502379 695181 1652590
37611 1652590 3375247 4598068 3882853 2891619 5133551 10951845 15813791 15322260 10621970
$$ packed form
37668a3237606N008982L397169j19059o60964J596575K179746j054096m066258
37660f955511j548069M946061P472847K071504n009590n281287M83989L930989
37652A10933J065989l342560l735664n78764K405566L150496J499349j502961
37644i27616l068228j222416J343680O36243j140965J869535P731873O530818
37636A1752924l893589j0980943m249634Q045822R582523r57556r232143o528913
37628f461509K55277K090078K97666L52229J752110J101294k39873J163649L573698
37619C884619K225764k518055n030791k577452J237626K275910J197560R57409
37611A652590J722657J222821p15215r91234K241932N818294M861946m91531m700290
$$ plain form
37602 10621970 6365685 4063296 1023008 -3450823 -5056569 -643990 5849016 7995855
37594 7995855 5705364 4350941 5390371 3832984 -2643971 -7487507 -3211267 7346052
37586 7346052 13637328 10898134 5283531 3949572 5493934 4457597 1516570 2817164
37578 2817164 9642749 15048666 13173338 7077173 3410818 2745048 414636 -4635912
37570 -4635912 -7824821 -6534109 -4392040 -5403559 -7894878 -7782278 -4984325 -2660282
37562 -2660282 -1913557 -1376940 -1120312 -2699819 -5271744 -5762873 -3776304 -2539814 -3576056
37553 -3576056 -4194536 -2525788 -1447631 -4049091 -7902336 -8166575 -4990288 -3292066
37545 -3292066 -5364309 -8019604 -7855975 -5452586 -2914812 -716570 1160778 2001747
$$ packed form
37602A0621970m256285k302389l040288m473831j605746M412579O493006K146839
37594G995855k290491j354423J039430j557387o476955m843536M276240J0557319
37586G346052O291276k739194n614603j333959J544362j036337k941027J300594
37578B817164O825585N405917j875328o096165l666355o65770k330412n050548
37570d635912l188909J290712K142069j011519k491319J12600K797953K324043
37562b660282P46725N36617K56628j579507k571925m91129J986569J236490j036242
37553c576056o18480J668748J078157k601460l853245k64239L176287J698222
37545c292066k072243k655295J63629K403389K537774K198242J877348Q40969
$$ plain form
37537 2001747 2277023 3820344 5937532 4784380 -245307 -3089043 1308843 8525940
37529 8525940 9727074 3984287 -892290 -67274 2564529 2368311 1178254 2506148
37521 2506148 4785668 4682089 3663855 5650350 9998179 12154904 10576283 8309067
37513 8309067 7771681 8025737 7474989 5788514 2956179 -364897 -1637385 962665 4684511
37504 4684511 4680166 782000 -2155845 -1673087 -1239181 -4251596 -8220247 -8175663 -3636794
37495 -3636794 994462 1927972 -576991 -3636021 -4692645 -3351414 -1503606 -1376716
37487 -1376716 -2976618 -4208552 -3716410 -2278854 -1083355 -284910 129042 -252595 -1259406
37478 -1259406 -2157605 -3224098 -5429465 -8003383 -8577624 -6609048 -4262631 -2863794
$$ packed form
37537B001747K75276J543321K117188j153152n029687k843736M397886P217097
37529H525940J201134n742787m876577Q25016K631803j96218j190057J327894
37521B506148K279520j03579j018234J986495M347829K156725j578621k267216
37513H309067n37386K54056n50748j686475k832335l321076j272488K600050L721846
37504D684511m345l898166k937845M82758M33906l012415l968651M4584M538869
37495c636794M631256R33510k504963l059030j056624J341231J847808J26890
37487a376716j599902j231934M92142J437556J195499P98445M13952l81637j006811
37478a259406q98199j066493k205367k573918n74241J968576K346417J398837
$$ plain form
37470 -2863794 -1173570 1400022 2855387 1948436 658017 773502 760270 -953505 -2260422
37461 -2260422 -760431 1376123 480948 -2130678 -1867438 1280541 1926075 -2558927 -7802476
37452 -7802476 -8488374 -4931282 -1091535 1015989 2076594 2636044 2357899 1319815 201785
37443 201785 -264417 710697 3099330 4557520 2254506 -2336273 -3383549 1752272 7414444
37434 7414444 6179179 -842692 -5099110 -2266179 2197918 1299616 -3991740 -7235142
37426 -7235142 -5737159 -2745764 -1489521 -1626516 -2142183 -3650166 -6001019 -6745343 -4442465
37417 -4442465 -1419070 -771646 -2114752 -2700886 -1536907 143706 1544517 2655368
37409 2655368 2467603 -197970 -3990761 -5932369 -5446787 -4921090 -5731245 -6390941 -5501878
$$ packed form
37470b863794J690224K573592J455365r06951j290419J15485j3232j713775j306917
37461b260422J499991K136554q95175k611626K63240L147979O45534m485002n243549
37452g802476o85898L557092L839747K107524J060605N59450k78145j038084j118030
37443B01785m66202R75114K388633J458190k303014m590779j047276N135821N662172
37434G414444j235265p021871m256418K832931M464097q98302n291356l243402
37426g235142J497983K991395J256243j36995n15667j507983k350853p44324K302878
37417d442465L023395O47424j343106n86134J163979J680613J400811J110851
37409B655368j87765k665573l792791j941608M85582N25697q10155o59696Q89063
$$ plain form
37400 -5501878 -3862618 -2443741 -848819 767268 861667 -564646 -746398 1746150 3928574
37391 3928574 2317147 -1779097 -4130994 -3782092 -3966008 -6786119 -9920635 -9600261 -5234432
37382 -5234432 -298221 803214 -3029751 -8038757 -9318592 -6662849 -4718519 -5980582
37374 -5980582 -6499197 -1777928 5298918 7229089 2245554 -2986700 -2420913 1716522
37366 1716522 2894581 -920237 -5598144 -6767638 -4540171 -2201293 -2116689 -3827959
37358 -3827959 -5456128 -5868738 -5020717 -3040412 -493166 720404 -858346 -2865410
37350 -2865410 -552530 6293460 10965058 8003756 1312667 -795319 2717689 4867940
37342 4867940 1925802 -1088851 1003798 4951063 3786202 -3062367 -9306061 -10138496
$$ packed form
37400e501878J639260J418877J594922J616087R4399j426313j81752K492548K182424
37391C928574j611427m096244k351897L48902j83916k820111l134516L20374M365829
37382e234432M936211J101435l832965n009006j279835K655743J944330j262063
37374e980582n18615M721269P076846J930171m983535n232254N65787M137435
37366A716522J178059l814818m677907j169494K227467K338878Q4604j711270
37358c827959j628169m12610Q48021J980305K547246J213570j578750k007064
37350b865410K312880O845990M671598k961302o691089k107986L513008K150251
37342D867940k942138l014653K092649L947265j164861o848569o243694q32435
$$ plain form
37334 -10138496 -6844017 -3301246 -1348715 -339136 942132 2927409 4966075 6005647
37326 6005647 5789306 5032766 4417115 4289042 5154151 6862570 7428072 5073588 1886151
37317 1886151 2454098 7487861 11750889 10554041 5822886 3072520 4370391 7139111
37309 7139111 8315818 6743445 2704441 -1908614 -3866971 -1976085 473255 -660099
37301 -660099 -4945366 -8290848 -8474018 -6705304 -4325720 -1514248 661359 469523 -1500365
37292 -1500365 -2648493 -2325071 -2349867 -2850280 -1298823 2570321 4532948 1483220 -3517667
37283 -3517667 -5411796 -4517623 -5476996 -9304207 -11174721 -7926266 -4030727 -6310917
37275 -6310917 -14084052 -18835920 -14733795 -5934752 -771123 -1240895 -2453834 -1471535
$$ packed form
37334a0138496L294479L542771J952531J009579J281268J985277K038666J039572
37326F005647k16341p56540o15651j28073Q65109J708419N65502k354484l187437
37317A886151N67947N033763M263028j196848m731155k750366J297871K768720
37309G139111J176707j572373m039004m613055j958357J890886K449340j133354
37301f60099m285267l345482j83170J768714K379584K811472K175607j91836j969888
37292a500365j148128L23422k4796n00413J551457L869144J962627l049728n000887
37283c517667j894129Q94173r59373l827211j870514L248455L895539k280190
37275f310917p773135m751868M102125Q799043N163629m69772j212939R82299
$$ plain form
37267 -1471535 -1239319 -4106905 -6470932 -3756908 2496796 6965157 7866971 7385500 6300420
37258 6300420 3520584 618248 1175901 4508141 5284565 1538399 -1695647 215698
37250 215698 4462850 4964142 757980 -3695289 -4789505 -2712159 759373 4113954
37242 4113954 6204238 6849781 6853882 6076671 3227980 -767520 -1996295 869844 3034026
37233 3034026 -115483 -5358140 -5677793 -840305 2192184 -205849 -3719546 -3947014
37225 -3947014 -2725057 -3067248 -3197483 -771671 910808 -2867767 -9781785 -12508031
37217 -12508031 -8957469 -4681744 -4239313 -5657338 -5600870 -5102183 -6540859 -8394874 -7252936
37208 -7252936 -3274256 129318 975240 -297544 -3383357 -7650451 -9600975 -5565450
$$ packed form
37267a471535K32216k867586k364027K714024O253704M468361R01814m81471j085080
37258F300420k779836k902336N57653L332240P76424l746166l234046J911345
37250B15698M247152N01292m206162m453269j094216K077346L471532L354581
37242D113954K090284O45543M101p77211k848691l995500j228775K866139K164182
37233C034026l149509n242657l19653M837488L032489k398033l513697k27468
37225c947014J221957l42191j30235K425812J682479l778575o914018k726246
37217a2508031L550562M275725M42431j418025N6468M98687j438676j854015J141938
37208g252936L978680L403574Q45922j272784l085813m267094j950524M035525
$$ plain form
37200 -5565450 1914522 4941546 106236 -6259123 -6307384 -1305291 716870 -3337838
37192 -3337838 -7650244 -6159727 -657500 2401050 249098 -4152388 -7016678 -7644610
37184 -7644610 -7450601 -7341140 -7052206 -6257458 -5386528 -4976452 -4400722 -2206091 1520986
37175 1520986 4216056 4101095 3761853 7678311 15584803 21143954 19045188 11375537
37167 11375537 4797492 2921861 3804914 3849323 1432146 -3064957 -8166887 -11565975
37159 -11565975 -11367762 -8171659 -5007743 -4409312 -5954448 -7164196 -6577284 -5381339
37151 -5381339 -5624708 -7183909 -7793522 -6559111 -5535891 -6106919 -5864878 -2231636 2492972
37142 2492972 4008560 2778234 2507216 2720064 214646 -1741481 4614277 17209965
$$ packed form
37200e565450P479972L027024m835310o365359m8261N002093K022161m054708
37192c337838m312406J490517N502227L058550k151952m401486k864290o27932
37184g644610J94009J09461K88934P94748Q70930M10076N75730K194631L727077
37175A520986K695070j14961l39242L916458P906492N559151k098766p669651
37167A1375537o578045j875631Q83053M4409k417177m497103n101930l399088
37159a1565975J98213L196103L163916N98431j545136j209748N86912J195945
37151e381339k43369j559201o09613J234411J023220n71028K42041L633242M724608
37142B492972J515588j230326k71018K12848k505418j956127O355758J2595688
$$ plain form
37134 17209965 22823994 16718656 12159798 20270340 32858815 41734956 63915621 121223310
37126 121223310 195170495 230841494 198134169 128379899 74907592 54708091 47605095
37119 47605095 37582143 28532097 23999701 17407495 7173988 2487947 7081790 11438050
37111 11438050 7765238 901777 -2006630 -2055344 -2337928 -905948 2961406 3914668 -766152
37102 -766152 -4952329 -3257899 -42130 -1439983 -4662666 -3266692 2055779 6075260
37094 6075260 8126721 10425568 10822231 5822071 -1239586 -3205957 561118 3883587
37086 3883587 3180386 753804 -775679 -1150890 159445 3585548 6586605 6288475 4426129
37077 4426129 4538527 5312206 2658490 -2283690 -3836000 -780406 1828424 902913 -857536
$$ packed form
37134A7209965N614029o105338m558858Q110542J2588475Q876141K2180665N7307689
37126A21223310P3947185L5670999l2707325o9754270n3472307k0199501p102996
37119D7605095j0022952r050046m532396o592206j0233507m686041M593843M356260
37111A1438050l672812o863461k908407m8714k82584J431980L867354R53262m680820
37102g66152m186177J694430L215769j397853l222683J395974N322471M019481
37094F075260K051461K298847L96663n000160p061657j966371L767075L322469
37086C883587p03201k426582j529483l75211J310335L426103L001057k98130j862346
37077D426129J12398P73679k653716m942180j552310L055594K608830r25511j760449
$$ plain form
37068 -857536 -996359 -1060396 -1911491 -954125 2582112 4325431 827347 -4333405 -4739242
37059 -4739242 188022 4265244 2127663 -4480136 -8612626 -5742948 1280017 5864173
37051 5864173 5698859 4436978 5105013 6416516 7978462 13633993 24396946 32623421
37043 32623421 30354698 20721582 13615019 11945735 10219315 5734567 2482794 3208986
37035 3208986 5542659 7341867 8766153 8137364 3095498 -3203355 -4623727 -1647163
37027 -1647163 -513866 -2244092 -1633387 1823919 2420175 -111045 1596202 9432356
37019 9432356 15279493 13897728 9733381 6640010 2372497 -1983837 -78395 6261367
37011 6261367 5779824 -2580679 -4195282 7680401 19455803 20134403 18808603 24457555
$$ packed form
37068h57536j38823o4037q51095R57366L536237J743319l498084n160752m05837
37059d739242M927264M077222k137581o607799m132490K869678P022965M584156
37051E864173j65314j261881O68035J311503J561946N655531J0762953Q226475
37043C2623421k268723r633116p106563j669284j726420m484748l251773P26192
37035C208986K333673J799208J424286o28789n041866o298853j420372K976564
37027a647163J133297j730226O10705L457306N96256k531220J707247P836154
37019I432356N847137j381765m164347l093371m267513m356334J905442O339762
37011F261367m81543q360503j614603J1875683J1775402O78600j325800N648952
$$ plain form
37003 24457555 27957720 23755371 28566343 52694976 74702274 80757653 109544973 205595923
36995 205595923 330653356 379996547 306777814 182295833 104106096 85837372 75809377
36988 75809377 49209665 28763506 28168847 28157722 15125638 4043485 9593569 22070092
36980 22070092 25620360 20612386 15843870 13530252 12226331 13116084 15512385 15408539
36972 15408539 13339036 14281774 16907447 13868359 5690756 2394611 7267558 11030781
36964 11030781 7158177 1279148 -579128 -1697517 -5512209 -7314934 -3326905 908662
36956 908662 -413180 -3712350 -3566130 -2481764 -4624239 -6614955 -3762129 232106
36948 232106 -798746 -4464104 -4139629 -643018 -119148 -2903687 -3974812 -3021562 -4692085
$$ packed form
37003B4457555L500165m202349M810972K4128633K2007298O055379K8787320R6050950
36995B05595923J25057433M9343191p3218733j24481981p8189737j8268724j0027995
36988G5809377k6599712k0446159n94659j1125j3032084j1082153N550084J2476523
36980B2070092L550268n007974m768516k313618j303921Q89753K396301j03846
36972A5408539k069503R42738K625673l039088q177603l296145M872947L763223
36964A1030781l872604n879029j858276j118389l814692j802725L988029M235567
36956I08662j321842l299170J46220J084366k142475j990716K852826L994235
36948B32106j030852l665358L24475L496611N23870k784539j071125R53250j670523
$$ plain form
36939 -4692085 -8949436 -10096254 -6701638 -4613555 -7690245 -11997313 -12141179 -8337898
36931 -8337898 -4255550 -1714357 -348011 187124 12386 -607300 -1844841 -3690582 -4531481
36922 -4531481 -2635910 572438 1338796 -1347970 -3829298 -2439525 1548882 3575379
36914 3575379 1972893 725262 4845964 13316472 18514755 14315463 3651232 -4478922
36906 -4478922 -5032090 -881375 3055955 5323829 6123204 4427775 89510 -4201293
36898 -4201293 -6256058 -7223813 -8208804 -6995554 -1946942 3343962 3881813 329117 -2226899
36889 -2226899 -1710155 -737104 -1022991 -661912 1938441 4971275 5677306 3641456 543739
36880 543739 -1757265 -2331891 -1755481 -1724183 -2907781 -3629390 -2097442 823400 2835490
$$ packed form
36939d692085m257351j146818L394616K088083l076690m307068j43866L803281
36931h337898M082348K541193J366346N35135j74738o19686j237541j845741q40899
36922d531481J895571L208348P66358k686766k481328J389773L988407K026497
36914C575379j602486j247631M120702Q470508N198283m199292j0664231q130154
36906d478922n53168M150715L937330K267874P99375j695429m338265m290803
36898d201293k054765r67755r84991J213250N048612N290904N37851l552696k556016
36889b226899N16744R73051k85887L61079K600353L032834P06031k035850l097717
36880E43739k301004n74626N76410L1298j183598p21609J531948K920842K012090
$$ plain form
36871 2835490 3343056 3275235 2589391 487579 -2142551 -3016152 -1527790 315099 360506
36862 360506 -1619885 -4297154 -5982889 -5556148 -3138231 294863 4089343 7548910
36854 7548910 8450655 4515886 -2553091 -7338879 -6899873 -4003861 -2100498 -403386
36846 -403386 2714077 4604738 1422700 -5223779 -9302885 -7643705 -2692535 1338826
36838 1338826 1939298 -951131 -4318722 -3444597 2704281 8939679 10204380 8290861
36830 8290861 7791661 7779674 3603025 -4234251 -9666721 -9735682 -7422702 -5192463 -2086925
36821 -2086925 1292862 1235093 -3073094 -7288589 -8276919 -7886025 -7936173 -6655012 -3365856
36812 -3365856 -1832770 -4750627 -8673107 -8696351 -5329282 -2681635 -2119620 -1642416 14852
$$ packed form
36871B835490N07566o7821o85844k101812k630130q73601J488362J842889M5407
36862C60506j980391k677269j685735M26741K417917L433094L794480L459567
36854G548910R01745l934769p068977m785788M39006K896012J903363J697112
36846d03386L117463J890661l182038o646479m079106J659180M951170M031361
36838A338826O00472k890429l367591Q74125O148878O235398J264701j913519
36830H290861m99200j1987m176649p837276n432470o8961K312980K230239L105538
36821b086925L379787n7769m308187m215495r88330L90894n0148J281161L289156
36812c365856J533086k917857l922480k3244L367069K647647N62015M77204J657268
$$ plain form
36803 14852 2254826 4747698 7755688 10558759 11446485 9285008 4568426 -452396 -3004940
36794 -3004940 -2689230 -2495018 -4748892 -7164559 -6151564 -2803851 -1128105 -1165131 548947
36785 548947 3733705 4038572 1096049 148462 3347575 6070525 5032707 3472531 4196766
36776 4196766 3884582 -493827 -5266066 -5985966 -5027354 -6993300 -10367759 -10107443 -5729380
36767 -5729380 -949512 2307234 4098122 3134430 -1156018 -5112906 -4501988 -114806
36759 -114806 4498685 8558909 12992925 16577069 17983010 19550122 25033347 36199295
36751 36199295 54428298 80173725 105981668 116794905 105415497 82972206 65554540
36744 65554540 55003742 42596809 27225161 17277807 15732736 16068384 14280618 13455672
$$ packed form
36803A4852K239974K492872L007990K803071Q87726k161477m716582n020822k552544
36794c004940L15710J94212k253874k415667J012995L347713J675746l7026J714078
36785E48947L184758L04867k942523r47587L199113K722950j037818j560176P24235
36776D196766l12184m378409m772239p19900R58612j965946l374459K60316M378063
36767e729380M779868L256746J790888r63692m290448l956888O10918M387182
36759a14806M613491M060224M434016L584144J405941J567112N483225J1165948
36751C6199295J8229003K5745427K5807943J0813237j1379408k2443291j7417666
36744F5554540j0550798j2406933j5371648r947354j545071L35648j787766q24946
$$ plain form
36736 13455672 14072658 10911687 3601186 389326 6341903 15672082 20422514 19748142
36728 19748142 16505727 11613719 6142925 2769117 1317423 -1152452 -3059318 1477113
36720 1477113 11631285 17325253 12792475 5028212 2843790 4840387 5086230 3899459
36712 3899459 4855312 6368394 4732401 1862052 2156171 4575520 5144209 4660678 6699406
36703 6699406 10276419 11853419 12847802 17517696 24054202 25227592 18670787 10363854
36695 10363854 6622290 7515343 9348229 9442724 7188343 3588885 894272 709274 2343475
36686 2343475 4338813 6309248 7548589 6003273 1254502 -3457744 -4916004 -3767904
36678 -3767904 -2352682 -1119518 344546 1597854 3280039 7458958 13292701 16337088
$$ packed form
36736A3455672O16986l160971p310501l211860N952577R330179M750432o74372
36728A9748142l242415m892008n470794l373808j451694k469875j906866M536431
36720A477113J0154172N693968m532778p764263k184422J996597K45843j186771
36712C899459R55853J513082j635993k870349K94119K419349N68689m83531K038728
36703F699406L577013J577000R94383M669894O536506J173390o556805q306933
36695A0363854l741564Q93053J832886R4495k254381l599458k694613j84998J634201
36686B343475J995338J970435J239341j545316m748771m712246j458260J148100
36678c767904J415222J233164J464064J253308J682185M178919N833743L044387
$$ plain form
36670 16337088 15382930 15281953 19017526 22410011 21919728 21847650 26978931 34055424 39465613
36661 39465613 49880800 73145070 100780956 112570750 100417957 77115779 58972810
36654 58972810 49674229 44687522 41554549 39554150 36214085 30643661 26100569 24827496
36646 24827496 24462783 23039028 22753509 24874862 25642955 21901247 16988984 16138424 18696248
36637 18696248 19468025 16059832 11080494 8260458 9378063 13947894 19449156 22626362
36629 22626362 22282736 20059006 17665321 14770466 10483366 5603745 2678190 4309044
36621 4309044 10530767 16972082 18130515 14876982 15382532 24403452 35262632 38741743
36613 38741743 36709638 38332334 44485854 46497787 41381315 37313657 40325339 45841988
$$ packed form
36670A6337088r54158j00977L735573L392485m90283p2078N131281P076493N410189
36661C9465613J0415187K3264270K7635886J1789794j2152793k3302178j8142969
36654E8972810r298581m986707l132973k000399l340065n570424m543092j273073
36646B4827496l64713j423755k85519K121353P68093l741708m912263q50560K557824
36637A8696248P71777l408193m979338k820036J117605M569831N501262L177206
36629B2626362l43626k223730k393685k894855m287100m879621k925555J630854
36621D309044O221723O441315J158433l253533N05550R020920J0859180L479111
36613C8741743k032105J622696O153520K011933n116472m067658L011682N516649
$$ plain form
36605 45841988 48856993 52926463 62224327 73900929 87274191 111919769 153514077
36598 153514077 195463067 208783160 183154423 139211089 106468162 95190539 93766468
36591 93766468 89446488 85893052 98076935 130593420 165075830 174870897 152609568
36584 152609568 117031636 90510867 77309977 68428809 59171916 52251991 48186060
36577 48186060 43352677 37018065 32036124 28646158 24645968 21317378 21983881 24728421
36569 24728421 23851499 19146749 16524312 18296476 20058445 19098721 18754320 21449443
36561 21449443 24057795 24238217 25652014 31764038 38553659 39004175 32976465 27868298
36553 27868298 29721379 36869974 42759673 43164897 39807042 37113677 36199777 33899740
$$ packed form
36605D5841988L015005M069470R297864J1676602J3373262K4645578M1594308
36598A53514077M1948990J3320093k5628737m3943334l2742927j1277623j424071
36591I3766468m319980l553436J2183883L2516485L4482410R795067k2261329
36584A52609568l5577932k6520769j3200890q881168r256893o919925m065931
36577D8186060m833383o334612m981941l389966m000190l328590O66503K744540
36569B4728421q76922m704750k622437J772164J761969r59724l44401K695123
36561B1449443K608352J80422J413797O112024O789621M50516o027710n108167
36553B7868298J853081P148595N889699M05224l357855k693365r13900k300037
$$ plain form
36545 33899740 28477003 23291343 21874345 22059224 19616017 16009324 16797106 22600368
36537 22600368 27810127 29396632 30893090 35023817 37904891 34719808 27382433 22104399
36529 22104399 21424143 22460740 21989809 20186030 19669784 22796000 29593294 37226683
36521 37226683 41922735 42042315 38951511 35431280 34400137 37963203 45014284 50237502
36513 50237502 48634328 41386378 34533913 31732685 31255312 30268645 28711478 28297789
36505 28297789 30702194 37107002 46359017 53513468 54131516 50449601 49073585 52302594
36497 52302594 57464612 66384419 88019631 125374592 163593285 178852644 160987714
36490 160987714 124237730 94007364 83921347 86821564 88337155 87167322 96959634
$$ packed form
36545C3899740n422737n185660j416998J84879k443207l606693P87782N803262
36537B2600368N209759J586505J496458M130727K881074l185083p337375n278034
36529B2104399o80256J036597m70931j803779n16246L126216O797294P633389
36521C7226683M696052J19580l090804l520231j031143L563066P051081N223218
36513E0237502j603174p247950o852465k801228m77373r86667j557167m13689
36505B8297789K404405O404808R252015P154451O18048l681915j376016L229009
36497E2302594N162018Q919807K1635212L7354961L8218693J5259359j7864930
36490A60987714l6749984l0230366j0086017K900217J515591j169833R792312
$$ plain form
36483 96959634 125539978 158067512 169069507 150005364 116546924 88121116 69850331
36476 69850331 57866405 51876322 53785233 59723799 62599668 60619587 56783903 51930691
36468 51930691 44473505 35667072 29334326 26895624 27167486 29834985 34389099 36864955
36460 36864955 32925534 24151229 16993682 15478650 18333177 22454428 25374756 25134484
36452 25134484 21848385 19078404 20054231 23137624 24505976 24179091 25230086 27942775
36444 27942775 29419660 28784280 28236065 28704503 28750135 28281489 29232581 31619663 32516404
36435 32516404 30004210 25288681 20372586 16327482 13921594 13088706 11906873 8982787
36427 8982787 6253244 6142094 6949103 5337801 2746886 4148117 9954334 14413670
$$ packed form
36483I6959634K8580344L2527534J1001995j9064143l3458440k8425808j8270785
36476F9850331j1983926n990083J908911N938566K875869j980081l835684m853212
36468E1930691p457186q806433o332746k438702K71862K667499M554114K475856
36460C6864955l939421q774305p157547j515032K854527M121251K920328k40272
36452B5134484l286099k769981R75827L083393J368352l26885J050995K712689
36444B7942775J476885o35380n48215M68438M5632m68646R51092K387082Q96741
36435C2516404k512194m715529m916095m045104k405888q32888j181833k924086
36427H982787k729543j11150Q07009j611302k590915J401231N806217M459336
$$ plain form
36419 14413670 13660837 10806613 10939065 14946988 20543831 26058052 30709878 33482522
36411 33482522 33743324 31531409 26730559 20074032 14760185 13829956 15762889 16198272
36403 16198272 14185462 12632908 12259289 10168975 5889284 3726319 6620073 12072587
36395 12072587 16846282 21359125 26199921 28389108 25203537 18860163 13623177 10484875
36387 10484875 7931781 5714883 4592663 4173874 3861270 4243221 5368535 5868132 5795482
36378 5795482 7414244 10827619 12284561 9831748 6964837 6914912 7106932 4119279 700837
36369 700837 1799582 5847550 6603090 2864157 -84097 992568 3295870 3754059 3414225
36360 3414225 4128269 5158878 5142830 4039333 1631717 -2518353 -6284968 -5817637 -983303
$$ packed form
36419A4413670p52833k854224J32452M007923N596843N514221M651826K772644
36411C3482522K60802k211915m800850o656527n313847r30229J932933M35383
36403A6198272k012810j552554l73619k090314m279691k162965K893754N452514
36395A2072587M773695M512843M840796K189187l185571o343374n236986l138302
36387A0484875k553094k216898j122220m18789l12604L81951J125314M99597p2650
36378E795482J618762L413375J456942k452813k866911m9925J92020k987653l418442
36369G00837J098745M047968P55540l738933k948254J076665K303302M58189l39834
36360C414225P14044J030609j6048j103497k407616m150070l766615M67331M834334
$$ plain form
36351 -983303 3404262 3761709 1945928 1284341 1844221 2342312 3485411 5892798 7330603
36342 7330603 6139907 5609625 10288888 18553395 23590521 22458635 19694314 19993721
36334 19993721 21294333 18599167 12157952 7446271 7421000 8833461 7408297 3619110
36326 3619110 1284501 2397620 5589489 8545663 9766334 8619854 5769554 3316797
36318 3316797 2799894 3404442 3781168 4805501 8144828 12579317 14625348 13059660 10286345
36309 10286345 9109418 10857373 16395055 24966463 31350288 28879532 17683417 6131120
36301 6131120 1455107 2510444 4457010 6123569 8391103 9317767 6898002 4393945
36293 4393945 6647260 11989757 13833476 10258342 6205341 5456400 6140193 5799918 5557939
$$ packed form
36351i83303M387565L57447j815781o61587N59880M98091J143099K407387J437805
36342G330603j190696n30282M679263Q264507N037126j131886k764321K99407
36334A9993721J300612k695166o441215m711681k5271J412461j425164l789187
36326C619110k334609J113119L191869K956174J220671j146480k850300k452757
36318C316797n16903O04548L76726J024333L339327M434489K046031j565688k773315
36309A0286345j176927J747955N537682Q571408O383825k470756j1196115j1552297
36301F131120m676013J055337J946566J666559K267534R26664k419765k504057
36293D393945K253315N342497J843719l575134m053001p48941O83793l40275k41979
$$ plain form
36284 5557939 6600211 6899605 4559158 1220101 -636358 -1115561 -1249060 -553459 1283530
36275 1283530 2700914 2778409 3269272 5535336 7416375 5931468 1673674 -2023414 -3124961
36266 -3124961 -1909706 642898 3037613 3119756 535253 -1410756 840470 5998329
36258 5998329 8773529 6171510 898129 -2067116 -723468 2754806 4887214 4112048
36250 4112048 1531549 -988146 -2958011 -4940292 -6483756 -5943008 -2915038 591107
36242 591107 2398331 2443468 1999521 2033769 3389069 6884915 11481045 13732285 11270587
36233 11270587 6078476 2305742 1524975 2227240 3242090 4833247 6313867 5579327
36225 5579327 2356261 -206653 951260 4746122 7055763 5508656 1829234 -691716
$$ packed form
36284E557939J042272K99394k340447l339057j856459m79203j33499O95601J836989
36275A283530J417384P7495M90863K266064J881039j484907m257794l697088j101547
36266c124961J215255K552604K394715Q2143k584503j946009K251226N157859
36258E998329K775200k602019n273381k965245J343648L478274K132408p75166
36250D112048k580499k519695j969865j982281j543464N40748L027970L506145
36242E91107J807224M5137m43947L4248J355300L495846M596130K251240k461698
36233A1270587n192111l772734p80767P02265J014850J591157J480620p34540
36225E579327l223066k562914J157913L794862K309641j547107l679422k520950
$$ plain form
36217 -691716 -989087 -732684 -1364317 -1782775 -57490 2912062 3324709 -769496 -5940054
36208 -5940054 -6602537 -1536195 4745288 7471514 6604561 5440135 5993688 7656019 9535506
36199 9535506 11688425 13499275 12856945 8597030 2987633 89109 1498755 4866459
36191 4866459 6852527 6485007 5206153 4672313 5195772 5575577 3919192 -448570 -5287937
36182 -5287937 -6804192 -3665034 1338275 4506633 4796757 3191142 499225 -2228180
36174 -2228180 -2929729 -944009 1119883 874644 203393 2267286 5691825 6291132 4064582
36165 4064582 3127870 4223971 3300787 -646813 -2557722 523289 4106904 3678044 2054770
36156 2054770 3449267 4901174 1116302 -5212732 -6237057 -1044260 3135136 2089781
$$ packed form
36217f91716k97371K56403o31633m18458J725285K969552M12647m094205n170558
36208e940054o62483N066342O281483K726226q66953j164426N53553J662331J879487
36199I535506K152919J810850o42330m259915n609397k898524J409646L367704
36191D866459J986068l67520j278854n33840N23459L79805j656385m367762m839367
36182e287937j516255L139158N003309L168358K90124j605615k691917k727405
36174b228180p01549J985720K063892k45239o71251K063893L424539N99307k226550
36165D064582r36712J096101r23184l947600j910909L081011L583615m28860j623274
36156B054770J394497J451907l784872o329034j024325N192797M179396j045355
$$ plain form
36148 2089781 -670611 -1573760 -1860688 -2562074 -1660008 658086 491188 -2482090 -2788629
36139 -2788629 1445948 3773741 -20893 -3392040 818260 7229389 5300978 -3170368
36131 -3170368 -5752678 1137883 6496118 2347460 -3807621 -1393400 6786162 10029698
36123 10029698 6617364 4643713 7454808 8595947 3401340 -2870386 -3037318 1589335
36115 1589335 4085455 1892244 -1153560 -1224133 1372585 4019859 4480520 2068711 -1111538
36106 -1111538 -629276 5533879 12890973 14358965 8760807 2391388 1257033 4741710
36098 4741710 8241014 9012284 7352197 4633826 2834521 4033030 7612156 9574895
36090 9574895 7481637 4502149 5204025 8598059 9530593 6629695 4209962 5255823
$$ packed form
36148B089781k760392r03149k86928p01386R02066K318094j66898k973278l06539
36139b788629M234577K327793l794634l371147M210300O411129j928411q471346
36131c170368k582310O890561N358235m148658o155081K414221Q179562L243536
36123A0029698l412334j973651K811095J141139n194607o271726j66932M626653
36115A589335K496120k193211l045804p0573K596718K647274M60661k411809l180249
36106a111538M82262O163155P357094J467992n598158o369419j134355L484677
36098D741710L499304P71270j660087k718371j799305J198509L579126J962739
36090I574895k093258k979488P01876L394034R32534k900898k419733J045861
$$ plain form
36082 5255823 6952494 5498903 1730269 -1144473 -2686007 -4516199 -6163701 -5381663
36074 -5381663 -2049648 1559269 4326422 6988032 9060332 8496433 5779189 5322581
36066 5322581 10255189 17566432 21191016 19172647 15208582 13322825 13708076 14377026
36058 14377026 14201810 12757918 9413650 4906153 2216622 3054015 4519272 2651119
36050 2651119 -1087435 -932503 4744647 10377926 10700380 7320042 4685466 3279085
36042 3279085 1305717 60821 1755325 3617311 679621 -5605949 -8123633 -4701960
36034 -4701960 -1460380 -3041021 -5814101 -4811658 -1770645 -863658 -866435 1991857 6165905
36025 6165905 6473841 2426417 -1339772 -2568651 -3282507 -3789381 -980438 5426866 10224582
$$ packed form
36082E255823J696671j453591l768634k874742j541534j830192j647502P82038
36074e381663L332015L608917K767153K661610K072300n63899k717244m56608
36066E322581M932608P311243L624584k018369l964065j885757L85251O68950
36058A4377026j75216j443892l344268m507497k689531Q37393J465257j868153
36050B651119l738554J54932N677150N633279L22454l380338k634576j406381
36042C279085j973368j244896J694504J861986k937690o285570k517684L421673
36034d701960L241580j580641k773080J002443L041013R06987k777K858292M174048
36025F165905L07936m047424l766189j228879p13856n06874K808943O407304M797716
$$ plain form
36016 10224582 9359016 5501142 3918921 5624965 7695011 8313784 8258091 8202307 7311607
36007 7311607 4918231 2298342 2213692 6545383 14055020 20934621 24334221 24703468 23792440
35998 23792440 21821200 18573341 15868338 16067127 18747919 21478476 22980462 22714946
35990 22714946 19013862 11913633 6546385 8118290 13703077 15215142 11220595 8805639
35982 8805639 11705592 14264039 11312848 6740343 6184650 7425889 5487411 2414051
35974 2414051 3472553 6849855 6136810 1500065 -595061 1473344 2552656 935975
35966 935975 1678471 7035428 11566359 10662276 7238680 5700723 5302325 4223949 4713027
35957 4713027 8604335 12123696 10956208 7097850 4996551 3850083 -139637 -5928867
$$ packed form
36016A0224582q65566l857874j582221J706044K070046O18773n5693n5784q90700
36007G311607k393376k619889q4650M331691P509637O879601L399600L69247r11028
35998B3792440j971240l247859k705003J98789K680792K730557J501986k65516
35990B2714946l701084p100229n367248J571905N584787J512065l994547k414956
35982H805639K899953K558447k951191m572505n55693J241239j938478l073360
35974B414051J058502L377302p13045m636745k095126K068405J079312j616681
35966I35975P42496N356957M530931r04083l423596j537957l98398j078376M89078
35957D713027L891308L519361j167488l858358k101299j146468l989720n789230
$$ plain form
35949 -5928867 -8483934 -6733550 -4737342 -4810337 -4906425 -3606161 -2756681 -3666924 -4703119
35940 -4703119 -4244961 -2711394 -422879 3147645 6551042 6259264 1592982 -2951907
35932 -2951907 -2657750 2130549 7639046 11437979 13196312 12598173 9705021 6666143
35924 6666143 5935831 6482856 4486742 -1046520 -5529161 -3776524 3098303 8110520
35916 8110520 6213095 -161680 -4610459 -4340660 -2153955 -1577721 -2786905 -3950137
35908 -3950137 -4142910 -3569744 -2775234 -2970812 -5238408 -7970026 -7407710 -2850009 1058659
35899 1058659 142519 -3400786 -4606191 -3312163 -3276637 -4737452 -3737636 403889 3005792
35890 3005792 1931077 2061283 7647207 14421268 14783457 8525415 2721779 1599249
$$ packed form
35949e928867k555067J750384J996208p2995r6088J300264Q49480r10243j036195
35940d703119M58158J533567K288515L570524L403397k91778m666282m544889
35932b951907K94157M788299N508497L798933J758333n98139k893152l038878
35924F666143p30312N47025j996114n533262m482641J752637O874827N012217
35916H110520j897425o374775m448779K69799K186705N76234j209184j163232
35908c950137j92773N73166P94510j95578k267596k731618N62316M557701L908668
35899A058659r16140l543305j205405J294028L5526j460815R99816M141525K601903
35890C005792j074715J30206N585924O774061L62189o258042n803636j122530
$$ plain form
35882 1599249 2029708 179024 -2167697 -848613 3834849 6952290 5200175 883994
35874 883994 -1182342 441137 2489503 1703987 -685167 -928234 1429581 2413173 -765363
35865 -765363 -5407094 -6703507 -3883453 -675068 -396062 -2695748 -4886930 -4822444 -2592349
35856 -2592349 -453518 -477930 -1526116 -199241 3859557 6090819 3233147 -853604
35848 -853604 296831 6704474 12153474 13041567 11755527 10686746 8778431 6169844
35840 6169844 6493897 10834868 14367677 13596846 12438662 15448324 19042416 16843224
35832 16843224 11274256 11176601 18029343 23409763 22140992 19220945 19413355 18121066
35824 18121066 9736789 -783196 -3538294 1765582 5543958 2379616 -2528995 -2566783
$$ packed form
35882A599249M30459j850684k346721J319084M683462L117441j752115m316181
35874H83994k066336J623479K048366p85516k389154k43067K357815R83592l178536
35865g65363m641731j296413K820054L208385K79006k299686k191182O4486K230095
35856b592349K138831k4412j048186J326875M058798K231262k857672m086751
35848h53604J150435O407643N449000Q88093j286040j068781j908315k608587
35840F169844L24053M340971L532809p70831j158184L009662L594092k199192
35832A6843224n568968r7655O852742N380420j268771k920047J92410j292289
35824A8121066q384277j0519985k755098N303876L778376l164342m908611l7788
$$ plain form
35816 -2566783 1395791 4388374 4632982 3879164 3774358 5003010 7601216 9708949 8385167
35807 8385167 3885151 697042 1976276 5266736 6205811 4238138 2049239 1558776
35799 1558776 3356893 7869244 13635425 16403128 13995866 10746199 12653115 18717478
35791 18717478 21742368 18066070 11934779 8964937 9429358 10127651 9565173 8687150 8693074
35782 8693074 10384707 14104015 18640124 21709426 22848607 24212778 27377675 31185471
35774 31185471 33774244 34469854 32482262 26647271 18616721 13496996 14207344 17159085
35766 17159085 16733537 12426466 8114309 5666425 3491594 990128 -16070 860725
35758 860725 1194712 -186514 -1005825 575154 2604864 2390076 938959 1629832 5516240
$$ packed form
35816b566783L962574K992583K44608p53818j04806J228652K598206K107733j323782
35807H385167m500016l188109J279234L290460R39075j967673k188899m90463
35799A558776J798117M512351N766181K767703k407262l249667J906916O064363
35791A8717478L024890l676298o131291k969842M64421O98293n62478q78023N924
35782H693074J691633L719308M536109L069302J139181J364171L164897L807796
35774C1185471K588773O95610j987592n834991q030550n119725P10348K951741
35766A7159085m25548m307071m312157k447884k174831k501466j006198Q76795
35758H60725L33987j381226q19311J580979K029710k14788j451117O90873L886408
$$ plain form
35749 5516240 10423021 14073289 15744302 15090249 11845213 7329652 4270650 3935502
35741 3935502 4539356 3505435 599073 -1972756 -1983495 962545 5351825 8764743 9538298
35732 9538298 8251212 7032886 6700759 5583358 2437773 -668652 -618704 2297168 5010676
35723 5010676 6655081 9494322 14163005 17876718 19226335 20817670 24522355 28649585
35715 28649585 34095473 48227898 74852745 102668582 113000587 100498144 79046964
35708 79046964 65846621 66975161 79667490 98245482 112317595 109058428 86952559
35701 86952559 61492052 48043037 43871383 36656898 25511590 20439843 23046723 22854777
35693 22854777 15576757 11123812 17116455 26119174 27754643 24087957 23078835 24096178
$$ packed form
35749E516240M906781L650268J671013o54053l245036m515561l059002l35148
35741C935502O03854j033921k906362k571829j0739K946040M389280L412918P73555
35732I538298j287086j218326l32127j117401l145585l106425M9948K915872K713508
35723E010676J644405K839241M668683L713713J349617J591335L704685M127230
35715B8649585N445888J4132425K6624847K7815837J0332005j2502443k1451180
35708G9046964j3200343J128540J2692329J8577992J4072113l259167k2105869
35701H6952559k5460507j3449015m171654p214485j1145308n071747K606880j91946
35693B2854777p278020m452945N992643R002719J635469l666686j009122J017343
$$ plain form
35685 24096178 21141186 15700083 14644274 17402345 16517246 10953822 8158215 11125566
35677 11125566 13462530 10933529 9033221 13785764 22048563 26981426 27775185 27744543
35669 27744543 27029481 23905016 20616105 21161998 24343762 24950503 21621685 18273768
35661 18273768 17551836 17875670 17735522 18149587 19344985 19201707 17047392 15487591 16202965
35652 16202965 16951055 15176006 11916077 9412993 7206546 3889688 1171108 2513708
35644 2513708 7941339 13244806 14917755 13767421 12974969 14168008 16324479 17886793
35636 17886793 19258673 22779111 29796183 38817630 49081045 65789620 96868585 140537778
35628 140537778 179287247 192981606 179766313 160211969 158330001 179681627 208200676
$$ packed form
35685B4096178k954992n441103j055809K758071q85099n563424k795607K967351
35677A1125566K336964k529001j900308M752543Q262799M932863P93759l0642
35669B7744543p15062l124465l288911N45893L181764O06741l328818l347917
35661A8273768p21932L23834j40148M14065J195398j43278k154315j559801P15374
35652A6202965P48090j775049l259929k503084k206447l316858k718580J342600
35644B513708N427631N303467J672949j150334p92452J193039K156471J562314
35636A7886793J371880L520438P017072R021447J0263415J6708575L1078965M3669193
35628A40537778L8749469J3694359j3215293j9554344j881968K1351626K8519049
$$ plain form
35621 208200676 221664447 209282770 177357345 141196397 112156253 91856644 77318321
35614 77318321 67657340 62653395 58180450 49591666 39430228 35143325 37649198 38903113
35606 38903113 33789386 27483596 25992315 25872076 20654416 12632247 9360641 11019784
35598 11019784 10706681 6841924 5801484 10512416 15199559 14884137 12541291 12429127
35590 12429127 12863390 10827613 8288729 8177374 8443625 5994561 2973034 3134242 4974461
35581 4974461 4609117 2855428 2869986 3020138 -397793 -4716081 -3540480 2140556 4357541
35572 4357541 1197544 85115 4553887 7434367 3616876 780275 7924246 19517249
35564 19517249 22479151 15758238 10802077 12807697 14014439 8847495 4100605 7449395
$$ packed form
35621B08200676J3463771j2381677l1925425l6160948k9040144k0299609j4538323
35614G7318321r660981n003945m472945q588784j0161438m286903K505873J253915
35606C8903113n113727o305790j491281j20239n217660q022169l271606J659143
35598A1019784l13103l864757j040440M710932M687143l15422k342846j12164
35590A2429127M34263k035777k538884j11355K66251k449064l021527J61208J840219
35581D974461l65344j753689J4558J50152l417931m318288J175601N681036K216985
35572D357541l159997j112429M468772K880480l817491k836601P143971J1593003
35564A9517249K961902o720913m956161K005620J206742n166944m746890L348790
$$ plain form
35556 7449395 14810871 17281079 14156486 10484536 6642804 -180379 -7005315 -7236806
35548 -7236806 -1184212 4191088 6127793 8283881 11351806 10364978 4073812 -1108742
35540 -1108742 -534284 2258288 2955737 3719838 7547812 11073226 9571987 5309110 4479923
35531 4479923 8276884 12588081 14679366 15244177 15461824 16241470 18532865 20782929 18842789
35522 18842789 12225849 6856612 6902599 7920111 4103644 -1570846 -1947874 2359802
35514 2359802 3960750 411017 -3091139 -2333739 2231027 10146641 21222402 30575605
35506 30575605 31357160 23917278 15448662 9920210 5679885 3011133 4807642 8309856
35498 8309856 6121714 -1442747 -4733756 425725 5995092 5050680 2211438 3775057
$$ packed form
35556G449395P361476K470208l124593l671950l841732o823183o824936k31491
35548g236806O052594N375300J936705K156088L067925r86828o291166n182554
35540a108742N74458K792572O97449P64101L827974L525414j501239m262877q29187
35531D479923L796961M311197K091285N64811K17647P79646K291395K250064j940140
35522A8842789o616940n369237M5987J017512l816467n674490l77028M307676
35514B359802J600948l549733l502156P57400M564766P915614J1075761R353203
35506C0575605P81555p439882q468616n528452m240325k668752J796509L502214
35498H309856k188142p564461l291009N159481N569367r44412k839242J563619
$$ plain form
35490 3775057 6300651 3664687 -1497412 -2488508 555842 2943794 4111157 6104813
35482 6104813 7705516 7769596 10077971 17327037 25530195 32968666 48519552 79035994
35474 79035994 111921815 123726108 106912714 77797591 57691151 56167269 72190300
35467 72190300 98265728 119279891 118916155 95184408 63913429 42082953 32709287
35460 32709287 28810871 25076599 20740980 16603498 14603321 16873260 21516979 22723552
35452 22723552 17882860 10957408 6602978 5242874 6130730 10067588 15665395 17673767
35444 17673767 13297298 6771215 3874943 4763603 5518034 4081608 1564265 -70561
35436 -70561 820111 4464387 8105923 8234917 5552331 4286995 5632140 6380212 5530546
$$ packed form
35490C775057K525594k635964n162099r91096L044350K387952J167363J993656
35482F104813J600703O4080K308375P249066Q203158P438471J5550886L0516442
35474G9035994L2885821J1804293j6813394k9115123k0106440j523882J6023031
35467G2190300K6075428K1014163l63736k3731747l1270979k1830476r373666
35460C2709287l898416l734272m335619m137482k000177K269939M643719J206573
35452B2723552m840692o925452m354430j360104Q87856L936858N597807K008372
35444A7673767m376469o526083k896272Q88660P54431j436426k517343j634826
35436g0561Q90672L644276L641536J28994k682586j265336J345145P48072q49666
$$ plain form
35427 5530546 6812741 11928566 16633011 17105284 15281769 14025115 12097904 8519621
35419 8519621 6782212 8933743 9900785 4470502 -3331405 -5053674 17441 4763093
35411 4763093 5347175 5124415 7007806 8806144 8128588 6480127 6029995 6506184 7568116
35402 7568116 10506813 14957029 16991784 13655319 7712241 5016174 7736315 12410008
35394 12410008 14722151 14323109 13994156 15295299 17060631 18491840 21487660 28053542
35386 28053542 37197395 47444272 61332065 83163830 111693661 138882634 157169456
35379 157169456 164904760 164557896 160631186 160387794 169591820 182997471 184875957 165579779
35371 165579779 134141900 108043838 93413591 82660921 69688660 58177335 53045042
$$ packed form
35427E530546J282195N115825M704445M72273j823515j256654j927211l578283
35419H519621j737409K151531R67042n430283p801907j722269N071115M745652
35411D763093N84082k22760J883391J798338o77556j648461m50132M76189J061932
35402G568116K938697M450216K034755l336465n943078k696067K720141M673693
35394A2410008K312143l99042l28953J301143J765332J431209K995820O565882
35386B8053542R143853J0246877J3887793K1831765K8529831K7188973J8286822
35379A57169456P735304l46864l926710k43392R204026J3405651J878486j9296178
35371A65579779l1437879k6098062j4630247j0752670j2972261j1511325n132293
$$ plain form
35364 53045042 51667861 48048108 40930591 33472963 27871974 24184019 22579173 23146728
35356 23146728 24065871 22786210 19309521 16547612 16836252 19026141 19794534 17657746
35348 17657746 14784738 14110815 15380546 15712232 14031755 12705665 13760584 15431705
35340 15431705 14158570 8997255 2852676 26690 2782036 8940074 13005511 11881220
35332 11881220 9185912 10648436 15412277 16698860 12028622 6959432 6091327 6466689
35324 6466689 4136512 1373728 1538976 1990606 -789856 -3324377 -569027 4047044
35316 4047044 3234613 -1287922 -511083 7154813 12939428 11585548 8750644 10766772
35308 10766772 15193660 16423271 13992050 10292700 5825347 1821316 2234647 7561776
$$ packed form
35364E3045042j377181l619753p117517p457628n600989l687955j604846N67555
35356B3146728R19143j279661l476689k761909K88640K189889P68393k136788
35348A7657746k873008o73923J269731L31686j680477j326090J054919J671121
35340A5431705j273135n161315o144579k825986K755346O158038M065437j124291
35332A1881220k695308J462524M763841J286583m670238n069190q68105L75362
35324F466689k330177k762784J65248M51630k780462k534521K755350M616071
35316D047044q12431m522535P76839P665896N784615j353880k834904K016128
35308A0766772M426888J229611k431221l699350m467353m004031M13331N327129
$$ plain form
35300 7561776 11305721 8447485 3481030 3840833 8647671 10795514 8145846 5527744
35292 5527744 5982772 6588706 4129193 -255359 -3700961 -4947274 -3581145 592650
35284 592650 5798016 8715105 8298880 6997456 6920815 7088072 5999848 4658640 4721419
35275 4721419 5185534 3693022 643581 -827782 484333 1870483 944117 -472294
35267 -472294 504783 2296587 523144 -4636743 -7172762 -3380666 2557011 4439876
35259 4439876 2503866 1825424 4335230 7208773 8243572 7856942 5787527 955189
35251 955189 -4298436 -4693372 1025118 7487829 9685222 9341568 11235230 15486584 17156912
35242 17156912 13130135 6696415 4265493 8187169 13820219 14733939 10442682 6500551
$$ packed form
35300G561776L743945k858236m966455L59803M806838K147843k649668k618102
35292E527744M55028O05934k459513m384552l445602j246313J366129M173795
35284E92650N205366K917089m16225j301424p6641J67257j088224j341208O2779
35275D721419M64115j492512l049441j471363J312115J386150r26366j416411
35267d72294R77077J791804j773443n159887k536019L792096N937677J882865
35259D439876j936010o78442K509806K873543J034799l86630k069415m832338
35251I55189n253625l94936N718490O462711K197393l43654J893662M251354J670328
35242A7156912m026777o433720k430922L921676N633050R13720m291257l942131
$$ plain form
35234 6500551 6202642 6136488 2934461 188439 3065780 8953023 10497557 6739197 3774931
35225 3774931 4504569 5603952 5534974 7080844 9674570 7898654 1373630 -2249247 959738
35216 959738 4637292 3322147 2118533 7309527 14399055 14942772 9937147 6327583
35208 6327583 4252255 -1275149 -8209335 -8486319 -1518211 3739864 2102464 -1549484
35200 -1549484 -1878610 -716420 -1428015 -2474417 -770411 3382589 7920431 11593424
35192 11593424 13071832 11910223 11748545 17302131 26393941 30591361 26252418 19485933
35184 19485933 17194109 18600059 19363430 19032113 19625376 20412562 18875197 14848543 10326729
35175 10326729 6991795 6097177 8134122 10677303 9912371 6358819 5126419 8092078
$$ packed form
35234F500551k97909o6154l202027k746022K877341N887243J544534l758360k964266
35225C774931P29638J099383o8978J545870K593726j775916o525024l622877L208985
35216I59738L677554j315145j203614N190994P089528N43717n005625l609564
35208F327583k075328n527404o934186k76984O968108N258075j637400l651948
35200a549484l29126J162190p11595j046402J704006M153000M537842L672993
35192A1593424J478408j161609j61678N553586R091810M197420m338943o766485
35184A9485933k291824J405950P63371l31317N93263P87186j537365m026654m521814
35175A0326729l334934q94618K036945K543181p64932l553552j232400K965659
$$ plain form
35167 8092078 10449944 8336924 5031203 5170461 7376353 7929376 7604234 8550657 7857529
35158 7857529 1686158 -6118933 -7408437 -1523524 3607890 2998145 267946 -26356
35150 -26356 950026 637153 544751 3005810 6165055 6546350 4310702 2178526 784922
35141 784922 -1269228 -3589180 -3565790 -14948 5019476 8545716 9304788 7970049 5878464
35132 5878464 4071229 3035280 2879415 3563005 4905597 6665618 8797075 11145364
35124 11145364 12756847 12624171 11669517 12261895 14404199 14470079 10217786 5084502 3732399
35115 3732399 4673108 2381020 -3233691 -5417059 -767637 4863357 4822678 1488030 2072027
35106 2072027 7388321 11048521 9034735 4190197 681406 -744137 -700956 764441
$$ packed form
35167H092078K357866k113020l305721J39258K205892N53023l25142R46423o93128
35158G857529o171371p805091j289504N884913N131414o09745k730199k94302
35150b6356R76382l12873r2402K461059L159245L81295k235648k132176j393604
35141G84922k054150k319952K3390L550842N034424L526240P59072j334739k091585
35132E878464j807235j035949j55865O83590J342592J760021K131457K348289
35124A1145364J611483j32676r54654N92378K142304O5880m252293n133284j352103
35115C732399R40709k292088n614711k183368M649422N630994m0679l334648N83997
35106B072027N316294L660200k013786m844538l508791j425543M3181J465397
$$ plain form
35098 764441 1981657 -137414 -4977678 -7065952 -3335884 1641949 1640551 -2413220 -4179490
35089 -4179490 -1270255 1921495 1094463 -2429734 -4495314 -3398453 -575885 2015868
35081 2015868 3510765 4166111 4806282 5594820 5353503 3340043 1352612 1930934 4386695
35072 4386695 5277290 3576602 2453119 4229841 6336640 4984238 939304 -1617283
35064 -1617283 -1140045 -369925 -1803965 -4389967 -5701028 -5266626 -4316762 -3455514 -2087537
35055 -2087537 119557 2236575 2946254 2285768 2074167 3933172 6864926 7845949 5435599
35046 5435599 1793297 125682 996618 2440633 3010413 3023653 2997942 2685200 2201509
35037 2201509 2703276 4909825 7573194 8367722 6367769 3226511 1670972 2882494
$$ packed form
35098G64441J217216k119071m840264k088274L730068M977833j398m053771j766270
35089d179490K909235L191750q27032l524197k065580J096861K822568K591753
35081B015868J494897O55346O40171P88538k41317k013460j987431N78322K455761
35072D386695Q90595j700688j123483J776722K106799j352402m044934k556587
35064a617283M77238P70120j434040k586002j311061M34402R49864Q61248J367977
35055b087537K207094K117018P09679o60486k11601J859005K931754R81023k410350
35046E435599l642302j667615Q70936J444015N69780J3240k5711l12742m83691
35037B201509N01767K206549K663369P94528j999953l141258j555539J211522
$$ plain form
35029 2882494 5587059 7740754 8523418 8237708 7109326 5403803 4142500 4007659 3763031
35020 3763031 1731289 -1137946 -2009248 -384089 1009014 372387 -985959 -2021626
35012 -2021626 -4358958 -8914408 -12701740 -11940295 -6699745 -171823 4755201 6173742
35004 6173742 3282372 -1254759 -2076866 2093373 5449642 3213344 -529376 1127834
34996 1127834 6744776 8573344 4406453 -408047 -2723734 -5090247 -8029433 -7175240
34988 -7175240 -1444542 3313507 3083348 1621827 2966188 4162815 1168034 -3172416
34980 -3172416 -3423356 -64702 2446663 3155832 4331891 6200939 7483979 8964762
34972 8964762 11284742 11578627 7784967 3920727 5083508 9180138 9881293 6189681
$$ packed form
35029B882494K704565K153695P82664k85710j128382j705523j261303j34841k44628
35020C763031k031742k869235q71302J625159J393103o36627j358346j035667
35012b021626k337332m555450l787332P61445N240550O527922M927024J418541
35004F173742k891370m537131q22107M170239L356269k236298l742720J657210
34996A127834N616942J828568m166891m814500k315687k366513k939186Q54193
34988g175240N730698M758049k30159j461521J344361J196627k994781m340450
34980c172416k50940L358654K511365P09169J176059J869048J283040J480783
34972H964762K319980K93885l793660l864240J162781M096630P01155l691612
$$ plain form
34964 6189681 2537706 714124 -1130474 -2045094 1352631 7218285 8664495 3675292
34956 3675292 -1676890 -2367647 -797705 -1185528 -3010806 -3411260 -1775572 1092429 4677297
34947 4677297 7236375 6338419 2950970 1065004 1552007 929616 -2000996 -3684772 -2507592
34938 -2507592 -2111085 -4383971 -4969452 -561451 4677970 5738838 5069122 7608183 11343910
34929 11343910 10342126 4815679 479078 -947671 -2790223 -4976884 -2613426 4832855
34921 4832855 9885763 6489593 -1652583 -6205017 -4529474 -1070920 -281319 -1830981
34913 -1830981 -2824999 -2352367 -2471709 -4696574 -6570135 -3843724 3267159 8752501 8085575
34904 8085575 4368255 3628020 5863993 5534617 447243 -4933023 -6044056 -3680110
$$ packed form
34964F189681l651975j823582j844598r14620L397725N865654J446210m989203
34956C675292n352182o90757J569942l87823j825278m00454J635688K868001L584868
34947D677297K559078q97956l387449j885966M87003o22391k930612j683776J177180
34938b507592L96507k272886n85481M408001N239421J060868o69716K539061L735727
34929A1343910j001784n526447m336601j426749j842552k186661K363458P446281
34921D832855N052908l396170q142176m552434J675543L458554P89601j549662
34913a830981r94018M72632j19342k224865j873561K726411P110883N485342o66926
34904H085575l717320p40235K235973l29376n087374n380266j111033K363946
$$ plain form
34896 -3680110 -1138972 408164 1504584 2165052 2260213 2280575 2230723 1472644 508237
34887 508237 779949 1967710 2016095 745799 627508 2737475 4838111 4995698 4160074
34878 4160074 3410937 1917151 105858 1536530 7948600 14781517 15760348 10738969
34870 10738969 5141576 2437459 1293121 143145 102919 1714514 2398356 -14166
34862 -14166 -3187165 -2756909 1658655 5673520 5883567 3985347 3407324 3606025 1011034
34853 1011034 -4264901 -6616229 -2485788 3187601 2480992 -4530136 -9283898 -6121897
34845 -6121897 588861 3231480 877271 -1361603 -356938 2112238 3655768 4408679
34837 4408679 5279574 6045424 6361246 6841321 8016806 9129088 8660228 5802614 1472725
$$ packed form
34896c680110K541138J547136J096420O60468R5161K0362m9852p58079r64407
34887E08237K71712J187761M8385j270296j18291K109967K100636J57587q35624
34878D160074p49137j493786j811293J430672O412070O832917R78831n021379
34870A0738969n597393k704117j144338j149976m0226J611595O83842k412522
34862a4166l172999M30256M415564M014865K10047j898220n78023J98701k594991
34853A011034n275935k351328M130441N673389p06609p011128m753762L162001
34845f121897O710758K642619k354209k238874J004665K469176J543530P52911
34837D408679Q70895P65850L15822M80075J175485J112282m68860k857614m329889
$$ plain form
34828 1472725 -1914376 -2294151 -32362 2546630 3948579 4573633 4714322 3613734 1674479
34819 1674479 1247804 3059109 3843239 442193 -5066893 -7610602 -5860364 -3297639
34811 -3297639 -2473648 -1859145 286167 2059477 481627 -3618136 -5872876 -3511965
34803 -3511965 1432869 4649799 4466329 3335124 4330283 7130864 8603391 6999204
34795 6999204 3941132 1941891 1678100 2455529 3566382 4067252 3089006 1861702 3394365
34786 3394365 7968264 10871944 7734257 1121463 -1611833 2694954 8943127 9616239
34778 9616239 3030679 -4985275 -6830794 -496090 8278814 11744224 8248725 3053043
34770 3053043 779789 214190 -1553718 -3513559 -3069491 -1216902 -648703 -492832 1916960
$$ packed form
34828A472725l387101l79775K261789K578992J401949O25054J40689j100588j939255
34819A674479m26675J811305P84130l401046n509086k543709J750238K562725
34811c297639Q23991O14503K145312J773310j577850m099763k254740K360911
34803c511965M944834L216930j83470j131205R95159K800581J472527j604187
34795F999204l058072j999241k63791P77429J110853N00870r78246j227304J532663
34786C394365M573899K903680l137687o612794k733296M306787O248173O73112
34778I616239o585560q015954j845519O334704Q774904L465410l495499n195682
34770C053043k273254n65599j767908j959841M44068J852589N68199J55871K409792
$$ plain form
34761 1916960 5137649 5092093 2171963 1031105 2784942 3515964 1977984 2353039 6338142
34752 6338142 8466334 3916330 -3526717 -6580978 -4518660 -2723851 -3848306 -4704678
34744 -4704678 -2064881 2658937 5784728 5946739 4959782 5060104 6206307 6485384 5257945
34735 5257945 4631249 6308136 8386605 8126945 6782605 7601900 9390973 7201184 467169
34726 467169 -4797500 -4074025 273663 4173338 7248196 9690036 8964922 4298067 111754
34717 111754 -56504 711619 -1759535 -5262383 -5212598 -2809576 -2436840 -3354508 -1254427
34708 -1254427 3266058 5212638 3904678 4019058 7351343 10253505 10397607 9692834 8953323
34699 8953323 6009287 1396150 -100333 3270140 6525087 5061031 1195749 -72990
$$ packed form
34761A916960L220689m5556k920130j140858J753837P31022j537980L75055L985103
34752F338142K128192m550004p443047l054261K062318J794809j124455q56372
34744d704678K639797M723818L125791J62011r86957J00322J146203K79077j227439
34735E257945o26696J676887K078469k59660j344340Q19295J789073k189789o734015
34726D67169n264669P23475M347688L899675L074858K441840p25114m666855m186313
34717A11754j68258P68123k471154l502848M9785K403022L72736r17668K100081
34708a254427M520485J946580j307960J14380L332285K902162J44102p04773p39511
34699H953323k944036m613137j496483L370473L254947j464056l865282j268739
$$ plain form
34691 -72990 1587785 2487432 586800 -2637356 -4564685 -3658870 -721815 1056837 -848664
34682 -848664 -4824990 -7177664 -7492443 -8261138 -9127679 -6508952 -328418 4055824 3216900
34673 3216900 297012 -753331 -1061579 -3119128 -5179752 -4117819 -1275009 -792140
34665 -792140 -3434480 -5799985 -4846262 -588131 4599297 7462368 6340182 3628567
34657 3628567 3302596 4709112 2618886 -4391228 -10184030 -9258897 -4365099 -1429244
34649 -1429244 -957790 -376 820071 -1205376 -4519785 -5032839 -2984329 -1831561 -1362557
34640 -1362557 1415613 5022823 4332890 -673435 -4017378 -3169512 -2583224 -5309983 -7607490
34631 -7607490 -5541997 -1351790 1093208 2587584 5719553 9343127 10679537 10354089
$$ packed form
34691g2990J660775Q99647j900632l224156j927329R05815K937055J778652j905501
34682h48664l976326k352674l14779p68695q66541K618727O180534M384242q38924
34673C216900k919888j050343l08248k057549k060624J061933K842810M82869
34665g92140k642340k365505R53723M258131N187428K863071j122186k711615
34657C628567l25971J406516k090226p010114n792802R25133M893798K935855
34649a429244M71454R57414Q20447k025447l314409n13054K048510J152768M69004
34640a362557K778170L607210o89933n006325l343943Q47866N86288k726759k297507
34631g607490K065493M190207K444998J494376L131969L623574J336410l25448
$$ plain form
34623 10354089 10891967 12044441 11593755 9391799 7103013 5193786 3263781 1981914
34615 1981914 1718343 784190 -1887122 -3923954 -2735063 39624 1058324 852088 2470435
34606 2470435 5289797 5065452 653705 -3862641 -5073327 -4298270 -4036297 -3992208 -3013709
34597 -3013709 -2145302 -3112332 -5604779 -8132041 -9885916 -10079649 -7539462 -3049270 -100483
34588 -100483 -833192 -2878278 -2789944 -1029676 -584594 -1914817 -2663939 -1786796 -610886
34579 -610886 9914 316191 -521274 -3629755 -7122722 -7310649 -4155618 -1712313 -1740761
34570 -1740761 -1042083 2403054 4731306 1489760 -5238162 -9308489 -8489001 -6004790
34562 -6004790 -5183741 -6197425 -7445563 -7069903 -4008808 -378515 -984826 -6767629 -10944074
$$ packed form
34623A0354089N37878J152474m50686k201956k288786j909227j930005j281867
34615A981914k63571r34153k671312k036832J188891K774687J018700k06236J618347
34606B470435K819362k24345m411747m516346j210686P75057K61973M4089R78499
34597c013709Q68407r67030k492447k527262j753875j93733K540187M490192K948787
34588a00483p32709k045086Q8334J760268M45082j330223p49122Q77143J175910
34579f10886O20800L06277q37465l108481l492967j87927L155031K443305k8448
34570a740761O98678L445137K328252l241546o727922m070327Q19488K484211
34562f004790Q21049j013684j248138L75660L061095L630293o06311n782803m176445
$$ plain form
34553 -10944074 -6901007 1604197 4534521 -494342 -5639226 -5408733 -3968110 -6277218
34545 -6277218 -9073693 -6513733 143708 4770912 5113087 3495554 1242317 -1860365
34537 -1860365 -4186129 -3926102 -3152649 -5091230 -8155970 -7899316 -4402576 -2306631 -3392439
34528 -3392439 -4666668 -4627501 -5753856 -8779565 -9726177 -5849539 -592503 1032269 -615419
34519 -615419 -902669 2628141 7795803 10851944 9868729 5802152 1837289 1001637 3153489
34510 3153489 5025072 4198611 2134496 2203117 5383090 8864664 8736094 3860428 -2573071
34501 -2573071 -5748215 -4257311 -1737425 -2239199 -4990026 -5868528 -3347705 -218187
34493 -218187 582124 -890893 -2982222 -4331520 -3798297 -1096918 1679375 1597766 -1176172
$$ packed form
34553a0944074M043067Q505204K930324n028863n144884K30493J440623k309108
34545f277218k796475K559960O657441M627204L42175j617533k253237l102682
34537a860365k325764K60027P73453j938581l064740K56654L496740K095945j085808
34528c392439j274229L9167j126355l025709r46612L876638N257036J624772j647688
34519f15419k87250L530810N167662L056141r83215m066577l964863q35652K151852
34510C153489J871583q26461k064115O8621L179973L481574j28570m875666o433499
34501b573071l175144J490904K519886n01774k750827q78502K520823L129518
34493b18187Q00311j473017k091329j349298N33223K701379K776293q1609k773938
$$ plain form
34484 -1176172 -3262810 -2636994 -917687 -363277 -1182610 -2702362 -4394871 -4582153 -1058360
34475 -1058360 5297429 10029668 9926427 6258058 2161426 -573283 -1095635 773703
34467 773703 2727277 1262444 -3162643 -5604646 -3396621 278889 2034407 3108058
34459 3108058 5001889 4876846 420549 -4369455 -4198422 -580056 1223998 1055384 2660008
34450 2660008 5081538 3211870 -2637208 -5543360 -2460248 1016308 -591918 -5113471
34442 -5113471 -7477884 -6673936 -4058997 384775 5526539 6987260 2768225 -1994488
34434 -1994488 -1025578 4511082 8286467 7748773 5642603 3929312 1809432 -281022
34426 -281022 -96294 1964992 2443491 336795 -1127930 -131588 333690 -2434581 -5607661
$$ packed form
34484a176172k086638O25816J719307N54410q19333j519752j692509j87282L523793
34475a058360O355789M732239j03241l668369m096632k734709n22352J869338
34467G73703J953574j464833m425087k442003K208025L675510J755518J073651
34459C108058J893831j25043m456297m790004J71033L618366J804054j68614J604624
34450B660008K421530j869668n849078k906152L083112L476556j608226m521553
34442e113471k364413Q03948K614939M443772N141764J460721m219035m762713
34434a994488R68910N536660L775385n37694k106170j713291k119880k090454
34426b81022J84728K061286M78499k106696j464725R96342M65278k768271l173080
$$ plain form
34417 -5607661 -4484089 409657 3806179 2878383 413010 135225 1798816 2640072 1853332
34408 1853332 1350285 2615728 4890126 6799249 7996732 8213798 6307642 2227250
34400 2227250 -935650 391746 4999942 6888387 2288732 -5068258 -8031282 -4453208
34392 -4453208 963887 3041333 1679451 186622 262915 511608 -849880 -3394704 -4745361
34383 -4745361 -2819696 2064242 6929860 8345679 5579749 1574799 213374 2308463
34375 2308463 4646038 3544828 -692795 -3749054 -2283294 1971325 4489558 3687294
34367 3687294 2087285 1624717 931930 -903542 -897782 3902438 10652905 13211818 10339400
34358 10339400 7130996 7242618 7923254 5253976 858394 -332158 2740041 5983084
$$ packed form
34417e607661J123572M893746L396522r27796k465373k77785J663591Q41256p86740
34408A853332n03047J265443K274398J909123J197483K17066j906156m080392
34400B227250l162900J327396M608196J888445m599655p356990k963024L578074
34392d453208N417095K077446j361882j492829P6293K48693j361488k544824j350657
34383d745361J925665M883938M865618J415819k765930m004950j361425K095089
34375B308463K337575j101210m237623l056259J465760M254619K518233q02264
34367C687294j600009m62568o92787j835472N760M800220O750467K558913k872418
34358A0339400l208404J11622O80636k669278m395582j190552L072199L243043
$$ plain form
34350 5983084 5700380 2583445 -54161 -92314 1581704 1902267 -1432699 -6904022 -9966274
34341 -9966274 -8112175 -3931496 -1602054 -1848378 -2494119 -2462177 -2346387 -2051650 -1048172
34332 -1048172 -399853 -1350519 -2386018 -1193849 852926 295427 -2229967 -2151350 1658739
34323 1658739 4682662 4100431 3377586 6060058 9282382 8039377 2985211 -784773
34315 -784773 -869309 972054 3128651 5498968 7145303 6573395 4374123 2650835 2224158
34306 2224158 2827607 4761916 7516045 8467539 6263615 3511369 2437332 623794
34298 623794 -3992040 -6987780 -3326988 2859513 3112236 -1312402 -280152 8677343
34290 8677343 15368842 12878644 8111054 9343933 12468783 9244179 2289879 590132
$$ packed form
34350E983084k82704l116935k637606l8153J674018L20563l334966n471323l062252
34341i966274J854099M180679K329442k46324o45741L1942J15790K94737J003478
34332a048172O48319r50666j035499J192169K046775n57499k525394P8617L810089
34323A658739L023923n82231p22845K682472L222324j243005n054166l769984
34315g84773q4536J841363K156597K370317J646335n71908k199272j723288m26677
34306B224158O03449J934309K754129R51494k203924k752246j074037j813538
34298F23794m615834k995740L660792O186501K52723m424638J032250Q957495
34290H677343O691499k490198m767590J232879L124850l224604o954300j699747
$$ plain form
34282 590132 4144403 4657967 -61919 -3475127 -2298887 -731528 -984840 722490 5596051
34273 5596051 8273220 5470263 1365458 133792 -279474 -2504747 -4192137 -3100961
34265 -3100961 -1934111 -2656557 -1520500 3955038 7992251 3909182 -5060808 -9855142
34257 -9855142 -8009826 -4433928 -1672477 2212929 6299608 5843730 488133 -3697935
34249 -3697935 -2941942 -499895 -56662 -226354 1021766 1748300 51219 -1452144 457673
34240 457673 4223689 5994538 4903983 2314011 -1500190 -6017787 -8276308 -6270154
34232 -6270154 -2726036 -1381442 -1276760 787313 3743296 3540484 324573 -1305491
34224 -1305491 190416 1010189 -1079545 -2686190 -562870 2738581 2790676 123223 -800485
$$ packed form
34282E90132L554271N13564m719886l413208J176240J567359k53312J707330M873561
34273E596051K677169k802957m104805j231666m13266k225273j687390J091176
34265c100961J166850p22446J136057N475538M037213m083069q969990m794334
34257i855142J845316L575898K761451L885406M086679m55878n355597m186068
34249c697935P55993K442047M43233j69692J248120P26534j697081j503363J909817
34240D57673L766016J770849j090555k589972l814201m517597k258521K006154
34232f270154L544118J344594J04682K064073K955983k02812l215911j630064
34224a305491J495907Q19773k089734j606645K123320L301451N2095k667453r23708
$$ plain form
34215 -800485 1943257 5660368 6839494 4426413 -233519 -4439879 -5424885 -2714504
34207 -2714504 682540 978090 -2397677 -6516449 -8372639 -7546754 -5812883 -5082371 -5473049
34198 -5473049 -4902498 -1392968 3768817 6693555 5667493 3303252 2229667 983547
34190 983547 -2669909 -6091147 -4045081 3153793 8245434 5651448 -1824713 -7242343
34182 -7242343 -7708256 -5423995 -2726794 44218 2208811 1988934 -720098 -3137351
34174 -3137351 -2679196 -52349 1895674 1533616 -456667 -2677619 -4370616 -5248242 -5255238
34165 -5255238 -5048540 -5820658 -7737098 -9061783 -8021806 -5440584 -4046153 -4651800 -4651548
34156 -4651548 -1731382 2193935 2993118 -80354 -3248781 -3212459 -1029833 180499 -614609
$$ packed form
34215h00485K743742L717111J179126k413081m659932m206360r85006K710381
34207b714504L397044K95550l375767m118772j856190Q25885J733871P30512l90678
34198e473049N70551L509530N161785K924738j026062k364241j073585j246120
34190I83547l653456l421238K046066P198874N091641k593986p476161n417630
34182g242343m65913K284261K697201K771012K164593k19877k709032k417253
34174c137351M58155K626847J948023l62058j990283k220952j692997q77626o996
34165e255238K06698p72118j916440j324685J039977K581222J394431o05647K52
34156d651548K920166L925317P99183l073472l168427L6322K182626J210332p95108
$$ plain form
34147 -614609 -2358594 -4463523 -6851422 -8078324 -6132234 -1630853 1796060 1264685
34139 1264685 -2433336 -6127822 -7087965 -4137646 1946276 7679342 8333130 2648011
34131 2648011 -4510199 -6542009 -2236058 3375654 5203799 2871223 -970506 -4281378
34123 -4281378 -6195152 -6360924 -5791813 -6591033 -8720514 -8790430 -4571351 990555 3396535
34114 3396535 2771747 2571056 3189370 1759238 -1633853 -3091582 -1807332 -2237802 -6357748
34105 -6357748 -9027087 -5634530 48089 1425550 -738163 -445736 2956632 3838575
34097 3838575 369323 -1721356 1859102 6952924 6838360 1361201 -3715675 -4201815
34089 -4201815 -931343 2995120 5699754 7554658 9919173 12476457 12349298 8038263
$$ packed form
34147f14609j743985k104929k387899j226902J946090M501381L426913n31375
34139A264685l698021l694486r60143K950319O083922N733066O53788n685119
34131B648011p158210k031810M305951N611712J828145k332576l841729l310872
34123d281378j913774j65772N69111p99220k129481o9916M219079N561906K405980
34114C396535o24788k00691O18314j430132l393091j457729J284250m30470m119946
34105f357748k669339L392557N682619J377461k163713K92427L402368Q81943
34097C838575l469252k090679L580458N093822j14564n477159n076876m86140
34089d201815L270472L926463K704634J854904K364515K557284j27159m311035
$$ plain form
34081 8038263 3683844 5430137 12582557 16796574 12581329 4651479 1195101 3071151
34073 3071151 4452253 2440702 738851 3234741 8044471 9885382 6493361 1083395
34065 1083395 -1212337 1190228 4762148 5291141 3138002 2103875 3387796 3926475
34057 3926475 1679162 -1021900 -1455817 -502306 -2425 541900 1288549 -549863 -6100011
34048 -6100011 -10320194 -7595173 -367180 3530175 1643768 -805480 199945 2254813
34040 2254813 2005930 565900 501496 1361359 1404946 990325 1320324 1891480 1696774 1271959
34030 1271959 1370173 1052685 -939927 -3977916 -6116804 -5927668 -3130668 978069 3235902
34021 3235902 1144369 -3184320 -4106342 837742 7505713 10364775 8992180 6987439
$$ packed form
34081H038263m354419J746293P152420M214017m215245p929850l456378J876050
34073C071151J381102k011551j701851K495890M809730J840911l392021n409966
34065A083395k295732K402565L571920N28993k153139j034127J283921N38679
34057C926475k247313k701062m33917R53511M99881N44325P46649j838412n550148
34048f100011m220183K725021P227993L897355j886407k449248J005425K054868
34040B254813k48883j440030o4404Q59863M3587m14621L29999N71156j94706m24815
34030A271959R8214l17488j992612l037989k138888J89136K797000M108737K257833
34021C235902k091533m328689r22022M944084O667971K859062j372595k004741
$$ plain form
34013 6987439 6137239 4685295 1027798 -3315978 -5059660 -2614946 2023696 5030739
34005 5030739 5055008 5027541 7754743 10520734 7749808 -384400 -6455824 -5280810 -813516
33996 -813516 250619 -1675319 -917888 3590926 6449090 4324970 848422 567341 2035789
33987 2035789 409302 -5087108 -9744365 -9248584 -4578367 -284272 834291 126371
33979 126371 286114 1449297 1413084 -572695 -2170273 -1035718 1933173 3787253 2958135
33970 2958135 247698 -2533637 -3473906 -1204294 3541966 7687512 8722016 7138715
33962 7138715 4635058 1407818 -2476149 -4451227 -1579825 4831982 9739370 9816774
33954 9816774 6063022 1202351 -2601627 -3580189 -1489064 552372 -934048 -4008603
$$ packed form
34013F987439q50200j451944l657497m343776j743682K444714M638642L007043
34005E030739K4269k7467K727202K765991k770926q134208o071424J175014M467294
33996h13516J064135j925938P57431M508814K858164k124120l476548k81081J468448
33987B035789j626487n496410m657257M95781M670217M294095J118563p07920
33979A26371J59743J163183l6213j985779j597578J134555K968891J854080q29118
33970B958135k710437k781335r40269K269612M746260M145546J034504j583301
33962G138715k503657l227240l883967j975078K871402O411807M907388P7404
33954I816774l753752m860671l803978r78562K091125K041436j486420l074555
$$ plain form
33946 -4008603 -2734766 3853928 8828344 6690489 1387137 205403 2838339 2655850
33938 2655850 -2382838 -6641187 -5608876 -2110115 -1223830 -3335627 -5450800 -6354280
33930 -6354280 -6958848 -7336494 -6698342 -5493097 -4847251 -4401521 -3002916 -1205444 -810629
33921 -810629 -1795082 -1691023 1348187 6107799 9392826 8768194 4287827 -1436597 -4839057
33912 -4839057 -4227502 -1434689 37756 -1300398 -3733381 -4814977 -4144230 -3280703 -3476139
33903 -3476139 -4096889 -3431855 -912626 2008053 3763281 4876551 6848199 9055561
33895 9055561 9027848 6570131 5026634 6526568 8303449 6598528 2435096 -114388
33887 -114388 -412958 -1818409 -5586723 -8345432 -6965020 -2633044 1518465 4105801
$$ packed form
33946d008603J273837O588694M974416k137855n303352j181734K632936j82489
33938B655850n038688m258349J032311L498761Q86285k111797k115173r03480
33930f354280o04568l77646O38152J205245O45846M45730J398605J797472L94815
33921h10629r84453J04059L039210M759612L285027o24632m480367n724424l402460
33912d839057O11555K792813J472445j338154k432983j081596O70747Q63527j95436
33903c476139o20750O65034K519229K920679J755228J113270J971648K207362
33895I055561k7713k457717j543497J499934J776881j704921m163432k549484
33887a14388k98570j405451l768314k758709J380412M331976M151509K587336
$$ plain form
33879 4105801 5323605 5646726 6176811 7891744 9317576 7579576 2924626 -943083
33871 -943083 -2415310 -4058646 -7032150 -7809104 -4086378 -28388 -753804 -4403111 -5043009
33862 -5043009 -1684132 1088123 598752 -1194576 -2337105 -3084955 -2972700 -486848 3263221
33853 3263221 4771485 3227116 1554732 1251788 85510 -3454956 -6870913 -6773169 -2848310
33844 -2848310 2509342 6305623 6295758 2952426 226057 1265043 3634639 2639958 -1051372
33835 -1051372 -2282436 -180092 138364 -3655411 -6977880 -6050057 -3780369 -3980997 -5226807
33826 -5226807 -5123432 -5472297 -7716705 -8072920 -3644559 730175 -859481 -4942485 -3090741
33817 -3090741 4738966 9907661 8396800 5951234 7770114 10682283 9580101 5771223
$$ packed form
33879D105801J217804L23121N30085J714933J425832j738000m654950l867709
33871i43083j472227j643336k973504p76954L722726M057990p25416l649307o39898
33862e043009L358877K772255m89371j793328j142529p47850J12255K485852L750069
33853C263221J508264j544369j672384l02944j166278l540466l415957R7744L924859
33844b848310N357652L796281r865l343332k726369J038986K369596r94681l691330
33835a051372j231064K102344L18456l793775l322469R27823K269688k00628j245810
33826e226807J03375l48865k244408l56215M428361M374734j589656m083004J851744
33817c090741P829707N168695j510861k445566J818880K912169j102182l808878
$$ plain form
33809 5771223 3892447 4222479 3191587 -101294 -2347281 -1147536 1392978 1543637
33801 1543637 -797677 -1567527 1863582 6030310 5313435 525340 -921391 4338460
33793 4338460 9622125 7402347 389750 -3046637 -1738499 -2060036 -6234328 -8871023
33785 -8871023 -6628736 -3310092 -2361055 -1536278 1004395 1912099 -1071487 -3813667 -2509473
33776 -2509473 -861237 -4092549 -9448155 -9594676 -3401502 3184511 5855187 5503391
33768 5503391 3732579 680201 -2420139 -3504949 -2926849 -2295773 -530844 4223437
33760 4223437 9320399 9909796 6710400 5431901 7514241 8049017 5032391 3609952
33752 3609952 7011186 9798216 6232830 368276 387344 5867618 8648057 5427094
$$ packed form
33809E771223j878776L30032j030892l292881k245987J199745K540514J50659
33801A543637k341314p69850L431109M166728p16875m788095j446731N259851
33793D338460N283665k219778p012597l436387J308138l21537m174292k636695
33785h871023K242287L318644R49037Q24777K540673R07704k983586k742180J304194
33776b509473J648236l231312n355606j46521O193174O586013K670676l51796
33768E503391j770812l052378l100340j084810N78100O31076J764929M754281
33760D223437N096962N89397l199396j278499K082340N34776l016626j422439
33752C609952L401234K787030l565386n864554J9068N480274K780439l220963
$$ plain form
33744 5427094 1519997 1027457 837733 -2369088 -5360450 -3445502 1706891 4518779
33736 4518779 3526561 2128076 2470428 3202026 3177537 3100517 2655776 -159195 -5113591
33727 -5113591 -8242696 -6678972 -2880112 -1364887 -2527014 -2656454 124189 2948061
33719 2948061 2400934 -480130 -1481635 1245739 5000227 6180170 4329330 1461062
33711 1461062 -1185962 -3755446 -5797844 -6134414 -5056165 -4385084 -4569376 -4156607 -3381338
33702 -3381338 -5220985 -10238667 -13173270 -8774177 509431 7125944 7882153 6002711
33694 6002711 4157862 1361724 -2028505 -2434348 921907 3556871 2853355 2358134 4596450
33685 4596450 5196199 406558 -4473777 -2334559 3444297 3474780 -2122661 -3119894 4514761
$$ packed form
33744E427094l907097m92540j89724l206821k991362J914948N152393K811888
33736D518779r92218j398485L42352P31598k4489p7020m44741k814971m954396
33727e113591l129105J563724L798860J515225j162127j29440K780643K823872
33719B948061n47127k881064j001505K727374L754488J179943j850840k868268
33711A461062k647024k569484k042398l36570J078249O71081j84292M12769P75269
33702c381338j839647n017682k934603M399093R283608O616513P56209j879442
33694F002711j844849k796138l390229m05843L356255K634964p03516m95221K238316
33685D596450N99749m789641m880335K139218N778856L0483n597441r97233P634655
$$ plain form
33676 4514761 12034223 11609798 7242443 5839849 5471315 982283 -4276756 -2279427
33668 -2279427 6221850 11442218 8296962 2474466 774398 2118722 1739685 -616890
33660 -616890 -1220282 1367328 4593750 5891352 5493492 4922216 4352428 2524040 -836831
33651 -836831 -3427675 -2645614 295741 645518 -3766187 -8460045 -7080826 637996 8523889
33642 8523889 11122735 8278496 2930926 -2012889 -4043201 -2075673 1205672 1138191
33634 1138191 -2827491 -5640634 -3453653 957332 2548281 1275754 1129538 3392495
33626 3392495 5158698 4336010 2130505 -6478 -2282238 -4309639 -4228006 -1704211 851778
33617 851778 1625277 1359395 542927 -2021199 -5383577 -4788232 2024213 9516253 10539508
$$ packed form
33676D514761P519462m24425m367355j402594l68534m489032n259039J997329
33668b279427Q501277N220368l145256n822496j700068J344324l79037k356575
33660f16890o03392K587610L226422J297602l97860n71276n69788j828388l360871
33651h36831k590844P82061K941355L49777m411705m693858J379219P718822P885893
33642H523889K598846k844239n347570m943815k030312J967528L281345o7481
33634A138191l965682k813143K186981M410985J590949j272527j46216K262957
33626C392495J766203q22688k205505k136983k275760k027401Q1633K523795K555989
33617H51778P73499k65882q16468k564126l362378N95345O812445P492040J023255
$$ plain form
33608 10539508 6301333 4180364 5876388 4759744 -2828053 -10478452 -10632199 -5447670
33600 -5447670 -2664706 -3925111 -4105500 -952976 1753656 1503449 1147599 3241809 5371949
33591 5371949 4496808 2219523 1946994 3275343 3075012 921490 -147808 1742896 4612739
33582 4612739 5171911 2505064 -1453582 -4437429 -6192830 -7802925 -8628996 -5697495
33574 -5697495 1696364 8065212 6399423 -2538809 -9578555 -7884308 -943332 2949341
33566 2949341 1061418 -2697313 -4731170 -5072413 -4399773 -2301313 533192 1595528
33558 1595528 -585446 -4641087 -7996957 -8869971 -6761938 -2806587 380317 936708
33550 936708 -236348 -1179768 -1829666 -3146298 -4142551 -2761950 351198 2018513 1038640
$$ packed form
33608A0539508m238175k120969J696024j116644p587797p650399j53747N184529
33600e447670K782964j260405j80389L152524K706632k50207l55850K094210K130140
33591E371949q75141k277285k72529J328349k00331k153522j069298J890704K869843
33582D612739N59172k666847l958646k983847j755401j610095q26071K931501
33574e697495P393859O368848j665789q938232p039746J694247O940976L892673
33566B949341j887923l758731k033857l41243O72640K098460K834505J062336
33558A595528k180974m055641l355870q73014K108033L955351L186904N56391
33550I36708j173056r43420o49898j316632r96253J380601L113148J667315r79873
$$ plain form
33541 1038640 -167793 801387 3464262 5967071 7068494 5865317 2107611 -2091862
33533 -2091862 -3285377 -853677 1809297 1449220 -1612802 -5069921 -7292801 -7251428 -4411107
33524 -4411107 -496033 942598 -1244082 -3853693 -3371197 -38609 3681432 6262555
33516 6262555 6729878 3905343 -1029331 -3547445 -767255 4237251 6317129 4704858
33508 4704858 2226050 121690 -2020388 -2799965 -644695 1773608 239313 -3782307
33500 -3782307 -4372855 -592568 1375811 -2233236 -7030305 -7921649 -6957704 -8733360 -12060374
33491 -12060374 -12137136 -8579387 -5369463 -3983467 -2254339 88922 193096 -2586661
33483 -2586661 -4640827 -3030285 877894 3948351 4399639 1471484 -4499014 -10101448
$$ packed form
33541A038640j206433R69180K662875K502809J101423j203177l757706m199473
33533b091862j193515K431700K662974l60077l062022l457119k222880M1373K840321
33524d411107L915074J438631k186680k609611M82496L332588L720041K581123
33516F262555M67323k824535m934674k518114K780190N004506K079878j612271
33508D704858k478808k104360k142078p79577K155270K418303j534295m021620
33500c782307n90548L780287J968379l609047m797069q91344R63945j775656l327014
33491a2060374p6762L557749L209924J385996J729128K343261J04174k779757
33483b586661k054166J610542L908179L070457M51288k928155n970498n602434
$$ plain form
33475 -10101448 -10445630 -5199105 -317793 -1015954 -5185341 -6835824 -4385618 -1836282
33467 -1836282 -2135681 -3204527 -1898965 863265 1493955 -773177 -2565493 -1278545
33459 -1278545 937554 242225 -3028473 -4616319 -2529470 542711 2199255 3654268
33451 3654268 5329280 3495720 -3510020 -9069348 -5541451 3479322 6428689 296363
33443 296363 -4853169 -1394490 4370359 2694662 -4466708 -7407075 -3620140 617391
33435 617391 2138651 4990742 11329918 16114907 14144860 7076278 338216 -3168890
33427 -3168890 -3956235 -3736572 -4230338 -5623377 -5384628 -1505075 3070307 3354959 27814
33418 27814 -797869 3152675 6642152 4999576 738551 -1326108 -1014565 -803888 -858808
$$ packed form
33475a0101448l44182N246525M881312o98161m169387j650483K450206K549336
33467a836282k99399j068846J305562K762230O30690k267132j792316J286948
33459a278545K216099o95329l270698j587846K086849L072181J656544J455013
33451C654268J675012j833560p005740n559328L527897R020773K949367o132326
33443B96363n149532L458679N764849j675697p161370k940367L786935M237531
33435F17391J521260K852091O339176M784989j970047p068582o738062l507106
33427c168890p87345K19663m93766j393039K38749L879553M575382K84652l327145
33418B7814q25683L950544L489477j642576m261025k064659L11543K10677n4920
$$ plain form
33409 -858808 -452468 -1037694 -3398131 -4719878 -3108396 -1995107 -4796329 -8048417 -6197045
33400 -6197045 -1225922 -251178 -4101494 -6026639 -2892298 61455 -1414075 -3576681
33392 -3576681 -1822245 1050712 40622 -2533252 -66736 7132505 10871996 6340286
33384 6340286 -1590358 -5793030 -5930851 -6484263 -8957786 -10514648 -9271468 -6869992
33376 -6869992 -5364536 -4615286 -3670815 -2277607 48269 4091817 8569553 9928872
33368 9928872 6702123 2303426 913249 2005105 2036866 527990 558957 3141824 5127667
33359 5127667 3992417 1289693 -348113 -565832 272624 2863806 6548086 7833245
33351 7833245 4574078 -294342 -2434112 -1991603 -2507495 -5100819 -7167546 -6349058 -2826334
$$ packed form
33409h58808M06340n85226k360437j321747J611482J113289k801222l252088J851372
33400f197045M971123R74744l850316j925145L134341K953753j475530k162606
33392c576681J754436K872957j010090k573874K466516P199241L739491m531710
33384F340286p930644m202672j37821n53412k473523j556862J243180K401476
33376f869992J505456P49250R44471J393208K325876M043548M477736J359319
33368I928872l226749m398697j390177J091856L1761j508876L0967K582867J985843
33359E127667j135250k702724j637806k17719Q38456K591182L684280J285159
33351G833245l259167m868420k139770M42509n15892k593324k066727Q18488L522724
$$ plain form
33342 -2826334 1768291 4955989 3981977 -816001 -4184135 -1635667 3556784 3960957
33334 3960957 -1062004 -3749313 516664 5723633 3754599 -3715341 -7762626 -4918411
33326 -4918411 -1242160 -3082182 -8864530 -12381624 -10813586 -6570519 -3124569 -1956430
33318 -1956430 -2866919 -4661195 -5361425 -3765512 -1266308 -439249 -1274068 -702703 2911750
33309 2911750 6606171 6245961 2145874 -1142349 -489460 2592397 4615601 3920353 1334442
33300 1334442 -1004101 -818219 2515288 6664376 8473232 7706666 6641049 5840539 3338978
33291 3338978 -1201497 -4955290 -6142423 -6358768 -6669825 -5107706 -1010101 1814275
33283 1814275 208616 -3091498 -3702379 -2338218 -2466796 -3763809 -3578020 -2984458 -4975032
$$ packed form
33342b826334M594625L187698r74012m797978l368134K548468N192451M04173
33334C960957n022961k687309M265977N206969j969034p469940m047285K844215
33326d918411L676251j840022n782348l517094J568038M243067L445950J168139
33318a956430r10489j794276p00230J595913K499204Q27059q34819N71365L614453
33309B911750L694421l60210m100087l288223O52889L081857K023204o95248k585911
33300A334442k338543J85882L333507M149088J808856p66566j065617q00510k501561
33291C338978m540475l753793j187133k16345l11057J562119M097605K824376
33283A814275j605659l300114o10881J364161j28578j297013J85789N93562j990574
$$ plain form
33274 -4975032 -7703861 -6461205 -2247668 -1093673 -3991614 -5233447 -2967648 -3341612
33266 -3341612 -9764391 -15235493 -11704168 -2024362 4242713 3726967 1289922 1010683
33258 1010683 1589695 641742 -1635407 -3911667 -5379156 -5519264 -4661205 -4366152 -5040918
33249 -5040918 -4375478 -819025 2884615 2941702 86343 -1661230 -859858 572475 1727479
33240 1727479 3458790 4702841 2773268 -1322693 -2210528 2551043 7645441 5933512
33232 5933512 -2148038 -8383105 -6283058 1384575 5897401 2610101 -4103715 -6711925
33224 -6711925 -3622421 132448 698823 10762 1193900 3218697 3339057 2070656 1803743
33215 1803743 2341584 2059823 2172226 5032916 8543619 7299562 290739 -6822446 -8581906
$$ packed form
33274d975032k728829J242656M213537J153995k897941j241833K265799l73964
33266c341612o422779n471102L531325R679806O267075n15746k437045k79239
33258A010683N79012r47953k277149k276260j467489j40108Q58059K95053o74766
33249e040918O65440L556453L703640N7087k855359j747573Q01372J432333J155004
33240A727479J731311J244051j929573m095961q87835M761571N094398j711929
33232E933512q081550o235067K100047P667633M512826l287300o713816k608210
33224f711925L089504L754869N66375o88061J183138K024797J20360j268401k66913
33215A803743N37841k81761J12403K860690L510703j244057p008823p113185j759460
$$ plain form
33206 -8581906 -5358298 -921157 1974575 2126261 -318895 -2685215 -1690009 1621084
33198 1621084 2395095 -522745 -1792215 2414863 7641157 7134320 1694864 -2084514
33190 -2084514 -1899322 -1962979 -4939025 -7501969 -6037795 -2288404 -379614 -1224812 -2778798
33181 -2778798 -3712740 -3941739 -2873806 34083 3478433 5302093 5028939 3639938 1413188
33172 1413188 -1715855 -3837956 -2062265 2991384 6203403 3747521 -1620054 -3808918
33164 -3808918 -1264826 1671532 1721674 1221885 3329036 5895526 4603815 975950 1760779
33155 1760779 8911713 15158586 13225689 6012891 2551246 5322182 7352356 2842206
33147 2842206 -4592997 -7399710 -4183408 -125016 969721 540178 1021781 1717127 778738
$$ packed form
33206h581906L223608M437141K895732J51686k445156k366320R95206L311093
33198A621084P74011k917840j269470M207078N226294n06837n439456l779378
33190b084514J85192o3657k976046k562944J464174L749391J908790q45198j553986
33181b778798r33942k28999J067933K907889L444350J823660k73154j389001k226750
33172A413188l129043k122101J775691N053649L212019k455882n367575k188864
33164c808918K544092K936358N0142m99789K107151K566490j291711l627865P84829
33155A760779P150934O246873j932897p212798l461645K770936K030174m510150
33147B842206p435203k806713L216302M058392J094737m29543M81603O95346r38389
$$ plain form
33138 778738 -1147403 -1642238 121003 2651620 4330189 4641849 3367902 329996 -3476861
33129 -3476861 -5906362 -5858039 -4554439 -3534140 -2275500 472594 3532661 4061993 2184552
33120 2184552 2061732 6083292 10193146 8636660 2481601 -993145 1857800 6335967
33112 6335967 6835332 4695469 4512620 5859633 4386043 -79578 -2688617 -1492971
33104 -1492971 -384182 -2055335 -3458660 -1785422 -286467 -3183428 -7988188 -8582954
33096 -8582954 -4374037 -617003 116711 1053366 4576438 7681396 6783159 3272733 1032130
33087 1032130 884533 702950 -487707 -1459479 -1050120 906024 4337909 8488447 11187519
33078 11187519 10755030 8472934 7047668 6566619 4360729 -372912 -4242802 -3862309
$$ packed form
33138G78738j926141m94835J763241K530617J678569L11660j273947l037906l806857
33129c476861k429501M8323J303600J020299J258640K748094L060067N29332j877441
33120B184552j22820M021560M109854j556486o155059l474746K850945M478167
33112F335967M99365k139863j82849J347013j473590m465621k609039J195646
33104a492971J108789j671153j403325J673238J498955k896961m804760n94766
33096h582954M208917L757034P33714R36655L523072L104958q98237l510426k240603
33087A032130j47597j81583j190657r71772M09359J956144L431885M150538K699072
33078A1187519m32489k282096j425266m81049k205890m733641l869890L80493
$$ plain form
33070 -3862309 -810518 184000 -2415556 -5217750 -5209476 -4020910 -4766463 -6702518 -6414104
$$ packed form
33070c862309L051791R94518k599556k802194Q274J188566p45553j936055K88414
$$ [...]
##END NTUPLES=NMR SPECTRUM
##END=
