##TITLE=31Pdec_SR135_1d
 , 24 sc
 26.7.2022
##JCAMPDX= 6.0         $$ Bruker NMR JCAMP-DX V2.0
##DATA TYPE= NMR SPECTRUM
##DATA CLASS= NTUPLES
##ORIGIN= UXNMR, Bruker Analytische Messtechnik GmbH
##OWNER= root
$$ XWIN-NMR		Version 3.5
$$ Tue Jul 26 15:31:02 2022 Russian Standard Time (UT+4h)  she@DPX200
##.OBSERVE FREQUENCY= 81.013821
##.OBSERVE NUCLEUS= ^31P
##.ACQUISITION MODE= SIMULTANEOUS
##.ACQUISITION SCHEME= undefined
##.AVERAGES= 24
##.DIGITISER RES= 16
##SPECTROMETER/DATA SYSTEM= spect
##.PULSE SEQUENCE= zgpg30
##.SOLVENT NAME= CDCl3
##.SHIFT REFERENCE= (INTERNAL, CDCl3, 0, 248.564)
##AUDIT TRAIL= $$ (NUMBER, WHEN, WHO, WHERE, WHAT)
$$ ##TITLE= Audit trail, XWIN-NMR		Version 3.5
$$ ##JCAMPDX= 5.01
$$ ##ORIGIN= Bruker BioSpin GmbH
$$ ##OWNER= she
$$ F:/spectra/data/she/nmr/P31/1/pdata/1/auditp.txt
$$ ##AUDIT TRAIL=  $$ (NUMBER, WHEN, WHO, WHERE, WHAT)
(   1,<2022-07-26 15:29:39.51 +0400>,<she>,<DPX200>,
      <created by zg, POWCHK disabled, PULCHK disabled
       configuration hash MD5:
       00 E9 B6 7A A2 85 ED C7 34 08 36 98 17 FE 4E 26
       data hash MD5: 32K
       94 56 DD B2 48 E2 DC 35 5B 7F FD 0D D3 D5 7E 6C>)
(   2,<2022-07-26 15:29:49.76 +0400>,<she>,<DPX200>,
      <Start of raw data processing
       efp BC_mod = 2 LB = 1 FT_mod = 6 PKNL = 1 PHC0 = -10323.97 PHC1 = 200.0568 SI = 64K 
       data hash MD5: 64K
       DA 91 EF 9F E8 0E 78 FD 32 C0 77 E7 A6 E4 ED BC>)
(   3,<2022-07-26 15:30:26.31 +0400>,<she>,<DPX200>,
      <pk PHC0 = 32.69876 PHC1 = -101.7999 
       data hash MD5: 64K
       6B 74 83 E0 EE 86 01 E2 49 77 21 D5 85 A7 4F 26>)
(   4,<2022-07-26 15:30:30.01 +0400>,<she>,<DPX200>,
      <abs ABSG = 5 
       data hash MD5: 64K
       65 CF 56 19 EA 0A 2B DD 87 83 3B 70 0F 29 A0 19>)
$$ ##END=
$$ 
$$ hash MD5
$$ 5B E5 48 C9 BF 46 D1 15 81 0F A9 87 2F 30 E3 FD
##$RELAX= 
##$RELAX= 
##$RELAX= 
##$RELAX= 
##$RELAX= 
##$RELAX= 
##$RELAX= 
##$RELAX= 
$$ Bruker specific parameters
$$ --------------------------
##$DU= <F:/spectra>
##$EXPNO= 1
##$NAME= <P31>
##$PROCNO= 1
##$TYPE= <nmr>
##$USER= <she>
##$AMP= (0..31)
100 100 100 100 100 100 100 100 100 100 100 100 100 100 100 100 100 100 
100 100 100 100 100 100 100 100 100 100 100 100 100 100 
##$AQSEQ= 0
##$AQ_mod= 1
##$AUNM= <au_zg>
##$AUTOPOS= <>
##$BF1= 81.014009
##$BF2= 200.13
##$BF3= 200.13
##$BF4= 200.13
##$BF5= 200.13
##$BF6= 200.13
##$BF7= 200.13
##$BF8= 200.13
##$BYTORDA= 1
##$CFDGTYP= 0
##$CFRGTYP= 5
##$CHEMSTR= <none>
##$CNST= (0..31)
1 1 145 1 1 1 1 1 1 1 1 1 1 1 1 1 1 1 1 1 1 1 1 1 1 1 1 1 1 1 1 1 
##$CPDPRG= <waltz16>
##$CPDPRG1= <>
##$CPDPRG2= <waltz16>
##$CPDPRG3= <>
##$CPDPRG4= <mlev>
##$CPDPRG5= <mlev>
##$CPDPRG6= <mlev>
##$CPDPRG7= <mlev>
##$CPDPRG8= <mlev>
##$CPDPRGB= <>
##$CPDPRGT= <>
##$D= (0..31)
0 1 0 0 0 0 0 0 0 0 0 0.03 2e-05 3e-06 0 0 0 0 0 0 0 0 0 0 0 0 0 0 0 0 
0 0 
##$DATE= 1658834978
##$DBL= (0..7)
120 120 120 11 120 120 24 19 
##$DBP= (0..7)
150 150 150 150 150 150 150 150 
##$DBP07= 0
##$DBPNAM0= <>
##$DBPNAM1= <>
##$DBPNAM2= <>
$$ [...]
##$SUBNAM3= <"">
##$SUBNAM4= <"">
##$SUBNAM5= <"">
##$SUBNAM6= <"">
##$SUBNAM7= <"">
##$SUBNAM8= <"">
##$SUBNAM9= <"">
##$SW= 501.771253377433
##$SWIBOX= (0..15)
0 1 3 0 0 0 0 0 0 0 0 0 0 0 0 0 
##$SW_h= 40650.406504065
##$TD= 32768
##$TD0= 1
##$TE= 0
##$TE2= 300
##$TE3= 300
##$TEG= 300
##$TL= (0..7)
0 120 53 12 22 120 120 120 
##$TP= (0..7)
150 150 150 150 150 150 150 150 
##$TP07= 0
##$TPNAME0= <>
##$TPNAME1= <>
##$TPNAME2= <>
##$TPNAME3= <>
##$TPNAME4= <>
##$TPNAME5= <>
##$TPNAME6= <>
##$TPNAME7= <>
##$TPOAL= (0..7)
0.5 0.5 0.5 0.5 0.5 0.5 0.5 0.5 
##$TPOFFS= (0..7)
0 0 0 0 0 0 0 0 
##$TUNHIN= 0
##$TUNHOUT= 0
##$TUNXOUT= 0
##$USERA1= <user>
##$USERA2= <user>
##$USERA3= <user>
##$USERA4= <user>
##$USERA5= <user>
##$V9= 5
##$VALIST= <valist>
##$VCLIST= <CCCCCCCCCCCCCCC>
##$VD= 0
##$VDLIST= <DDDDDDDDDDDDDDD>
##$VPLIST= <PPPPPPPPPPPPPPP>
##$VTLIST= <TTTTTTTTTTTTTTT>
##$WBST= 1024
##$WBSW= 4
##$XGAIN= (0..3)
0 0 0 0 
##$XL= 0
##$YL= 0
##$YMAX_a= 12471
##$YMIN_a= -16624
##$ZGOPTNS= <>
##$ZL1= 120
##$ZL2= 120
##$ZL3= 120
##$ZL4= 120
##$ABSF1= 248.5645
##$ABSF2= -253.2056
##$ABSG= 5
##$ABSL= 3
##$ALPHA= 0
##$AQORDER= 0
##$ASSFAC= 0
##$ASSFACI= 0
##$ASSFACX= 0
##$ASSWID= 0
##$AUNMP= <proc_1d>
##$AZFE= 0.1
##$AZFW= 0.5
##$BCFW= 0
##$BC_mod= 2
##$BYTORDP= 0
##$COROFFS= 0
##$CY= -3
##$DATMOD= 1
##$DC= 0
##$DFILT= <>
##$DTYPP= 0
##$F1P= 0
##$F2P= 0
##$FCOR= 1
##$FTSIZE= 65536
##$FT_mod= 6
##$GAMMA= 0
##$GB= 0
##$INTBC= 1
##$INTSCL= 5.30512e-09
##$ISEN= 30
##$LB= 1
##$LEV0= 0
##$LPBIN= 0
##$MAXI= 10000
##$MC2= 0
##$MEAN= 0
##$ME_mod= 0
##$MI= 50
##$NCOEF= 0
##$NC_proc= -8
##$NLEV= 6
##$NOISF1= 182.463
##$NOISF2= 159.3651
##$NSP= 0
##$NTH_PI= 0
##$NZP= 0
##$OFFSET= 248.5645
##$PC= 4
##$PHC0= -10291.27
##$PHC1= 98.2569
##$PH_mod= 1
##$PKNL= yes
##$PPARMOD= 0
##$PSCAL= 0
##$PSIGN= 0
##$REVERSE= no
##$SF= 81.014009
##$SI= 65536
##$SIGF1= 159.3651
##$SIGF2= -187.1042
##$SINO= 113.3802
##$SIOLD= 16384
##$SREGLST= <1H.CDCl3>
##$SSB= 0
##$STSI= 65536
##$STSR= 0
##$SW_p= 40650.406504065
##$SYMM= 0
##$S_DEV= 0
##$TDeff= 32768
##$TDoff= 0
##$TI= <>
##$TILT= no
##$TM1= 0
##$TM2= 0
##$TOPLEV= 0
##$USERP1= <user>
##$USERP2= <user>
##$USERP3= <user>
##$USERP4= <user>
##$USERP5= <user>
##$WDW= 1
##$XDIM= 65536
##$YMAX_p= 484456209
##$YMIN_p= -261177513
$$ End of Bruker specific parameters
$$ ---------------------------------
##NTUPLES= NMR SPECTRUM
##VAR_NAME=  FREQUENCY,     SPECTRUM/REAL,   SPECTRUM/IMAG
##SYMBOL=    X,             R,               I
##VAR_TYPE=  INDEPENDENT,   DEPENDENT,       DEPENDENT
##VAR_FORM=  AFFN,          ASDF,            ASDF
##VAR_DIM=   65536,         65536,           65536
##UNITS=     HZ,            ARBITRARY UNITS, ARBITRARY UNITS
##FACTOR=    0.620285442955139, 1,           1
##FIRST=     20137.2065510759, 0,            0
##LAST=      -20513.1999529892, 0,           0
##MIN=       -20513.1999529892, -261177513,  0
##MAX=       20137.2065510759, 484456209,    0
$$ Real data points
##PAGE= N=1
##DATA TABLE= (X++(R..R)), XYDATA
$$ [...]
40891 -5845697 -3162491 622545 4933787 5224919 -71674 -6104155 -7871214 -5674011
40883 -5674011 -2062829 2160074 6189391 7693923 6235566 4880188 5615305 6277433
40875 6277433 4512306 1530337 -621324 -2247532 -3794229 -3673425 -1175633 1366267
40867 1366267 2103811 2567937 4476780 6656966 7767274 8848030 10269687 9557645 5641676
40858 5641676 2025388 2026948 3906667 4561049 4896575 7075731 9278347 8252052 5002401
40849 5002401 2993877 2491263 1697030 1736616 4853601 8742013 8696395 5238230 3656694
40840 3656694 5422786 6035694 2903403 -393639 -332406 1011145 62423 -2485374 -3747882
40831 -3747882 -3554305 -3329258 -2151692 1765258 6392262 6874942 2060316 -3138241 -3673120
40822 -3673120 -615974 828817 -1399064 -3751760 -2469071 1262832 3689907 4104077
40814 4104077 4704511 5548993 3882733 -422043 -2928353 -851184 2072927 651800
40806 651800 -3986237 -5868196 -2401446 3092413 6924788 8827888 9171473 6451281
40798 6451281 247338 -5730190 -6785236 -2914698 1140028 1868752 938800 1784159 3755191
40789 3755191 2622346 -2533650 -6229934 -3357789 3007152 5030680 1060430 -1914450
40781 -1914450 1667284 8241988 10796586 8402384 5641280 4985233 4751018 3810623 3558113
40772 3558113 4467225 4302964 1244532 -3233989 -5693908 -3961595 1146131 6572669
40764 6572669 9887201 11841186 14779935 18064108 17749999 12615936 7541964 7606962 10970690
40755 10970690 11564803 7590512 3193827 2160639 4015152 6610014 8800415 9704630
40747 9704630 8552980 6491438 6108067 8187214 10888045 12606667 13540727 14029661 13657681
40738 13657681 12735984 12623417 13676552 14490628 13938785 12665124 12001270 12487315 13832227
40729 13832227 15509025 17268244 19499193 22547647 25299607 25812653 24302469 23870064
40721 23870064 26874240 32265335 38065393 44496222 52693397 62460282 73577666 86852874
40713 86852874 100768565 109375421 107397628 96187659 81434876 66674307 52443529
40706 52443529 39713282 29820076 22402522 17302629 16530103 20035061 22246442 18605585
40698 18605585 13231497 13164907 16725925 15902266 9931844 7049983 10768130 13828804
40690 13828804 10199253 4910092 5725681 11061711 13168653 9663936 5374941 4517028
40682 4517028 6377836 8129914 8117850 6571289 5272691 5989854 8358345 10664016 12553468
40673 12553468 14238713 13612267 8625942 2577576 1412983 4770632 5918957 2310722
40665 2310722 -802926 -46926 573432 -1652426 -1799201 3864562 9636011 8929627 5428481
40656 5428481 6728711 11049782 10050147 2731076 -2980435 -2109721 2220554 5673530
40648 5673530 7286851 6867469 4672135 4026045 7882168 12825620 12880241 8665561 5679329
40639 5679329 4452891 1184631 -1917633 2570738 13715755 19953825 15236917 8040806
40631 8040806 7932438 11673445 10803263 6123120 4948821 8272753 10603667 10636134 12580442
40622 12580442 16747970 17369428 11758603 4856218 1942078 2119136 1936769 1108154 1200037
40613 1200037 1684326 847322 -886430 -1411840 -132509 1305277 1227147 -473749 -2823803
40604 -2823803 -4836051 -5932901 -5806982 -4221511 -1288766 1879899 3441139 2654666
40596 2654666 1294155 2143167 5660285 8922537 8716068 5497202 3343784 5390519
40588 5390519 9935536 12279871 10365140 6915054 5270496 5044935 3739186 1119259
40580 1119259 -631699 -279195 1764505 5479354 10587020 14069413 12561912 8153112
40572 8153112 7247993 11404418 13787372 8558985 141772 -2036847 3960615 10840504
40564 10840504 12338824 9842182 7792306 7290887 6710229 5431406 4264839 4024964
40556 4024964 5848184 11448628 20883780 30844105 37196101 39498709 42044863 49896663
40548 49896663 63580908 77476338 84141995 81142688 72957052 65136671 58019809 48706184
40540 48706184 38316945 33344846 38454107 50753140 62984865 70294387 72156092 69788767
40532 69788767 64273293 56453695 46867929 36159726 26293436 19975098 17686222 16667856
40524 16667856 14054375 9626752 4640530 222978 -1684137 1284253 8023684 13044833
40516 13044833 12578445 9276724 7418329 6173974 2404187 -2173582 -2886483 -311121
40508 -311121 273768 -1832940 -1219441 3818380 7176151 4621323 1073325 2668757 6823987
40499 6823987 6994527 3712191 3273894 6913188 8759744 5257429 407983 -285642 3407097
40490 3407097 7755614 9829517 9097190 6705922 4852190 5548147 9084050 14029890
40482 14029890 18019419 18187356 13433571 7888902 8444408 15388552 19444140 13477232
40474 13477232 3601022 1290867 6834009 9801631 5747434 2114927 4778526 8709602
40466 8709602 7676090 5015447 7356916 13447455 16942506 16387325 15160300 14400590
40458 14400590 12927602 12005756 13523328 15090570 13365210 10789311 12407181 17079760
40450 17079760 18930099 17230412 17445505 21593766 25031239 25155717 26501507 33584535
40442 33584535 44282166 54495049 64740031 77187034 89185090 94674251 90866533
40435 90866533 80187165 66923041 54974007 47533384 45518208 46510582 47741157 49886424
40427 49886424 55716778 65126273 73653816 76399688 72049956 62786102 51577648 40326703
40419 40326703 29999402 21566160 16211232 14433053 15193545 16355985 16061396 13834536
40411 13834536 10913640 9523205 10747448 12653477 11863782 7965505 4933911 6646362
40403 6646362 12145318 17058119 18594204 17186812 14331499 11310597 9501438 9536734
40395 9536734 10374051 11037227 12397411 15042246 16752716 15257250 12442802 12006443 13447358
40386 13447358 12745236 9270755 7416635 10072186 14647816 17373872 17845338 17401930
40378 17401930 16550342 16042775 17052116 18187451 16024612 10935634 8205734 10195153
40370 10195153 11872921 8652991 4444767 5724429 10626489 11508298 7360419 5472715
40362 5472715 9364194 13037398 11176948 8253892 11123366 16986871 16634048 8546295
40354 8546295 1957824 3976450 10168078 11999666 8786390 6447534 7022441 6353740
40346 6353740 2511759 -48856 2401516 6616123 7355536 5139377 4325074 5671844
40338 5671844 5825862 3266182 18716 -2340087 -3923358 -3692233 -31721 5020992
40330 5020992 6673651 4039174 1818010 3558056 7225159 9709268 11818220 15656350
40322 15656350 20031865 21868456 20367296 17137758 13731160 10992831 9184021 7333435
40314 7333435 4553776 2874010 5504457 10962422 13109343 9504038 5414778 6065700
40306 6065700 9063716 8999778 5902817 3737670 3230330 2045361 478337 1163804 3732757
40297 3732757 4942111 3870110 2435198 1319313 31231 326409 4384473 9783419
40289 9783419 11591192 9717992 8927491 11055747 12755607 12021526 11279905 12162448 12655480
40280 12655480 11888955 12574946 15597523 16957906 13870995 9851970 9527501 11547544
40272 11547544 11040756 6980452 3033706 2415847 5288940 10178736 15013240 17615816
40264 17615816 17597598 16932967 16923027 16107652 13066285 9400851 7608177 7704577 8332985
40255 8332985 9394310 10877939 10842464 7781544 3860575 2645639 4353174 6228563
40247 6228563 6829805 6904615 6772459 6308768 7259270 11713563 17544420 19033768 13887753
40238 13887753 6968080 4801558 8021820 11385878 10282445 5137638 -308024 -3072333
40230 -3072333 -2622319 118293 3939395 7485074 9449818 9672665 9776158 11744005 15668427
40221 15668427 19532620 21276564 20429793 17830222 14731302 12302194 10985728 10075233
40213 10075233 8759887 7631424 8154053 10626446 13731028 15998756 16603783 15186824
40205 15186824 12492016 10613610 10563712 10316177 8065904 6711155 10974807 19665483
40197 19665483 25520471 24548672 20988158 20228998 21347196 20855096 20038698 22860825 28382023
40188 28382023 31055866 28680024 25398456 25772023 29253101 31934035 31861819 31581308 35686320
40179 35686320 45077145 53704802 53985005 46703480 41451088 44346481 49988926 50428599
40171 50428599 47500572 49002949 55839517 61951552 65935452 72834508 83033022 89304397
40163 89304397 88814999 89371760 98403654 113321274 129135260 148738816 177913664 215954834
40155 215954834 260188947 314471908 380526294 441201894 465505168 436782107 369750905
40148 369750905 295347887 234270706 189242996 155759098 130707053 111361890 94273095
40141 94273095 78671225 67292271 61213549 56500310 48744822 39145298 32729289 30998326
40133 30998326 29881018 25984082 21552251 20705534 23104920 24743606 23747102 21646505
40125 21646505 19400401 16336298 13585132 14302227 18763729 22820120 23239136 21394333
40117 21394333 19744806 18291266 17073430 18338952 22610426 25853341 24624738 21255304
40109 21255304 19756325 19549689 18168232 17181531 19192502 21135754 17955537 12179729
40101 12179729 11836682 17977577 22367712 20098162 16606066 17805246 20306534 17730633
40093 17730633 11665908 9168957 12085647 15668911 16839599 17802051 21000168 25127992
40085 25127992 27375175 26859272 25221693 25524027 29983080 37054446 42030658 42550315
40077 42550315 41728853 43366421 46387635 47588803 47756580 50355438 55153824 58069004
40069 58069004 57353960 55463140 54446249 53799801 53419273 54312324 55509448 54666332 52952369
40060 52952369 54844141 61344251 67879643 71139704 73521492 77975754 82939406 86249459
40052 86249459 90357676 99338104 113656932 132147854 156466666 189341803 231283571
40045 231283571 283313572 348109678 419868093 475038709 484456209 439897152 363549384
40038 363549384 287934832 230617387 190049025 158498336 131868190 109661392 92247262
40031 92247262 79595411 70487887 63205746 57794017 55443736 54503920 50687297 43540470
40023 43540470 38542588 39036341 40216608 36363545 30379865 29206210 31973138 30817134
40015 30817134 23421253 16592688 15497033 16850202 16106957 14677735 15375856 16143208
40007 16143208 13736469 9827032 8192699 8665260 8667304 8347699 9567279 11822641 13494400
39998 13494400 15130827 17382053 18127435 16204547 15206026 18019660 20221338 15791734
39990 15791734 7856125 5918539 12223346 18539968 17992633 12919778 8709145 6707969
39982 6707969 6458348 8683947 12105148 12616650 9525774 7651260 9563869 11211107
39974 11211107 9560739 8701710 12587357 17141670 16725124 14121419 15936069 20929544
39966 20929544 21717762 17084325 14010312 16735311 21433526 23478951 23412373 23485346 23875563
39957 23875563 24570983 26168696 26965332 24028499 18871956 17100869 20436163 24049132
39949 24049132 23958956 21860144 20009932 16940333 12046992 9253875 11268529 14270361
39941 14270361 13349131 9882452 8438346 9284490 9344963 8275280 8059026 8267588 7234058
39932 7234058 6608684 8989633 11861837 10108240 4705541 2572702 6389017 10538360
39924 10538360 9629020 5738852 3891138 4827099 6321088 8286437 12086497 16739998
39916 16739998 19927986 21726325 23847123 25929898 25928190 23962799 22792133 24162604
39908 24162604 26974199 29204045 29572032 27263910 22185370 15898995 10624323 7179674
39900 7179674 5405645 5953015 9084844 12014153 10866531 6127353 2844613 4035805
39892 4035805 7250827 9545651 11919155 15467556 16956414 13448309 8862674 9551066
39884 9551066 14078261 14261138 7419330 742748 629205 3958711 4387327 2013368 1040648
39875 1040648 1645775 593472 -2201146 -3851688 -3940190 -4009415 -2819522 1576621 5693325
39866 5693325 3780398 -2090585 -2656132 5240579 13014894 12138130 5594287 2361579
39858 2361579 5253828 10285798 14769993 19417947 23737511 25407200 24509863 23883746
39850 23883746 24801628 25822824 26084188 26432612 27075772 27070101 26285981 25200337 22989668
39841 22989668 18889729 15269442 15685334 19168369 20025248 14989444 7767114 4445541
39833 4445541 6491610 10526468 13541385 15703473 18208203 20633104 21520715 20669986
39825 20669986 19497518 18838835 17450893 13872614 9265289 6557159 6349156 5621824
39817 5621824 1865558 -2919711 -4175515 -223098 5684347 8663369 6785394 2590079
39809 2590079 409320 1875652 4342274 4522393 2672752 1137680 -135819 -2975737
39801 -2975737 -6043844 -5261799 -616871 2269472 33395 -3515157 -3794279 -2189425
39793 -2189425 -1865953 -1251514 2293327 5684112 4008207 -746415 -2115844 523302
39785 523302 1413604 -1612190 -4013910 -2831527 -1145602 -1792761 -2742326 -1734761 -216285
39776 -216285 458118 1905520 4625060 5609037 3462447 1708632 3379320 6050084 5839392
39767 5839392 2937229 -178840 -2501716 -3170988 -392473 4396126 5440777 694691
39759 694691 -2823678 2313967 12633875 17724720 14197773 8980572 8541367 11181094
39751 11181094 11820519 9477761 7282034 7879797 10760578 12611808 10057971 3929795
39743 3929795 107494 3146632 9645917 11738679 7232469 2053539 1687850 4534619
39735 4534619 5817210 4265289 1931239 193088 -724198 -73960 2300679 4261180
39727 4261180 3821614 2703271 4479040 9283837 13371192 14500765 14825591 16990008
39719 16990008 20004514 21460867 21993110 24197067 27609700 28284769 24254191 18473350
39711 18473350 14790821 13524907 13040385 13313007 15106974 17331560 18351274 18774248
39703 18774248 19825456 20098670 17563687 13950469 12904500 14053117 13579216 11056784
39695 11056784 10525186 13379147 15556129 14329587 12712896 13456699 13447310 9004416 3074308
39686 3074308 1412127 3786347 4758313 2282201 32811 985879 3548810 5174856
39678 5174856 5962449 7118211 8556093 9475751 9677750 9529064 9730475 11047598 13120988
39669 13120988 14140950 13012868 10929605 9469296 8603829 8244632 9722511 13223258
39661 13223258 15738968 14816633 12844849 14076246 18450750 21959278 22314527 20626888
39653 20626888 18170867 15332138 13281508 12720334 11304151 6595824 1495829 1838449
39645 1838449 7607208 11307889 7177076 -1739694 -7952868 -7941890 -4049137 -513580
39637 -513580 178677 -1365847 -2228802 -392887 2703347 4649555 6364337 10480068 15607884
39628 15607884 16756637 12688169 8383543 8043055 9781185 10013445 9079626 8812626 7940975
39619 7940975 4520464 814983 1026641 5080475 8852506 10081931 9969532 9010334 5795295
39610 5795295 1254253 -95560 4016773 9243087 9437142 4459990 -226093 -1164256
39602 -1164256 -195059 521905 2333263 6057695 7948683 4689936 243109 1395893
39594 1395893 6860947 8141218 3061362 437835 6496680 14027779 12769592 5218169
39586 5218169 2478150 7153506 10836177 8551376 5362261 6186164 8333652 8362959 8513594
39577 8513594 11131497 13103064 11460998 9336892 10696919 13663241 14950611 16999799
39569 16999799 24051453 33552983 38027774 34640955 27521156 21107731 16080696 11843693
39561 11843693 8688769 6831442 6198201 7194986 9405036 10433106 8689318 6245568
39553 6245568 6085049 7684157 8453231 8423327 9835779 12568807 13779560 12574002 11822503
39544 11822503 14182792 18514275 21610288 22529204 24143697 29912971 38761691 44183948
39536 44183948 40571328 30165783 20878614 17051218 15928895 13766832 10645762 7396382
39528 7396382 2908355 -2235569 -4156912 -1614000 951294 563804 1005198 5558380
39520 5558380 9456071 6672110 278029 -2042736 139502 1355222 1235368 4193650
39512 4193650 8662418 7367398 151847 -3724563 330093 5281547 4442436 1603311
39504 1603311 2702105 4940154 2348112 -3048916 -4186388 -91980 3798915 4797041
39496 4797041 5171897 5855195 4733413 1807009 244134 970577 913528 -1837614 -4994524
39487 -4994524 -5696992 -3846873 -405886 4384181 9171354 10728405 7683001 3439782
39479 3439782 2862629 6626107 10817466 11953000 10607053 9622815 10172179 10887332 10498083
39470 10498083 9821442 10378181 12022026 13350522 14169922 15830078 18619111 20512635
39462 20512635 19866045 18230287 18556264 20759974 21062312 16642547 9570792 4620740
39454 4620740 3843710 5076261 5644110 5198696 4075715 1564305 -1830571 -2594314 1731692
39445 1731692 7813449 9981236 8056105 7033795 8673856 9180460 7128347 7351807
39437 7351807 12901803 18884536 19980996 19275607 22711097 28767655 32080348 34738572
39429 34738572 43934348 58071764 65216498 58456359 44581769 33616473 27217594 22341515
39421 22341515 19379048 19732003 19987847 15820507 9376696 6581819 8562087 11335094
39413 11335094 13132309 16564039 23182641 30382380 34717623 35142344 32251520 27055912
39405 27055912 21380967 17348483 15425455 14090379 11829743 8652173 5613259 3557002
39397 3557002 2343016 1120411 -340175 -889312 551578 3284021 5886780 8139685
39389 8139685 9965312 9728324 6781524 4716337 7724606 13922018 17423417 17685865
39381 17685865 20701176 28618193 34469638 31599499 23379914 18294646 18883172 20849871
39373 20849871 20631400 18733234 17035519 16992431 19433536 23460222 27803837 35303930
39365 35303930 51213268 72792113 85942562 79311572 58577047 39546515 29688783
39358 29688783 24379747 19250938 16272394 16519963 16120561 12909065 10378687 11447482
39350 11447482 13692366 14011924 13240464 12961802 11961641 9017537 5809303 4392143
39342 4392143 4598106 5534055 6427253 5102579 -26423 -5273640 -4245000 2761630 7413180
39333 7413180 4565506 -520198 -368431 4191548 6980746 6226147 5509323 7050061 9349381
39324 9349381 10478148 9470786 5548604 -189920 -3536332 -1539116 2853662 4236284
39316 4236284 1994667 477138 2548247 6481896 8943136 7983792 3579525 -1817639
39308 -1817639 -3910331 -821112 3908764 5607459 4754504 5343203 7866491 8546813 5934400
39299 5934400 3714769 5206047 8424660 8710971 4269779 -2165417 -5651612 -2856637
39291 -2856637 4266835 8844636 6159127 366728 248206 7490047 13836602 12238361
39283 12238361 6299378 4454488 8019942 10613606 8486941 5678155 7213341 11436410
39275 11436410 12493790 8657060 4587622 4792253 7482208 7271918 3177860 763680
39267 763680 4713259 11701899 13999592 9294862 2928808 -169225 -1294922 -3310494
39259 -3310494 -4249091 -134240 7716988 13094224 12600694 9008935 6375103 5398816 4763113
39250 4763113 3853466 2374511 -320758 -3738449 -5877734 -5679838 -4091672 -1882605
39242 -1882605 1085389 3369784 2167636 -1715069 -2676019 2233895 7612702 6241306
39234 6241306 -587090 -4801185 -2951739 141860 65479 -840381 1399441 5652213 7834539
39225 7834539 6739720 4176420 1483288 -946348 -2356003 -2511251 -2379621 -1958370 345392
39216 345392 4061320 5357136 2422401 -807799 -83766 2790413 3432321 1967699 1136457
39207 1136457 -364805 -5696118 -11854918 -11503634 -3864156 3530234 6049091 7490596
39199 7490596 10942964 11769690 5688813 -2249798 -4275622 -1400418 -329566 -1632300
39191 -1632300 306 4308790 3996661 -2670411 -6466353 124171 11074959 14638257
39183 14638257 9380658 4761163 6599982 9628778 6747998 -400027 -4581663 -3105175
39175 -3105175 385532 2803518 4951503 7371142 7782499 5147380 2649467 3205885
39167 3205885 4469815 2214844 -2768603 -5427238 -3722983 -979537 -521285 -1937468
39159 -1937468 -3615006 -4958054 -4472782 299519 8330890 14069050 13974042 11153357 10158817
39150 10158817 10157890 7619125 3441221 1975595 3644431 3979549 853161 -2100154 -1207716
39141 -1207716 1817957 2702646 360096 -2672559 -3963130 -3062075 -483121 3129922
39133 3129922 6606347 8103307 6134713 1222716 -3542310 -4828112 -2830255 -1392332
39125 -1392332 -2871493 -4381756 -1603465 4734408 9311197 8847010 5014803 586386
39117 586386 -3685567 -7289895 -8632723 -7554570 -6465305 -6752336 -6284561 -2788306 2221060
39108 2221060 5399447 6062022 6247120 7277527 8575753 9266920 8870531 6820842 3173939
39099 3173939 -442849 -2173542 -2111862 -1991977 -2989287 -4676868 -5618746 -4425036 -1275304
39090 -1275304 1143181 129743 -2618793 -1711622 4727590 11241296 11717051 7701301
39082 7701301 5730335 7658048 8850010 6263499 2967822 2635106 4030374 4020288 2696530
39073 2696530 2042828 1893448 824833 -491632 -449833 -176720 -2394790 -6565595 -8551310
39064 -8551310 -6066631 -1721942 874206 1923525 4258136 8476291 11604728 10824586
39056 10824586 6764457 2125991 -1749676 -5252356 -7840762 -7380010 -3318463 1341647
39048 1341647 3332966 3164143 3353352 3616523 1376182 -2871429 -4829630 -2504256 876118
39039 876118 2404768 4038731 7924617 10719095 7967047 2275526 1003883 5779983
39031 5779983 10231118 9636883 7300091 8266776 11244954 11165098 7087361 2892994 1070248
39022 1070248 48375 -1880233 -3439433 -2749920 -755300 -162129 -1441127 -1812930 786601
39013 786601 3928745 3222686 -1035435 -2762296 1911668 7980551 7143085 -754507 -6749226
39004 -6749226 -4138757 3795521 9457244 10023022 7720435 4583407 1083805 -1936917
38996 -1936917 -3732786 -5041713 -6274480 -5752223 -2484860 979298 1630682 462847
38988 462847 535836 1886847 2032801 704654 286815 1673167 2956706 2312600 -360243
38979 -360243 -4138311 -6991552 -6358823 -2820793 -1377383 -5112727 -9490577 -8061268
38971 -8061268 -2354718 190520 -2390084 -4528408 -3336459 -3034034 -6251279 -8359700
38963 -8359700 -5285469 -797018 -128595 -1222213 1084222 5666998 7014437 4676243
38955 4676243 3861944 6735594 9128687 6936467 1206217 -4238243 -6631915 -5022682
38947 -5022682 -561272 3239900 3493206 1636091 1297928 2450104 1307968 -3237704
38939 -3237704 -7035112 -6463729 -3604208 -2908177 -4820167 -5712770 -3283111 744282 3504044
38930 3504044 4505550 5285517 6654237 7610295 6956948 4924391 2628199 743932 -358941
38921 -358941 31284 1950295 3573760 3063849 1639083 2631680 7024695 12031160 14619037
38912 14619037 14171743 11229373 6595736 2716795 2568351 5372230 6663698 4658248
38904 4658248 2936786 4183924 5413840 3380531 780055 1775652 4491562 4156726
38896 4156726 1477100 921136 1947474 -154022 -4309032 -3002575 5690428 13126578
38888 13126578 11850155 6170484 5152546 9626503 12893322 11701417 9442424 8862516
38880 8862516 8126788 5682201 3824932 4575466 5616250 3844537 838934 856483 3927142
38871 3927142 5015510 1363874 -2900051 -2533354 884492 1227646 -2721418 -5328941
38863 -5328941 -2856112 1059091 1755604 866429 2695579 6546572 8038260 6169190
38855 6169190 3725029 1880950 -112000 -562280 3410646 9866116 12915500 10719434
38847 10719434 7564680 6852322 7158993 6684132 6257478 5806534 2948146 -2227808 -5502353
38838 -5502353 -4303645 -963826 1967692 4923598 7466685 6673127 2730404 869167
38830 869167 3712601 6724786 5573053 2822739 2337374 2333697 6523 -1978449 -649386
38821 -649386 105564 -4415381 -10097571 -9301423 -3355600 -379382 -1962125 -1991662 1130083
38812 1130083 1542349 -2681211 -5146922 -2053669 1403631 714103 339959 5860355 13818464
38803 13818464 16429110 12517090 7436984 4930483 4742551 6059766 7906301 7605704
38795 7605704 3627761 -1001276 -1999042 576278 3283677 4147368 3185497 198580 -4001396
38786 -4001396 -6004196 -3736303 -480093 -564155 -2462181 -1098619 3927021 7822485
38778 7822485 8156959 7345660 6844243 4532503 -104199 -3251133 -2201671 424288 981541
38769 981541 -69552 -604996 -1349668 -4033532 -7147933 -7651447 -5844566 -4779981 -5326463
38760 -5326463 -5362438 -3796796 -1910755 -276480 2166726 4803698 4515750 443471 -3059112
38751 -3059112 -1408727 3615124 5662462 2051800 -3065219 -4719109 -3298148 -2527759
38743 -2527759 -3453110 -3716372 -2255133 -1288009 -2604346 -4487090 -4067295 -994314 3004780
38734 3004780 6696761 9404002 9816221 7364388 4142545 2780395 2659101 1028086
38726 1028086 -2139962 -3609026 -1777082 1203995 3282381 4943495 6143459 4768148
38718 4768148 957724 -906449 1553682 4102501 2571781 713279 4394166 10149937
38710 10149937 8517317 -674350 -6015860 -1122193 5589857 4159530 -1598265 -1156690
38702 -1156690 5345026 7578494 1571522 -4644692 -3674765 1672495 4790566 4240393
38694 4240393 2269636 20085 -1442723 121430 4008053 5098220 843827 -3870629
38686 -3870629 -3508745 -214051 50984 -2809273 -3335089 519434 4801005 6309090 6549776
38677 6549776 7685590 9082409 9626472 9739326 9280113 6784362 2829490 1212160 4330985
38668 4330985 9484089 12023802 10739951 8444120 8764002 13796348 22882942 31582775
38660 31582775 33714547 27397298 18380121 14620641 17529947 20943421 19112100 13340937
38652 13340937 9426579 10196592 12661050 12409547 9156199 6914895 9145999 14783625
38644 14783625 19420342 19729247 16058097 11228443 7963593 7482277 9193140 10910692
38636 10910692 10270213 7143638 4418004 5268100 9455935 13241705 13489572 11202871
38628 11202871 10197332 12666878 17181218 21083421 23311353 23870555 22017788 17264340
38620 17264340 11942125 10199750 13322840 17800442 19420503 17926986 16116275 15640659
38612 15640659 15809435 15833031 15896106 15936187 15476834 15201590 16793357 20202468 22608035
38603 22608035 21615869 18733569 18040472 21316783 25884736 28218402 28929454 32419585
38595 32419585 40907747 50327405 54043096 50066598 42358258 35078408 28546566 21977291
38587 21977291 16916191 15077613 14827379 13171380 10208123 8402170 8145378 7498524
38579 7498524 6123650 5744539 6261550 5347169 3234128 3966119 9356447 14965577 15487821
38570 15487821 11856724 9155330 8932288 8162610 5920627 6244797 11924565 18822700
38562 18822700 20210853 15480151 10607514 9691500 10017565 7661795 4503857 5297269
38554 5297269 9190494 9569443 3546142 -3153304 -3621067 1587605 6787121 9027192
38546 9027192 9237713 8027283 5806271 5765836 10569075 15991105 14306391 5632220 -345661
38537 -345661 2989092 10419886 12893882 9378109 5469870 3997996 3304637 2852106 4117037
38528 4117037 6176247 5997881 3746423 3054363 5120276 6914509 6525229 6163406 7983171
38519 7983171 10487534 11394835 11243466 11780579 13053136 14413786 16473996 19668090 22407374
38510 22407374 23112830 23098615 25154550 29757839 34503942 36805329 35518757 30571993
38502 30571993 23121347 16117679 12652910 12830396 13443575 11708073 8654206 7764706
38494 7764706 10286307 13023279 11862206 7204143 4248991 6962329 13199951 17593641
38486 17593641 18155652 17361834 17181037 16723299 15925227 17814823 24206111 31637222 35130575
38477 35130575 34653149 34247495 35379846 35029532 30909114 25061278 20766423 18458099
38469 18458099 16452402 13951043 11711214 10806825 11587743 12798587 11767500 7636666
38461 7636666 4463341 7686207 16241638 22050296 20058245 15221536 15564362 21314922
38453 21314922 26236301 27971130 30720653 37379393 45156309 50886909 55254128 58766425
38445 58766425 58312243 51886443 43364962 38003106 35254710 30522943 22919202 16891722
38437 16891722 15966786 18274019 19123136 16094837 11272859 9395176 12778193 17001497
38429 17001497 14067973 2395955 -8972075 -10231945 -3052662 2085506 -98793 -4290912
38421 -4290912 -3978551 -110567 2524602 2669795 2305873 2209196 1888078 1993850 3197572
38412 3197572 4005418 2813590 957716 738988 1502415 846903 -929095 -861116 2201147
38403 2201147 6049167 8371336 8976438 8379994 6833974 5622183 6774052 10044824
38395 10044824 12347916 12073701 12077732 15645130 20518726 20515796 13904833 6940014 6567096
38386 6567096 11673060 15086835 13495889 10959546 11377272 12092480 8810179 3837359
38378 3837359 3958834 10507713 16707861 16342336 11053825 6880915 6720277 8891420 10992091
38369 10992091 12408826 14019864 17241084 22512587 27874371 30722369 31619410 33509352
38361 33509352 35784621 33042162 23081433 12706997 10470337 15386972 18495004 15322101
38353 15322101 10854129 10639704 12659550 11698009 7844900 5927330 8208025 11969966
38345 11969966 13986626 13730829 11836867 8757396 6086159 6258574 8942315 9948709
38337 9948709 6326319 1122573 52208 3922913 7569855 6707549 2661521 -856787
38329 -856787 -2482679 -2625312 -1093739 1636057 2866644 801231 -2144393 -2373390 -64954
38320 -64954 2272047 4382842 6987009 7599473 3465734 -1899663 -1741964 3707947 7117944
38311 7117944 5888619 6163834 11263025 14236691 8479732 -837110 -4197808 -1960683
38303 -1960683 -1933440 -5296225 -4768460 2855094 10990359 12336798 7266938 960548 -2580079
38294 -2580079 -1739906 2766125 7277339 8377602 7705869 9597907 13663810 14789293
38286 14789293 11301638 7495376 6448227 6101279 4861413 5300071 8789028 11574788
38278 11574788 10382306 7815965 7979426 10202059 11259503 10808101 10519066 10323110 9295846
38269 9295846 8052906 7015770 4811012 1489121 329770 3022263 6323437 7313481
38261 7313481 8252206 11436532 13073745 8640949 1625773 -310943 3335390 5727760
38253 5727760 3779784 2128145 4578958 8122803 8096752 4377317 67729 -1958481
38245 -1958481 248479 6108017 10447522 8115775 2058597 891422 6212377 9161280
38237 9161280 3673372 -3724078 -3696197 1960422 4259988 1291213 -541744 1630370
38229 1630370 3120945 754891 -1989189 -1659833 -140566 68084 308638 1704653 1467044
38220 1467044 -2390090 -6529354 -7003402 -5310080 -5196575 -6285702 -5852073 -4567412 -4970039
38211 -4970039 -5826807 -3887676 -425041 196586 -1478748 -56550 5341676 8495815
38203 8495815 5709135 1762006 2041002 4163529 2930051 -549700 -1049719 1990753
38195 1990753 4390885 4823181 6143812 8920813 9471013 5836055 1130771 -820430
38187 -820430 409809 3454037 7297910 10234645 9944985 6571028 3275525 2296038 2688348
38178 2688348 2865349 2711195 2370786 1955967 3185602 7618021 12200177 11151190 4469757
38169 4469757 -206252 2418945 8076793 10153923 9707008 12061865 16531504 17115049
38161 17115049 12753827 9561488 11738158 16621743 20576982 23713713 25896660 23795025
38153 23795025 16324085 8852775 7109126 9635938 10841022 9192530 7455248 6453105
38145 6453105 4162516 848773 -129167 2384778 5630244 7725049 10017433 13131990
38137 13131990 14948074 14802055 15581722 18707050 21255821 22153502 26937128 39977203
38129 39977203 54349836 57122744 45261953 29558408 20923764 19000709 17387445 14211874
38121 14211874 12288754 12390993 11966820 9330730 5127085 526617 -3030945 -3675245
38113 -3675245 -1621347 -267113 -1748896 -3125964 -303964 5936289 11385007 14234868
38105 14234868 15744228 16875618 18493205 23060225 31092047 37330546 36107362 29659639
38097 29659639 25046263 23420634 19597161 12816950 9650557 13181011 16860056 13976416
38089 13976416 7333466 4061171 5387219 7251010 7686099 7914994 8290829 8284829 9137985
38080 9137985 12189025 15673743 16953154 16992309 19447709 26169874 35908521 45845870
38072 45845870 52190819 51530690 44345268 35239976 27535880 20287305 12721717 7672506
38064 7672506 7169490 8429815 8350436 8363484 10320314 11402492 8667886 5304710 6187748
38055 6187748 9970688 12061538 12983198 16818421 23509781 30306939 39020972 52978483
38047 52978483 67180307 70953946 62021133 49465473 40631857 33490253 24845383 17364884
38039 17364884 13655591 10832328 6623027 4650316 7683891 10988128 8834806 3559065
38031 3559065 1739943 4383062 7030824 7540706 8018604 10135429 13260467 16463077
38023 16463077 18713870 18349587 15591583 13908739 15743585 18921176 20320699 20389654
38015 20389654 20568045 19571095 16739766 15811437 19802160 24842713 25356369 23172332 24357084
38006 24357084 28341862 28330305 22712408 17517106 15622655 12255634 5249596 1505845
37998 1505845 6626557 14440116 15116244 9915510 8987645 15889277 23296534 25221900
37990 25221900 24982548 27422705 30600000 31397611 34346442 46578271 64955246 75841842
37982 75841842 69968614 52531462 35884156 26303306 21396394 17259238 13264745 10507331
37974 10507331 9610525 10734037 13189859 14669392 13040194 9227451 6343686 5727798
37966 5727798 5749274 4701591 2877941 1455587 1181934 2395336 4462043 5110798 2511462
37957 2511462 -1739717 -3990078 -3196954 -1804326 -1631396 -1719213 -1017685 -224506 250925
37948 250925 1208487 2091338 624334 -2935363 -4225858 -258556 5908279 8961322 7899910
37939 7899910 5795061 4711266 4383610 4990812 7503839 10984396 12485241 10562524
37931 10562524 7086693 4887602 4819942 5599500 5749003 5378730 6037062 8302749 9879533
37922 9879533 7852377 3261603 1197295 4958966 11970160 17144865 18698407 18856982
37914 18856982 20286375 23763512 28294530 31837909 32847983 32268500 32545089 33577051
37906 33577051 31874629 25600115 18266535 14957989 16472643 19457816 20682422 18939756
37898 18939756 14685417 10499850 10113997 14057346 17912383 17815032 15797331 16214447 18694267
37889 18694267 18843804 14895427 9379306 4754271 1596045 859207 3543462 7668740
37881 7668740 9533837 8624915 7743121 7971020 7485577 5969988 5861535 7791622 8881497
37872 8881497 7578349 6431065 7496024 8285838 5556456 882362 -950555 1980702
37864 1980702 7173029 11687980 15002495 17467637 18067830 15338270 10174558 6266297
37856 6266297 6589722 9912968 12334074 12306558 12026378 13253020 14521203 14131479 13091847
37847 13091847 12651619 11674756 9623352 9465572 13575917 18920685 20841287 19858284 19858056
37838 19858056 21117933 20655093 18426991 17180444 16597810 13842954 9906641 8861921
37830 8861921 10495316 10740960 10106428 13547709 20120414 21664331 15482343 9530480
37822 9530480 9703860 10488092 5368455 -1165711 -961190 4432812 7645721 8422486 11980248
37813 11980248 16776334 15074263 5981130 -2218524 -4508156 -4794843 -6453707 -5948588
37805 -5948588 -360964 5872054 7311438 5529374 5302488 6530539 5402612 1340976
37797 1340976 -2231868 -3089571 -2194548 -992828 -23426 -119080 -2185549 -5330170 -7121119
37788 -7121119 -6196946 -3388876 -74641 3284993 6312420 7368035 4576986 -1164478
37780 -1164478 -5333782 -3781894 2397664 7994655 10062316 10513299 11245288 10360488 6445755
37771 6445755 3439414 6161085 12374933 14792025 11057159 6413653 5369950 5993275
37763 5993275 4724574 2037567 4642 -1783616 -3913711 -3962631 -217055 3544125
37755 3544125 2058532 -3272107 -5121482 150417 7767830 11061355 9396033 7174204
37747 7174204 7181280 7880707 6617993 2981703 -1328557 -4281233 -4667565 -2859660 -1140185
37738 -1140185 -2067577 -5398179 -7539095 -5493971 -750336 2523383 2878172 2952079 5052192
37729 5052192 7890248 9128884 9009975 9333540 10355423 11032652 11261170 11413378 10436472
37720 10436472 7109050 2947552 1191956 2586059 4427164 4260062 2565846 1372931
37712 1372931 1936240 4031180 5920816 5193681 1610826 -1261497 102990 3809722
37704 3809722 4188556 -621143 -6051728 -7217434 -4328893 -366309 3219611 5943650
37696 5943650 6441962 4463654 2555714 2482437 1832816 -2194790 -7170086 -7864368 -3750381
37687 -3750381 312992 1237598 1166985 2419854 3163657 889908 -2804706 -4254621 -2806900
37678 -2806900 -703962 946803 2726189 3845446 2175834 -1741425 -3782932 -1252135
37670 -1252135 3204995 4827235 2645340 6027 -163579 1552570 2779817 2416091
37662 2416091 1461297 1788839 4325961 7809811 9649000 8758422 6755398 5274016 3491083
37653 3491083 416457 -1797963 -264270 3445348 4627139 2589742 2173711 6438970
37645 6438970 11927073 13732021 11547392 7657546 2661361 -2858005 -5696478 -3834570
37637 -3834570 -540789 53535 -704222 832534 3310256 2547444 -239224 538216 5353522
37628 5353522 8214046 6334175 4452874 6905905 11400519 13844047 13926073 12420046
37620 12420046 8152833 1766062 -2183515 -1346650 341678 -839969 -2172031 -24577
37612 -24577 2650242 1106717 -1948841 278842 7077155 9903481 4810531 -1761803
37604 -1761803 -2399495 1537511 3449076 1250916 -706886 1622892 6638517 9153044
37596 9153044 6459807 1301843 -1495962 -547899 1542519 2857668 4424999 6725512
37588 6725512 7467464 5528770 4014064 5727972 8207152 7612421 5401035 5990180 9222104
37579 9222104 10909668 10353454 11117597 13718522 13902762 10205620 7403861 9398734 13520204
37570 13520204 15244128 14260744 12354415 9470291 6060311 5516879 9323645 12798685
37562 12798685 11056807 6932039 7100703 11775354 14738356 13439754 12144685 13457169
37554 13457169 13493201 9165419 4681693 5485322 9367058 9514657 4604797 29214 -477545
37545 -477545 1288488 3303017 6886862 12465187 16272256 14848691 9827172 4903703
37537 4903703 697221 -3789174 -7072048 -6980395 -5068802 -4807139 -6274436 -6959126 -6827188
37528 -6827188 -7564295 -7404567 -2729053 4603320 7816335 4824640 1159198 992974 1767284
37519 1767284 1118568 2163476 6626650 9167677 5528057 1111206 3432611 10014738
37511 10014738 12594552 10535408 10301724 12770653 11519598 4941835 102966 1334928
37503 1334928 3723842 2301047 39332 1337903 4042384 4191790 3685870 6420380
37495 6420380 10060456 8547990 1595908 -4171523 -3714306 1122639 5371301 6731036
37487 6731036 6547218 6921690 8102541 8723734 8366325 8615876 10230434 10857835 8404382
37478 8404382 5292807 5316150 7175447 6287962 2780828 1474169 3075251 2531245 -1307758
37469 -1307758 -1750094 5495913 14516777 17244207 14134493 10945354 9466560 7858241
37461 7858241 6487477 6918187 7991425 8770602 12028178 18649120 22535830 18606259
37453 18606259 12268747 12219600 16864461 18186905 17196149 23151119 36449683 45656669
37445 45656669 46507384 51332855 70332245 92537684 97146744 79612204 55413205 39091838
37437 39091838 30102653 21506106 13173729 9880713 11133767 10621455 5965100 3038953
37429 3038953 7308394 14462876 14967466 7351564 1075862 3861101 11461118 14609479
37421 14609479 11973277 9744351 10663142 11059759 8968395 7862792 10217280 13390560
37413 13390560 14583807 14613258 13933485 10213531 3603701 -390695 2022524 6617718
37405 6617718 6797758 2838676 539807 2440706 5320994 5832490 4341147 2923653
37397 2923653 2685230 3445241 4018004 2937752 415683 -1249169 -632344 921798 2106128
37388 2106128 4384167 9311868 14697421 16504725 13886994 9787075 7195765 7066983
37380 7066983 9042345 11832424 13664990 14599763 17280685 22838680 27439510 26427365
37372 26427365 21260760 18394112 20873209 24828524 25650483 24295400 25063268 29245879
37364 29245879 33813751 35872634 36147020 37395364 40500902 43291550 43511256 42249908
37356 42249908 43248785 48531597 55835475 61176889 63154936 63704753 65032763 66804108
37348 66804108 66506585 62388166 56031647 51434089 50718030 51546785 50434622 47843039
37340 47843039 47267115 49334696 50308462 47645709 43686932 41722564 41306160 40111670
37332 40111670 38009182 36277227 34599967 31917560 28936279 26958399 25377815 22998207
37324 22998207 20634617 19708107 19450850 18277296 16739372 16224497 15930294 14316461 12513999
37315 12513999 12814954 14419146 14204894 11515020 8918529 8270086 8952597 9833952 10152494
37306 10152494 8909639 6254937 4727402 6034821 7771708 7084164 6191028 9328673
37298 9328673 15010851 17198293 14528026 12198974 13169270 13688665 10398427 6215132
37290 6215132 5270015 6576482 6913368 6211903 5848582 4976658 3069916 3187179 7763295
37281 7763295 13295339 14396038 11946139 12039123 16890232 21568700 20885402 15878192 11709881
37272 11709881 11360441 13124800 13537509 11666891 9988742 10541882 11198603 8241779 2644289
37263 2644289 64552 3005928 6877458 6781816 4574145 5002848 7730116 8314955 5534914
37254 5534914 2571840 1618291 2166502 4231691 8198905 11315664 9605846 4342098
37246 4342098 1707566 4430217 8377488 9414719 8928250 9629308 10209485 8260509 5526015
37237 5526015 5818767 9174784 11869914 11572723 9469372 7788131 7821537 9947603 13125738
37228 13125738 14553529 12098017 7231444 3774247 3587252 5010295 5585233 4738926
37220 4738926 3429379 2548329 2487225 3484569 5359131 6825992 5978763 2567803 -292436
37211 -292436 1502044 7799330 13141299 13219381 10730991 11270490 14492657 14531172 9887994
37202 9887994 6890808 10070037 14447211 12743567 6489404 3332015 5219529 6673917
37194 6673917 5094816 5226664 10398772 15523495 13783326 6513073 1140140 1269590
37186 1269590 3971009 6254146 8955387 12880704 15491553 14451340 11948976 11978941
37178 11978941 14196801 14011573 9455927 4826147 5264104 9674350 12181704 10212169
37170 10212169 7803995 9771518 15238082 19051137 18042092 13688421 9424664 7384581
37162 7384581 7494344 8085513 7419427 5667110 4972575 6666275 9350889 10932211 11371698
37153 11371698 11905374 12832785 13929450 15624210 17502816 17213404 13801724 10699741
37145 10699741 11704819 14918230 14906756 10597059 6469420 5566900 6137324 6284097 6969845
37136 6969845 8443316 8465392 6745712 6698673 9697396 11891486 10365283 8231453 9184976
37127 9184976 10939073 9515851 6959401 8517257 13846836 17317537 16587919 15048266
37119 15048266 15415566 16223085 15599828 13895849 11440453 7869158 4853573 5526443 9647397
37110 9647397 12694885 11313418 6986155 3331862 2483205 4891821 9776158 14636954
37102 14636954 16668248 15500150 12944069 10540080 9478573 11311433 15144151 15859312
37094 15859312 10201580 3590126 4809571 13935493 22012634 23406478 21340825 19546935
37086 19546935 16475224 11560358 9588877 13121350 16617911 14463624 10068189 10399209
37078 10399209 15258581 18800396 19057785 19305358 21451692 23970132 25550885 26033805
37070 26033805 24800982 22352766 21794599 24818681 28498637 30024341 31332004 34191818
37062 34191818 34657340 29035715 22213990 22311133 28835477 33908780 34246204 34192066 37240544
37053 37240544 42127827 47477226 53283918 58006979 61209814 68020733 83084340 102358589
37045 102358589 121620028 150660718 202436575 264059489 295954794 271911506 209534606
37038 209534606 149586008 113909360 95731621 82627346 71493349 61987585 51092777
37031 51092777 39091907 31514281 31039390 33797131 35811573 36957474 36859853 33281301
37023 33281301 27119203 23499379 24983151 27977473 28376744 26894842 26287976 26580000
37015 26580000 25706600 22796977 18955547 16279730 16805476 20569561 24448474 25070018
37007 25070018 22927946 21240968 20937645 19722129 16328183 12687959 11158023 12022690
36999 12022690 14280881 16793070 18481387 19397376 21275311 24855644 27485276 26208463
36991 26208463 22504512 20678426 21955336 23529518 23201875 21509794 19405812 17356090
36983 17356090 16766896 18851261 21970174 23247961 22566123 21943183 22079051 23134594 27048228
36974 27048228 34063429 38783401 36130531 30240337 30167309 36981067 43087510 44757047
36966 44757047 46214261 49529522 50398190 47661253 47159501 50936429 52341024 48452917
36958 48452917 47570499 55707039 64800228 65051764 61193810 64196857 73090473 78819245
36950 78819245 81800359 90506669 104227376 112559253 112867401 113575799 117912563 119213501
36942 119213501 116418455 119435197 133106231 150564668 170367493 204006265 252583137
36935 252583137 289146427 283237474 238069923 186889564 154758966 139395237 129026461
36928 129026461 121831591 121874696 128748765 139786918 155034312 172966448 186633890 190415445
36920 190415445 187263362 184310430 183816705 182544448 178137350 172351277 168540902 168266921
36912 168266921 170512812 173863358 179635891 191460386 210516489 234159109 262400721
36905 262400721 301214816 351645495 397466710 414010995 392843846 350929032 312769315
36898 312769315 290955654 286928679 299279953 320717825 333208577 319455122 280696526
36891 280696526 235475781 199866360 175172372 155145137 137231063 123024428 112959718
36884 112959718 105255587 98240747 91163156 84011778 77850396 73929916 71776774 69570317
36876 69570317 66398804 62284856 56464578 48471797 40899840 37709004 38882232 39813901
36868 39813901 37304949 33357234 31398923 31397487 30989831 29611280 29079498 30914945 34778399
36859 34778399 38914625 41040714 39843339 36913150 36307233 40790955 48958510 56992523
36851 56992523 62617352 66419994 70077937 74501256 79248499 82533698 81976751 76682902
36843 76682902 69171622 64449858 65946851 71861825 76290455 75232020 71450579 71731586
36835 71731586 78535543 86137947 86828503 79691046 70871529 65738634 63570138 60486621
36827 60486621 55164170 50196933 49051617 52762778 58909062 63313450 63635046 61948364
36819 61948364 63345804 71727428 87085837 106136928 124370966 137826384 144634970
36812 144634970 145908587 145009004 145615304 149625706 155448191 158448982 155378469 149043521
36804 149043521 145994415 148696011 153725152 159489148 170419833 189275777 211122634
36797 211122634 232574943 262145669 309500506 364414973 398965423 395766177 365093593
36790 365093593 329349958 300849163 282720793 280688389 298247570 322439352 329106773
36783 329106773 306738125 266943064 228506981 198974357 175724493 157134932 144818820
36776 144818820 137778086 131333535 122595988 113435810 107277036 104988889 104593321 103993297
36768 103993297 103343046 104432588 107344508 108363504 102793557 90248985 75909471 65751492
36760 65751492 61070164 58190371 53374259 47591041 45591192 49383338 53821252 51656555
36752 51656555 43298231 37697838 41448699 50871785 58598847 64356136 73265440 85163650
36744 85163650 92836810 92292470 88846423 90017624 96614715 104091245 109397499 112840329
36736 112840329 115337867 117578266 121143529 127531921 135959017 143703830 148456565 149579118
36728 149579118 148112980 146554502 147334953 150272922 152810792 154012391 156590045 162965932
36720 162965932 170905794 175978010 177650374 179520182 182922735 183818000 178351077 169075977
36712 169075977 162113810 158856347 154421920 145333400 134862852 127835505 123033697 115247060
36704 115247060 103676581 93195234 86792439 81896744 76027355 71107647 68989196 67175037
36696 67175037 63298589 60104333 60835540 62737022 61186257 58204938 60080685 67226907
36688 67226907 73254074 74432393 73233037 71398976 66784753 59665625 55206817 55698626
36680 55698626 56487098 54330189 53973945 60281665 68473782 69537270 62792424 55930671
36672 55930671 53722226 53489292 51742717 48856334 45941823 42546663 39268683 38200207
36664 38200207 39012010 38688070 36996310 38130903 44487013 52675206 58955744 65220670
36656 65220670 75142524 86340098 91453383 87282534 78788620 72706642 70462047 69595798
36648 69595798 69565819 72336649 77461395 80276661 77073736 70145540 64992333 63057201
36640 63057201 60090993 52461669 42486303 35485292 33130165 32364625 30562863 28979884
36632 28979884 29988386 32902364 34727857 34565653 34951179 37821889 40954184 40841942
36624 40841942 38715878 40461098 48815977 58182538 60314843 53903870 44960739 38267246
36616 38267246 33002308 27908287 25752634 28805778 32953478 31280542 23053179 15104444
36608 15104444 13498960 16700868 18299123 14681914 8627906 6010466 9717294 16670320
36600 16670320 20890719 19658258 15954552 14394783 16001406 18175025 18570294 17019920
36592 17019920 14206714 10663406 7428748 6032842 7074908 9521394 11669093 12465751
36584 12465751 12262267 12676112 14857771 17298547 16764600 12584037 8377240 7723496 9792502
36575 9792502 11734765 13597036 17094838 20486104 19530306 14393726 10988646 13216074
36567 13216074 17684202 19118102 17854823 18112992 20831777 22519082 20705548 16800172
36559 16800172 13226704 10835500 9834174 10606501 12570523 14287210 15590172 17653425
36551 17653425 20096399 20295012 17164676 13757150 13990382 17959037 22604043 26162469
36543 26162469 29435088 32817180 35007121 36038514 39437820 48665597 61434659 69744133
36535 69744133 67090337 55185269 42264196 34653698 31399732 27929309 23101035 19920199
36527 19920199 19765432 19642939 17045964 14682408 17057703 23586225 28556791 27935790
36519 27935790 23231813 18198440 14622896 12471638 11645519 11821135 12046562 11811000 11413892
36510 11413892 10735041 9307425 8083840 8870201 11130042 11904426 10241992 8972106
36502 8972106 10176454 11697437 10789042 8768255 8827079 11113505 13374606 15010316 17011042
36493 17011042 19009043 19856155 20138006 20636324 19448360 14681414 9110747 7482817
36485 7482817 9428792 10121320 8478734 9196044 14727144 20454864 21109132 17962287 15835296
36476 15835296 15947360 15910150 15001344 15123656 16736230 17356044 15156180 12099868 12130858
36467 12130858 16572840 22084410 23904782 21341148 18953271 21332418 27898659 34294162
36459 34294162 37398555 36831624 33285722 28600927 26096445 26923723 27063391 22257114
36451 22257114 15026766 11634795 12610620 12574900 9913820 9352534 12736541 14666898 11273002
36442 11273002 6656046 5599617 6007772 4671179 4931348 10865382 17709120 16623273
36434 16623273 7455213 -1040799 -3276926 -1907680 -554637 1370866 4675732 7157224
36426 7157224 7267927 7048990 9020774 12947200 16997456 19360048 18122931 13050152
36418 13050152 8391931 10001668 17729367 24050976 22740619 16288286 12070028 13335603
36410 13335603 17162428 20005991 21444052 21956208 20517402 16847682 14129390 16050055
36402 16050055 21172037 23662248 20943348 17379090 17933193 21271705 22805486 21906441
36394 21906441 21357827 21659619 21483418 22430316 26965274 32196834 32571721 28804855 27026400
36385 27026400 29083113 31773880 35603456 44327870 55246245 62040877 68938384 87206898
36377 87206898 114204378 135577369 157356858 211534438 307081061 393084360 402370677
36370 402370677 328144546 229804340 162796828 130475473 109307941 90014696 76132803
36363 76132803 64147342 48004339 33230335 28604233 30089961 27392504 20992578 19331094
36355 19331094 23118145 24983419 22467998 20199081 20050199 18767038 15552003 14243614
36347 14243614 17168290 22257758 26422301 28051928 27281879 26714223 29656268 35230641
36339 35230641 38642621 38439963 38657118 41350718 43402867 44219370 49091615 59674001
36331 59674001 68673905 70651816 71009709 76835243 85817147 92629527 99378772 109962517
36323 109962517 120509895 126712363 135319973 155648924 182961168 203193229 212387971
36316 212387971 218418129 224017524 221849884 208555934 191224159 176119877 161479261
36309 161479261 145245837 130139699 116945684 102013264 85934012 75983445 74933165
36302 74933165 75521110 71379141 65738852 63315613 60967678 53873792 45224687 41621816
36294 41621816 42477944 41738225 38038253 35827127 36808723 36752308 32304396 26497929 24990474
36285 24990474 28728108 32476057 30765699 24222929 18553386 17256967 17995163 17695481
36277 17695481 17719047 20158031 22118530 19457944 14606195 14152005 18886885 22885973
36269 22885973 23158917 23287959 25496360 25841119 20912507 14130675 11326348 13447015
36261 13447015 16733042 17508770 14913917 11504405 11946086 17965341 24660886 25919433
36253 25919433 22806893 21023003 20802831 17012133 9977057 7355726 12297370 18160054
36245 18160054 19132728 18039128 18523169 17500304 12036702 6797423 7055511 9834730
36237 9834730 9654565 8258234 10665011 15521470 17570323 16801561 17177698 18381494 16529803
36228 16529803 11812013 8469132 8125418 9194450 11447720 15151838 17387871 15458456
36220 15458456 12282842 12275191 14032975 13824434 13769944 18389217 24724744 25062652 19356327
36211 19356327 15877115 18468000 21811134 21215475 18858882 17739605 17084946 16724195
36203 16724195 18851587 22320442 22191957 18444361 18288528 25776107 35413684 40270502
36195 40270502 40370831 38935562 36867141 35944497 40841857 51781709 61253104 64967161
36187 64967161 70227182 85489488 108101877 134003183 174693160 246521249 337306441
36180 337306441 398860853 389446730 323548856 267517275 277675541 343991071 399415468
36173 399415468 385276121 303822726 206151207 137086269 101594951 81031012 64558266
36166 64558266 54202771 49460945 43250996 33415210 26332763 25580799 25423437 19830856
36158 19830856 11489952 6947211 7328851 8692330 8513412 7367837 6075530 4992545
36150 4992545 5070285 6703927 8353974 8481569 7879608 8282910 9781003 11141168 11366728
36141 11366728 9632149 5527165 919670 -664784 1325838 2668297 -116895 -4469576
36133 -4469576 -5309797 -2321476 79583 -641986 -2453460 -2844643 -2002226 -983889 365240
36124 365240 2441567 4883958 7419496 10065310 12168287 12962811 13061196 13553144 14122295
36115 14122295 14275402 15261144 17354351 16606693 9668643 1763362 3108593 15121364
36107 15121364 26727455 28408028 23987643 23235118 28421134 35387081 43617085 56523743
36099 56523743 73778117 91987976 111937818 135772571 156391767 159768819 141578316
36092 141578316 113516573 88999738 70075524 53130034 39392596 32106085 28838905
36085 28838905 24877268 21011754 20611280 21677922 19275747 14099990 11333452 11949928
36077 11949928 12143763 10829007 10598031 11122751 8774821 3816608 1128763 2171634
36069 2171634 2802941 1192034 1284848 5297074 8929140 8121463 5396855 5066628 6520569
36060 6520569 6917898 6824911 8241924 9796729 8783985 6240705 5728471 8181063 11282048
36051 11282048 12813544 12113138 9955512 9140032 12490489 17736062 17916373 10529840
36043 10529840 2670677 2285278 7519974 10573461 9723399 10719037 17057483 25720121
36035 25720121 33225670 39867035 46590209 52945526 59612995 67965858 75422698 76122389
36027 76122389 68477810 57770933 49058875 41810012 34072479 27534414 24923528 25741261
36019 25741261 27949023 30956236 33787824 33410150 28636014 23146229 20801997 20229935
36011 20229935 18085701 15516913 16495979 20799669 23693644 22800457 20863679 20848358 22227199
36002 22227199 23633744 26007079 31059401 38516573 46360251 52395048 54704168 52211017
35994 52211017 45934112 38553240 31959416 26190177 20940998 16488558 12623146 8540179
35986 8540179 4789453 3532926 5370825 7468572 6916271 4999332 5657014 9838396
35978 9838396 14089345 15684051 16584399 20050561 25057779 27326213 25496050 22777184
35970 22777184 21837146 21822914 22228155 25704420 33780408 43800893 55291786 75720137
35962 75720137 111418775 152642764 176454655 168723680 138538312 108759841 98057651
35955 98057651 113182896 147836526 181061979 185645174 151570902 99783460 62423878
35948 62423878 49877359 46494857 37141621 24855931 19210805 20159372 21562072 22059823
35940 22059823 23332410 23040417 18229870 12401218 11350800 14201966 15627852 15041463
35932 15041463 16203652 18614183 16946259 10099809 4349826 5191494 10565222 14228644
35924 14228644 12580209 6859505 1418156 481289 4008481 6853079 4855371 820050
35916 820050 529738 3916672 5568328 3865567 3361018 6783038 11033699 13590187 16510953
35907 16510953 20383077 20667404 15652359 12648409 18952676 30011379 34438183 29297848
35899 29297848 22547234 20336751 19875417 16838784 12554348 10069658 8772205 7324878
35891 7324878 7475016 10275397 12316382 10961554 10207223 15095056 22117612 22341629 14480022
35882 14480022 7919226 10263646 17740809 21891781 21102565 20226751 21578185 22252293
35874 22252293 20062614 17159297 16596101 18596987 21267904 22477750 20435404 15073895
35866 15073895 9620423 8066203 10045712 11019727 8938242 7665642 11364088 18105741
35858 18105741 22518086 23289182 24127944 27356562 30431586 30500966 29750064 33437824 43345859
35849 43345859 55954940 68350160 84061318 109709526 144491893 175419609 186678333
35842 186678333 174612597 151878217 136619493 138848564 155772745 175593183 184405081
35835 184405081 174297830 149351841 122279869 102220304 87355206 71677818 55435226
35828 55435226 43876360 37910477 32638230 25509161 19748120 17722179 16453273 13110876
35820 13110876 10507101 12580147 17148571 18034111 13517897 8510370 7965572 11190034
35812 11190034 13555195 11953614 7738848 5084823 6472837 9430396 8885081 3755143
35804 3755143 -610368 1167375 7117699 10252005 7756353 3862492 2702840 2596944
35796 2596944 267457 -2741632 -2507844 -137972 -1386998 -7892643 -13455763 -11780495
35788 -11780495 -4497766 2113845 5853723 9313139 12907377 12793368 7303277 943541
35780 943541 -1004239 1105133 3411944 4757440 6954959 9930067 10513976 6676358
35772 6676358 400701 -4371053 -5003946 -1271515 4869545 10032279 11422758 9034914
35764 9034914 5527314 3954021 5652512 9251189 11167089 8672246 3550708 791422
35756 791422 2168025 3661991 1688064 -1104877 -254615 2822788 3095544 659470 752256
35747 752256 4499989 6343310 3117869 -381953 1118865 5169021 5697214 1945455
35739 1945455 -1689327 -2552736 -1708875 -368903 1199834 1823347 361479 -1842378 -2767360
35730 -2767360 -3314719 -5548160 -7894855 -6179516 196583 6842278 9915906 9720148
35722 9720148 7979939 5182007 2177613 1028630 1951585 2106831 -92119 -1832751
35714 -1832751 56677 3843027 5043765 2704995 -64397 -1367180 -2363799 -3254723
35706 -3254723 -1589239 3159664 6680064 4980461 610906 -39733 4975698 11153122
35698 11153122 13865134 13156051 11423098 9793478 8535825 8181315 8067415 6090799
35690 6090799 2071847 -871430 -622302 578099 -231409 -2128972 -2667685 -2521367 -3592787
35681 -3592787 -4312765 -1792955 2318395 3542644 1999647 2404207 5809160 7332907
35673 7332907 4331816 1245709 2820943 7067420 9034184 8024677 6774779 6265725
35665 6265725 5895093 6974124 11543377 18348045 23644880 25834675 26545452 27493668 28699625
35656 28699625 29400977 28599679 25227679 19763083 15114550 13945659 15430614 16153795
35648 16153795 13829567 9063893 4152660 1082236 -44339 -1109420 -3508355 -5743814
35640 -5743814 -5374219 -2917011 -781876 1422293 6208741 12265097 14479410 11929082
35632 11929082 10408602 13813711 18362625 19547301 19470596 21767310 24032254 22049534
35624 22049534 17937716 16835286 18104342 17324211 15147198 16229158 20130714 21284088
35616 21284088 18378487 16204896 17063069 17486747 15257201 13142382 13595107 15513543
35608 15513543 17974749 21521910 24475517 24181475 23254851 27804135 38063264 48571498
35600 48571498 59141566 75419160 95268724 108647168 121349027 164855791 260270426
35593 260270426 373165425 427953088 383524912 286804455 234436047 276720636 367178721
35586 367178721 412098067 364080209 258978319 165484223 115173316 90741086 68114809
35579 68114809 46729681 36107567 33602279 29452035 23452919 22265607 25031965 24705463
35571 24705463 21563130 22880880 28692348 29613183 21852888 14137014 14665245 19452662
35563 19452662 19921337 15785302 13110337 13425134 12292415 7623329 3037597 2073764
35555 2073764 3490384 3828051 1810669 -1217231 -3383247 -3558242 -1664709 1253019
35547 1253019 3822626 5783274 8044258 10720006 11874218 9611233 5382954 3330353
35539 3330353 5120929 7113949 5010771 252682 -1618616 982823 3374130 1953309
35531 1953309 -212334 1573551 6097239 8011929 5455902 1555365 -960443 -2485338
35523 -2485338 -3838898 -4584487 -4603521 -4361323 -3331189 -1004932 632349 -1013349 -4655399
35514 -4655399 -6124400 -4264836 -2040765 -1183932 -121082 1504000 1108398 -1553786
35506 -1553786 -2124594 1641937 5031866 3051042 -1209095 -683879 4774002 7809345
35498 7809345 4226668 -1318997 -2162135 2104084 6735594 8189427 6661609 4260509
35490 4260509 3262022 5139834 9143591 12241826 11994972 9179735 6482754 5134399
35482 5134399 4118301 2479504 1068854 1472195 3699499 5434211 3947943 -872764
35474 -872764 -5704613 -6936745 -4799052 -3245689 -5195035 -9076959 -11115666 -9909182
35466 -9909182 -7130646 -4463069 -2150438 -801192 -2113634 -6218130 -9946533 -9974307
35458 -9974307 -7083812 -5106037 -5643775 -6213838 -4451744 -1844408 -1345299 -2767445 -3025209
35449 -3025209 -490587 3177307 5499529 5304089 2415946 -2077998 -4717246 -2057411
35441 -2057411 4111754 7034514 3197606 -2511105 -3548990 -1144698 -1729353 -6166974
35433 -6166974 -8205136 -4926304 -2051150 -5045421 -10395417 -11257802 -8121312 -7352596
35425 -7352596 -10778692 -13380690 -11712973 -8671733 -8083419 -9277326 -9514210 -8338069
35417 -8338069 -7086380 -6643380 -7542307 -9873025 -11633996 -9981423 -5688988 -3179773
35409 -3179773 -4112066 -4510488 -1268800 2034900 195958 -5208334 -7628902 -4819510
35401 -4819510 -1173304 -451569 -990866 143613 2091516 2006360 -317341 -2358882 -2552059
35392 -2552059 -1930941 -2094067 -2902308 -2831332 -1270772 231811 -335822 -2703463 -4308604
35383 -4308604 -3304879 -506030 1998421 2830822 1553230 -1243828 -3283234 -2177460
35375 -2177460 1045248 2263725 -180816 -2751634 -1919991 418010 -4261 -3335713
35367 -3335713 -5950480 -5974898 -4602806 -2780174 -601257 380181 -1730084 -5601544 -7857904
35358 -7857904 -7866742 -7720028 -7608118 -5524041 -1950988 -147449 -511145 755467 5324142
35349 5324142 9254723 8473765 4298428 722160 -835162 -1191496 -466852 1264655 2146121
35340 2146121 431221 -2671702 -4269967 -3169560 -482228 2100807 3298855 2580586
35332 2580586 687051 -969844 -1754137 -1471857 857768 5394021 8999985 7966539
35324 7966539 3643779 1294937 2267685 1974937 -2102460 -5253284 -2206649 4825194
35316 4825194 9313042 9046052 7116404 6097876 5693862 5239211 4588651 2959284 153574
35307 153574 -1575922 130995 4011089 6427411 5738570 3073628 -178449 -2996263
35299 -2996263 -3931418 -2619066 -1346132 -2414640 -4719442 -5484910 -4299498 -2682399
35291 -2682399 -1033617 664244 444455 -3260492 -7461026 -7173615 -2330070 1947204
35283 1947204 2462699 1176254 352083 -1025524 -3697892 -4851718 -1838623 3162911
35275 3162911 5697674 4980511 3932594 3759816 2149991 -1946800 -4791545 -2054016
35267 -2054016 4573866 8349624 5742452 630436 -1646464 -1410303 -2302945 -4182033
35259 -4182033 -3672241 -1248227 -1643353 -5769433 -8283037 -6213665 -4242823 -6812727
35251 -6812727 -10111925 -8083844 -2610711 -468811 -2258080 -2087383 2002652 4847624
35243 4847624 2797832 -1089643 -2998414 -3862330 -5693022 -6978172 -5563294 -3015368
35235 -3015368 -2535093 -4467210 -6609356 -7331867 -6233709 -3387056 65112 2051452
35227 2051452 1939814 1214754 618365 -1068339 -3699357 -3971446 73022 4684557 4218089
35218 4218089 -1264068 -5604860 -4131015 1279899 5650177 6820377 6069678 4602152
35210 4602152 2054180 -1664547 -5190935 -7016002 -6603583 -3847268 721396 4309372
35202 4309372 2934454 -3494864 -9136278 -8663435 -4483272 -3215990 -5514423 -4982078
35194 -4982078 1447042 8034946 8640010 5372388 3723349 3137291 -875955 -7208989
35186 -7208989 -8957518 -3345946 4078603 6923142 4979049 1681107 -1487565 -5071436
35178 -5071436 -8486645 -9747067 -7860651 -4145569 -1338421 -1397678 -3399567 -4085559 -1792970
35169 -1792970 865891 119378 -3706655 -6352158 -5082936 -1791526 -118664 -1219361
35161 -1219361 -3201590 -3749953 -2499190 -851527 312344 1808933 3962594 4490198
35153 4490198 1286256 -3331636 -4971331 -3799780 -4091673 -6432361 -6393652 -3188517 -2749306
35144 -2749306 -7890936 -12209628 -9913946 -5492261 -5901308 -8676373 -7187403 -3448326
35136 -3448326 -4806550 -10097156 -10559660 -4474039 179597 -1019587 -3597714 -4325977
35128 -4325977 -6168232 -9521381 -8606660 -1666554 4102580 3445907 894687 1755692 2905405
35119 2905405 -360590 -4787976 -4323359 -65300 2572402 3163855 5468411 9625443
35111 9625443 11812911 10638981 8570753 7613123 7519772 7588351 7454875 7178757 7975200
35102 7975200 10528974 11842960 7905685 748878 -2528176 54047 2266797 -59191
35094 -59191 -2411239 74408 4213759 4793491 3341470 4101708 5952383 5328888 3231992
35085 3231992 2434664 1430719 -1821512 -3741161 -225532 5154226 5753795 2074484
35077 2074484 -347592 -823160 -2967645 -6038781 -5554111 -1974731 -433573 -1788676
35069 -1788676 -1902237 -47314 42461 -1707202 -656688 3821929 6216622 3778972 540601
35060 540601 -199372 -838212 -3865300 -7194930 -8402714 -8527594 -8532376 -6663629 -2433067
35051 -2433067 959436 1075473 -610181 -2289703 -4512558 -6932442 -6654155 -2911968
35043 -2911968 246665 -746680 -3826107 -4432262 -1554799 1959908 3373069 2367618
35035 2367618 897341 1769913 5521110 8251610 5205179 -2874215 -9847111 -11392670
35027 -11392670 -9135815 -6842211 -5908895 -6035629 -7271418 -9408950 -11201276 -11402407
35019 -11402407 -9446677 -5449505 -1285048 -253760 -2750289 -4024020 -316334 4613125
35011 4613125 4422045 128093 -1565546 694891 1353022 -1651547 -3231421 -639509
35003 -639509 1357560 -1021367 -4023131 -3346256 -1340552 -1632388 -2292822 -569351 676070
34994 676070 -1837625 -4380629 -1433917 4647914 6747614 3868853 1472141 1838323
34986 1838323 1417062 -1804932 -4801428 -4674469 -2138782 1296444 5032447 7312721
34978 7312721 5867500 1749781 -1394339 -2638999 -4268840 -6345905 -5649988 -1621675
34970 -1621675 1540257 1359960 1184661 4194722 7147695 4937089 -869923 -3403677
34962 -3403677 -57568 4187216 4099914 776221 -1343123 -870550 349332 1633057 4169195
34953 4169195 7454962 8624331 6558129 3885905 3200910 3700440 3693655 4017464 5874885
34944 5874885 7206845 5271069 1966074 2048404 5678484 7242718 3112248 -3400340
34936 -3400340 -7003109 -6860852 -5428827 -3965576 -2559239 -2380648 -4229356 -5986318
34928 -5986318 -4814462 -1367426 917364 240751 -2351848 -5583227 -8839432 -10451628
34920 -10451628 -8202254 -2812301 1214716 45784 -4972203 -8593295 -7296756 -2725337
34912 -2725337 639073 438202 -1710763 -2947528 -2265236 -276631 2475312 5276993
34904 5276993 6340256 4250394 -24680 -4271585 -7465938 -9190674 -8016486 -3615747
34896 -3615747 494669 457756 -1756101 -251699 5947907 10769750 9444254 4131784
34888 4131784 -1174418 -6208171 -11157332 -12695365 -8676903 -3535751 -3239017 -6802553
34880 -6802553 -8323779 -6041882 -3597217 -2812520 -1255121 2105873 4254806 3165293
34872 3165293 1165467 848508 1077963 -152334 -1399271 566842 5739685 9902267
34864 9902267 8821289 2558729 -4280772 -6516644 -3256643 1194827 1964536 -1236532
34856 -1236532 -4586802 -5156230 -3772040 -2969009 -3756459 -4959004 -4830972 -2903551 -468977
34847 -468977 999148 1763659 2915118 3553167 1373766 -2811370 -4177302 -95938 5329125
34838 5329125 6348241 3083097 -42231 -1523757 -3344444 -5212667 -4117080 -318426
34830 -318426 1906165 1173976 1075909 2806831 1603245 -4991922 -10420816 -7144258 1541314
34821 1541314 4945960 -315228 -6032338 -4290252 2491159 6666887 5798989 3399627
34813 3399627 2004305 639904 -1288320 -2132819 -1299456 -1275989 -4352623 -8958855 -11076810
34804 -11076810 -8592227 -3118883 1810573 3475943 1758687 -709445 -868548 1302101
34796 1302101 2400066 -321235 -5535452 -9791538 -11522335 -11138801 -8569318 -3845263
34788 -3845263 435716 971756 -1317934 -1793935 1221365 3802581 2483775 -432765
34780 -432765 -600658 2076321 4428249 5291907 5839055 5764300 3285343 -1038998 -4048934
34771 -4048934 -4156072 -3099685 -3160463 -4982566 -8102157 -10929985 -10348811 -4736211 2105855
34762 2105855 3758099 -671639 -4775035 -3382391 533981 783962 -2883651 -4999836
34754 -4999836 -2789367 318698 557785 -694244 219650 3213766 4409541 1584780
34746 1584780 -2954182 -5521224 -5175788 -3608018 -2289117 -1415413 -1171103 -2201004 -4327142
34737 -4327142 -5972802 -5622711 -3373888 -772153 324122 -1253456 -5017852 -8456326
34729 -8456326 -8690484 -5299841 -975626 1037814 -307025 -3480578 -5619440 -4268096
34721 -4268096 411058 4763312 4719396 381395 -4171124 -6055125 -6116355 -5497450 -3097521
34712 -3097521 1122029 3411189 714141 -3871678 -4441791 -620688 1667741 -1552084
34704 -1552084 -7005273 -8839624 -5962395 -2416119 -1595240 -2213074 -511322 4276024
34696 4276024 7968235 6229383 687080 -2415816 -383480 2352169 846287 -3436865
34688 -3436865 -5596609 -4297353 -1558877 1971278 6209890 7776724 3327943 -3367802
34680 -3367802 -4240444 1917757 7265988 6016326 1724075 318074 1422637 983331
34672 983331 -1847149 -5156202 -8194995 -10253658 -8571079 -2205412 4212060 5291475
34664 5291475 1826301 -1284676 -2193153 -2628813 -2999856 -2146397 -1109122 -1972542 -3211013
34655 -3211013 -1272858 2940178 4207457 495590 -4354379 -6695397 -7297116 -7737511
34647 -7737511 -6911405 -3833076 -756516 -807404 -4426902 -9562350 -13154000 -11865816 -4883993
34638 -4883993 2771394 3787847 -2455362 -8404959 -8373078 -5649780 -5874661 -7798324 -6356939
34629 -6356939 -2001270 -202980 -2443442 -4123730 -2219860 646181 1532423 1664057
34621 1664057 2974463 4023289 2549435 -397078 -1835683 -899428 756014 1506732
34613 1506732 1088001 353800 698843 2371337 2840650 -796312 -6746213 -8921107 -4629554
34604 -4629554 1088596 2135099 -91309 718001 5912244 9887982 8585918 4912047
34596 4912047 3272568 2775671 -289509 -5533421 -8382745 -6546330 -2870947 -996638
34588 -996638 -1116640 -1477126 -1704871 -2484917 -3393784 -3491381 -3430674 -4532978 -5847315 -4705643
34578 -4705643 -788933 2910785 4306290 4728424 5390336 4201120 -660427 -6105806
34570 -6105806 -7291477 -4521201 -2578522 -3289486 -3543883 -1646903 -727304 -3615750 -8508346
34561 -8508346 -12251834 -14007227 -13041051 -7495367 745473 4523505 163279 -5831683
34553 -5831683 -5076491 566351 2442748 -1110906 -3009281 167830 2800391 93941
34545 93941 -4452011 -5920919 -5912036 -8000580 -10172570 -8182372 -3473405 -1431042 -3030296
34536 -3030296 -3803159 -927661 3327310 5652786 5423496 3706150 1560857 86344
34528 86344 -126750 -122084 -1343290 -3134967 -3277592 -1098097 1728178 3678886 5042536
34519 5042536 6608225 7891163 7336713 4089069 -442550 -3139913 -2421196 -798676
34511 -798676 -2206810 -6350704 -8389667 -5632321 -1622753 -1033453 -3129492 -3944942 -3130950
34502 -3130950 -4061898 -7366294 -8926384 -5776805 -591438 1878635 701355 -1052682
34494 -1052682 -716059 1497234 3953564 5599429 5975878 4520362 1189216 -2270265
34486 -2270265 -2941146 441626 5851588 10022026 11546019 11000455 9080065 6409370
34478 6409370 4310878 3378318 1912355 -1496403 -4589552 -4354356 -2914405 -5579604
34470 -5579604 -12131107 -15506824 -11517165 -4538368 -127146 2625422 6417845 8393616
34462 8393616 4427697 -2151225 -3664290 842644 4490101 2976637 -118163 78242
34454 78242 3122318 5481102 5500148 4024415 2788367 3543542 6435603 8570525 6614638
34445 6614638 1148332 -3993010 -6528580 -7061434 -6098279 -3356464 -100228 1526783
34437 1526783 1940744 3465642 5982675 6854300 5484751 4071048 3338346 1640163 -1023750
34428 -1023750 -2541120 -3289174 -6371413 -11384651 -12826193 -7755772 -1015490 787898
34420 787898 -2406309 -5194376 -3842589 720732 5244276 6762971 4270759 -14913
34412 -14913 -2230500 -1092638 1037517 2175496 3249205 5256829 6747171 6140338 4074294
34403 4074294 1488709 -2009231 -5679610 -6325712 -2366834 2800687 4455461 2156758
34395 2156758 -784475 -2082266 -2309543 -2975153 -4817621 -7284904 -8507633 -7022568
34387 -7022568 -4288757 -3406296 -4377434 -3455451 1080905 5409741 4830392 -442292 -6483452
34378 -6483452 -10261048 -10656031 -7589857 -3210464 -1719382 -4781182 -8846969 -9825186
34370 -9825186 -8187419 -6305784 -3407062 2373542 8667916 10590760 7381695 2989746
34362 2989746 71377 -2464373 -5591703 -7924953 -8442688 -8099105 -7385422 -5078896 -916392
34353 -916392 2679210 3120397 578925 -2654317 -4808267 -6081676 -8040034 -11381731
34345 -11381731 -13845643 -11767494 -5255929 998 -935403 -5261250 -5656054 -470177
34337 -470177 3760455 1630144 -3453634 -4412099 -713964 1201395 -2513552 -7590787
34329 -7590787 -7753035 -3324357 -263531 -1696274 -4434684 -4878044 -4588259 -7011707 -11088346
34320 -11088346 -12206916 -8854337 -4401015 -1991558 -1315714 -1240402 -1932887 -2772320 -1505973
34311 -1505973 2308647 5628078 5754038 3548324 1168480 -676599 -1389206 356192
34303 356192 3515379 3892092 -287327 -4792418 -4976250 -2363158 -1574608 -2969342 -3121514
34294 -3121514 -1150194 504150 1045433 2085874 3297324 2082655 -1526519 -3972975
34286 -3972975 -3539136 -2756270 -3788424 -5011576 -4475598 -3718285 -5110418 -7299120 -6619045
34277 -6619045 -2685910 274635 -1258106 -5168387 -6094398 -2562308 732095 -591182
34269 -591182 -4114662 -4309792 -1605688 -2305110 -8113871 -11649231 -6484015 2830220 6269722
34260 6269722 1106702 -6461907 -10624009 -10953480 -8873781 -5162857 -1610790 -118422
34252 -118422 686502 3471294 6402134 4319161 -3227827 -10166353 -11965864 -10887296
34244 -10887296 -10934029 -11972836 -11836268 -10602329 -9489213 -8239311 -6592743 -5975268 -6829780
34235 -6829780 -6346342 -1817574 5134647 10183691 11086562 8956682 6002879 3829950
34227 3829950 2936812 2374953 790516 -1352961 -2015967 -748062 322757 -413954 -2079020
34218 -2079020 -3394790 -4287054 -4207152 -1730773 2358658 4475528 3046973 1134280 1472939
34209 1472939 1706380 -1774329 -7463281 -10507739 -9551130 -7452685 -5917730 -4117796
34201 -4117796 -2772981 -4551559 -8810094 -10473719 -6944958 -2565916 -2718440 -6114949
34193 -6114949 -7037236 -3695556 156599 1695932 2476300 4126476 4757752 2355043 -1207859
34184 -1207859 -2733478 -2189503 -1268197 704404 5146934 9431308 8755520 3454086 -447801
34175 -447801 246403 1478945 -1134208 -5233858 -5692605 -2495424 96075 309565 -6040
34166 -6040 8463 -790768 -2044000 -1661475 313807 1220344 -37639 -1328435 -632854
34157 -632854 1377924 2617603 1477038 -2295449 -6433288 -6794269 -2155148 2526766
34149 2526766 1297344 -4932215 -9784087 -10260799 -9285629 -9009343 -7195850 -2416513 2097076
34140 2097076 3063196 1991463 2065141 2936262 1958198 -1215282 -4144644 -4670469 -2647283
34131 -2647283 270475 1596868 416382 -721271 1169175 4166651 2800473 -3894789
34123 -3894789 -9787610 -9654602 -5966477 -4262935 -5102873 -5025865 -3310130 -2783726 -4314275
34114 -4314275 -4794618 -1580995 3752450 7165509 6286648 2312982 -1450143 -2856054
34106 -2856054 -2884165 -3842269 -5959979 -7291637 -6857215 -5749418 -4966199 -4579878 -5246593
34097 -5246593 -7512239 -9126097 -6673302 -1075260 2259630 419832 -3583039 -6079050
34089 -6079050 -7156778 -7528701 -5839732 -2634717 -2276111 -6195475 -8390382 -3317556
34081 -3317556 4965535 7774732 3658773 -1159922 -2753467 -3075635 -3755469 -2998686 -65528
34072 -65528 2484132 2678546 1170800 -1425887 -4982342 -7060613 -4530093 810929 3066668
34063 3066668 406949 -2408097 -1919469 -1416233 -4920872 -9899961 -10708522 -6926627 -3609120
34054 -3609120 -4130440 -6699502 -7923386 -6623767 -3563173 153866 3303731 4533219
34046 4533219 3235363 182009 -3097684 -5558760 -7258386 -8703704 -9649163 -9112885
34038 -9112885 -6937438 -4505217 -3092715 -2370866 -1638284 -1547159 -3005091 -5195827 -6595589
34029 -6595589 -7289202 -8176140 -8560473 -7156995 -5156019 -5220655 -7144106 -7728990 -5951669
34020 -5951669 -4986047 -7164253 -9617518 -7625889 -837906 6283706 9427341 7861524
34012 7861524 3558318 -1031328 -4223460 -5639274 -6087086 -6469590 -6795210 -6523215 -5568618
34003 -5568618 -4614606 -4607461 -5909879 -7504819 -7285051 -4095368 438922 3120283 2467151
33994 2467151 -63037 -2217430 -3171594 -3308951 -3053020 -2734199 -2841862 -3594514 -4514576
33985 -4514576 -4719747 -3406187 -314172 3522963 5747262 4557923 742588 -3206176
33977 -3206176 -6024538 -8451560 -10915912 -12088964 -10668766 -7494973 -4797480 -3893431
33969 -3893431 -4423155 -5435481 -6491136 -7763566 -9322473 -10276584 -8992998 -4937531
33961 -4937531 -158910 2175450 1065128 -1445004 -3099024 -4070416 -5803540 -7927665
33953 -7927665 -7868351 -4086742 1165086 3528192 1214807 -2968915 -5100643 -4812011 -4965524
33944 -4965524 -7102499 -9451871 -9940665 -8751099 -6586306 -2868221 2043515 4888489
33936 4888489 2920431 -1789741 -4662064 -4553728 -3969021 -3721449 -1688324 2143700 3777089
33927 3777089 964310 -2426746 -1200793 4085446 8302561 8698695 7034658 5278824
33919 5278824 3036359 60830 -2030928 -2306526 -2311586 -3261954 -3489030 -1347023 762645
33910 762645 -1237363 -6710793 -9781975 -6586227 -272444 3359712 3052857 2157799 2952555
33901 2952555 4260324 4511524 3976523 3210575 1819131 -134856 -1383066 -1090189 215682
33892 215682 1838547 3420591 3988952 2420080 -830171 -4328931 -7704607 -10517101
33884 -10517101 -9970569 -4248258 1675456 -534628 -10924975 -18794800 -15998593 -7589831
33876 -7589831 -3754716 -5554616 -5779960 -1332435 3184875 3915460 2513859 1288670
33868 1288670 -269239 -2224750 -2548412 -757396 1008729 2141252 4550060 7863902
33860 7863902 8102645 3510759 -2185801 -4948688 -5412994 -6037217 -6491061 -5059838 -2332422
33851 -2332422 -417674 99931 93907 -24611 -396773 -960580 -1741578 -2696345 -2811770 -1211859
33841 -1211859 542471 -264381 -3413627 -5740086 -5899310 -6067121 -7915735 -10149049 -11316712
33832 -11316712 -11793620 -11498811 -9024025 -4786580 -1831953 -1771670 -3073228 -4648686 -7160067
33823 -7160067 -9258929 -7508723 -2700036 -1020890 -5071017 -8689087 -5756771 154550
33815 154550 1001458 -3857166 -7373807 -4895387 1151152 5824976 6015703 994867 -6866722
33806 -6866722 -12566842 -13420360 -12300855 -12570830 -12446792 -8997634 -4681772 -3780309 -4749583
33797 -4749583 -3133029 -280703 -1291924 -5254415 -6250960 -4236034 -5459410 -10410800
33789 -10410800 -11285324 -5088996 416204 -690475 -3013198 -213479 3241789 42371
33781 42371 -6220232 -5832032 1764002 7842852 8277201 7636087 9131862 9943933 8524818
33772 8524818 8050003 9389754 8074281 2346120 -2157608 -638105 3111421 2528428
33764 2528428 -2023535 -4907366 -3946540 -2110895 -1859017 -2598162 -3261147 -3517191 -2751503
33755 -2751503 -1017883 -350595 -2149367 -4358730 -4558002 -4445745 -7030691 -10436466 -9757106
33746 -9757106 -5203392 -2805912 -5543906 -9083220 -8787559 -5985163 -3820841 -1376111
33738 -1376111 3427546 8212493 8410448 3458471 -3309448 -9202343 -12772959 -12204041
33730 -12204041 -7882875 -4662885 -6116081 -8040514 -3959387 3811347 6086668 543444
33722 543444 -4494104 -2785114 1035044 187958 -3357049 -3189088 1058153 4530346 5507597
33713 5507597 6141750 6663876 5432242 3907286 5338384 8579957 9028811 6097139 4189960
33704 4189960 5466529 7143519 7366444 8248693 10658204 10894520 5940222 -1495794 -6448251
33695 -6448251 -7652200 -7311968 -7168352 -7314593 -7162327 -5639448 -2118288 1608638 2622018
33686 2622018 1340465 1686156 5168116 8264923 8048605 6751765 7455065 8719309 7789139
33677 7789139 6242089 7287273 9343685 8027653 3854342 2062272 4143462 5289376
33669 5289376 2311349 -970519 359128 4683677 6256941 3331097 -70410 -138098
33661 -138098 2176094 3422262 2517369 1884392 3965900 7613968 9036083 6509723 2624870
33652 2624870 510957 -592002 -3411482 -7309555 -8597844 -6527960 -4962246 -6380436
33644 -6380436 -7956311 -6444688 -3842043 -4290193 -7342383 -8707318 -6948489 -5021085
33636 -5021085 -4743227 -3938952 -744869 2558482 2498364 -816662 -4329119 -6354525 -7988725
33627 -7988725 -10383760 -12412391 -11728612 -7604270 -2203715 1259154 1721607 1083038 1390759
33618 1390759 2130687 1371509 -1373670 -5052839 -8863085 -11823985 -11420509 -6089952 713429
33609 713429 2759536 -1157312 -5070810 -3625751 1172090 3749585 2499717 -195189
33601 -195189 -3137970 -6903989 -10202125 -10300372 -7512515 -5475109 -6071527 -7152478 -6204784
33592 -6204784 -3575582 -1111956 59889 -375739 -1911433 -2818415 -1924668 -882682 -2056551
33583 -2056551 -4215474 -3763929 -691670 750304 -1331081 -3350866 -2081847 279768
33575 279768 82035 -2043476 -3193321 -3335866 -4248330 -5136638 -3748581 -967792 -33502
33566 -33502 -1341778 -1953171 -614280 393163 -721621 -2669140 -3924228 -5469136 -8733199
33557 -8733199 -12345252 -12846616 -8437056 -1288979 3948919 4330397 1610829 186697
33549 186697 1576211 2725897 1072573 -1152422 -474067 1961653 2088437 -340800 -1225711
33540 -1225711 1189761 3469511 2465243 -97754 -972897 -541698 -1746749 -5410363
33532 -5410363 -9024825 -9513788 -5869891 -38923 3945876 3256948 -273086 -1755848
33524 -1755848 562745 2888074 1326628 -2596966 -4493194 -3395858 -2248590 -2923267
33516 -2923267 -4063302 -3982991 -2750136 -732378 2283981 5369521 6134792 3887416 1558987
33507 1558987 2499166 6111117 8487001 7036385 2778412 -1810846 -5200917 -6550199
33499 -6550199 -5235211 -2243812 -469271 -1388126 -2331698 338967 5626704 8466980
33491 8466980 6482394 3097024 2499492 4430560 6075632 6334784 5319841 2055822
33483 2055822 -3646282 -8736419 -10243845 -9737658 -10377274 -10912530 -7849181 -2960503 -2302671
33474 -2302671 -6655948 -9357263 -6236016 -1601357 -463150 -563740 2334449 5967322
33466 5967322 5388937 2380772 3273330 8011828 8979752 2273461 -6173048 -8516517 -4230293
33457 -4230293 1734240 6055982 8479467 8725347 6167085 2064724 -871576 -1511105
33449 -1511105 -1346395 -2376814 -4857564 -7136762 -7307010 -5192084 -2606302 -1109889
33441 -1109889 -55983 1866552 3735574 3192446 253914 -2076480 -1883011 -911734 -1879366
33432 -1879366 -5039197 -8646915 -10958911 -10344193 -5550598 1857346 6897585 5721541
33424 5721541 114019 -4744958 -6156497 -5040889 -2184435 2822177 8183445 9170442
33416 9170442 3391140 -5060593 -9267784 -6702509 -1141684 1944517 361541 -3801898
33408 -3801898 -6382651 -4608412 87329 2913916 877499 -3344870 -4661053 -2311223
33400 -2311223 -460497 -1541311 -2550518 -179250 3430177 3647610 292770 -2459014
33392 -2459014 -2421630 -1470976 -1195022 -926499 -1147088 -4135231 -8817028 -9467337 -3461195
33383 -3461195 3241899 3348658 -1451676 -3285999 -230544 1000733 -4155269 -10815717
33375 -10815717 -11702444 -7055786 -2975821 -2554243 -3497440 -3502061 -3246035 -3469810 -3027678
33366 -3027678 -1543308 -1182070 -3513063 -6365773 -6341989 -3693498 -2077513 -3217146 -4385887
33357 -4385887 -2662432 383171 923114 -1090638 -1479612 1862831 5440107 5013191 1510521
33348 1510521 -913434 -1137672 -1776368 -4035082 -5562428 -4266250 -1327158 839401
33340 839401 1347123 459584 -1379988 -2966451 -2855073 -1678305 -1864103 -3821623 -4822106
33331 -4822106 -3400797 -2317412 -4508321 -8077660 -8545994 -5113749 -1562378 -1113450
33323 -1113450 -3078618 -4848496 -4916199 -3316823 -824388 1350942 1893675 143375 -3249144
33314 -3249144 -6033300 -5187065 227124 6607882 8299866 3692848 -3012981 -7165411
33306 -7165411 -8306705 -8029806 -6530045 -4228466 -3854396 -6895337 -10035835 -9333999 -6196826
33297 -6196826 -4647660 -4307186 -1617042 2764509 3989408 962172 -1730490 -1185066
33289 -1185066 228649 482487 1342732 3598436 4433477 2943749 2975095 6376708 8444375
33280 8444375 5024323 -313419 -1897225 -942706 -2396715 -5554326 -5083522 -379040
33272 -379040 3104757 2169111 -701801 -3087416 -5835235 -8748828 -8525695 -3850785 1575034
33263 1575034 4020057 4442440 5393821 6194422 4670436 1784710 751852 1902663 1714146
33254 1714146 -2022937 -6289989 -6177850 -1528772 2235525 1011338 -2629816 -3756111
33246 -3756111 -2812570 -4182419 -7408907 -6442668 42965 4532432 1850439 -1895798
33238 -1895798 997791 6325901 4070047 -4605603 -7913942 -1796065 3641348 -19668
33230 -19668 -7234549 -8444932 -4430028 -2816015 -5387735 -7010242 -4708582 -843236
33222 -843236 1825801 2881410 2619987 1748928 1930273 3454417 3765973 1082362 -2673409
33213 -2673409 -5335154 -7762469 -10065940 -8339527 -443638 7910657 9078048 3735491
33205 3735491 -972093 -2136894 -2976528 -4409843 -2535917 3555420 8258181 7063046
33197 7063046 2569858 -409879 -1303112 -1863823 -1915877 -1159871 -2016596 -6020242 -9427786
33188 -9427786 -7256556 -981682 2365009 -657150 -5561773 -6401457 -3571326 -2398549
33180 -2398549 -5295138 -8446715 -6985572 -1291180 3564698 3662147 -306189 -4925481
33172 -4925481 -7176421 -5424562 148576 6569590 9207102 5754256 -1469887 -7955415
33164 -7955415 -10689746 -9129203 -4733955 -786274 -456328 -3288548 -5516866 -5370939
33156 -5370939 -5463403 -7808030 -9622429 -7578045 -3717360 -2877715 -5694457 -8307457 -8040355
33147 -8040355 -5450107 -1664953 2294640 4338156 3524415 2688151 4696306 7132233
33139 7132233 5571129 1301387 107292 3411390 6542068 6353632 4483607 2142698
33131 2142698 -1603404 -4577458 -1791155 5738970 9538282 5602175 1187557 3848736
33123 3848736 9581937 9236525 2407920 -3263988 -4190331 -3866882 -4499713 -3738257 -1115534
33114 -1115534 -788392 -4961010 -9529536 -9465519 -5343620 -1837700 -1799594 -3837091 -4543101
33105 -4543101 -2113685 1415407 1832221 -1950594 -5374930 -3561826 1879501 4861509
33097 4861509 3190091 804616 1227607 3257270 4847309 7012711 10861489 13895548
33089 13895548 12951614 9111214 6294114 5872622 5725794 4199469 2021580 -2376
33081 -2376 -2510500 -5694223 -7766377 -6879870 -3818693 -1512575 -1908019 -3980293 -5003395
33072 -5003395 -3554282 -1027950 26349 -1064458 -2409807 -2211626 -1157159 -1097866 -2119309
33063 -2119309 -2755854 -2940355 -4269709 -6475450 -6397611 -2808180 17494 -2744734 -8924907
33054 -8924907 -11133612 -6560313 -627881 816789 -1284723 -2743552 -3075296 -4479868
33046 -4479868 -6187748 -4857830 -210249 3863018 4139757 1019495 -3240199 -6361185
33038 -6361185 -6432811 -3402937 57137 1683176 2533586 3880105 3285711 -1595878 -7040787
33029 -7040787 -7149979 -3119181 -1785726 -4459921 -4828428 -40391 4031421 2514504
33021 2514504 -834483 -1053736 -445716 -3010654 -5890530 -4031880 539277 2045822
33013 2045822 806551 1634011 4072587 2620613 -3504909 -8775544 -10312736 -11005432
33005 -11005432 -12268410 -11072346 -6745290 -3856587 -4698089 -4929751 -1129960 2535605
32997 2535605 507904 -5222468 -8189820 -7021982 -6012149 -7178700 -7684524 -5901905
32989 -5901905 -4793984 -6813491 -9186974 -7719207 -3303793 -916521 -2474724 -4270804
32981 -4270804 -2659722 736749 1937453 574789 -377549 234310 737651 695533 1671118
32972 1671118 2958202 1200537 -3357925 -4833491 82106 5583449 3765800 -3972650
32964 -3972650 -8452504 -5276477 -160807 -287852 -4957278 -7674439 -4961115 -61443
32956 -61443 1764344 -239851 -1711920 732983 4403446 4046002 -186233 -2323324 1057001
32947 1057001 6796710 11452612 16079986 21173439 22911976 20199503 19915582 27912779
32939 27912779 40144596 51928751 70437470 104001585 140309141 151609876 127170762
32932 127170762 87696368 59820974 47207691 36529361 22366196 12286909 10930420
32925 10930420 12539232 10980725 7633556 6094364 5612166 3550821 538944 -262228
32917 -262228 2277923 5259863 4427095 -946933 -6102539 -5536238 134152 4987457 6110012
32908 6110012 6743048 9083420 9181735 3534463 -3448819 -4609195 -287254 2792969 1802061
32899 1802061 768394 2914338 5647153 4988825 1104699 -2441078 -2507513 1463914 7001093
32890 7001093 9977023 8413621 4774622 2630853 2134574 1496927 1523031 4496502 8816727
32881 8816727 9409701 4823386 33809 -56430 2870795 3184412 -1024492 -5480315 -5099492
32872 -5099492 -511131 1895893 -2835009 -11481832 -15234728 -9990319 -1618613 1284623
32864 1284623 -2279528 -5963590 -5187195 -1773736 552534 1157592 1390908 1323271 -238499
32855 -238499 -3529552 -6890588 -7878504 -5452201 -1520365 614750 272320 349550 2762504
32846 2762504 4998530 3923416 1199876 1110210 3857095 5281748 3448120 1320572
32838 1320572 1661676 2887565 1997575 -968790 -3519298 -4143914 -3456915 -2853689 -3116941
32829 -3116941 -3819642 -3850319 -3074400 -2858876 -3835733 -4214205 -2191524 942437 2454826
32820 2454826 2185697 2423653 4387984 7315657 10251684 12097346 11005309 6865245
32812 6865245 3066760 2075018 928971 -3929194 -8923305 -7198777 -133914 2823280
32804 2823280 -2051728 -6872458 -4208404 1876444 2813534 -1687009 -4807475 -3429134
32796 -3429134 -952679 -782001 -2897259 -6202923 -9109556 -8231944 -1466317 7466870
32788 7466870 11886843 9993341 6185732 4392872 3871653 2229102 -943644 -4613153
32780 -4613153 -7743741 -9115527 -7772640 -4399678 -750926 2202521 3902126 2835647
32772 2835647 -1686639 -6563468 -6740794 -921103 6491087 9807793 7217421 1728911
32764 1728911 -1673783 -368394 3020845 3040073 -1936087 -7341285 -8735138 -7810266 -8596862
32755 -8596862 -10238828 -8609140 -3729540 87077 1214398 2107526 3383396 2588829
32747 2588829 169927 424466 4028068 5549074 1886404 -2233267 -1522833 1767881
32739 1767881 2028235 -1069209 -3302256 -2634515 -315508 2615808 5317241 5553455 2540469
32730 2540469 -476879 -703543 -543770 -3206776 -6227686 -5181691 -1608498 -346631
32722 -346631 -384500 3643941 10664304 12399221 5763830 -1732946 -2830506 -148964 -291717
32713 -291717 -3918039 -7124635 -8399152 -8547382 -6936689 -3424258 -1619358 -4648109
32705 -4648109 -9223954 -9282398 -4673927 -1195159 -2204327 -4925641 -5551041 -3964514 -2454355
32696 -2454355 -2690429 -4596949 -6084064 -4292539 642546 4321295 3538113 1295033
32688 1295033 2269757 4930920 3701792 -1660660 -5383934 -5248462 -5884751 -9852215 -12242958
32679 -12242958 -8903576 -4372710 -5297102 -9694441 -9761876 -3620846 2503961 3582081
32671 3582081 1088926 -1675420 -3780663 -4417870 -1715289 3248222 5294599 1433700
32663 1433700 -4583054 -7227833 -6198599 -4948301 -4395082 -2495937 691778 1941974
32655 1941974 -511455 -4739038 -8429328 -11325174 -13166575 -12378833 -8903764 -5805754
32647 -5805754 -5520619 -6406574 -5711204 -4298229 -5080694 -7603670 -7928045 -4368290 -181765
32638 -181765 651699 -1913151 -4652425 -4670110 -1612174 2074967 2837213 5521 -1903822
32629 -1903822 2176686 10466784 15236002 12484125 6748506 3867774 3206018 1118340
32621 1118340 -1432545 -360543 4105480 7170953 6502068 4448364 2795280 138244
32613 138244 -4151678 -7406834 -6875282 -2516732 4244569 11162061 13932574 8873080
32605 8873080 -1050327 -7005463 -4195579 2201463 4186189 1128166 -1066013 1073465
32597 1073465 4882553 6472369 5574004 4645781 5454397 7500212 8799436 7873075 5320500
32588 5320500 3000790 1587240 325764 -382265 1635140 6893086 12176825 13938464
32580 13938464 12299610 9640658 6798666 3361835 593214 693741 3100298 4609889
32572 4609889 4034845 3969039 6213787 7658754 3612373 -5263485 -12320332 -12435777 -8026162
32563 -8026162 -5349044 -6206204 -6681532 -4097531 -1161652 -1328636 -3665129 -5399439 -6492013
32554 -6492013 -7720839 -6967519 -2567384 1482453 -269670 -5906951 -7939943 -4408850
32546 -4408850 -1513499 -3432236 -6136496 -4457083 460322 4420701 5876445 4780349
32538 4780349 781329 -3538721 -2769235 3463567 7761429 5147537 874361 1996253
32530 1996253 6140241 6273980 2792990 2070010 4942212 5660527 2278769 -260476 1121221
32521 1121221 2922775 1470908 -1501786 -2187895 310338 3951991 5691022 3194121
32513 3194121 -2190775 -4981696 -2005096 2078275 705492 -4490965 -5800754 -1215879
32505 -1215879 2851466 1546242 -2388938 -4391176 -3972607 -2709290 -1568264 -2101525
32497 -2101525 -5296246 -7844289 -5050362 1169079 3441699 62452 -1913486 2094926
32489 2094926 6790557 5648955 1064229 -134443 2804472 4632822 2473606 -999034
32481 -999034 -1837586 982584 4744088 4852080 -404812 -6220258 -5961800 -357792 2920490
32472 2920490 537557 -1650380 1564986 5967562 4254542 -3115053 -9056019 -9277853
32464 -9277853 -5836303 -3063513 -3486801 -6105647 -6615424 -2018425 3734002 3095894 -4485103
32455 -4485103 -11045224 -11506247 -9735088 -9748234 -8853103 -5067761 -3283229 -6474417 -8116734
32446 -8116734 -2398363 4451284 3295775 -2849238 -4187257 -328258 1177718 -358139
32438 -358139 1343035 5719572 4984165 -1240089 -3958373 -306914 1439477 -3371908
32430 -3371908 -7725858 -5358028 -716043 130069 -706047 618390 1547341 -944429 -3165251
32421 -3165251 -963212 2765971 3857704 4255555 6366738 6031195 -536038 -7836428
32413 -7836428 -8114584 -3486795 -2013743 -4655093 -5548507 -3489265 -3505112 -7106010 -9815043
32404 -9815043 -9335050 -8329776 -7909508 -5872918 -3058167 -4013444 -8737154 -10553727 -5669501
32395 -5669501 940385 2929253 837025 -1020046 -1468837 -1723724 -1031935 2082971 5920094
32386 5920094 6966813 4443195 787631 -1508739 -1537706 221910 1764722 665159
32378 665159 -2732905 -4726160 -2766532 1066028 3147945 3078366 2899873 3224048 3093787
32369 3093787 2567265 2338305 1461099 -1451697 -5128135 -6898386 -7003221 -8261087 -10878439
32360 -10878439 -11042471 -6157424 1341571 7137517 9588898 9420770 7424132 4837356
32352 4837356 3790024 4460701 3564876 -1016127 -5559701 -4608193 723389 3308677 -30335
32343 -30335 -3780530 -1728142 4057238 6423874 3308988 -8126 1217033 5270405
32335 5270405 7432570 6272669 4044192 2434093 686829 -2027073 -4522622 -5061788
32327 -5061788 -4020561 -3687185 -5182734 -6648652 -5407474 -1440682 2426377 3775935
32319 3775935 2851634 1341434 331753 295066 1698328 3902772 4154336 42254 -6238217
32310 -6238217 -8053129 -1072971 10429526 16607615 12753932 4903862 2098196 4677000
32302 4677000 4833310 -1049023 -6671988 -5696210 -1639960 -1726532 -4855480 -3978788 1212311
32293 1212311 3480852 837156 157657 4301259 5320602 -2670096 -11868388 -11056963
32285 -11056963 -2062898 3874738 2904672 1554666 4116938 7099016 7267200 6341211
32277 6341211 5484002 2788751 -1124761 -1955604 883494 2100887 -1018512 -3997512
32269 -3997512 -2622486 570276 1317521 167635 -253707 -114583 -269127 682667 3019693
32260 3019693 3465992 415658 -2262727 -1212648 472691 -1515846 -5071799 -5176961
32252 -5176961 -2229424 -488110 -113122 2489289 7034085 8665192 5552201 1556340
32244 1556340 151389 495551 828213 1362183 2183801 2063262 1062385 1152391 2729426
32235 2729426 3422623 1822066 -283864 -841267 -262279 257696 1026835 2938094 5832091
32226 5832091 8844965 10960433 10649382 6810325 831426 -4118078 -6692217 -8442931
32218 -8442931 -10392811 -10623047 -7060281 -1392532 1908759 544329 -2910312 -3894454
32210 -3894454 -1060201 2349915 2901894 1659979 2427490 5642708 7337928 5450704
32202 5450704 3503789 4940940 6926707 4339038 -1970290 -6289757 -6867140 -7753028
32194 -7753028 -10740323 -11356873 -6187721 265978 700367 -5172804 -10319908 -9365389 -4249155
32185 -4249155 -422344 -277096 -1910101 -2864928 -2990768 -3320322 -3620012 -2554690 83382
32176 83382 3100812 6082463 9599536 12297616 10632464 3954209 -2582871 -3703326
32168 -3703326 -980874 -122585 -2341020 -3147016 166305 4647908 6533546 5794333 4215314
32159 4215314 2701325 2331498 4512616 7940450 8668267 5385897 1485221 -250191
32151 -250191 -1469011 -4093244 -6041382 -4800484 -2238572 -1689067 -2586942 -2405064 -2134476
32142 -2134476 -5030786 -10585936 -14219580 -13178421 -9224104 -5328113 -2856563 -2123778
32134 -2123778 -2754054 -3220837 -2376919 -1211004 -1022139 -1097829 -948619 -2898063 -8212743
32125 -8212743 -12271537 -9296836 -1621609 2077388 -1144374 -4786836 -3675748 -1507453
32117 -1507453 -3033631 -4952978 -1546970 4637502 5746517 652813 -3914436 -4502798
32109 -4502798 -5295885 -8965064 -10504373 -5171895 2577711 4402261 -288741 -4342977
32101 -4342977 -3822937 -2662646 -4890970 -7722776 -6124005 -919460 2162219 400393
32093 400393 -3039861 -4368237 -3806042 -3688994 -4649820 -5719204 -6616821 -7831914 -9109000
32084 -9109000 -9481340 -8470819 -6239675 -3273671 -879591 -734630 -2375609 -2496451 930804
32075 930804 4877632 4615598 491826 -2123547 -251186 2838265 2652414 -882833 -4980188
32066 -4980188 -8188385 -10026665 -8891007 -4284498 26306 -773752 -5940878 -9199959
32058 -9199959 -6293194 91586 3957099 2475474 -2217536 -6023151 -6530533 -4597849
32050 -4597849 -2857681 -2178794 -406545 3823871 7179347 4738550 -2776347 -8342719
32042 -8342719 -6855945 -1449983 473388 -4116543 -11114971 -14122158 -10629261 -4105741
32034 -4105741 -645743 -2712640 -6372614 -6397496 -3346619 -2209051 -4175318 -4769389 -1821549
32025 -1821549 352241 -1359425 -2164199 3585154 12134427 14333804 8442660 1699744
32017 1699744 -794834 -1464464 -3248664 -4495556 -3981290 -4738334 -8415485 -10633371 -6996573
32008 -6996573 -379821 2731911 842464 -2229700 -3749129 -4038862 -3160704 -442419
32000 -442419 2566984 2737123 -272121 -3318614 -4105606 -3619264 -3701855 -4563272 -5333112
31991 -5333112 -5073694 -2810173 1410162 4984950 4411691 -483806 -5529480 -6529180 -3619786
31982 -3619786 -472922 71553 -1272596 -1600290 697933 4158536 6182265 6258379 6016275
31973 6016275 6061253 4811150 1622855 -974859 -431205 1670772 1279239 -2553062 -6183496
31964 -6183496 -5935305 -2379208 657481 353954 -2411743 -4368390 -3811453 -2822457 -4247532
31955 -4247532 -6698897 -5319124 1234184 7575332 8027062 3887199 854410 983441
31947 983441 1267497 -623895 -3452686 -5392794 -6206818 -6109912 -5793855 -7551578 -12458138
31938 -12458138 -16197979 -12440705 -1903709 6450510 5793442 -709428 -5167351 -4586127
31930 -4586127 -1817818 109574 389719 -1125680 -3701859 -4517602 -1334761 3489776
31922 3489776 4576491 -413079 -8336482 -14265658 -15623493 -12683629 -7335148 -2169518
31914 -2169518 866528 1909096 2484965 3165929 3083914 2095326 1874246 3608043 5487897
31905 5487897 4192086 -971604 -6825830 -9949594 -10264310 -9651997 -8262971 -4817055
31897 -4817055 -303767 1991142 1230749 411722 986051 -326932 -5969709 -12003137 -12820835
31888 -12820835 -9134544 -5939940 -4281044 -1408373 1697511 548355 -4031786 -5055853
31880 -5055853 -243718 3508967 845584 -3466223 -2345281 2672158 4961546 3256443
31872 3256443 1582953 1403487 677585 -727395 -951882 -588942 -1687223 -3290750 -3253403
31863 -3253403 -3161677 -5706865 -8468547 -6797075 -2141769 -501893 -2574157 -2863405 413334
31854 413334 2212643 -311966 -3071736 -2698358 -2111815 -4135523 -5677138 -3453169 -396715
31845 -396715 -685180 -2506925 -1722672 518815 98100 -2258792 -1833736 2096857 4866786
31836 4866786 3446012 200638 -1267367 -334464 1606259 3319141 3744049 2001698
31828 2001698 -1361843 -4109722 -3927278 -328643 4311889 5732036 1821182 -3714157
31820 -3714157 -4434721 712532 5426171 4368511 217158 -758882 2713897 6696449
31812 6696449 8277193 7824133 6351889 4555183 3531966 3256861 1801541 -907567
31804 -907567 -1154667 2722322 5698703 2880185 -1822014 -909328 4611526 6613865 2945690
$$ [...]
##END NTUPLES=NMR SPECTRUM
##END=
